##TITLE=1H_Pr Q-20
 CDCl3
 8 sc, 
 20.2.2023
##JCAMPDX= 6.0         $$ Bruker NMR JCAMP-DX V2.0
##DATA TYPE= NMR FID
##DATA CLASS= NTUPLES
##ORIGIN= UXNMR, Bruker Analytische Messtechnik GmbH
##OWNER= root
$$ XWIN-NMR		Version 3.5
$$ Mon Feb 20 14:28:51 2023 Russian Standard Time (UT+4h)  she@DPX200
##.OBSERVE FREQUENCY= 200.13135
##.OBSERVE NUCLEUS= ^1H
##.DELAY= (6, 6)
##.ACQUISITION MODE= SIMULTANEOUS
##.ACQUISITION SCHEME= undefined
##.AVERAGES= 8
##.DIGITISER RES= 18
##SPECTROMETER/DATA SYSTEM= spect
##.PULSE SEQUENCE= zg30
##.SOLVENT NAME= CDCl3
##.SHIFT REFERENCE= (INTERNAL, CDCl3, 0, 15.7039)
##AUDIT TRAIL= $$ (NUMBER, WHEN, WHO, WHERE, WHAT)
$$ ##TITLE= Audit trail, XWIN-NMR		Version 3.5
$$ ##JCAMPDX= 5.01
$$ ##ORIGIN= Bruker BioSpin GmbH
$$ ##OWNER= she
$$ F:/spectra/data/she/nmr/H-F/1/audita.txt
$$ ##AUDIT TRAIL=  $$ (NUMBER, WHEN, WHO, WHERE, WHAT)
(   1,<2023-02-20 14:27:50.48 +0400>,<she>,<DPX200>,
      <created by zg, POWCHK disabled, PULCHK disabled
       configuration hash MD5:
       00 E9 B6 7A A2 85 ED C7 34 08 36 98 17 FE 4E 26
       data hash MD5: 16K
       D9 36 62 D3 B7 63 BA 9E EA 2F BB 7E 5D EE D9 50>)
$$ ##END=
$$ 
$$ hash MD5
$$ 09 FD 38 10 7F 04 9B F9 0E B1 67 CA D2 FC 86 A2
##$RELAX= 
##$RELAX= 
##$RELAX= 
##$RELAX= 
##$RELAX= 
##$RELAX= 
$$ Bruker specific parameters
$$ --------------------------
##$DU= <F:/spectra>
##$EXPNO= 1
##$NAME= <H-F>
##$PROCNO= 1
##$TYPE= <nmr>
##$USER= <she>
##$AMP= (0..31)
100 100 100 100 100 100 100 100 100 100 100 100 100 100 100 100 100 100 
100 100 100 100 100 100 100 100 100 100 100 100 100 100 
##$AQSEQ= 0
##$AQ_mod= 1
##$AUNM= <au_zg>
##$AUTOPOS= <>
##$BF1= 200.13
##$BF2= 200.13
##$BF3= 200.13
##$BF4= 200.13
##$BF5= 200.13
##$BF6= 200.13
##$BF7= 200.13
##$BF8= 200.13
##$BYTORDA= 1
##$CFDGTYP= 0
##$CFRGTYP= 5
##$CHEMSTR= <none>
##$CNST= (0..31)
1 1 145 1 1 1 1 1 1 1 1 1 1 1 1 1 1 1 1 1 1 1 1 1 1 1 1 1 1 1 1 1 
##$CPDPRG= <>
##$CPDPRG1= <>
##$CPDPRG2= <>
##$CPDPRG3= <>
##$CPDPRG4= <mlev>
##$CPDPRG5= <mlev>
##$CPDPRG6= <mlev>
##$CPDPRG7= <mlev>
##$CPDPRG8= <mlev>
##$CPDPRGB= <>
##$CPDPRGT= <>
##$D= (0..31)
0 1.2 0 0 0 0 0 0 0 0.06 0 0.03 0 0 0 0 0.0002 0 0 0 0 0 0 0 0 0 0 0 0 
0 0 0 
##$DATE= 1676888869
##$DBL= (0..7)
120 120 120 120 120 120 120 120 
##$DBP= (0..7)
150 150 150 150 150 150 150 150 
##$DBP07= 0
##$DBPNAM0= <>
##$DBPNAM1= <>
##$DBPNAM2= <>
##$DBPNAM3= <>
##$DBPNAM4= <>
##$DBPNAM5= <>
##$DBPNAM6= <>
##$DBPNAM7= <>
##$DBPOAL= (0..7)
0.5 0.5 0.5 0.5 0.5 0.5 0.5 0.5 
##$DBPOFFS= (0..7)
0 0 0 0 0 0 0 0 
##$DE= 6
##$DECBNUC= <off>
##$DECIM= 32
##$DECNUC= <off>
##$DECSTAT= 4
##$DIGMOD= 1
##$DIGTYP= 9
##$DL= (0..7)
0 120 120 120 120 120 120 120 
##$DP= (0..7)
150 150 150 150 150 150 150 150 
##$DP07= 0
##$DPNAME0= <>
##$DPNAME1= <>
##$DPNAME2= <>
##$DPNAME3= <>
##$DPNAME4= <>
##$DPNAME5= <>
##$DPNAME6= <>
##$DPNAME7= <>
##$DPOAL= (0..7)
0.5 0.5 0.5 0.5 0.5 0.5 0.5 0.5 
##$DPOFFS= (0..7)
0 0 0 0 0 0 0 0 
##$DQDMODE= 0
##$DR= 18
##$DS= 0
##$DSLIST= <SSSSSSSSSSSSSSS>
$$ [...]
##$SUBNAM2= <"">
##$SUBNAM3= <"">
##$SUBNAM4= <"">
##$SUBNAM5= <"">
##$SUBNAM6= <"">
##$SUBNAM7= <"">
##$SUBNAM8= <"">
##$SUBNAM9= <"">
##$SW= 18.05172834244
##$SWIBOX= (0..15)
0 0 2 0 0 0 0 0 0 0 0 0 0 0 0 0 
##$SW_h= 3612.71676300578
##$TD= 16384
##$TD0= 1
##$TE= 0
##$TE2= 300
##$TE3= 300
##$TEG= 300
##$TL= (0..7)
0 120 120 120 120 120 120 120 
##$TP= (0..7)
150 150 150 150 150 150 150 150 
##$TP07= 0
##$TPNAME0= <>
##$TPNAME1= <>
##$TPNAME2= <>
##$TPNAME3= <>
##$TPNAME4= <>
##$TPNAME5= <>
##$TPNAME6= <>
##$TPNAME7= <>
##$TPOAL= (0..7)
0.5 0.5 0.5 0.5 0.5 0.5 0.5 0.5 
##$TPOFFS= (0..7)
0 0 0 0 0 0 0 0 
##$TUNHIN= 0
##$TUNHOUT= 0
##$TUNXOUT= 0
##$USERA1= <user>
##$USERA2= <user>
##$USERA3= <user>
##$USERA4= <user>
##$USERA5= <user>
##$V9= 5
##$VALIST= <valist>
##$VCLIST= <CCCCCCCCCCCCCCC>
##$VD= 0
##$VDLIST= <DDDDDDDDDDDDDDD>
##$VPLIST= <PPPPPPPPPPPPPPP>
##$VTLIST= <TTTTTTTTTTTTTTT>
##$WBST= 1024
##$WBSW= 4
##$XGAIN= (0..3)
0 0 0 0 
##$XL= 0
##$YL= 0
##$YMAX_a= 203327
##$YMIN_a= -298060
##$ZGOPTNS= <>
##$ZL1= 120
##$ZL2= 120
##$ZL3= 120
##$ZL4= 120
##$ABSF1= 10
##$ABSF2= 0
##$ABSG= 5
##$ABSL= 3
##$ALPHA= 0
##$AQORDER= 0
##$ASSFAC= 0
##$ASSFACI= 0
##$ASSFACX= 0
##$ASSWID= 0
##$AUNMP= <proc_1d>
##$AZFE= 0.1
##$AZFW= 0.1
##$BCFW= 1
##$BC_mod= 2
##$BYTORDP= 1
##$COROFFS= 0
##$CY= 11.3945322036743
##$DATMOD= 1
##$DC= 2
##$DFILT= <>
##$DTYPP= 0
##$F1P= 2.36226072786647
##$F2P= -0.459571619588291
##$FCOR= 0.5
##$FTSIZE= 0
##$FT_mod= 4
##$GAMMA= 1
##$GB= 0.15
##$INTBC= 1
##$INTSCL= 1
##$ISEN= 128
##$LB= 0.24
##$LEV0= 0
##$LPBIN= 0
##$MAXI= 10000
##$MC2= 0
##$MEAN= 0
##$ME_mod= 0
##$MI= 1.114404
##$NCOEF= 0
##$NC_proc= 0
##$NLEV= 6
##$NOISF1= 3.799351
##$NOISF2= 2.8
##$NSP= 1
##$NTH_PI= 0
##$NZP= 0
##$OFFSET= 15.70392
##$PC= 1
##$PHC0= -19113.17
##$PHC1= 16.20078
##$PH_mod= 1
##$PKNL= yes
##$PPARMOD= 0
##$PSCAL= 0
##$PSIGN= 0
##$REVERSE= no
##$SF= 200.130013532006
##$SI= 16384
##$SIGF1= 3
##$SIGF2= 2
##$SINO= 400
##$SIOLD= 16384
##$SREGLST= <1H.CDCl3>
##$SSB= 0
##$STSI= 0
##$STSR= 0
##$SW_p= 3612.71676300578
##$SYMM= 0
##$S_DEV= 0
##$TDeff= 0
##$TDoff= 0
##$TI= <>
##$TILT= no
##$TM1= 0
##$TM2= 0
##$TOPLEV= 0
##$USERP1= <user>
##$USERP2= <user>
##$USERP3= <user>
##$USERP4= <user>
##$USERP5= <user>
##$WDW= 1
##$XDIM= 8192
##$YMAX_p= 0
##$YMIN_p= 0
$$ End of Bruker specific parameters
$$ ---------------------------------
##NTUPLES= NMR FID
##VAR_NAME=  TIME,          FID/REAL,        FID/IMAG
##SYMBOL=    X,             R,               I
##VAR_TYPE=  INDEPENDENT,   DEPENDENT,       DEPENDENT
##VAR_FORM=  AFFN,          ASDF,            ASDF
##VAR_DIM=   8192,          8192,            8192
##UNITS=     SECONDS,       ARBITRARY UNITS, ARBITRARY UNITS
##FACTOR=    0.0002768,     1,               1
##FIRST=     0,             0,               0
##LAST=      2.2672688,     0,               0
##MIN=       0,             -298060,         0
##MAX=       2.2672688,     203327,          0
$$ Real data points
##PAGE= N=1
##DATA TABLE= (X++(R..R)), XYDATA
$$ plain form
0 0 0 0 0 0 0 0 0 0 0 0 0 8 -8 8 -8 16 -16 16 -24 32 -32 40 -48 56 -67 80 -90 104 -120 143 -160 184 -208
33 -208 236 -267 301 -337 379 -423 472 -525 585 -649 718 -794 876 -967 1067 -1175 1296 -1426
51 -1426 1571 -1733 1911 -2112 2339 -2595 2890 -3230 3636 -4118 4707 -5453 6418 -7733 9633
66 9633 -12637 18119 -31360 134774 28446 -232381 55194 203327 16449 -158195 -34752
77 -34752 53622 29924 12184 20081 -34291 3082 106055 73727 -89678 -92142 39688 42031
89 42031 -89798 -102216 -14766 12973 -4853 11469 753 -22096 33794 87201 -3488 -90406
101 -90406 -11749 65686 -18356 -87479 -13382 46575 6851 304 39303 23997 6211 47592
113 47592 34553 -46811 -38966 38709 459 -89533 -29401 72495 6303 -76919 21457 112667
$$ packed form
0@%%%%%%%%%%%Qj6J6j6K4l2L2m0N6o4P2q8J04j23J47j70J94k24K63l03L44l92
33b08M44n03N68o38P16q02Q95r97J110j234J367j512J670j843K034k242K471k722
51a426K997l304L644m023M451m934N485o120O866p754Q825j0160J1871j4151J7366
66I633k2270L0756m9479J66134j06328k60827K87575J48133j86878j74644J23443
77c4752Q8374k3698j7740P897n4372L7373J02973l2328j63405k464J31830K343
89D2031j31829j2418Q7450K7739j7826J6322j0716k2849N5890N3407r0689q6918
101i0406P8657P7435q4042o9123P4097N9957l9724o547L8999j5306j7786M1381
113D7592j3039q1364P845P7675l8250q9992O0132J01896o6192q3222R8376R1210
$$ plain form
125 112667 6497 -84412 16192 83902 -29053 -98031 -6710 42844 -25001 -43924 19189
136 19189 32148 2149 20365 37603 -976 -15739 16338 6527 -39342 -31347 5446 -7014
148 -7014 -22658 11935 26409 -5473 2259 44602 23401 -34080 -20204 24370 -3206 -48631
160 -48631 -21220 15724 -1094 -9175 19397 22563 1174 15528 32848 -1542 -27623 -1541
172 -1541 6574 -25556 -24954 8566 1529 -19749 15633 46105 -474 -32770 22237 50842 -19662
185 -19662 -67050 -8306 38295 -10563 -51318 -10709 34048 24501 1476 -832 5603 18030 23028
198 23028 -6245 -37518 -15499 20768 2369 -31913 -13393 24648 21595 2669 7266 9864 -19
211 -19 4862 9152 -17552 -37197 -8400 18912 -7508 -31926 -568 33498 18669 -6566 -1848
$$ packed form
125A12667j06170r0909J00604O7710j12955o8978R1321M9554o7845j8923O3113
136A9189J2959k9999J8216J7238l8579j4763L2077r811m5869P995L6793j2460
148g014j5644L4593J4474l1882P732M2343k1201n7481J3876M4574k7576m5425
160d8631K7411L6944j6818q081K8572L166k1389J4354J7320l4390k6081K6082
172a541Q115l2130O02L3520p037k1278L5382L0472m6579l2296N5007K8605p0504
185a9662m7388N8744M6601m8858m0755M0609M4757r547k3025k308O435J2427M998
198B3028k9273l1273K2019L6267j8399l4282J8520L8041l053j8926M597K598r883
211a9M881M290k6704j9645K8797K7312k6420k4418L1358L4066j4829k5235M718
$$ plain form
224 -1848 11769 9637 -416 -12965 -22998 -8461 13221 1285 -21261 -2534 33276 23401 -10204
237 -10204 -3209 22799 9639 -19132 -15340 -202 -7450 -16220 -3653 4566 -1969 2934 15476
250 15476 9630 -2412 1569 5969 -5950 -13745 -6818 -5708 -10160 -1599 7543 1695 1165 16916
264 16916 19382 -893 -6166 10024 7533 -15449 -18139 -212 3082 -8631 -6358 7393 9308
277 9308 4684 6554 5008 -2032 -2417 -71 -8173 -15989 -7326 1736 -4215 -5876 6901 11881 4675
292 4675 5190 10930 4274 -6059 -1540 2959 -8616 -13820 -1438 7034 -439 -2910 7757 12720
306 12720 5060 528 1283 -1596 -5006 -5597 -8135 -11275 -5952 2746 863 -4048 5134 13350 5640
321 5640 -2433 1868 5087 -3160 -9061 -3973 -1533 -4419 -1324 4646 5215 3980 7387 8674 2564
$$ packed form
224a848J3617k132j0053j2549j0033J4537K1682j1936k2546J8727L5810r875l3605
237a0204O995K6008j3160k8771L792J5138p248q770J2567Q219o535M903J2542
250A5476n846j2042L981M400j1919p795O927J110m452Q561R142n848n30J5751
264A6916K466k0275n273J6190k491k2982k690J7927L294j1713K273J3751J915
277I308m624J870j546p040l85K346q102p816Q663R062n951j661J2777M980p206
292D675N15N740o656j0333M519M499j1575n204J2382Q472p473k471J0667M963
306A2720p660m532P55k879l410n91k538l140N323Q698j883m911R182Q216p710
321E640q073M301L219q247n901N088K440k886L095N970N69j235L407J287o110
$$ plain form
336 2564 -1473 269 -1897 -7562 -7307 -4609 -4305 -4099 816 4500 1498 1994 7175 4862 -2924 -4412
352 -4412 -584 -2504 -7595 -5479 -363 433 1249 5256 6184 4870 5326 5844 1971 -2727 -3115 -2560 -4629
369 -4629 -5490 -2939 -486 288 2089 5068 3531 472 1501 2011 -2539 -6759 -5578 -3107 -4012 -4127
385 -4127 -56 2355 2961 5275 6218 4473 2037 1747 784 -1760 -3606 -3939 -3940 -783 2725 1442 -335
402 -335 2755 7854 5718 -2731 -5603 50 1669 -5661 -10637 -6052 1640 2294 -992 -1541 2223 7410
418 7410 7214 -176 -5122 -1631 4120 991 -7360 -7265 1623 7279 3219 -2100 273 7704 8230 559
434 559 -6020 -4006 863 -479 -6192 -7932 -3482 2272 3633 39 -1317 1588 5674 4174 -3126
449 -3126 -6174 -1302 1358 -2336 -5378 -1183 3522 2586 2280 5778 5153 -222 -252 5143 3037 -7397
$$ packed form
336B564m037J742k166n665K55K698L04K06M915L684l002M96N181k313p786j488
352d412L828j920n091K116N116P96Q16M007R28j314M56N18l873m698l88N55k069
369d629q61K551K453P74J801K979j537l059J029N10m550m220J181K471r05j15
385d127M071K411O06K314R43j745k436k90r63k544j846l33jL157L508j283j777
402c35L090N099k136q449k872N653J619p330m976M585P692O54l286n49L764N187
418G410j96p390m946L491N751l129q351R5Q888N656m060n319K373P431N26p671
434E59o579K014M869j342n713j740M450N754J361l594j356K905M086j500p300
449c126l048M872K660l694l042M195M705r36l06L498o25n375l0N395k106j0434
$$ plain form
465 -7397 -9375 1106 5295 -3697 -8556 -160 8164 4867 -1823 -2793 -280 2223 1582 -4285 -9183
480 -9183 -5398 3915 5134 -3798 -7290 3867 14159 7491 -7171 -6308 7603 9664 -4234 -12217
494 -12217 -3114 7026 4219 -3767 -4782 1466 7591 6243 -2057 -6795 -2546 4760 2379 -9424
508 -9424 -11703 1241 8852 -1111 -9104 1077 11454 3981 -5246 -132 5491 -479 -5207 111
522 111 3217 -3006 -5011 3593 7636 1004 -3470 2433 6562 509 -4562 -2426 -998 -3018 -2495 -81
538 -81 -2309 -5023 1208 8279 3014 -7233 -3435 8545 7346 -7616 -11670 1720 9265 565 -8485
553 -8485 -2958 7952 9029 1461 -3555 -1700 4066 6355 -425 -9364 -7466 4753 7730 -5462
567 -5462 -12065 1421 12755 3441 -9413 -4778 6524 4076 -5504 -6351 -517 1191 -613 -530 1428
$$ packed form
465g397j978J0481M189q992m859Q396Q324l297o690r70K513K503o41n867m898
480i183L785R313J219q932l492J1157J0292o668j4662Q63J3911K061j3898p983
494a2217R103J0140k807p986j015O248O125j348q300m738M249P306k381j1803
508i424k279J2944P611r963p993J0181J0377p473r227N114N623n970m728N318
522A11L106o223k005Q604M043o632m474N903M129o053n071K136J428k020N23K414
538h1k228k714O231P071n265j0247L798J1980j199j4962m054J3390P545q700r050
553h485N527J0910J077p568n016J855N766K289o780q939J898J2219K977j3192
567e462o603J3486J1334r314j2854M635J1302k448r580q47N834J708j804Q3J958
$$ plain form
582 1428 -307 595 5821 5781 -1342 -4552 2551 5948 -2156 -7433 -1145 4001 699 -2704 334 2823
598 2823 447 -370 1618 255 -4064 -4337 1293 2071 -4525 -6747 970 6182 1721 -3159 -707 4848
614 4848 4704 378 -3212 -2892 2000 4412 -788 -5814 -1689 6430 6049 -2381 -5088 2900 7358 759
630 759 -7696 -4954 2975 2447 -4278 -5735 -184 3772 1596 -1383 -520 1087 1530 911 -645 -2472
646 -2472 -2212 1419 2703 -1809 -3144 2474 5982 2118 -2235 811 4017 1367 -3494 -2259 637
661 637 385 -2520 -2796 -86 1063 277 -626 -46 777 1080 -1269 -2876 -1209 1321 -300 -3216 -826
678 -826 3300 2389 -425 240 2587 2904 822 -488 -471 474 704 -1011 -1974 -528 817 829 24 -228
696 -228 541 -164 -235 -721 -1850 -2669 -1127 397 -797 -2453 -818 2924 2210 -1141 -262 2519 2534 -626
$$ packed form
582A428j735R02N226m0p123l210P103L397q104n277O288N146l302l403L038K489
598B823k376q17J988j363m319k73N630P78o596k222P717N212m461m880K452N555
614D848j44m326l590L20M892K412n200n026M125Q119l81q430k707P988M458o599
630G59q455K742P929n28o725j457N551L956k176k979Q63J607M43o19j556j827
646b472K60L631J284m512j335N618L508l864m353L046L206k650m861J235K896
661F37k52k905k76K710J149p86r03N80Q23L03k349j607J667K530j621k916K390
678h26M126r11k814O65K347L17k082j310J7R45K30j715r63J446J345J2q05k52
696b28P69p05p1m86j129q19J542J524j194j656J635L742p14l351Q79K781J5l160
$$ plain form
714 -626 -1281 532 514 -100 -130 -131 93 1380 1432 351 -275 721 603 -1197 -1204 -822 -1548 -2146 -830 237 -940
735 -940 -1252 1227 1964 -113 -1008 700 1661 -355 -1831 -404 1135 634 -255 467 839 1907 1810 284
753 284 -255 884 1212 -1245 -2290 -632 294 -1406 -1864 -193 720 -223 -713 236 290 -605 -240 -165 -1056
772 -1056 -1250 -247 895 32 -43 1224 1779 1308 842 724 504 415 404 -595 -1357 -334 635 -444 -1122
791 -1122 -161 1325 237 -1248 -633 399 -793 -1255 -1355 -592 -551 -861 218 559 458 850 965 790
809 790 901 644 335 45 141 226 -77 -508 891 770 147 -295 649 682 -378 -1072 -437 -562 -1154 -1520 -1001
830 -1001 -235 -368 -241 -172 147 648 409 -72 -37 314 429 -169 -544 254 733 497 776 825 589 834 764
851 764 252 -644 -743 -15 64 -1248 -1658 -714 560 53 -1394 -399 287 616 -538 -959 -561 336 -79 -289
$$ packed form
714f26o55J813j8o14l0jK24J287N2j081o26R96j18j800pL82p26n98J316J067j177
735i40l12K479P37k077q95J708R61k016j476J427J539n01q89P22L72J068r7j526
753B84n39J139L28k457j045J658R26j700m58J671R13r43m90R49N4q95L65P5q91
772a056j94J003J142q63p5J267N55m71m66j18k20q9j1r99p62J023R69j079o78
791a122R61J486j088j485O15J032j192m62j00P63M1l10J079L41j01L92J15j75
809G90J11k57l09k90R6Q5l03m31J399j21o23m42R44L3j060o94O35j25n92l66N19
830a001P66j33J27O9L19N01k39m81L5L51J15n98l75P98M79k36K79M9k36K45p0
851G64n12q96r9P28P9j312m10R44J274n07j447R95O86L29j154m21L98Q97m15k10
$$ plain form
871 -289 -480 -38 1115 1369 589 438 1070 1193 681 43 -34 56 -124 -118 -515 -735 -467 301 435 -485 -862
892 -862 -176 264 -437 -943 -1013 -769 -204 344 -420 -609 234 1351 1125 14 -332 873 1602 400 -1022
911 -1022 -387 715 773 142 -316 -205 462 1006 130 -1357 -1224 580 626 -1214 -1977 -715 510 79 -964
930 -964 -1034 236 1171 565 -437 103 554 675 155 -18 34 308 879 836 419 5 358 1070 717 -396
950 -396 -1339 124 207 -1019 -1231 -444 -432 -562 164 502 -1185 -1119 956 1411 -845 -2169 386 1753 91
969 91 -1550 -26 1703 1331 359 -229 374 758 1126 900 -1164 -1193 422 1138 -767 -2234 -673 1860
987 1860 573 -1664 -1731 373 909 -631 -1869 -895 693 299 -692 -699 217 734 449 782 445 126 368
1006 368 975 673 -872 -864 1431 985 -973 -840 1142 687 -1269 -321 479 -388 -1770 -170 1034 -679
$$ packed form
871b89j91M42J153K54p80j51O32J23n12o38p7R0j80Ol97k20K68P68J34r20l77
892h62O86M40p01n06p0K44N65N48p64j89Q43J117k26j111l46J205P29j202j422
911a022O35J102N8o31m58J11O67N44q76j487J33J804M6j840p63J262J225m31j043
930i64p0J270R35o06j002N40M51J21n20j73N2K74N71m3m17m14L53P12l53j113
950c96r43J463Q3j226k12P87J2j30P26L38j687O6K075M55k256j324K555J367j662
969I1j641J524J729l72r72n88O03L84L68k26k064k9J615P16j905j467J561K533
987A860j287k237o7K104N36j540j238R74J588l94r91pR16N17k85L33l37l19K42
1006C68O07l02j545QK295m46j958J33J982m55j956R48Q00q67j382J600J204j713
$$ plain form
1024 -679 -2003 -368 1491 66 -1580 -86 1430 672 -596 126 425 43 457 1033 -224 -858 585
1041 585 1951 710 -1092 -326 1247 1086 -1093 -1611 -154 952 -435 -1765 -1124 498 980 -750
1057 -750 -1078 198 355 -298 267 -194 -561 -208 1206 958 -790 -424 1892 1380 -767 -281 1413 949
1075 949 -719 -999 850 69 -1157 -251 385 -177 -1219 -40 824 -353 -1115 123 148 -839 -603 141
1093 141 -134 -622 155 1023 -11 -226 675 872 304 31 117 415 482 68 -264 -69 975 675 -585 -756
1113 -756 358 577 -343 -930 -468 -105 -488 -494 -398 -560 -440 410 562 -401 -220 837 824 -559 -105 752
1133 752 782 -545 -288 777 168 -308 482 437 267 -81 352 -66 -674 -383 275 -481 -922 -131 218 -277
1153 -277 -566 -19 120 -378 -108 165 -32 54 437 98 8 234 431 480 16 270 865 289 -184 39 377
$$ packed form
1024f79j324J635J859j425j646J494J516p58j268P22K99l82M14N76j257o34J443
1041E85J366j241j802P66J573j61k179n18J457J106j387j330O41J622M82j730
1057g50l28J276J57o53N65m61l67L53J414k48j748L66K316n12k147M86J694m64
1075I49j668k80J849p81j226R06O36n62j042J179Q64j177p62J238K5r87K36P44
1093A41k75m88P77Q68j034k15R01J97n68k73Q6K98O7m14l32J95J044l00j260j71
1113g56J114K19r20n87M62L63l83oR6j62J20Q50J52r63J81J057j3j383M54Q57
1133G52L0j327K57J065o09m76P90m5j70l48M33m18o08K91O58p56m41P91L49m95
1153b77k89N47J39m98K70K73j97Q6L83l39r0K26J97M9m64K54N95n76m73K23L38
$$ plain form
1174 377 105 -371 147 -79 -793 -363 -212 -469 -483 -124 54 -579 -722 67 -285 -434 -194 193 -236 -2
1194 -2 272 679 229 -24 578 607 52 138 428 186 -294 31 318 -199 -422 203 382 -212 -526 -122 -85 -663
1216 -663 -251 -210 -291 -407 -187 -21 -114 -313 354 481 -195 327 396 468 279 324 263 276 82 331 437 -183 93
1239 93 261 161 -343 -175 21 -209 -364 -581 -273 -358 -187 -185 -334 -416 145 59 -222 -197 35 169 100 -3 415
1262 415 388 281 409 374 -48 61 450 205 -25 -224 100 -316 -466 -139 -266 -506 -508 -223 -204 -255 -214 23
1284 23 -91 -259 -281 -54 23 -234 -4 197 298 221 524 416 205 163 332 138 20 15 183 -42 -107 -118 -31
1307 -31 -402 -22 -151 -273 -324 -201 -259 -338 -474 -31 -255 -247 -185 -137 97 2 352 381 134 68 252 409 -80 353
1331 353 324 499 -45 235 218 18 -365 -101 -186 -204 -204 -334 -347 -698 -31 -6 -484 -210 -203 136 227 143 -1 12
$$ packed form
1174C77k72m76N18k26p14M30J51k57j4L59J78o33j43P89l52j49K40L87m29K34
1194bK74M07m50k53O02K9n55Q6K90k42m80L25K87n17k23O25J79n94l14M04L7n78
1216f63M12M1q1j16K20J66r3j99O67J27o76N22O9P2j89M5o1J3j94K49J06o20K76
1239I3J68j00n04J68J96k30j55k17L08q5J71Kj49q2N61q6k81K5K32J34o9j03M18
1262D15k7j07J28l5m22J09L89k45k30j99L24m16j50L27j27k40kK85J9n1M1K37
1284B3j14j68k2K27P7k57K30K01J01p7L03j08k11m2J69j94j18nJ68k25o5j1Q7
1307c1l71L80j29j22n1J23n8p9j36M43k24QO2M8K34r5L50K9k47o6J84J57m89M33
1331C53k9J75n44K80j7k00l83K64q5j8%j30j3l51O67K5m78K74PL39R1q4j44J3
$$ plain form
1355 12 272 325 266 301 117 471 245 33 389 417 119 272 -112 332 -218 -316 -53 -68 -312 -261 163 -344 -395
1378 -395 -180 -98 -140 -371 -192 263 41 141 69 95 -16 50 265 127 81 237 320 250 82 16 112 164 -75 24
1402 24 -182 -18 -90 -297 -194 -78 -409 -131 -449 -338 -175 44 -323 -90 -93 -260 288 238 -29 18 251 489
1424 489 286 40 249 298 178 5 57 -116 -44 -18 384 4 -492 -214 -133 38 -440 -417 -355 -275 -187 -257 -120
1447 -120 57 -5 -66 270 -56 -68 125 104 128 35 253 428 308 207 1 145 -94 30 -321 -3 -163 -154 -375
1470 -375 -213 -224 -162 -219 -9 -59 -140 -166 120 -212 -373 21 201 -39 -79 -113 318 262 163 105 699 238 43 -42
1494 -42 278 221 -153 -63 432 -137 -259 -20 188 -217 -329 -120 72 -219 -430 -265 129 58 -201 147 223 -195
1516 -195 -119 247 444 103 -207 281 303 33 -90 246 183 76 79 13 284 45 -328 -23 -162 -23 -188 -16
$$ packed form
1355A2K60N3n9L5j84L54k26k12L56K8k98J53l84M44n50r8K63j5k44N1M24n07n1
1378c95K15Q2m2k31J79M55k22J00p2K6j11O6K15j38m6J56Q3p0j68o6R6N2k39R9
1402B4k06J64p2k07J03J16l31K78l18J11J63K19l67K33lj67N48n0k67M7K33K38
1424D89k03k46K09M9j20j73N2j73P2K6M02l80m96K78Q1J71m78K3O2Q0Q8p0J37
1447a20J77o2o1L36l26j2J93k1K4r3K18J75j20j01k06J44k39J24l51L18j60Rk21
1470c75J62j1O2n7K10n0q1k6K86l32j61L94J80k40m0l4M31n6r9n8N94m61j95q5
1494d2L20n7l74R0M95n69j22K39K08m05j12K09J92k91k11J65L94p1k59L48P6m18
1516a95P6L66J97l41l10M88K2k70j23L36o3j07Lo6K71k39l73L05j39J39j65J72
$$ plain form
1538 -16 -410 -114 -168 -173 44 -122 -297 179 277 96 -151 131 439 -44 -281 229 561 139 143 410 180 -148
1560 -148 323 225 -21 -369 -57 374 -360 -153 -204 118 -342 -83 -206 -241 -283 -162 178 -168 158 228 -356 -51
1582 -51 58 121 169 193 390 133 -320 -114 148 -104 155 163 123 -70 -39 26 -183 -455 -482 -20 -83 -625 -247 -35
1606 -35 57 -271 -217 282 30 20 198 28 -3 143 402 155 204 237 293 -45 108 206 -83 -288 -142 196 0
1629 0 -147 -48 18 60 -467 -358 -247 -177 -197 -121 -277 -232 -81 -55 -159 -310 102 -4 -298 337 305 133 59 180
1653 180 131 -152 155 332 453 -365 -42 133 -236 -473 -175 305 -283 -382 -93 40 -133 -441 192 -21 -450
1674 -450 -203 -50 51 33 80 253 124 51 93 -5 93 142 283 22 115 98 85 149 -132 98 83 -315 -177 150
1698 150 -275 -335 -55 31 -457 -426 199 -314 -285 -12 37 122 -174 231 231 340 24 331 280 117 -106 167 295
$$ packed form
1538a6l94K96n4nK17j66j75M76R8j81k47K82L08m83k37N10L32m22MK67k30l28
1560a48M71r8k46l48L12M31p34K07n1L22m60K59j23l5m2J21L40l46L26P0n84L05
1582e1J09O3M8K4J97k57m53K06K62k52K59Qm0j93L1O5k09k72k7M62o3n42L78K12
1606c5R2l28N4M99k52j0J78j70l1J46K59k47M9L3N6l38J53R8k89k05J46L38j96
1629@j47R9O6M2n27J09J11P0k0P6j56M5J51K6j04j51M12j06k94O35l2j72p4J21
1653A80m9k83L07J77J21q18L23J75l69k37K98M80n88r9K89J33j73l08O33k13m29
1674d50K47J53J01j8M7J73j29p3M2r8R8M9J41k61R3j7j3O4k81K30j5l98J38L27
1698A50m25o0K80Q6m88L1O25n13K9K73M9Q5k96M05%J09l16L07n1j63k23K73J28
$$ plain form
1721 295 -24 -27 125 -171 -312 -180 -20 -148 -165 -76 -280 -346 -389 56 -231 -258 -47 28 249 -104 79 230 54
1744 54 65 442 39 -63 262 287 24 -9 5 63 -70 86 36 -162 -230 211 -135 -266 -210 -231 -25 -190 -81
1767 -81 -182 12 -173 -151 76 98 166 127 1 -59 -92 517 151 37 255 352 -306 -8 104 128 144 -151 -89 -212
1791 -212 79 -187 48 -380 -154 167 -101 -440 24 -60 -209 -181 138 121 0 81 179 124 97 218 221 255 -106
1814 -106 72 -38 228 205 46 384 15 118 216 -66 -293 -365 15 -270 -71 -138 -169 -32 205 -82 -106 148
1836 148 -237 -23 -125 151 119 236 62 190 53 -126 72 205 -58 103 187 -164 16 -246 -171 173 -255
1857 -255 -439 -111 79 7 -46 -235 307 -160 179 -48 -272 -271 -212 -42 187 179 -39 40 361 83 26 173 216
1880 216 16 24 45 -150 13 -41 -242 -9 264 38 -101 -204 -19 -100 60 -84 -14 -273 -8 -63 156 -18
$$ packed form
1721B95l19lJ52k96j41J32J60j28j7Q9k04o6m3M45k87k7K11P5K21l53J83J51j76
1744E4J1L77m03j02L25K5k63l3J4N8j33J56n0j98o8M41l46j31N6k1K06j65J09
1767h1j01J94j85K2K27K2O8l9j26o0l3O09l66j14K18R7o58K98J12K4J6k95O2j23
1791b12K91k66K35m28K26L21k68l39M64q4j49K8L19j7j21Q1R8n5k7J21LL4l61
1814a06J78j10K66k3j59L38l69J03R8k82k27p2L80k85J99o7l1J37K37k87k4K54
1836A48l85K14j02K76l2J17j74J28j37j79J98J33k63J61Q4l51J80k62P5L44m28
1857b55j84L28J90p2n3j89N42m67L39k27k24JN9J70K29qk18P9L21k78n7J47M3
1880B16k00QK1j95J63n4k01K33K73k26j39j03J85q1J60j44P0k59K65n5K19j74
$$ plain form
1902 -18 -17 125 244 -32 116 322 121 -87 92 75 184 115 -3 95 63 140 44 59 -86 -217 -21 -54 -118 -116 -4
1927 -4 -138 -44 -80 -54 -11 -77 68 38 256 60 -34 -27 273 9 250 -41 31 306 195 129 20 283 -19 42 -7
1952 -7 -135 -192 -202 78 -6 -156 43 -23 85 -230 149 242 -149 100 147 317 336 246 179 -105 138 164 356 13
1976 13 -47 72 -65 63 -47 -98 38 146 -102 177 129 -300 -44 -35 -96 -5 -114 32 -39 146 124 21 210
1999 210 46 -259 267 300 -89 56 -9 55 -8 125 312 33 -22 238 24 282 -66 -59 -29 24 -59 -13 -6 96
2023 96 -281 -401 154 -261 -83 -200 120 224 -82 43 210 101 80 40 65 198 -315 107 103 102 119 -13 -135
2046 -135 -63 -148 -81 -87 -28 -107 -23 -256 1 -297 -4 133 -218 15 -153 34 -29 -26 -15 182 -38 27 187 61
2070 61 89 41 58 33 -35 95 -90 138 229 -417 -157 95 -70 -202 -308 15 -301 -343 50 -18 1 -79 48 15
$$ packed form
1902a8JJ42J19k76J48K06k01k08J79j7J09o9j18R8l2P7r6J5j45j31J96l3o4KJ12
1927dj34R4l6K6M3o6J45l0K18j96r4PL00k64K41k91P2K75j11o6j09K63l02O1m9
1952gj28n7j0K80q4j50J99o6J08l15L79R3l91K49M7J70J9r0o7k84K43K6J92l43
1976A3o0J19j37J28j10n1J36J08k48K79m8m29K56Ro1R1j09J46p1J85k2j03J89
1999B10j64l05N26L3l89J45o5O4o3J33J87k79n5K60k14K58l48PL0N3q3M6PJ02
2023I6l77j20N55m15J78j17L20J04l06J25J67j09k1m0K5J33n13M22mjJ7j32j22
2046a35P2q5O7oN9p9Q4k33K57k98K93J37l51K33j68J87o3LJ1J97k20O5J60j26
2070F1K8m8J7k5o8J30j85K28R1o46K60K52j65j32j06L23l16m2L93o8J9q0J27l3
$$ plain form
2094 15 -177 237 167 72 -162 193 25 -41 133 53 127 61 60 178 185 -124 39 -78 -87 114 -121 -35 -5 -141 -91
2119 -91 -183 -60 -52 109 -65 44 60 -107 161 66 97 107 -98 19 64 -2 -52 210 43 -13 24 120 -69 83 -121
2144 -121 -177 197 -214 -78 -135 106 -128 13 -28 -86 -31 -213 23 51 53 -54 38 272 271 -50 0 340 275 39
2168 39 -14 -52 115 352 102 173 90 61 -250 -5 -112 -96 -21 -162 -162 -149 114 130 278 247 -81 70 -214 -104
2192 -104 -76 -33 -216 -158 42 52 29 -173 84 -9 146 12 104 86 139 85 149 133 -52 -131 -72 -166 6 -140 189
2217 189 -64 -340 -34 -34 -94 -8 -193 -7 30 124 286 -189 105 -156 297 144 196 64 -143 136 -168 55
2239 55 -176 213 -153 -111 237 -101 -48 -250 -98 -187 -14 -69 -208 -209 80 170 -35 -186 77 -154 -123 -48 236
2262 236 -16 -131 140 151 75 19 1 -118 40 16 200 136 -3 -134 71 -7 -187 119 -119 174 -105 -40 -21
$$ packed form
2094A5j92M14p0r5k34L55j68o6J74q0P4o6jJ18Pl09J63j17rK01k35Q6L0j36N0
2119i1r2J23QJ61j74J09J6j67K68r5L1J0k05J17M5o6n0K62j67n6L7R6j89J52k04
2144a21n6L74m11J36n7K41k34J41m1n8N5j82K36K8Kj07R2K34jl21N0L40o5k36
2168C9n3l8J67K37k50P1q3k9l11K45j07J6P5j41%J3K63J6J48l1l28J51k84J10
2192a04K8M3j83N8K00J0k3k02K57r3J55j34R2j8N3n4O4j6j85p9N9r4J72j46L29
2217A89k53k76L06%o0Q6j85J86L7R4J62m75K94k61M53j53N2j32k07K79l04K23
2239E5k31L89l66M2L48l38N3k02J52q9J73n5j39jK89R0k05j51K63k31L1P5K84
2262B36k52j15K71J1p6n6j8j19J58k4J84o4j39j31K05p8j80L06k38K93k79O5J9
$$ plain form
2285 -21 61 83 61 -19 -217 -92 136 -48 -170 -85 153 239 97 -27 46 -89 -66 117 8 23 20 -256 -113 -203
2309 -203 87 -224 -89 12 -96 -309 -239 239 180 -47 -88 15 -36 -10 4 140 -166 162 118 -69 111 104 72
2332 72 -4 -188 -54 70 -77 -39 29 237 -59 37 -120 138 -49 -222 -20 -162 106 -13 97 -165 -63 -131
2354 -131 11 68 -17 125 57 51 178 -102 140 -160 -115 -82 -185 15 72 92 -140 92 1 -163 -225 -261 78 -17
2378 -17 -77 118 126 -18 -12 24 -20 18 -189 -95 -203 144 42 -84 99 184 11 197 -117 -70 -6 71 -59 21 -131
2403 -131 -95 120 -10 -205 -48 -99 -87 -104 -54 -190 -189 129 74 50 -43 -4 11 -196 48 93 -40 -56 -10 179 26
2428 26 47 45 298 93 136 -291 -69 133 -319 165 105 62 7 83 -95 -18 -167 346 -12 -66 58 -235 -68 -199
2452 -199 -108 -177 148 -54 3 237 -274 -1 -78 -238 -250 64 -83 150 312 -66 54 -169 -159 136 -270 178
$$ packed form
2285b1Q2K2k2q0j98J25K28j84j22Q5K38Q6j42j24P3j35K3J83j09J5lk76J43r0
2309b03K90l11J35J01j08k13P0M78n9k27m1J03n1K6J4J36l06L28m4j87J80pl2
2332G2p6j84J34J24j47L8O8K08k96R6j57K58j87j73K02j42K68j19J10k62J02o8
2354a31J42N7q5J42o8oJ27k80K42l00M5L3j03K00N7K0k32K32r1j64o2l6L39r5
2378a7o0J95Qj44OL6m4L8k07R4j08L47j02j26J83Q5j73J86l14M7O4P7j30Q0j52
2403a31L6K15j30j95J57n1J2j7N0j36JL18n5k4r3L9J5k07K44M5j33j6M6J89j53
2428B6K1kK53k05M3m27K22K02m52M84o0m3n5P6j78P7j49N13l58n4J24k93J67j31
2452a99R1o9L25k02N7K34n11K73p7j60j2L14j47K33J62l78J20k23J0K95m06M48
$$ plain form
2474 178 203 -129 6 145 114 30 90 -90 -32 117 288 -6 5 -205 11 -14 -76 -73 217 -49 -387 19 -98
2497 -98 31 -39 108 -110 252 -79 -206 -60 172 -63 113 96 227 9 140 -76 -188 40 82 230 115
2518 115 178 -114 61 -153 -101 110 199 -71 53 -62 -136 37 -92 126 -131 61 -97 -19 -276 -22 -259 63
2540 63 -55 -65 108 -198 125 -289 166 -31 31 159 -76 96 -114 50 285 -116 90 -48 63 141 1
2561 1 108 124 -144 65 -6 124 -64 -103 -127 -45 25 -140 -62 -92 186 -40 15 -149 8 -27 129 72 163 69 -33
2586 -33 -46 69 43 -128 108 -11 80 56 117 -85 -15 -145 251 -160 86 -201 -5 -83 199 -5 170 -122 -267
2609 -267 49 12 -138 155 14 146 -9 43 99 -29 113 31 127 -84 82 118 52 -60 -28 -186 -232 -42 -86
2632 -86 13 -157 -90 -90 -240 -33 2 162 -75 -57 -2 -202 -281 11 87 -18 118 22 38 6 22 68 -48 48 101 -92
$$ packed form
2474A78K5l32J35J39l1q4O0j80N8J49J71k94J1k10K16k5o2LK90k66l38M06j17
2497i8J29p0J47k18L62l31j27J46K32k35J76j7J31k18J31k16j12K28M2J48j15
2518A15O3k92J75k14N2K11Q9k70J24j15p4J73j29K18k57J92j58P8k57K54k37L22
2540F3j18j0J73l06L23m14M55j97O2J28k35J72k10J64K35m01K06j38J11P8j40
2561AJ07J6k68K09p1J30j88l9k4Q2P0j65P8l0K78k26N5j64J57l5J56n7R1r4j02
2586c3j3J15k6j71K36j19R1k4O1k02P0j30L96m11K46k87J96p8K82k04J75k92j45
2609b67L16l7j50K93j41J32j55N2N6j28J42q2R6k11J66L6o6j12L2j58m6J90m4
2632h6R9j70O7%j50K07L5J60k37J8N5k00p9K92P6j05J36r6J6l2J6M6j16R6N3j93
$$ plain form
2658 -92 246 -114 134 203 286 -51 -77 -255 -33 165 -157 -87 -54 -137 139 130 -168 50 278 67 23 113 84 5
2682 5 -111 161 54 45 73 438 -17 113 188 169 116 -160 -68 137 104 -245 -254 172 -96 -76 155 -44 15 -18 -61
2707 -61 38 -239 52 86 288 113 -218 -93 26 89 168 115 -23 219 4 65 -254 -23 -220 135 6 87 -119
2730 -119 266 148 164 -178 -29 -158 -257 10 -139 118 -57 12 -31 217 -4 217 153 58 176 -149 113 -98
2752 -98 27 -97 5 101 -15 -167 1 125 -160 147 -100 -325 45 83 9 109 67 -161 -165 276 -14 -36 148
2775 148 -1 503 219 -17 -205 165 92 106 -43 7 89 -155 99 49 -255 -84 -138 19 -97 -68 -86 -220 5
2798 5 108 8 156 -145 -41 -59 134 -341 59 21 -48 161 231 -67 217 -211 -63 68 -86 75 118 -85
2820 -85 216 35 90 -82 -102 -21 -193 -101 -19 6 7 -22 16 137 224 -33 103 113 -226 50 241 140 64 -82 -44
$$ packed form
2658i2L38l60K48O9Q3l37k6j78K22J98l22P0L3q3K76rk98K18K28k11m4R0k9p9
2682Ej16K72j07rK8L65m55J30P5j9n3k76R2K05l3l49rM26k68K0K31j99N9l3m3
2707f1R9k77K91L4K02j75l31J25J19O3P9n3j38K42k15O1l19K31j97L55j29Q1k06
2730a19L85j18J6l42J49j29r9K67j49K57j75O9m3K48k21K21o4r5J18l25K62k11
2752i8J25j24J02R6j16j52J68J24k85L07k47k25L70L8p4J00m2k28mM41k90k2J84
2775A48j49N04k84k36j88L70p3J4j49N0Q2k44K54n0l04J71n4J57j16K9j8j34K25
2798EJ03j00J48l01J04j8J93m75M00l8o9K09P0k98K84m28J48J31j54J61M3k03
2820h5L01j81N5j72k0Q1j72R2Q2K5Jk9L8J21Q7k57J36J0l39K76J91j01p6j46L8
$$ plain form
2845 -44 7 75 53 90 -87 -96 -131 -87 -37 -209 -69 -279 7 -48 -106 -117 -235 -271 178 -85 248 171 -9 -44 74
2870 74 215 -11 -182 28 -131 35 22 -46 11 203 85 -42 60 -207 41 -330 32 -166 86 -68 -161 -119
2892 -119 136 19 -175 136 -110 26 -45 97 -31 -196 -199 263 106 89 165 147 -140 50 -80 142 44 -56
2914 -56 164 -41 -50 -209 121 -58 72 -32 21 160 -87 15 -133 -29 -51 -123 -32 -95 -74 45 56 -168 18
2937 18 -125 152 -287 -124 -43 -98 1 53 -257 -2 -26 71 -16 49 21 195 166 87 -32 75 185 4 -6 -142
2961 -142 13 -208 -44 31 -38 -359 201 36 251 151 -174 212 120 48 -4 155 37 22 -67 92 -85 94
2983 94 -110 -48 67 -19 -116 40 -132 61 -109 -69 53 -146 -13 -195 -140 -208 146 129 234 134 -73 103 37
3006 37 54 -71 6 -220 -52 -91 87 -178 346 -138 -88 -15 -235 4 66 -201 79 12 124 -22 -110 238 -164
$$ packed form
2845d4N1O8k2L7j77rl5M4N0j72J40k10K86n5n8j1j18l6M49k63L33p7j80l5J18
2870G4J41k26j71K10j59J66j3o8N7J92j18j27J02k67K48l71L62j98K52j54r3M2
2892a19K55j17j94L11k46J36p1J42j28j65lM62j57j7P6j8k87J90j30K22r8j00
2914e6K20k05rj59L30j79J30j04N3J39k47J02j48J04k2p2R1o3K1J19J1k24J86
2937A8j43K77m39J63Q1n5R9N2l10K55k4R7q7O5k8J74k9p9j19J07J10j81j0j36
2961a42J55k21J64P5o9l21N60j65K15j00l25L86r2p2n2J59j18j5q9J59j77J79
2983I4k04O2J15q6r7J56j72J93j70M0J22j99J33j82N5o8L54j7J05j00k07J76o6
3006C7J7j25P7k26J68l9J78k65N24m84N0P3k20K39O2k67K80o7J12j46q8L48m02
$$ plain form
3029 -164 -23 -43 136 19 63 16 -40 -69 180 225 -130 -7 225 -13 141 87 4 59 -89 -151 18 -27 -150 237
3053 237 6 -3 112 -184 -127 65 -42 5 45 -130 2 -93 -24 -66 112 -67 -48 -116 232 203 242 -186 31 -31
3077 -31 74 -133 -151 139 -6 151 61 94 -137 7 143 -146 190 -43 -45 -4 51 -146 -236 -193 -42 -155 212
3100 212 -47 51 235 83 -17 10 -4 129 57 49 -188 39 25 103 14 -75 -145 154 9 97 50 -107 -88 105 -93
3125 -93 -135 136 36 139 35 147 -71 177 178 -132 168 56 -35 -33 -59 -104 109 -207 64 152 46 -100 -31 -37
3149 -37 -92 -74 -147 206 2 285 62 -46 20 -50 -161 21 -33 -168 -38 248 2 239 50 -7 80 63 -199
3172 -199 -15 0 90 7 34 -6 28 -16 192 -27 -160 -173 -299 189 321 199 246 3 -54 62 -154 194 59
3195 59 -22 -231 -35 -194 180 73 -42 -182 -25 -5 280 75 -95 29 -270 -40 -1 116 117 12 -160 17
$$ packed form
3029a64J41k0J79j17M4m7n6k9K49M5l55J23K32k38J54n4q3N5j48o2J69m5j23L87
3053B37k31rJ15k96N7J92j07M7M0j75J32r5O9m2J78j79J9o8L48k9L9m28K17o2
3077c1J05k07j8K90j45J57r0L3k31J44J36k89L36k33kM1N5j97r0M3J51j13L67
3100B12k59R8J84j52j00K7j4J33p2qk37K27j4P8q9q9p0K99j45Q8m7j57J9J93j98
3125i3m2K71j00J03j04J12k18K48Jl10L00j12r1Kk6m5K13l16K71Q8j06j46O9o
3149c7n5J8p3L53k04K83k23j08O6p0j11J82n4j35J30K86k46K37j89n7Q7j7k62
3172a99J84J5R0q3K7m0L4m4K08k19j33j3j26M88J32j22M7k43n7J16k16L48j35
3195E9q1k09J96j59L74j07j15j40J57K0K85k05j70J24k99K30L9J17Jj05j72J77
$$ plain form
3217 17 40 -39 -188 -41 -86 44 195 49 193 -59 -48 -124 29 38 162 227 121 -103 -145 -47 9 151 -261 36
3241 36 -26 -96 82 165 -200 -200 -38 -262 -119 -137 -46 247 -13 19 -87 -45 71 -112 33 116 60 -227 -206 230
3265 230 -236 115 125 -144 -73 -146 -1 -88 -205 -106 -113 -168 -281 16 -106 -222 108 58 39 136 51 116 80 -111 -27
3290 -27 26 -11 -144 152 63 -227 -33 -22 -98 141 123 3 -84 12 39 -129 87 -286 15 -121 77 258 101
3313 101 -14 2 163 -7 118 -117 31 113 -28 24 159 164 10 74 -7 11 -37 208 25 -25 -87 -48 188 -166
3337 -166 -97 -28 -185 -28 -119 -105 44 164 104 -45 -372 215 90 -184 104 -17 -144 31 -191 -62 -60 95
3359 95 -133 97 -49 -13 38 -80 -115 -21 62 3 63 -213 -239 -141 48 -51 272 -58 -138 -27 -96 -11 -336 -100 154
3384 154 347 -11 79 312 318 -112 -246 -100 129 114 227 183 -122 -146 -238 126 -244 48 -13 134 -13 113 90
$$ packed form
3217A7K3p9j49J47m5J30J51j46J44k52J1p6J53RJ24O5j06k24m2R8N6J42m12K97
3241C6o2p0J78Q3l65%J62k24J43j8R1K93k60L2j06M2J16j83J45Q3n6k87K1M36
3265B30m66L51J0k69P1p3J45q7j17R9pn5j13K97j22j16L30n0j9R7q5O5l6j91Q4
3290b7N3l7j33K96q9k90J94J1p6K39j8j20q7R6K7j68K16l73L01j36J98J81j57
3313A01j15J6J61j70J25k35J48Q2j41N2J35Nj54O4q1J8m8K45j83n0o2L9K36l54
3337a66O9O9j57J57r1J4J49J20o0j49l27N87j25k74K88j21j27J75k22J29KJ55
3359I5k28K30j46L6N1j18l5R4Q3n9O0k76k6R8J89r9L23l30q0J11o9Q5l25K36K54
3384A54J93l58R0K33Om30j34J46K29j5J13m4l05k4r2L64l70K92o1J47j47J26k3
$$ plain form
3407 90 117 157 35 -98 -88 -29 36 24 -112 -80 -12 -105 260 82 205 66 -31 -133 -24 -3 -100 4 88 55 136
3432 136 34 108 -65 -252 0 -228 -122 134 -5 -19 9 -151 -212 246 -27 -57 -56 83 62 255 -57 45 -43
3455 -43 -82 43 42 109 -144 -61 -42 -68 -54 -12 -251 68 -65 102 205 -245 -23 32 -87 80 137 191 -69 -47 111
3480 111 -9 -190 57 63 -85 36 152 172 38 181 115 171 62 -26 -98 -4 68 -214 -173 242 -305 -120 83
3503 83 -312 68 22 -180 -220 -50 -41 211 92 231 154 -76 58 104 126 -11 66 140 76 42 86 -111 -40 212 256
3528 256 -63 -114 -23 -8 121 121 122 -210 -113 -141 61 -112 30 -50 0 -62 35 51 4 54 252 -136 83 -111 23
3553 23 -6 -64 167 70 26 -16 -36 71 1 -163 -1 -116 152 203 -314 18 -32 -126 95 225 -20 78 227 -126
3577 -126 -157 -115 -69 -61 -5 -223 -83 6 167 -66 74 -79 -38 -34 21 181 -147 -92 -64 86 -9 -145 157 -138 -59
$$ packed form
3407I0K7M0j22j33J0N9O5j2j36L2O8r3L65j78J23j39r7j02J09K1r7J04Q4l3Q1
3432A36j02P4j73j87K52k28J06K56j39j4K8j60o1M58k73l0JJ39k1J93l12J02q8
3455d3l9J25jO7k53Q3J9k6J4M2k39L19j33J67J03m50K22N5j19J67N7N4k60K2J58
3480A11j20j81K47Oj48J21J16K0j34J43o6N6j09q8p2R4P2k82M1M15n47J85K03
3503H3l95L80m6k02m0J70RK52j19J39p7k30J34M6K2j37P7P4o4l4M4j97P1K52M4
3528B56l19n1R1J5J29%Jl32R7k8K02j73J42q0N0o2R7J6m7N0J98l88K19j94J34
3553B3k9n8K31r7m4m2k0J07p0j64J62j15K68N1n17L32n0r4K21J30k45R8J49l53
3577a26l1M2M6QN6k18J40Q9J61k33J40j53M1MN5J60l28N5K8J50r5j36L02k95P9
$$ plain form
3602 -59 -115 -47 93 45 48 -19 33 -91 -10 -278 -27 222 -254 41 -14 88 22 228 134 66 -64 -41 179 -172 -1
3627 -1 -141 -32 82 -182 59 190 -124 -68 43 299 178 83 -211 282 13 -24 102 137 -76 -58 237 -136
3649 -136 297 82 -19 -51 -10 93 -238 -120 -194 -124 -208 -128 15 -125 77 -105 -14 41 38 -254 -147 -113 296 65
3673 65 -11 -99 -40 -25 9 -142 -113 74 253 -194 66 113 -97 -272 -269 -22 -142 -19 24 74 5 -308 90 -36
3697 -36 -2 -117 -88 19 299 153 68 12 64 386 101 -23 142 -131 84 42 3 5 175 -169 -154 -302 39 -179
3721 -179 -6 87 109 68 120 -39 115 190 -263 -62 141 80 106 33 52 62 13 60 -35 49 117 -76 61 -237 44
3746 44 -70 -80 1 11 -210 305 -219 110 -294 -239 -64 -70 39 191 -310 -227 125 -59 -123 54 210 60 178
3769 178 -239 32 27 -14 -30 97 -124 287 229 -22 185 65 16 -56 -1 164 108 -86 -13 -182 -151 92 -124 137
$$ packed form
3602e9n6O8J40m8Lo7N2j24Q1k68K51K49m76K95n5J02o6K06r4o8j30K3K20l51J71
3627aj40J09J14k64K41J31l14N6J11K56j21r5k94M93k69l7J26L5k13J8K95l73
3649a36M33k15j01l2M1J03l31J18p4P0q4Q0J43j40K02j82R1N5lk92J07L4M09k31
3673F5p6q8N9J5L4j51K9J87J79m47K60M7k10j75LK47j20J23M3N0o9l13L98j26
3697c6L4j15K9J07K80j46q5n6N2L22k85j24J65k73K15m2l9KJ70l44J5j48L41k18
3721a79J73R3K2m1N2j59J54P5m53K01K03o1K6p3J9J0m9M7r5Q4O8j93J37k98K81
3746D4j14j0Q1J0k21N15n24L29m04N5J75oJ09J52n01Q3L52j84o4J77J56j50J18
3769A78m17K71nm1j6J27k21M11n8k51K07j20m9p2N5J65n6j94P3j69L1K43k16K61
$$ plain form
3793 137 119 24 35 295 94 -301 -164 239 42 -225 214 101 31 -179 21 12 157 153 147 -2 -71 -20 31 320
3817 320 93 -90 -15 -67 172 162 178 -34 -167 -52 -2 245 -148 -22 -21 10 194 -10 79 231 -40 -91 -300
3840 -300 -6 33 90 25 44 50 14 186 -241 -77 88 233 -332 -147 57 -197 -109 -98 -49 207 33 -146 -10
3863 -10 -71 -19 -8 154 -23 212 6 -118 -166 38 -177 108 -159 167 101 134 197 -177 -168 20 -29 189 119 4
3887 4 74 -9 80 -8 -344 189 -163 -13 379 -282 -28 -76 -3 -123 -109 -26 -63 -109 -309 119 20 223 -86 55
3911 55 -45 -88 -22 8 -58 196 -185 7 -110 -14 23 -12 -70 97 329 -50 16 324 -36 104 -49 -4 -249 -301
3935 -301 -48 -272 -98 -153 39 102 -14 -28 127 225 62 51 -60 205 70 -77 59 -264 -189 388 22 38
3957 38 62 132 -165 -214 65 31 -25 1 -86 -68 -136 80 38 -222 -18 179 28 -166 0 163 -115 92 -51 113
$$ packed form
3793A37j8r5J1K60k01l95J37M03j97k67M39j13p0k10K00rJ45moj49o9N1N1K89
3817C20k27j83P5n2K39j0J6k12j33J15N0K47l93J26JL1J84k04Q9J52k71n1k09
3840c00K94L9N7o5J9Ol6J72m27J64J65J45n65J85K04k54Q8J1M9K56j74j79J36
3863a0o1N2J1J62j77K35k06j24m8K04k15K85k67L26o6L3O3l74RJ88m9K18p0j15
3887DP0q3Q9q8l36N33l52J50L92o61K54m8P3j20J4Q3l7m6k00M28r9K03l09J41
3911E5j00m3O6L0o6K54l81J92j17R6L7l5n8J67K32l79O6L08l60J40j53M5k45n2
3935c01K53k24J74n5J92O3j16j4J55R8j63j1j11K65j35j47J36l23P5N77l66J6
3957C8K4P0k97m9K79l4n6K6q7J8o8K16m2k60K04J97j51j94J66J63k78K07j43J64
$$ plain form
3981 113 -69 -188 91 105 25 -4 -80 -52 -89 90 108 -19 -68 308 52 -21 -146 129 284 228 134 -68 107 23
4005 23 -1 15 213 -103 -303 111 164 21 -82 -132 -67 279 -39 -34 -138 -85 62 -220 -79 224 31 -150 -155 77
4029 77 327 130 85 59 64 125 67 10 10 -258 -115 -129 226 82 24 104 -35 -89 -78 111 52 6 -170 -44 66 -19
4055 -19 130 -62 32 -190 119 8 -122 -133 31 -149 197 142 -59 -38 -39 -161 -30 -4 -58 -152 -8 -84 -33 -81
4079 -81 -6 155 11 94 -110 -49 -57 194 201 -19 430 -12 -63 22 13 112 63 39 28 160 17 157 -30 -31 -210 212
4105 212 -12 -64 -152 54 71 -268 -37 -229 -9 -181 -324 -227 -7 11 118 -26 3 -27 127 162 133 86 146 245
4129 245 32 -83 50 -291 75 167 -59 -158 78 1 42 71 -149 67 190 73 -155 -54 50 111 35 -117
4151 -117 -121 -266 -25 -134 45 -29 -8 214 -43 -19 -367 218 -2 -34 -147 -56 -75 -27 24 155 -306 -65 -91 99
$$ packed form
3981A13j82j19K79J4q0k9p6K8l7J79J8j27m9L76k56p3j25K75J55n6r4k02J75q4
4005B3k4J6J98l16k00M14N3j43j03n0O5L46l18Nj04N3J47k82J41L03j93j81nK32
4029G7K50j97m5k6NO1n8n7%k68J43j4L55j44n8Q0j39n4J1J89n9m6j76J26J10q5
4055a9J49j92R4k22L09j11j30j1J64j80L46n5k01K1jj22J31K6n4r4J44p6N1m8
4079h1P5J61j44Q3k04O1qK51Pk20M49m42n1Q5rR9m9k4j1J32j43J40j87jj79M22
4105B12k24n2q8K06J7l39K31j92K20j72j43R7K20J8J07j44K9l0J54L5k9m7O0R9
4129B45k13j15J33l41L66R2k26r9K36p7M1K9k20K16J23j17k28J01J04O1p6j52
4151a17mj45K41j09J79p4K1K22k57K4l48N85k20l2j13R1j9M8N1J31m61K41k6J90
$$ plain form
4175 99 67 -173 -261 -93 89 26 -65 26 -30 182 -181 46 -220 105 59 -96 -237 -87 125 10 214 -37 168
4198 168 -78 -69 1 -67 178 -196 -74 -58 -23 -337 -184 -98 7 266 12 -28 -24 -7 155 -2 -39 -9 97 43 188
4223 188 34 81 -40 115 -375 -8 42 -90 181 108 -23 -158 21 -48 81 121 61 105 17 112 63 125 64 -111
4247 -111 -189 -183 -202 5 -70 17 185 31 158 -61 225 201 148 124 163 43 -68 -143 -49 18 -47 176 18 -135 -48
4272 -48 -148 76 -175 -14 -72 -34 87 -153 -32 202 -80 -77 -102 -252 398 146 -41 57 40 11 -183 137 52
4295 52 92 -149 34 198 -131 -7 -143 -94 -49 225 -16 207 14 85 -152 -104 102 -96 -99 175 327 -161 -36
4318 -36 -106 -1 -142 -22 56 22 -177 36 5 -339 -150 -30 78 -45 70 150 -127 70 -273 -135 -145 -54 -190
4341 -190 23 161 -120 178 83 43 -71 98 36 39 -12 -79 -116 16 -12 91 80 -28 252 78 44 28 -71 155
$$ packed form
4175I9l2k40q8J68J82o3r1R1n6K12l63K27k66L25m6j55j41J50K12j15K04k51K05
4198A68k46RP0o8K45l74J22J6L5l14J53Q6J05K59k54m0MJ7J62j57l7L0J06n4J45
4223A88j54M7j21J55m90L67N0j32K71p3j31j35J79o9J29M0o0M4q8R5m9O2o1j75
4247a11p8Oj9K07p5Q7J68j54J27k19K86k4n3k4L9j20j11p5R4O7o5K23j58j53Q7
4272d8j00K24k51J61n8L8J21k40J21K34k82Lk5j50O50k52j87R8j7k9j94L20q5
4295E2M0k41J83J64l29J24j36M9M5K74k41K23j93P1k37M8K06j98lK74J52m88J25
4318c6p0J05j41J20P8l4j99K13l1l44J89J20J08j23J15Q0k77J97l43J38j0R1j36
4341a90K13J38k81K98r5m0j14J69o2Ln1o7l7J32k8J03j1j08K80j74l4j6r9K26
$$ plain form
4365 155 -290 -49 -157 116 -50 -10 29 -76 46 11 126 -47 -202 -209 21 141 -44 -100 -102 181 28 -86 196
4388 196 184 219 155 -35 172 82 -112 -142 35 -97 -2 104 21 105 38 106 -109 237 -201 -61 6 -307 291 53
4412 53 -19 -62 -50 175 -182 57 219 89 145 -51 8 192 405 159 90 -55 224 28 -94 202 -91 20
4434 20 -210 79 -389 -51 27 93 -133 90 -10 161 -49 177 -38 9 -14 -276 22 203 -66 4 -100 -123
4456 -123 84 119 -30 17 165 44 -15 -10 -103 -57 180 71 -77 -22 -11 68 95 -179 52 145 5 -341 144 -64
4480 -64 88 -55 26 211 301 253 -33 95 65 238 -65 150 212 -18 93 -98 248 -74 -24 -184 -6 -63 -128
4503 -128 -316 66 78 -73 58 -65 -90 -89 55 -143 -383 219 202 53 -131 9 -60 17 117 278 127 -76
4525 -76 -260 82 12 -149 87 -157 113 30 -34 -124 -107 68 58 137 -110 69 1 244 56 266 149 294 122
$$ packed form
4365A55m45K41j08K73j66M0L9j05J22l5J15j73j55pK30J20j85n6kK83j53j14K82
4388A96j2L5o4j90K07r0j94l0J77j32R5J06q3Q4o7O8k15L46m38J40O7l13N98k38
4412E3p2m3J2K25l57K39J62j30N6j96N9J84K13k46o9j45K79j96j22K96k93J11
4434B0k30K89m68L38P8O6k26K23j00J71k10K26k15M7k3k62K98J81k69P0j04k3
4456a23K07L5j49M7J48j21n9Nr3M6K37j09j48N5J1P9K7k74K31R3j40l46M85k08
4480f4J52j43Q1J85R0m8k86J28l0J73l03K15O2k30J11j91L46l22N0j60J78n7o5
4503a28j88L82J2j51J31j23k5JJ44j98k40O02j7j49j84J40o9P7J00J61j51k03
4525g6j84L42p0j61K36k44K70q3o4r0J7J75j0P9k47J79o8K43j88K10j17J45j72
$$ plain form
4548 122 77 135 20 176 -4 176 272 32 0 -12 18 116 -57 -67 -94 -19 -62 99 75 185 127 17 -296 36
4572 36 -2 267 160 -150 176 -42 117 212 24 166 81 6 140 58 -97 -150 -67 -58 106 -10 -127 -6 -23 -211
4596 -211 0 -97 13 -233 -35 -7 79 -27 -114 49 205 41 -28 -191 -79 102 165 31 8 8 -66 248 64
4619 64 227 -166 148 -62 -210 -61 39 -114 100 62 -169 -334 -205 53 -98 20 30 -55 -33 254 129 43
4641 43 96 -41 -118 200 -54 -212 -112 -170 -226 -206 84 -256 -11 63 171 161 -104 -229 -43 174 208 -81 36
4664 36 12 -236 -38 -85 140 -10 204 -84 166 97 65 21 -66 -23 76 -31 149 -55 142 68 241 203 -173 -189
4688 -189 -22 -8 82 118 41 -13 -42 -116 -227 -216 -217 105 56 211 -56 0 37 -141 -132 -32 55 -125 46 41 270 89
4714 89 38 30 -84 -250 -12 -27 -145 27 172 12 -112 -158 105 -20 1 31 2 149 62 4 73 -218 -280 437
$$ packed form
4548A22m5N8j15J56j80J80R6k40l2j2L0R8j73j0k7P5m3J61k4J10n8j10l13L32
4572C6l8K69j07l10L26k18J59R5j88J42q5p5J34q2j55n3Q3RJ64j16j17J21j7j88
4596b11K11r7J10k46J98K8Q6j06q7J63J56j64o9j63J12J81O3j34k3%p4L14j84
4619F4J63l93L14k10j48J49J00j53K14l8k31j65J29K58j51J18J0q5K2K87j25q6
4641D3N3j37p7L18k54j58J00n8n6K0K90l40K45P4J08j0k65j25J86K17L4k89J17
4664C6k4k48J98m7K25j50K14k88K50o9l2m4q7M3R9j07J80k04J97p4J73l8l76j6
4688a89J67J4R0L6p7n4k9p4j11J1jL22m9J55k67N6L7j78RJ00Q7j80J71nK29j81
4714H9n1qj14j66K38j5j18J72J45j60j24m6K63j25K1L0k9J47q7n8O9k91o2P17
$$ plain form
4738 437 176 30 151 -74 158 103 194 -114 -45 -8 -82 -208 -60 -10 -108 350 -67 -20 -52 13 -237 63 -76
4761 -76 -117 97 133 189 -142 -9 -116 -52 -150 181 38 -13 115 41 -257 -56 275 -142 141 51 -16 212 -39
4784 -39 -23 247 212 13 -76 -143 203 102 -73 35 -46 -63 33 89 -79 143 173 58 95 -59 -48 -71 -22 20 -158
4809 -158 -69 -125 36 -118 -255 -115 -213 114 -116 -159 18 221 -7 -29 -148 27 -131 -163 121 -118 126 -137
4831 -137 27 58 -170 75 -18 84 -13 106 288 -166 157 80 -24 -119 -61 23 -15 166 -9 -257 -99 -6 -54
4854 -54 8 -158 214 -126 -159 123 -133 102 157 97 -27 214 -22 146 174 129 -60 44 146 23 10 6 -8 -209
4878 -209 90 27 200 -164 62 -146 -166 84 -14 51 176 139 -104 64 1 -125 -8 140 -88 134 -153 -29
4900 -29 250 10 71 -3 99 133 56 -68 -82 67 -289 -163 42 20 -176 -76 -27 -157 -145 -126 167 -76 -168 -19
$$ packed form
4738D37k61j46J21k25K32n5R1l08O9L7p4j26J48N0r8M58m17M7l2O5k50L00j39
4761g6m1K14L6N6l31J33j07O4r8L31j43n1J28p4k98K01L31m17K83r0o7K28k51
4784c9J6K70l5j99q9o7L46j01j75J08q1j7R6N6j68K22L0j15L7j54J1k3M9M2j78
4809a58Q9n6J61j54j37J40r8L27k30m3J77K03k28k2j19J75j58l2K84k39K44k63
4831a37J64L1k28K45r3J02r7J19J82m54L23p7j04r5N8Q4l8J81j75k48J58R3m8
4854e4O2j66L72l40l3K82k56K35N5o0j24K41k36J68K8m5j89J04J02j23j3mj4k01
4878b09K99o3J73l64K26k08k0K50r8O5J25l7k43J68o3j26J17J48k28K22k87J24
4900b9K79k40O1p4J02L4p7j24j4J49l56J26K05k2j96J00M9j30J2J9K93k43r2J49
$$ plain form
4924 -19 22 -194 73 -82 -148 179 -16 -153 -36 -28 117 -115 -137 -205 90 268 337 -87 54 -4 -23 -23 -123 43
4948 43 -4 10 -263 14 -53 -186 -68 263 40 -105 -43 -187 207 -157 14 -10 68 202 -142 7 -51 101 -104
4971 -104 66 100 69 54 -226 -95 -98 128 144 157 -128 9 52 -117 89 -28 -3 16 171 -14 105 -265 -97
4994 -97 -239 94 37 131 132 169 -27 2 -133 -49 -60 25 -59 59 -33 -55 47 -162 92 139 -290 43 -80 -257 -156
5019 -156 -6 -34 -68 108 -200 138 72 -23 -2 227 60 49 -11 117 -3 96 -81 -22 117 -316 -6 25 -41 72
5043 72 -92 -63 -287 -173 35 279 88 -32 -269 21 -153 20 -202 146 48 180 49 -33 -57 125 -19 -24
5065 -24 -195 -56 131 156 55 -79 166 102 -58 85 18 -164 52 -50 -47 77 -9 196 79 -5 -157 -103 129
5088 129 43 61 77 19 -84 40 186 -20 -153 141 49 285 -49 51 166 -113 -143 -143 -22 -113 29 88 57 103
$$ packed form
4924a9M1k16K67j55o6L27j95j37J17QJ45k32k2o8K95J78O9m24J41n8j9%j00J66
4948D3m7J4k73K77o7j33J18L31k23j45O2j44L94l64J71k4P8J34l44J49n8J52k05
4971a04J70L4l1j5k80J31lK26J6J3k85J37M3j69K06j17K5J9J55j85J19l70J68
4994i7j42L33n7R4JL7j96K9j35Q4j1Q5q4J18r2k2J02k09K54M7m29L33j23j77J01
5019a56J50k8l4J76l08L38o6r5K1K29j67j1o0J28j20R9j77N9J39m33L10L1o6J13
5043G2j64K9k24J14K08K44j91j20k37K90j74J73k22L48r8J32j31q2k4J82j44n
5065b4j71J39J87K5j01j34K45o4j60J43o7j82K16j02LJ24q6K05j17q4j52N4K32
5088A29q6J8J6n8j03J24J46k06j33K94r2K36l34J00J15k79l0%J21r1J42N9l1M6
$$ plain form
5112 103 70 -70 29 252 -50 -69 -160 37 -154 8 -43 193 157 92 -42 62 92 -3 106 69 60 -84 20 166
5136 166 -98 -55 -59 -219 -7 53 31 95 -96 60 -197 -328 252 -133 40 -301 174 100 258 149 152 81 124 3
5160 3 -63 140 -101 -112 -53 -12 137 29 46 -53 -29 -38 -38 -236 -43 139 -183 -40 -175 -226 21 222 105 -123 -74
5185 -74 10 -43 31 82 -38 44 -69 -7 110 118 97 170 3 36 70 -127 -41 65 -106 -120 -39 -29 66 -46 -77 -156 -25
5212 -25 64 -197 -226 163 -179 -107 130 100 -159 -16 -46 99 -256 16 39 246 -33 146 -55 44 -71 188 -57
5235 -57 191 44 -56 -277 82 -145 -146 14 -103 -3 -296 68 71 -267 -62 296 -61 -2 235 -38 113 39
5257 39 20 285 199 183 19 7 -27 -106 -130 -160 23 -90 -115 -24 23 -44 74 106 -22 -234 -149 -30 -133 100 100 -11
5283 -11 100 -193 -81 -62 60 -61 52 161 39 -8 89 73 -99 153 54 111 -89 38 -164 55 -26 28 202
$$ packed form
5112A03l3j40R9K23l02j9r1J97j91J62n1K36l6o5j34J04L0r5J09l7rj44J04J46
5136A66k64M3mj60K12O0k2O4j91J56k57j31N80l85J73l41M75p4J58j09Lp1M3j21
5160Co6K03k41j1N9M1J49j08J7r9K4r%j98J93J82l22J43j35n1K47K01j17k28M9
5185g4Q4n3P4N1j20Q2j13O2J17Qk1P3j67L3L4j97Q6J06j71j4Q1J0R5j12l1p9J31
5212b5Q9k61k9L89l42P2K37l0k59J43l0J45l55K72K3K07k79J79k01R9j15K59k45
5235e7K48j47j00k21L59k27jJ60j17J00k93L64Ll38K05L58l57N9K37k73J51p4
5257C9j9K65q6j6j64j2l4p9k4l0J83j13k5R1M7o7J18L2j28k12Q5J19j03K33%j11
5283a1J11k93J12J9J22j21J13J09j22m7R7j6j72K52r9N7k00J27k02K19q1N4J74
$$ plain form
5306 202 -185 -175 18 -46 -233 -121 -20 -34 54 -151 276 172 -112 -22 -86 118 263 -172 109 -1 -45 -92 14
5329 14 -12 -202 21 -37 35 78 -125 -116 24 154 33 27 -22 73 202 -118 96 -112 -119 92 -166 -117 50 -90 146
5354 146 47 167 65 -37 -80 70 128 3 -61 168 -176 56 -151 -176 144 -224 -70 -30 -111 -133 -125 -59 5 -9
5378 -9 -48 173 -85 -203 2 0 147 -183 251 -6 -336 -308 227 -209 14 5 172 -74 -194 -96 -58 -135 82 98
5402 98 -19 57 11 17 142 19 -69 332 154 197 -179 197 -56 56 63 154 -231 150 230 167 -130 21 -84 34
5426 34 161 -192 52 -243 240 -224 -23 -183 -87 -26 17 -213 223 -125 -184 -1 64 92 -143 -69 0 -226 -109
5449 -109 120 141 82 -87 -128 -61 -285 115 161 -142 -23 150 50 73 -111 -25 24 132 249 224 190 -87 345
5472 345 -28 -41 -197 18 37 -72 42 -84 4 99 169 164 21 121 39 34 -26 137 111 -60 -24 -13 18 61 -103
$$ packed form
5306B02l87J0J93o4j87J12J01j4Q8k05M27j04k84R0o4K04J45m35K81j10m4m7J06
5329A4k6j90K23n8P2M3k03RJ40J30j21om9R5J29l20K14k08pK11k58M9J67j40K36
5354A46r9J20j02j02m3J50N8j25o4K29l44K32k07k5L20l68J54M0q1k2QO6O4j4
5378il9K21k58j18K05kJ47l30M34k57l30K8N35m36K23rJ67k46j20R8L8p7K17J6
5402I8j17P6m6OJ25j23q8M01j78M3l76L76k53J12PR1l85L81Q0o3k97J51j05J18
5426C4J27l53K44k95M83m64K01j60R6O1M3k30M36l48n9J83O5K8k35P4O9k26J17
5449a09K29K1n9j69m1O7k24M00M6l03J19J73j00K3j84Q6M9J08J17k5l4k77M32
5472C45l73j3j56K15J9j09J14j26Q8R5P0nj43J00q2no0J63k6j71L6J1L1M3j64
$$ plain form
5497 -103 26 -151 -65 61 -69 97 -18 -217 157 43 53 211 163 -98 -24 -4 -3 -110 22 108 -132 -27 187
5520 187 1 -150 121 419 -238 -111 -160 -58 78 -137 104 13 38 104 -18 30 -45 -121 -54 -199 44 -31 142
5543 142 67 38 -25 81 -198 128 -127 110 -57 -253 55 18 -322 37 -141 53 -91 -282 3 125 101 -221
5565 -221 258 -129 -34 87 -78 54 184 52 -94 22 -175 -250 31 164 -28 78 -42 -18 185 -131 -32
5586 -32 20 -121 352 -64 -65 223 113 152 105 -42 130 27 -57 96 -30 -122 113 8 -216 102 -107 60 -190
5609 -190 -92 229 242 -59 -111 -104 95 253 166 -37 -66 -23 181 18 169 -130 -135 -14 152 81 -34 -64 304 -136
5633 -136 -97 -281 63 -87 -51 193 -186 283 -71 29 221 -125 -39 -83 -106 64 -19 -24 38 -142 -35 -262 50
5656 50 -61 -7 167 229 -51 -85 -157 89 101 -124 63 176 61 -16 -162 7 -84 47 70 -41 203 89 59
$$ packed form
5497a03J29j77Q6J26j30J66j15j99L74j14J0J58m8k61P4K0Jj07J32Q6k40J05K14
5520A87j86j51K71K98o57J27m9J02J36k15K41r1K5O6j22M8p5p6O7j45K43p5J73
5543A42p5k9o3J06k79L26k55K37j67j96L08l7l40L59j78J94j44j91K85J22k4l22
5565b21M79l87R5J21j65J32J30j32j46J16j97p5K81J33j92J06j20K4K03l16R9
5586c2N2j41M73m16jK88j10L9m7j47J72j03q4J53j26r2K35j05k24L18k09J67k50
5609a90R8L21J3l01n2PJ99J58q7k03k9M3K04j63J51k99nJ21J66p1j15l0L68m40
5633a36L9j84L44j50L6K44l79M69l54J00J92l46Q6m4k3J70q3nO2j80J07k27L12
5656E0j11N4J74O2k80l4p2K46J2k25J87J13j15p7j46J69r1J31K3j11K44j14l0
$$ plain form
5679 59 228 85 162 304 -3 7 91 17 -69 -32 -22 9 2 -39 -92 103 -77 188 -172 152 117 44 40 97 -18 138
5705 138 -186 0 67 -63 -120 -155 -150 59 -163 -206 -77 72 -218 219 58 -233 -84 0 192 62 -31 -115 -97
5728 -97 -136 -78 -73 101 36 -114 -24 -244 193 125 -67 212 6 -21 -62 130 2 -244 -34 -204 -4 119 11
5751 11 12 -59 -56 -202 109 -303 106 -48 31 -63 22 -72 -55 -20 -46 110 -29 58 -39 -78 -33 -71 79 3 -14 -68 -78
5778 -78 104 -86 -146 268 2 13 -78 -155 276 21 6 -186 9 -96 -127 -126 -71 -19 -86 118 102 -73 115 43 184
5803 184 -194 146 -121 53 60 -103 -34 -11 48 -55 41 -121 -80 90 68 7 48 -133 -187 -112 195 -231 -38 -230
5827 -230 -68 62 -1 264 105 219 33 33 108 -178 -107 -179 -88 215 40 -3 -31 -212 -108 124 118 147 -200 91
5851 91 172 16 -159 -32 -9 -38 110 -96 101 -241 -50 99 204 -7 -232 174 56 -273 53 215 211 47
$$ packed form
5679E9J69j43P7J42l07J0Q4p4q6L7J0L1pm1n3J95j80K65l60L24l5p3mN7j15J56
5705A38l24J86O7j30n7l5NK09k22m3J29J49k90M37j61k91J49Q4J92j30r3q4J8
5728i7l9N8NJ74o5j50R0k20M37o8j92K79k06k7m1J92j28k46K10j70K00J23j08
5751A1Jp1Lj46L11m12M09j54P9r4Q5r4J7L5k6J56j39Q7r7l9M5l8J50p6j7n4j0
5778g8J82j90o0M14k66J1r1p7M31k55j5j92J95j05l1JN5N2o7K04j6j75J88p2J41
5803A84l78L40k67J74Pj63O9K3N9j03R6j62M1J70k2o1M1j81n4P5L07m26J93j92
5827b30J62J30o3K65j59J14j86%P5k86P1p2R1L03j75m3k8j81J04K32oK9l47K91
5851I1Q1j56j75J27K3k9J48k06J97l42J91J49J05k11k25M06j18l29L26J62mj64
$$ plain form
5873 47 50 136 -125 -35 -114 99 -29 18 -118 53 -76 -186 67 -313 108 -193 -33 -76 -32 44 -243 -23 30 -78
5897 -78 142 110 3 -203 14 96 37 430 252 122 163 -152 -91 -91 -140 40 -256 -219 7 -111 15 98 -50 -93
5921 -93 -99 110 234 -3 134 57 -159 -31 143 31 -186 57 -119 19 -157 -48 134 -116 89 -186 -49
5942 -49 28 -9 76 -67 14 147 191 -178 83 -30 -1 -66 -136 -76 -420 -86 -101 -55 225 278 -134 87 -98 -173 -149
5967 -149 -28 36 42 254 75 -2 96 -42 38 112 56 214 -110 18 34 -53 -147 -15 84 -144 -29 16 171 -3
5991 -3 -93 102 196 -11 -4 154 -26 55 -129 82 -183 23 61 -214 -32 2 -44 -44 -12 245 -46 -286 -55 -87 16
6016 16 26 213 -41 23 39 141 -34 -56 47 -12 54 -143 -111 84 -106 30 -248 -202 110 -239 96 -157 -75
6039 -75 -96 -258 -228 -110 49 176 107 29 75 -90 -189 36 -61 -177 -255 26 138 -142 40 -92 -33 -295 88
$$ packed form
5873D7LQ6k61R0p9K13j28M7j36J71j29j10K53l80M21l01J60m3M4P6k87K20N3j08
5897g8K20l2j07k06K17Q2n9L93j78j30M1l15O1%m9J80k96L7K26j18J26Q3j48m3
5921i3oK09J24k37J37p7k16J28J74j12k17K43j76J38j76J09J82k50K05k75J37
5942d9P7l7Q5j43Q1J33M4l69K61j13K9o5p0O0l44L34j5M6K80N3m12K21j85p5K4
5967a49J21O4OK12j79p7R8j38Q0P4n6J58l24J28J6q7r4J32R9k28J15M5J55j74
5991cr0J95R4k07PJ58j80Q1j84K11k65K06L8k75J82L4m6%L2K57k91k40K31l2J03
6016A6J0J87k54O4J6J02j75k2J03n9O6j97L2J95j90J36k78M6L12l49L35k53Q2
6039g5k1j62L0J18J59J27o9p8M6j65r9K25r7j16p8K81J12k80J82j32N9k62L83
$$ plain form
6062 88 180 14 146 105 -76 -16 -4 -85 149 37 -170 81 273 -166 -205 99 -219 135 -135 -55 118 -74 168
6085 168 -11 -107 -84 2 86 183 -59 -110 -116 232 183 -71 -26 136 22 119 2 -58 -145 -185 -147 -5 -157 -23 122
6110 122 -292 42 107 -283 22 -64 89 63 3 -273 -303 -2 68 -122 17 86 -174 -54 27 -143 24 133 14
6133 14 -87 1 96 -93 -113 -192 -162 -73 -63 268 61 -110 -144 -115 -223 77 -54 -151 -84 -133 128 -233 -53 93
6157 93 161 -147 61 8 82 137 -79 -68 240 204 1 60 49 131 -299 141 88 94 58 -136 76 -28 100 -20 -47
6182 -47 -26 120 -44 123 68 -210 -163 -16 165 76 70 21 83 354 39 6 -30 1 153 -100 -51 -110 -206 -90 -130
6207 -130 25 -96 190 106 -12 -18 -194 195 -128 -165 -111 69 194 -17 58 240 112 -10 126 -62 15 -192
6229 -192 -285 141 -25 -182 -103 -269 99 113 -114 77 -46 -99 -72 -77 -19 -107 45 130 -12 -31 -120 63 -52 -116
$$ packed form
6062H8R2j66J32m1j81O0J2q1K34j12k07K51J92m39l9L04l18L54k70Q0J73j92K42
6085A68j79r6K3Q6Q4R7k42n1oL48m9k54M5J62j14R7j17o0q7m0L8J42j52J34J45
6110A22m14L34O5l90L05q6J53k6o0k76l0L01P0j90J39O9k60J20Q1j70J67J09j19
6133A4j01Q8R5j89k0p9L0Q9J0L31k07j71l4K9j08L00j31r7O7m9K61l61J80J46
6157I3O8l08K08n3P4N5k16J1L08l6k03N9j1Q2m30M40n3Ol6j94K12j04J28j20k7
6182d7K1J46j64J67n5k78M7J47J81q9om9O2K71l15l3l6L1J52k53M9n9r6J16m0
6207a30J55j21K86q4j18oj76L89l23l7N4J80J25k11P5J82j28j22J36j88P7k07
6229a92r3M26j66j57P9j66L68J4k27J91j23n3K7nN8q8J52Q5j42j9q9J83j15o4
$$ plain form
6253 -116 70 64 -128 -51 112 22 19 -16 -19 -92 -27 304 -101 -78 -171 -73 140 -224 286 -2 52 126 70 108 53 -57
6279 -57 -120 74 -45 -159 11 276 -138 -118 -229 128 -117 361 -4 104 64 60 -113 201 -104 -250 70 -53
6301 -53 -32 -71 -90 -238 51 89 -209 -177 -85 -238 128 41 -129 70 -98 68 217 -31 32 -42 -38 5 -124 -2
6325 -2 45 10 198 6 90 -143 -160 18 -63 139 64 -211 53 -78 -20 -18 -107 -187 135 96 -49 125 8 1 23 329
6351 329 174 -155 -24 3 107 32 15 -5 -16 -4 -121 -270 108 5 -53 143 35 89 73 -32 197 -52 -133
6374 -133 193 -139 128 -82 -147 -278 -91 157 45 132 106 -138 65 -13 -98 -65 -46 -240 65 7 31 -12 93
6397 93 -12 36 163 120 51 -63 -95 -31 87 17 -60 93 -42 -74 -36 -103 129 103 203 168 -185 31 21 52 -40
6422 -40 6 138 -19 -255 66 15 -147 -24 28 -101 226 249 -261 15 -48 154 21 101 118 28 69 120 -71 115
$$ packed form
6253a16J86oj92P7J63r0ll5lp3O5L31m05K3r3R8K13l64N10k88N4P4n6L8n5j10
6279e7o3J94j19j14J70K65m14K0j11L57k45M78l65J08m0mj73L14l05j46L20j23
6301e3K1l9j9j48K89L8k98L2R2j53L66q7j70J99j68J66J49k48O3p4MM3j29J22
6325bM7l5J88j92Q4k33j7J78q1K02p5k75K64j31N8Kq9q0L22l9j45J74j17pK2L06
6351C29j55l29J31K7J04p5j7k0j1J2j17j49L78j03n8J96j08N4j6j05K29k49q1
6374a33L26l32K67k10o5j31J87K48j12Q7k6k44K03p8q5L3J9j94L05n8K4m3J05
6397I3j05M8J27m3o9j14l2O4J18p0p7J53j35l2L8o7K32k6J00l5l53K16j0L1r2
6422d0M6J32j57k36L21n1j62J23N2j29L27K3n10K76o3K02j33Q0J7r0M1N1j91J86
$$ plain form
6446 115 -50 -108 22 150 96 -112 255 48 -68 217 48 1 32 -187 25 77 -135 80 -96 -18 110 -132
6468 -132 -94 66 -238 -178 95 -186 3 170 -103 217 172 -97 143 89 46 5 56 -81 402 -58 -62 47 -60
6491 -60 260 21 -96 -1 14 -57 -110 -72 -136 -109 104 67 28 87 189 117 220 -122 -1 204 154 171 -132 176 -120
6516 -120 -46 -2 116 192 29 -129 240 17 -108 -81 131 -106 -171 -96 3 70 -135 -116 -5 29 -8 -26 -133 -30
6540 -30 -102 62 -98 -15 31 199 18 -90 133 -12 -22 47 -132 -35 -159 61 39 2 -187 -159 157 -249 16
6563 16 7 -77 -139 37 -136 -81 80 -84 21 4 -61 -25 -68 36 180 -296 -102 164 43 -22 18 114 -235 -35
6587 -35 -202 -154 26 35 63 -130 13 -434 -109 -64 13 -117 -6 98 120 45 119 54 -4 -95 82 7 62 -271 108
6612 108 38 -96 -57 5 -82 -105 122 -112 38 151 -296 150 -66 -70 33 -94 72 210 132 171 -22 -61 65
$$ packed form
6446A15j65n8J30J28n4k08L67k07j16K85j69m7L1k19K12N2k12K15j76P8J28k42
6468a32L8J60l04O0K73k81J89J67k73L20m5k69K40n4m3m1N1j37M83m60mJ09j07
6491f0L20k39j17R5J5p1n3L8o4K7K13l7l9N9J02p2J03l42J21K05n0J7l03L08k96
6516a20P4M4J18P6j63j58L69k23j25K7K12k37o5P5R9O7k05J9J11L4l7j8j07J03
6540c0p2J64j60Q3M6J68j81j08K23j45j0O9j79R7j24K20k2l7j89K8L16m06K65
6563A6rq4o2J76j73N5J61j64J05j7o5L6m3J04J44m76J94K66j21o5M0R6l49K00
6587c5j67M8J80RK8j93J43m47L25M5P7j30J11J04K2p5P4o5n8r1J77p5N5l33L79
6612A08p0j34L9O2q7k3K27k34J50J13m47M46k16mJ03j27J66J38p8L9j93l9J26
$$ plain form
6635 65 -147 -148 -135 29 167 -191 -50 -26 -52 32 -15 -15 19 -112 -82 74 67 -39 -163 -33 13 103 -89 -116 56 58
6661 58 -87 123 53 61 -129 -23 -64 41 9 -57 45 237 52 176 99 -35 187 -21 16 28 -84 86 67 68
6685 68 -40 64 -86 -75 15 -87 141 -79 -51 8 60 43 202 85 -240 -119 111 -133 107 -15 -219 -82
6707 -82 -176 -12 -42 -2 -119 -2 25 -216 -208 -237 12 140 21 -60 -124 -35 -135 -62 -113 42 -72 -61 274 0 -195
6732 -195 231 46 -160 -149 21 -48 -138 70 -14 30 -164 -162 -87 95 75 22 -44 -155 50 -106 -58 175 75 23
6756 23 -87 41 110 -137 -11 -65 139 12 -224 140 99 128 15 -59 -60 -19 -87 123 -318 -195 -66 71 -4 -175
6780 -175 35 50 -227 -7 -177 32 -197 -48 -229 96 -90 7 14 -302 -89 -24 52 -45 -153 -72 103 -105 7
6803 7 46 130 31 -62 -49 152 21 -50 -100 -6 -96 14 182 -58 111 -3 115 83 -184 100 -125 259 105 83
$$ packed form
6635F5k12jJ3J64J38l58J41K4k6Q4m7%L4j31L0J56pj06j24J30M6R0j92k7J72K
6661E8j45K10p0Qj90J06m1J05l2o6J02J92j85J24p7j34K22k08L7J2j12J70j9J
6685F8j08J04j50J1R0j02K28k20K8N9N2j7J59j17l25J21K30k44K40j22k04J37
6707h2r4J64l0M0j17J17K7k41Qk9K49J28j19q1o4Q9j00P3n1J55j14J1L35k74j95
6732a95M26j85k06J1J70o9r0K08q4M4j94KP5J82k0n3o6j11K05j56M8K33j00n2
6756B3j10J28O9k47J26n4K04j27k36L64m1K9j13p4jM1o8K10m41J23J29J37p5j71
6780a75K10J5k77K20j70K09k29J49j81L25j86R7Pl16K13O5P6r7j08Q1J75k08J12
6803GL9Q4r9r3J3K01j31p1n0R4r0J10J68k40J69j14J18l2k67K84k25L84j54k2
$$ plain form
6827 83 212 -25 -24 -113 -63 7 -110 151 126 52 68 9 -100 -243 19 -174 63 -30 -51 -17 -190 77 -133 209
6851 209 -238 133 30 -167 78 151 -132 202 14 81 -149 187 54 8 -17 56 -274 117 14 -128 -109 -33
6873 -33 9 172 43 166 -10 -174 -79 -113 91 -14 75 134 36 -5 -78 25 299 -84 17 13 12 106 194 92 201
6898 201 -113 58 -33 212 107 -155 202 12 -44 43 -12 183 138 174 -10 -55 -15 108 -80 -205 -153 -52 55
6921 55 357 84 40 41 -228 -5 -92 -15 55 -46 141 152 -69 -124 -26 -161 90 -58 104 111 -204 147 176 52
6945 52 60 -243 238 140 233 102 -205 -32 -62 177 149 78 -95 -16 111 79 -25 64 -137 243 139 180 100 27 92
6970 92 -62 69 -110 -65 -311 -24 -185 59 203 43 -165 -177 146 54 -142 6 -53 -88 153 -57 -25 -32 279
6993 279 5 20 179 162 11 6 -285 -55 259 161 -205 -82 9 -133 -84 -48 -7 4 29 118 -325 140 -37 126
$$ packed form
6827H3J29k37Jq9N0P0j17K61k5p4J6n9j09j43K62j93K37r3k1L4j73K67k10L42
6851B09m47L71j03j97K45P3k83L34j88O7k30L36j33m6k5P3l30L91j03j42J9P6
6873c3M2J63j29J23j76j64R5l4K04j05Q9N9r8m1p3J03K74l83J01mjR4Q8j02J09
6898B01l14J71r1K45j05k62L57j90n6Q7n5J95m5L6j84m5M0J23j88j25N2J01J07
6921E5L02k73m4Jk69K23q7P7P0j01J87J1k21n5R8j35K51j48J62Pl15L51K9j24
6945E2Ql03M81r8R3j31l07J73l0K39k8p1j73P9J27l2j04Q9k01L80j04M1q0p3O5
6970I2j54J31j79M5k46K87j61K44J44j60k08j2L23r2j96J48n9l5K41k10L2pL11
6993B79k74J5J59j7j51nk91K30L14r8l66J23R1j42M9L6M1J1K5Q9m43M65j77J63
$$ plain form
7017 126 113 79 92 -19 -115 -48 202 -100 2 66 20 32 -221 -20 -107 268 148 29 86 -310 -70 -26 -83 82
7041 82 -127 -108 24 -372 -127 -181 208 -159 88 6 67 248 -9 57 -41 -118 124 135 -71 67 15 -119 -68 91
7065 91 -49 -364 219 -122 -96 -32 -153 45 2 -93 25 71 10 -188 184 -131 -23 85 138 56 -111 153 -157
7088 -157 29 -16 -220 12 -44 88 -46 -146 -149 70 -184 142 257 -78 -18 27 38 90 143 111 -102 196 -166
7111 -166 26 -48 -118 -8 190 -158 -39 -142 -78 -38 -110 -16 53 -34 -80 13 -107 109 -122 140 46 -63 50 -111
7135 -111 209 33 -62 -70 29 157 35 -215 -92 -73 -19 106 -120 93 105 174 153 54 -24 115 81 -1 39 -65 -183
7160 -183 -146 176 278 107 -64 -156 -36 101 -73 -29 -174 93 -208 80 -60 51 114 -34 -118 -123 -116 127 -49
7183 -49 -81 71 137 76 -13 67 -124 -91 -48 157 -166 248 -162 -237 -136 77 -154 -32 57 276 68 -5 -220 -48
$$ packed form
7017A26j3l4J3j11r6O7K50l02J02O4m6J2k53K01q7L75j20j19N7l96K40M4n7J65
7041H2k09J9J32l96K45n4L89l67K47q2O1J81k57O6r8p7K42J1k06J38n2j34N1J59
7065I1j40l15N83l41K6O4j21J98m3r5J18M6o1j98L72l15J08J08N3q2j67K64l10
7088a57J86m5k04K32n6J32j34j00lK19k54L26J15l35O0M5J1N2N3l2k13K98l62
7111a66J92p4p0J10J98l48J19j03O4M0p2R4O9q7m6R3j20K16k31K62r4j09J13j61
7135a11L20j76r5qR9J28j22k50J23J9N4J25k26K13J2O9k1r9p8J39l4q2M0j04j18
7160a83L7L22J02j71j71r2J20J37j74M4j45K67l01K88j40J11O3j48q4nPK43j76
7183d9l2J52O6o1q9Q0j91L3M3K05l23M14m10p5J01K13k31J22Q9K19k08p3k15J72
$$ plain form
7207 -48 -93 190 -39 -231 1 -194 110 -38 -138 -80 140 -28 109 23 -61 -6 -220 -66 124 -29 227 -26
7229 -26 17 -30 0 34 60 -270 160 -68 -5 -120 -73 -69 185 -83 19 -222 -142 35 69 171 37 -72 73 137
7253 137 -88 64 -67 -36 -70 140 68 -9 276 -86 120 -32 42 -118 32 -12 -1 23 188 30 -91 15 -165
7276 -165 -61 215 223 90 -123 198 291 -214 19 18 66 286 -43 -11 -76 -81 232 84 48 -109 -169 -143 -79 -84 -37 133
7302 133 -13 18 168 2 145 13 -63 97 154 24 -86 24 -253 -163 196 57 -97 -20 35 7 -51 80 77
7325 77 122 -230 128 -206 -136 146 -118 -209 -195 149 -21 -87 -122 51 -177 257 -65 125 -20 97 33 -258 39
7348 39 -19 147 -12 50 -44 -19 -15 60 -7 34 -151 -107 -14 204 -25 78 132 -62 -98 -213 141 183 -24 167 73
7373 73 66 -21 95 158 51 6 97 145 13 -386 98 191 2 -184 -5 -294 -67 -68 5 -125 -23 -88 -3 1 -132
$$ packed form
7207d8m5K83k29j92K32j95L04j48j00N8K20j68J37q6q4N5k14J54J90j53K56k53
7229b6M3m7L0L4K6l30M30k28O3j15M7MK54k68J02k41Q0J77L4J02j34j09J45O4
7253A37k25J52j31L1l4K10p2p7K85l62K06j52P4j60J50m4J1K4J65j58j21J06j80
7276a65J04K76Qj33k13L21R3n05K33jM8K20l29L2o5nL13j48l6j57o0K6O4nM7J70
7302A33j46L1J50j66J43j32p6J60N7j30j10J10k77R0L59j39j54P7N5k8n8J31l
7325G7M5l52L58l34P0K82k64r1J4L44j70o6l5J73k28M34l22J90j45J17o4k91K97
7348C9n8J66j59O2r4K5MP5o7M1j85M4R3K18k29J03N4j94l6j15L54M2k07J91r4
7373G3pq7J16O3j07m5R1M8j32l99M84R3j89j86J79k89K27jP3j30J02o5Q5Mj33
$$ plain form
7398 -132 -4 -131 -287 -194 -109 16 80 170 -38 139 140 -47 -123 53 -36 -223 -33 -91 -128 34 -1 52 -91 -101
7422 -101 74 -93 32 181 -215 -11 40 186 -241 -140 44 -37 69 -34 119 -176 40 253 -37 -64 -79
7443 -79 108 31 98 -63 -72 -203 76 137 70 15 105 -311 -198 -216 -374 -59 -148 -74 96 -134 -2 -19 97 219
7467 219 75 -220 -262 -95 -11 -7 155 -57 -34 69 76 164 40 -30 -30 164 -72 240 -122 54 -31 -27 -33 -72 -185 -57
7493 -57 100 18 151 136 -1 -291 129 -124 -204 68 -171 79 96 73 -107 -51 17 -53 -39 88 77 -51 -78 -30
7517 -30 166 -124 -120 69 -125 -72 -360 29 246 -51 -293 398 263 -221 18 -67 -24 174 143 -3 -57 23 -22
7540 -22 176 -33 132 -176 150 -100 275 -331 -42 -40 7 92 -56 -17 -42 193 -68 -159 -150 305 -169 41 69 42
7564 42 -118 -163 97 83 -90 52 155 58 -33 -109 -118 139 -36 59 -237 -35 17 -129 296 208 261 81 -16 16 -34
$$ packed form
7398a32J28j27j56R3Q5J25O4R0k08J77Jj87p6J76q9j87J90n8l7J62l5N3j43j0
7422a01J75j67J25J49l96K04N1J46m27J01J84q1J06j03J53k95K16K13k90k7j5
7443g9J87p7O7j61rj31K79O1o7n5R0m16J13j8j58L15q9P4J70k30J32j7J16J22
7467B19j44k95m2J67Q4MJ62k12K3J03PQ8j24p0%J94k36L12l62J76q5Mol9j13J28
7493e7J57q2J33j5j37k90M20k53q0K72k39K50J7k3j80N6O8p0J4J27j1j28k7M8
7517c0J96k90MJ89j94N3k88L89K17k97k42O91j35m84K39q5M3J98l1j46n4Q0m5
7540b2J98k09J65l08L26k50L75o06K89KM7Q5j48L9k5K35k61r1RM55m74K10K8k7
7564D2j60m5K60j4j73J42J03r7r1p6rK57j75R5k96K02N2j46M25q8N3j80r7L2n0
$$ plain form
7589 -34 63 -18 -218 -101 -139 -13 -34 -11 199 98 -140 -64 123 -66 -7 80 54 127 112 45 225 -127 61 -162
7613 -162 202 138 195 21 220 -260 24 -214 -10 -4 7 -127 -175 -115 -190 -92 273 -110 -186 -14 -266 25 -63 150
7637 150 49 40 -93 216 51 -1 -85 102 -158 -39 140 4 122 71 9 -77 170 -276 12 -66 -80 -102 -203
7660 -203 -92 46 110 -180 122 -211 -87 12 -120 219 -68 383 14 11 -111 33 63 40 -52 -132 -32 -146 93
7683 93 384 21 -101 35 27 157 62 107 -153 -107 -151 144 147 96 106 146 -44 53 -91 -105 -206 -111 20 117 156 -115
7709 -115 -244 -135 -19 -93 -311 19 -13 -81 104 179 -21 27 -264 10 -84 -225 95 222 4 55 -184 -37
7731 -37 -17 97 169 -149 99 -217 12 77 -205 13 266 255 169 -37 101 48 -14 -130 49 19 51 26 50 -87
7755 -87 -27 -29 24 158 -167 45 -76 -6 54 94 173 33 -34 52 -14 180 -73 4 -131 153 304 -50 -172 -150 -43
$$ packed form
7589c4R7q1k00J17l8J26k1K3K10j01k38P6J87j89N9Q7k6P3j5o7J80l52J88k23
7613a62L64o4N7j74J99m80K84k38K04OJ1j34m8O0p5R8L65l83p6J72k52K91q8K13
7637A50j01rj33L09j65n2q4J87k60J19J79j36J18n1o2q6K47m46K88p8j4k2j01
7660b03J11J38O4k90L02l33J24R9j32L39k87M51l69lj22J44L0k3r2q0J00j14K39
7683I3K91l63j22J36qJ30r5M5k60M6m4K95Ln1J0M0j90R7j44j4j01R5J31R7L9k71
7709a15j29J09J16p4k18L30l2o8J85P5k00M8k91K74r4j41L20J27k18N1k39J47
7731c7K0J14P2l18K48l16K29O5k82K18K53j1q6k06J38n3o2j16J79l0L2k5K4j37
7755h7O0kN3J34l25K12j21P0O0M0P9j40o7Q6o6J94k53P7j35K84J51l54j22K2J07
$$ plain form
7780 -43 -90 27 -110 -29 59 120 -102 -12 -206 -4 -67 -45 295 -96 -212 321 -58 1 -32 198 -210 -114 18 1
7804 1 23 -91 -76 -3 -137 -142 16 84 -204 -23 -21 128 175 -17 -113 -46 -125 -201 57 91 86 114 12 66 -101 -216 105
7831 105 -258 -8 -89 94 -168 45 179 161 -24 -9 72 9 -107 -158 -90 -118 330 -124 -68 181 162 -30 -131
7854 -131 25 88 -35 169 -91 212 140 -359 6 -182 189 134 30 -39 31 -10 172 -140 121 55 -28 -268 -88
7877 -88 17 251 -75 -106 -131 -73 -105 -173 -179 287 41 42 215 118 -6 98 -20 66 -65 68 -221 45 91 -80
7901 -80 -46 -47 226 -158 58 89 36 -81 191 -24 -204 -151 -144 -121 -168 27 33 229 -61 -11 22 -127 -44 -46 21 -80
7927 -80 -48 -11 -249 138 -77 -92 -120 99 68 48 -68 -2 168 -41 -54 -40 -164 92 57 158 61 -37 -93 -171 272
7952 272 -2 372 -101 -95 -101 -195 268 177 -8 238 233 38 2 -122 260 62 135 377 135 41 -1 -61 115 33 -114
$$ packed form
7780d3m7J17j37Q1Q8O1k22R0j94K02o3K2L40l91j16N33l79N9l3K30m08R6J32j7
7804AK2j14J5P3j34nJ58O8k88J81KJ49M7j92r6O7p9p6K58L4nK8j02N4j67j15L21
7831A05l63K50q1J83k62K13J34j8j85J5Q1o3j16n1O8k8M48m54N6K49j9j92j01
7854a31J56O3j23K04k60L03p2m99L65j88L71n5j04o9P0m1J82l12K61o6q3k40J80
7877h8J05K34l26l1k5N8l2o8oM66k46JJ73r7j24J04j18Q6j31J33k89K66M6j71
7901h0L4jK73l84K16L1n3j17K72k15j80N3PK3m7J95OJ96k90N0L3j49Q3kO7j01
7927h0L2L7k38L87k15j5k8K19l1k0j16O6J70k09j3J4j24K56l5J01r7r8n6p8M43
7952B72k74L74m73Oor4M63r1j85K46nj95l6j24L82j98P3K42k42r4m2o0J76q2j47
$$ plain form
7977 -114 145 -109 73 -9 111 59 -41 26 197 -57 38 -16 -8 -26 -24 -22 37 -68 145 -71 -72 -54 -166 -208 214 26
8003 26 247 2 -134 33 -68 13 117 -80 33 128 -107 -120 317 -125 4 44 138 107 53 -116 113 83 109
8026 109 -130 45 59 217 137 -6 39 69 258 -6 -17 69 72 74 -50 46 128 -49 46 -233 131 205 124 91 -36
8051 -36 -197 154 72 -10 -28 229 74 51 -108 74 24 -211 -102 29 243 -9 2 -24 -191 44 -135 -322 160
8074 160 -115 35 -124 22 -52 131 186 135 -285 -65 -37 -100 -17 -21 -142 -85 -157 -204 -16 43 6 56 -16 -323 -110
8099 -110 208 131 -87 -168 -133 -14 -24 -215 144 -1 18 213 -149 -2 -55 118 87 -21 -95 -67 21 -54 -71 -61
8123 -61 -65 -5 -27 83 186 -39 18 172 -115 -97 52 -69 -19 57 -50 137 -263 -148 -147 -140 -193 57 47 -34 99
8148 99 52 23 -62 34 51 12 -24 -243 36 124 -165 270 -5 11 68 42 -65 180 -92 14 122 -283 7 -123
$$ packed form
7977a14K59k54J82q2J20n2j00O7J71k54R5n4Qj8KKN9j05K13k16jJ8j12m2M22j88
8003B6K21k45j36J67j01Q1J04j97J13R5k35j3M37m42J29M0R4l1n4j69K29l0K6
8026A09k39J75J4J58q0j43M5L0J89k64j1Q6LKj24R6Q2j77R5k79L64P4q1l3j27
8051c6j61L51q2q2j8K57j55k3j59J82n0k35J09J31K14k52J1k6j67K35j79j87M82
8074A60k75J50j59J46p4J83N5n1m20K20K8o3Q3mj21N7p2m7J88N9l7N0p2l07K13
8099a10L18p7k18q1L5J19j0j91L59j45J9J95l62J47n3J73l1j08p4K8Q8p5j7J0
8123f1mO0k2J10J03k25N7J54k87J8J49j21N0P6j07J87m00J15JPn3K50j0q1J33
8148I9m7k9q5R6J7l9l6k19K79Q8k89M35k75J6N7k6j07K45k72J06J08m05K90j30
$$ plain form
8172 -123 -175 179 -64 -158 125 -280 -189 -14 37 -170 72 -185 -108 -86 -37 -27 38 -42 219
$$ packed form
8172a23n2L54k43r4K83m05R1J75N1k07K42k57P7K2M9J0O5q0K61
8191B19
$$ Imaginary data points
##PAGE= N=2
##DATA TABLE= (X++(I..I)), XYDATA
$$ plain form
0 0 0 0 0 0 0 0 0 0 0 0 0 0 0 0 8 -8 8 -8 8 -10 16 -16 16 -24 24 -32 35 -40 48 -55 63 -71 79 -90 100 -113
36 -113 126 -140 156 -176 194 -217 240 -265 293 -325 357 -392 432 -477 526 -578 639 -706 781
55 781 -868 964 -1078 1211 -1371 1566 -1810 2126 -2551 3150 -4068 5622 -8757 17490 -90192
70 -90192 -298060 9549 199243 -19346 -183543 -10931 128942 71136 19129 36607 11496
81 11496 25761 96009 50887 -95428 -84279 62524 66532 -67396 -71093 43201 69123 16428
93 16428 8603 6753 -18435 8206 39642 -42162 -116178 -29472 58979 -18417 -86737 65 73324
106 73324 20301 -11625 27053 19220 -14164 10246 7697 -56756 -45669 37828 19841 -59243
118 -59243 -5640 94360 32749 -60391 19732 102671 -6222 -103906 -4711 72222 -35979
$$ packed form
0@%%%%%%%%%%%%%%Qj6J6j6J6j8K6l2L2m0M8n6O7p5Q8j03J18j34J50j69J90k13
36a13K39k66K96l32L70m11M57n05N58o18O82p49Q24r09J003j104J217j345J487
55G81j649J832k042K289k582K937l376L936m677N701p218R690j4379K6247j07682
70i0192k07868L07609J89694k18589j64197J72612J39873n7806n2007J7478k5111
81A1496J4265P0248m5122j46315J1149J46803M008j33928l697J14294K5922n2695
93A6428p825j850k5188K6641L1436q1804p4016Q6706Q8451p7396o8320Q6802P3259
106G3324n3023l1926L8678p833l3384K4410k549o4453J1087Q3497j7987p9084
118e9243N3603J00000o1611r3140Q0123Q2939j08893r7684R9195P6933j08201
$$ plain form
129 -35979 -102760 4187 69238 -5517 -36532 30781 47074 -1089 -1540 17597 -16129 -34849
141 -34849 -712 1993 -35630 -22650 24232 18558 -4767 20364 34933 -1000 -7771 25032 5763
154 5763 -48387 -32495 19332 313 -41929 -10581 35418 16856 -4471 17604 21084 -6939
166 -6939 -4301 11774 -15791 -38781 -6926 12641 -13444 -13841 23089 22320 -3384 17195 40380
179 40380 -4475 -39467 8100 35844 -29346 -67480 -89 50284 -1893 -43312 4359 48858
191 48858 23412 -12855 -12763 -1085 3875 1197 -20412 -38419 -9685 28304 10972 -21845 -1031
204 -1031 37111 26542 -4242 -3586 4036 -5702 -6474 -839 -16780 -26930 4270 30358 3925 -20777
218 -20777 8865 37690 12549 -20597 -13674 3571 -1592 -14157 -19057 -16829 -140 19059 8328
$$ packed form
129c5979o6781J06947O5051p4755l1015O7313J6293m8163m51J9137l3726j8720
141c4849L4137K705l7623J2980M6882n674k3325K5131J4569l5933o771L2803j9269
154E763n4150J5892N1827j9019m2242L1348M5999j8562k1327K2075L480k8023
166f939K638J6075k7565k2990L1855J9567k6085l97L6930p69k5704K0579K3185
179D0380m4855l4992M7567K7744o5190l8134O7391N0373n2177m1419M7671M4499
191D8858k5446l6267R2J1678M960k678k1609j8007K8734L7989j7332l2817K0814
204a031L8142j0569l0784O56P622r738p72N635j5941j0150L1200K6088k6433k4702
218b0777K9642K8825k5141l3146O923J7245n163j2565m900K228J6689J9199j0731
$$ plain form
231 8328 -12361 3996 33043 17575 -19576 -13418 14772 3136 -24990 -15762 7636 4158 -4953
244 -4953 7049 16596 6957 4426 12076 4059 -11397 -8401 -1669 -10713 -16674 -5393 1623 -2071
258 -2071 3982 12154 5418 8 10252 9245 -10747 -16037 1875 3026 -15877 -14144 8456 14048
272 14048 877 1488 14470 13496 2391 -324 -932 -7042 -7643 -3749 -7462 -11440 -1551 9202 3079
287 3079 -1387 8124 10741 -411 -4111 223 -4818 -13421 -7293 1262 -5202 -8028 5830 14480 5743
302 5743 460 9054 11678 772 -6039 -3487 -3694 -6093 -4601 -3205 -3181 2458 9523 6073 -820 3797
318 3797 9246 -951 -11001 -6066 -1025 -7428 -11320 -2890 3273 467 2768 8012 6919 3132 3867
333 3867 3549 -2599 -6143 -2772 -2002 -4866 -2872 2647 3888 3540 6240 7527 2582 -548 1859 -1023
$$ packed form
231H328k0689J6357K9047j5468l7151O158K8190j1636k8126R228K3398l478r111
244d953J2002R547r639k531P650q017j5456K996O732r044n961J1281P016l694
258b071O053Q172o736n410J0244j007j9992n290J7912J151j8903J733K2600N592
272A4048j3171O11J2982r74j1105k715o08o110o01L894l713l978R889J0753o123
287C079m466R511K617j1152l700M334n041q603O128Q555o464k826J3858Q650q737
302E743n283Q594K624j0906o811K552k07k399J492J396K4N639P065l450o893M617
318C797N449j0197j0050M935N041o403l892Q430O163k806K301N244j093l787P35
333C867l18o148l544L371P70k864J994N519J241l48K700J287m945l130K407k882
$$ plain form
349 -1023 -8486 -8757 -3082 -2791 -6211 -2803 3668 4208 2782 4991 4228 673 -753 -925 -3265 -6428
365 -6428 -4169 -516 -868 -87 3943 6069 5692 5074 5160 2394 -2094 -2375 -1466 -5262 -7396 -3941 -128
382 -128 -318 -418 2675 4347 2641 2238 1487 -2031 -4449 -3867 -3176 -3714 -3792 -1278 1353 4059 6428 4601
400 4601 1982 3488 6325 2522 -5944 -6906 57 2009 -4004 -6965 -366 7131 5585 -238 -1085 1795
416 1795 3845 846 -6564 -9333 -3956 1898 -788 -7083 -4040 6007 9904 3465 -2389 605 6603
431 6603 5046 -3497 -7719 -2737 2732 2054 -3131 -2745 2981 7515 5541 102 -2043 498 2273 -750
447 -750 -7312 -8333 -1829 1712 -2041 -4551 682 5505 2819 544 2787 1782 -3368 -3104 1834 925
463 925 -6926 -5971 5308 9151 -249 -4487 4255 11134 4087 -4837 -4471 -748 773 -923 -5676 -7274
$$ packed form
349a023p463k71N675K91l420L408O471N40j426K209p63l555j426j72k340l163
365f428K259L653l52P81M030K126l77o18Q6k766m488k81R09l796k134L455L813
382a28j90j00L093J672j706m03p51l518k418N82O91n38p8K514K631K706K369j827
400D601k619J506K837l803q466r62O963J952o013k961O599P497j546n823q47K880
416A795K050k999p410k769N377N854k686o295L043J0047L897o439n854K994N998
431F603j557q543m222M982N469o78n185L86N726M534j974n439k145K541J775l023
447g50o562j021O504L541l753k510N233M823k686k275K243j005n150K64M938r09
463I25p851R55J1279L843r400m238Q742O879p047q924L66L723J521j696m753j598
$$ plain form
479 -7274 -1803 6465 5240 -4165 -6140 4247 10711 1474 -11849 -8439 6075 6678 -6958 -11132
493 -11132 1255 11085 6272 -2932 -2169 5002 8389 3780 -4512 -7228 -1097 4924 1703 -8266 -7798
508 -7798 5512 11002 -505 -8965 764 9925 305 -9718 -4320 2725 -1860 -6860 -853 3989
522 3989 -925 -2382 5089 7983 531 -3781 1737 5544 -656 -5955 -1895 1933 12 -68 2092 963
538 963 -1348 2902 7524 711 -8983 -4445 6314 2993 -10550 -11601 3448 9616 -712 -8707
552 -8707 -1135 9252 7124 -2513 -6134 -1688 3994 3913 -2567 -7793 -2871 8403 9185 -3475 -8485
567 -8485 5225 13654 1488 -11580 -4987 7033 2830 -7790 -7022 908 2834 -655 -1201 900
581 900 7 -139 2947 1873 -4421 -6117 1484 4920 -2375 -6470 1290 7359 2786 -1442 1471 4241
$$ packed form
479g274N471Q268j225r405j975J0387O464r237j3323L410J4514O03j3636m174
493a1132J2387R830m813r204P63P171L387m609q292k716O131O021l221r969M68
508g798J3310N490j1507q460R729R161r620j0023N398P045m585n000O007M842
522C989m914j457P471K894p452m312N518L807o200n299M060L828j921q0K160j129
538I63k311M250M622o813r694M538J0759l321j3543j051J5049O168j0328p995
552h707P572J0387k128r637l621M446N682q1o480n226M922J1274P82j2660n010
567h485J3710Q429j2166j3068O593J2020m203j0620P68P930J926l489n46K101
581I00q93j46L086j074o294j696P601L436p295m095P760O069m573m228K913K770
$$ plain form
597 4241 1559 -992 312 -70 -3466 -2837 1915 2423 -3043 -4860 2679 6330 -253 -5200 -1720 2968
613 2968 1583 -3864 -5393 -2546 2214 3560 -1131 -4383 705 7713 5611 -3148 -4581 3244 6799
628 6799 -645 -7593 -2834 5344 3919 -3187 -3709 2427 5341 1302 -2552 -1738 109 -250 -1392 -2933
644 -2933 -3383 -1933 1093 1829 -1800 -2282 2795 5424 555 -3704 -361 3256 800 -3658 -1518 2498
660 2498 2457 -391 -454 2474 3118 904 -545 -394 15 -147 -2229 -3291 -1372 995 -478 -2938 -558
677 -558 2894 1410 -2099 -1175 1343 1265 -1355 -2520 -1023 638 1136 -80 -259 1503 2807 1962 986
694 986 385 647 650 -245 -799 -1245 -1676 -95 906 -168 -2085 -255 2206 1242 -2657 -2133 923 413
712 413 -2693 -2693 -71 927 -92 307 710 1223 2106 1869 640 -42 880 914 -833 -583 157 -82 -486 902
$$ packed form
597D241k682k551J304l82l396O29M752N08n466j817P539L651o583m947L480M688
613B968j385n447j529K847M760J346m691l252N088P008k102q759j433P825L555
628F799p444o948M759Q178j425p106n22O136K914m039l854Q14J847l59j142j541
644b933m50J450L026P36l629m82N077K629m869m259L343L617k456m458K140M016
660B498m1k848o3K928O44k214j449J51M09j62k082j062J919K367j473k460K380
677e58L452j484l509R24K518p8k620j165J497J661M98j216j79J762J304q45r76
694I86o01K62Lq95n54m46m31J581J001j074j917J830K461r64l899N24L056n10
712D13l106%K622R98j019L99M03N13Q83k37j229o82R22L4j747K50P40k39m04J388
$$ plain form
732 902 1346 -135 -524 635 1182 -1276 -2332 -827 -104 -1529 -2541 -632 1020 266 -555 454 1257
749 1257 1548 788 -443 -637 688 987 -896 -1444 950 1789 299 -336 1358 2188 244 -791 -42
766 -42 -148 -1483 -1479 -794 -883 -1648 -398 638 -168 -735 274 641 -26 -466 -470 -266 -56 -75 -104 -175 920 1930
788 1930 950 90 929 1811 1019 -632 -359 542 -319 -1405 -778 90 -216 -548 61 362 -218 -467 -315
807 -315 -707 -705 -711 -793 -700 -131 412 493 122 1277 1636 563 609 950 1185 11 -879 163 610 -236 -568 24
829 24 882 492 64 -108 -121 -287 -570 -1245 -1295 -726 -542 -885 -838 -71 815 667 298 633 408 482 601 -30
851 -30 -342 -157 677 1158 -4 -381 1086 1692 578 -795 -148 823 -51 -1125 -1429 -930 -226 -406 -1034
870 -1034 -865 -223 481 719 -650 -440 158 440 29 -706 -461 417 617 521 674 646 834 1364 1135 175
$$ packed form
732I02M44j481l89J159N47k458j056J505P23j425j012J909J652p54q21J009Q03
749A257K91p60j231j94J325K99j883n48K394Q39j490o35J694Q30j944j035P49
766d2j06j335MO85q9p65J250J036q06n67J009L67o67m40mK04K10j9k9p1J095J010
788A930r80q60Q39Q82p92j651K73R01q61j086O27Q68l06l32O09L01n80k49J52
807c15l92Koq2R3N69N43Q1l71J155L59j073M6L41K35j174q90J042M47q46l32N92
829B4Q58l90m28j72j3j66k83o75n0N69J84l43M7P67Q86j48l69L35k25P4J19o31
851c0l12J85Q34M81j162l77J467O06j114j373O47R71q74j074l04M99P04j80o28
870a034J69O42P04K38j369K10N98K82m11p35K45Q78K00r6J53k8J88N30k29r60
$$ plain form
890 175 -614 142 531 -385 -755 -821 -146 273 -174 -576 -648 -251 489 151 -1281 -1284 -160 667 -377 -1135 -257
911 -257 1100 1065 463 -53 554 1256 1242 525 -772 -556 1135 812 -932 -1295 442 1377 532 -928 -959
930 -959 316 348 -803 -1723 -1166 -179 -272 -694 -829 -268 174 264 646 393 8 525 1039 711 -207 -589 975
951 975 1018 69 -342 528 500 101 756 434 -750 -1176 696 593 -1910 -2532 -82 1576 -595 -2096 -332
970 -332 1735 577 -895 -986 62 245 377 210 -954 -657 1368 1719 -237 -1458 468 2551 937
987 937 -1601 -1257 1160 1332 -603 -2097 -747 1056 347 -1145 -918 101 419 -253 -488 -449 -398 -387 261
1006 261 44 -1110 -459 1300 1395 -517 -161 1790 1281 -596 12 1248 237 -1483 265 1458 -363
1023 -363 -2042 165 1523 -10 -1714 -503 862 -372 -1580 -861 -200 -370 -262 306 -298 -914 710
$$ packed form
890A75p89P56L89r16l70o6O75M19m47m02p2L97P40l38j432lJ124Q27j044p58Q78
911b57J357l5o02n16O07P02j4p17j297K16J691l23j744l63J737R35q45j460l1
930i59J275L2j151r20N57R87r3m22j35N61M42R0L82k53l85N17N14l28r18l82J564
951I75M3r49m11Q70k8l99O55l22j184m26J872j03k503o22K450J658k171j501J764
970c32K067j158j472r1J048J83J32j67j164K97K025L51j956j221J926K083j614
987I37k538L44K417J72j935j494J350J803p09j492K27J019L18o72k35L9N1J1O48
1006B61k17j154O51J759R5j912L56J951n09j877O08J236j011j720J748J193j821
1023c63j679K207J358j533j704J211J365j234j208P19O61j70J08N68o04o16J624
$$ plain form
1040 710 1499 465 -775 -179 1579 1113 -744 -1204 608 1757 461 -1026 -277 1057 1077 -758 -1043
1057 -1043 -82 376 -781 -773 -645 -744 -443 244 -182 -1083 -929 1338 974 -1116 -648 1134 1089 -932 -623
1076 -623 1136 805 -209 232 1183 172 -354 470 1086 -81 -1156 195 119 -760 -693 182 -208 -695 -201
1095 -201 530 -301 -1064 -58 444 -327 -618 -212 105 215 -182 -105 -121 1086 1023 -193 -178 773 977 -84
1115 -84 -778 -102 589 -117 -269 -129 -404 -248 169 90 -721 -804 189 145 -957 -821 366 260 -621 -609 592
1136 592 574 -7 622 704 243 314 603 173 -521 251 913 244 -372 403 529 62 -180 46 156 -170 -637
1157 -637 -197 -302 -653 -164 -188 -337 -367 149 -81 -225 -65 322 401 -464 134 537 192 84 260 654 288
1178 288 161 613 289 -385 150 133 -317 -381 -130 -372 -410 -91 42 -287 -527 -402 -32 -239 -477 86 82 -156
$$ packed form
1040G10P89j034j240N96J758m66j857m60J812J149j296j487P49J334K0j835k85
1057a043R61M58j157QJ28r9L01O87m26r01J54K267l64k090M68J782m5k021L09
1076f23J759l31j014M41R51j011n26Q24O16j167j075J351p6q79O7Q75l90m87M94
1095b01P31q31p63J006N02p71k91M06L17J10l97P7j6J207o3j216J5R51K04j061
1115h4o94O76O91p06j52J40k75J56M17p9q11q3R93m4j102J36J187j06q81J2J201
1136E92j8n81O29Q2m61P1K89m30o94P72O62o69o16P75J26m67k42K26J10l26m67
1157f37M40j05l51M89k4j49l0N16k30j44J60L87P9q65N98M03l45j08J76L94l66
1178B88j27M52l24o74N35j7m50o4K51k42l8L19J33l29k40J25L70k07k38N63mk38
$$ plain form
1200 -156 26 197 547 -102 90 1004 177 -401 515 730 157 -124 422 248 -338 -325 -27 -141 -273 -145
1220 -145 -256 -471 -498 -145 -339 -709 -621 52 -315 -413 -32 93 134 60 515 213 155 453 779 266 196 300
1242 300 406 187 -6 212 -176 -42 54 -48 -242 -337 -115 151 -209 -823 -69 118 -602 -460 74 125 -340
1263 -340 -144 335 -17 -35 381 285 45 405 227 341 128 274 225 227 360 226 58 -285 -266 -112 -524 -604
1285 -604 -212 -81 -226 -245 -416 97 22 -424 -136 201 -36 -3 303 -129 100 333 214 216 259 483 105 314
1307 314 340 289 1 -53 99 25 -233 -278 26 35 -379 -280 -174 -228 -444 -298 -132 -298 -568 -9 79 -75 2 239
1331 239 322 92 334 410 177 -122 24 283 32 331 188 -175 -438 201 201 -51 -52 -164 28 -30 -349 -228
1353 -228 -286 -380 -317 -279 -52 234 43 16 56 -41 257 154 -5 492 518 -49 67 276 175 8 143 367 0
$$ packed form
1200a56J82J71L50o49J92R14q27n78R16K15n73k81N46j74n86J3K98j14j32J28
1220a45j11k15k7L53j94l70Q8O73l67r8L81J25M1p4M55l02n8K98L26n13p0J04
1242C00J06k19j93K18l88J34R6j02j94r5K22K66l60o14P54J87p20J42N34N1m65
1263c40J96M79l52j8M16r6k40L60j78J14k13J46m9KJ33j34j68l43J9J54m12q0
1285f04L92J31j45j9j71N13p5m46K88L37k37L3L06m32K29K33j19KM3K24l78K09
1307C14K6n1k88n4J52p4k58m5L04Rm14R9J06n4k16J46J66j66k70N59Q8j54P7K37
1331B39Q3k30K42P6k33k99J46K59k51K99j43l63k63O39%k52jj12J92n8l19J21
1353b28n8r4O3L8K27K86j91k7M0r7K98j03j59M97K6n67J16K09j01j67J35K24l67
$$ plain form
1376 0 -271 32 93 -9 -201 -394 32 -388 -497 -174 -161 -339 -304 52 -31 14 3 260 -60 -216 287 520 256
1399 256 176 21 135 549 412 91 56 80 176 35 -430 -282 -68 -25 -5 -306 -168 -366 109 -138 -276 -480
1421 -480 89 131 -197 -303 -13 356 186 -168 202 488 418 156 390 235 425 187 6 206 -198 37 183
1442 183 303 -136 -291 -38 37 -308 -241 -242 -127 -536 80 -248 -117 -195 -59 421 83 52 71 138 175 94 73 97
1466 97 531 160 178 221 354 254 11 -108 -66 -11 30 -462 -132 -241 -296 197 -75 -397 -360 57 31 -136 -229
1489 -229 -13 149 -95 94 158 261 -153 379 366 258 68 159 300 264 -156 58 129 -120 -268 -326 194 -414
1511 -414 -377 -146 -66 -125 -560 -60 5 -240 -410 84 114 -499 143 72 249 208 284 280 173 354 44 169 61
1534 61 80 -37 -192 -226 121 -378 -170 192 -356 -447 -101 234 -7 -580 -395 14 -202 -317 -129 -54 -127 36
$$ packed form
1376@k71L03O1j02j92j93M26m20j09L23J3j78L5L56q3M5j1K57l20j56N03K33k64
1399B56q0j55J14M14j37l21l5K4R6j41m65J48K14M3K0l01J38j98M75k47j38k04
1421d80N69M2l28j06K90L69j70l54L70K86p0k62K34j55J90k38j81K00m04K35J46
1442A83J20m39j55K53P5l45O7jJ15m09O16l28J31p8J36M80l38l1J9O7L7q1k1K4
1466I7M34l71J8M3J33j00k43j19M2N5M1m92L30j09n5M93k72l22L7M17k6j67r3
1489b29K16J62k44J89O4J03m14N32j3j08j90R1J41l6m20K14P1k49j48n8N20o08
1511d14L7K31Q0n9m35N00O5k45j70M94L0o13O42p1J77m1P6mj07J81l10J25j08
1534F1J9j17j55l4L47m99K08L62n48r1L46L35k41n73J85M09k16j15J88P5p3J63
$$ plain form
1556 36 129 122 9 -6 143 159 31 204 459 129 21 310 107 -72 74 -11 -8 -463 -221 102 -149 -357 -270
1579 -270 -438 -95 -130 -231 -67 -341 174 39 -72 62 228 205 78 326 294 215 -26 247 192 -6 225 217
1601 217 73 -167 -57 254 -289 -415 -169 -68 -381 -305 -242 -245 -356 -251 10 108 -241 155 -20 32 124 -78
1623 -78 476 -51 79 28 169 -7 -179 224 215 -127 -19 119 19 138 -23 -236 -336 -30 -13 -437 -378 -1
1645 -1 139 -384 -345 -61 110 -391 -4 73 -103 13 60 402 86 108 313 342 -316 -39 402 223 -166 115
1667 115 61 -209 -172 339 -183 -222 -361 -2 -182 -174 -77 80 0 -167 -159 -9 134 -163 213 90 65 345 199
1690 199 65 60 402 403 92 176 -60 1 -259 94 -13 28 -127 -20 107 -269 -214 -192 -244 -42 -176 103 -268
1713 -268 -234 284 -59 -211 53 70 86 62 0 332 -42 -140 87 482 -241 90 459 100 64 -126 179 25
$$ packed form
1556C6R3pj13j5J49J6j28J73K55l30j08K89k03j79J46q5Lm55K42L23k51k08Q7
1579b70j68L43l5j01J64k74N15j35j11J34J66k3j27K48l2p9k41K73n5j98K31q
1601B17j44k40J10L11n43j26K46J01l13P6O3lj11J05K61R8l49L96j75N2R2k02
1623g8N54n27J30n1J41j76j72M03rl42J08J38j00J19j61k13j00L06J7m24N9L77
1645aJ40n23L9K84J71n01L87P7j76J16M7L42l16K2K05K9o58K77M41j79l89K81
1667A15n4k70L7N11n22l9j39L59j80QR7J57q0j67QJ50J43k97L76j23k5K80j46
1690A99j34nL42Jl11Q4k36O1k60L53j07M1j55J07J27l76N5K2n2K02j34K79l71
1713b68L4N18l43j52K64J7J6k4o2L32l74r8K27L95p23L31L69l59l6j90L05j54
$$ plain form
1735 25 -134 101 -227 32 -234 -260 -160 -229 21 119 -201 -244 147 381 186 150 199 284 40 260 187 -30 75
1758 75 102 70 -129 -144 152 46 -258 -2 65 100 89 -274 184 -284 -145 -224 53 -77 139 192 32 -28 -98 140
1782 140 100 -32 132 96 170 -84 88 190 -134 113 291 39 -77 378 128 -139 -234 -158 -139 34 129 -92
1804 -92 -163 -431 -69 -80 -162 -30 8 109 -94 -89 381 115 33 156 -129 168 177 160 200 97 17 -50 82 199 -201
1829 -201 -185 -72 82 -66 21 22 107 -42 -468 -19 24 -207 -75 -29 233 -37 54 17 37 -50 39 290 -46 64
1853 64 118 337 115 -182 -255 9 2 -149 -155 -352 -100 -109 -133 -64 -121 -15 -33 -193 -122 5 146 -53 89 12 141
1878 141 37 -42 77 16 -70 70 6 62 258 -19 -20 221 -15 22 94 8 133 138 -22 -150 -315 -84 -101 -105 -290
1903 -290 -14 -74 117 48 -301 -246 -29 81 -76 260 241 54 66 124 40 199 99 -175 194 25 -183 68
$$ packed form
1735B5j59K35l28K59k66k6J00o9K50R8l20m3L91K34j95l6M9Q5k44K20p3k17J05
1758G5K7l2j99j5K96j06l04K56O7L5j1l63M58m68J39p9K77j30K16N3j60o0p0K38
1782A40m0j32J64l6P4k54J72J02l24K47J78k52j16M55k50k67r5P6J9J73R5k21
1804i2p1k68L62j1q2J32L8J01k03NM70k66q2J23k85K97Rj7M0j03q0o7J32J17m00
1829b01J6J13J54j48Q7JQ5j49m26M49M3k31J32M6K62k70R1l7K0q7Q9K51l36J10
1853F4N4K19k22k97p3K64pj51oj97K52rk4O9n7J06j8j60P1J27J41j99J42p7J29
1878A41j04p9J19o1q6J40o4N6J96k77jK41k36L7P2q6J25Nj60j28j65K31j7mj85
1903b90K76o0J91o9l49N5K17J10j57L36j9j87J2N8q4J59j00k74L69j69k08K51
$$ plain form
1925 68 -133 -189 -245 18 -229 -31 -112 -317 28 99 -121 -285 -113 -249 -132 134 -216 173 76 59 25 188 -166
1948 -166 144 189 -175 206 89 147 -117 -8 -27 -172 6 122 -283 123 -76 -144 66 33 -42 -274 -176 20
1970 20 140 -241 70 -12 -70 -136 19 6 -19 26 230 145 268 -67 130 311 -63 -85 127 19 115 -144 -52 25
1994 25 -142 -54 -175 -259 -58 -117 9 19 -226 188 -113 140 92 84 139 93 100 36 208 107 -53 160 84 -6 -85
2019 -85 26 -61 -149 -119 255 -118 38 -16 -145 128 30 192 -273 -1 34 -16 1 82 61 113 22 284 -47 51 -87
2044 -87 176 139 261 355 -16 41 7 -62 82 223 -217 78 -81 23 -184 -61 -191 -3 -139 38 -115 -29
2066 -29 -228 3 56 -102 -392 -15 172 133 232 -270 28 145 -117 129 18 -144 237 194 168 -221 -25 150
2088 150 -87 10 5 -73 119 -257 -114 -27 -358 57 -189 -22 118 -227 -22 41 -34 198 3 -27 125 222 69
$$ packed form
1925F8k01n6n6K63k47J98q1k05L45P1k20j64J72j36J17K66l50L89r7j7l4J63l54
1948a66L10M5l64L81j17N8k64J09j9j45J78J16m05M06j99o8K10l3p5k32R8J96
1970B0J20l81L11q2n8o6J55j3k5M5K04q5J23l35J97J81l74k2K12j08R6k59R2P7
1994B5j67Q8j21q4K01n9J26J0k45M14l01K53m8qN5m6Po4J72j01j60K13p6r0p9
2019h5J11q7q8L0L74l73J56n4j29K73r8J62m65K72L5n0J7Q1k1N2r1K62l31R8j38
2044h7K63l7J22R4l71N7l4o9J44J41m40K95j59J04k07J23j30J88j36J77j53Q6
2066b9j99K31N3j58k90L77J87l9R9n02K98J17k62K46j11j62L81m3k6l89J96J75
2088A50k37R7np8J92l76J43Q7l31M15k46J67J40l45K05O3p5K32j95l0J52R7j53
$$ plain form
2111 69 -64 1 209 -40 257 18 -82 -7 -73 54 -114 -252 -83 -107 54 -49 -344 -1 -86 -199 -31 -40 43
2134 43 80 56 81 200 -24 247 34 19 47 -45 35 -48 118 -69 -122 53 59 -56 -37 -31 -188 -123 63 45 -21 -2
2160 -2 86 42 144 -170 26 225 -35 -73 -59 177 -165 49 245 70 -188 246 241 -200 -7 444 269 -34 -72
2183 -72 -27 -257 54 220 -5 -70 -322 -174 -176 -72 -136 -144 -97 -11 -463 -63 27 215 -277 36 -127 170 89 289
2207 289 -8 -34 2 141 46 155 83 63 -48 57 -50 -121 -96 -59 -33 -126 -228 -112 -68 -29 -20 -149 180 107 -56
2232 -56 24 -78 66 -11 68 -16 236 8 79 -123 95 -4 -240 102 59 -39 -48 -216 -86 30 -167 113 2 -149
2256 -149 119 122 105 -14 -180 6 -84 -166 195 -3 -88 116 96 60 -177 89 15 87 -70 88 225 -45 218
2279 218 27 144 -27 116 -86 -64 -87 142 106 23 -131 110 -112 12 -19 -317 25 -159 19 148 -191 -220
$$ packed form
2111F9j33O5K08k49K97k39j00P5o6J27j68j38J69k4J61j03k95L43q5j13J68rQ3
2134D3L7k4K5J19k24K71k13j5K8r2Q0q3J66j87n3J75Oj15J9Oj57O5J86j8o6J9
2160bQ8m4J02l14J96J99k60l8J4K36l42K14J96j75k58M34nm41J93M51j75l03l8
2183g2M5k30L11J66k25o5k52J48kJ04o4qM7Q6m52M00R0J88m92L13j63K97q1K00
2207B89k97k6L6J39r5J09p2k0j11J05j07p1K5L7K6r3j02J16M4L9Rj29L29p3j63
2232e6Q0j02J44p7P9q4K52k28P1k02K18r9k36L42m3r8rj68J30J16j97K80j11j51
2256a49K68Lj7j19j66J86r0q2L61j98q5K04k0l6k37K66p4P2j57J58J37k70K63
2279B18j91J17j71J43k02K2k3K29l6q3j54K41k22J24l1k98L42j84J78J29l39k9
$$ plain form
2301 -220 114 -9 52 8 118 -111 -156 65 155 -70 178 -81 -90 33 153 -50 -51 -149 -45 153 -194 -48 111
2324 111 -94 35 34 4 -3 -61 101 -10 -84 -82 -2 -243 -122 38 34 242 87 113 -79 -54 4 -201 73 -10 -93 -168
2350 -168 -74 -381 109 58 -181 14 200 61 27 -159 23 -22 -61 -308 150 39 -58 127 -8 166 87 67 313
2373 313 41 124 -91 -147 -6 15 -346 23 333 7 -193 -280 -13 175 25 81 144 7 98 -38 -92 -56 96
2396 96 -90 -14 -19 41 -103 -158 -199 -20 -267 125 -44 37 -84 -193 117 18 43 -35 92 -153 -57 -33 -211 130
2420 130 -46 -100 121 -47 -61 38 77 81 59 91 -73 53 -235 63 -18 74 83 -114 108 -68 -200 -68 -97 124
2444 124 6 -120 142 86 -10 -205 -58 -154 -4 -237 174 -44 14 -196 -77 -51 12 -33 -10 170 124 239 106
2467 106 79 277 -4 195 20 277 28 -20 83 -136 -1 -40 -11 -228 -228 -95 223 18 -158 -163 -69 -35 -210
$$ packed form
2301b20L34j23O1m4J10k29m5K21R0k25K48k59rJ23J20k03jr8J04J98l47J46J59
2324A11k05J29jl0pn8J62j11p4KQ0k41J21J60mK08j55K6j92K5N8k05K74q3q3p5
2350a68R4l07M90n1k39J95J86j39l4j86J82m5l9k47M58j11r7J85j35J74p9k0K46
2373C13k72Q3k15n6J41K1l61L69L10l26k00q7K67J88j50N6O3j37R1j36n4L6J52
2396I6j86P6nO0j44n5m1J79k47L92j69Q1j21j09L10r9K5p8J27k45R6K4j78L41
2420A30j76n4K21j68j4R9L9Mk2L2j64J26k88K98q1R2Rj97K22j76j32J32k9K21
2444A24j18j26K62n6r6j95J47r6J50k33M11k18N8k10J19K6O3m5K3J80m6J15j33
2467A06k7J98k81J99j75K57k49m8J03k19J35l9K9k17%J33L18k05j76nR4L4j75
$$ plain form
2490 -210 -93 21 -232 247 -302 45 72 188 210 98 87 65 32 113 -170 92 8 -7 340 94 -156 -98 -172
2513 -172 156 17 -23 251 73 27 -47 348 -44 238 -56 89 -83 85 44 106 -160 23 204 -144 208 46
2535 46 235 218 15 15 35 -55 -98 -236 142 -24 84 -166 -10 -9 -232 -16 152 25 -457 -110 67 -37 14
2558 14 -32 20 -184 -129 39 -1 -133 46 202 217 -54 -182 153 -190 -1 97 -41 -98 -29 -66 4 -21 -94 204
2582 204 129 -19 38 59 -111 114 54 83 143 48 104 217 93 -100 54 4 56 127 -2 112 73 157 -13 -150
2606 -150 63 58 -90 49 53 66 69 -70 -124 80 -26 142 -91 13 59 -109 -140 -97 -204 -36 -57 -41 -14 156 -6
2631 -6 56 50 -75 -181 -81 -73 90 -146 54 -296 -322 174 187 2 38 3 -229 130 -65 160 -78 45 36 -124
2655 -124 116 -66 -31 181 -43 157 -32 -218 -133 19 -12 -100 -47 -102 77 -135 54 -155 17 -311 -22 -291
$$ packed form
2490b10J17J14k53M79n49L47K7J16K2j12j1k2l3Q1k83K62q4j5L47k46k50N8p4
2513a72L28j39m0K74j78m6p4L95l92K82k94J45j72J68m1O2k66J83J81l48L52j62
2535D6J89j7k03%K0r0m3j38L78j66J08k50J56Jk23K16J68j27m82L47J77j04N1
2558A4m6N2k04N5J68m0j32J79J56J5k71j28L35l43J89R8j38n7O9l7P0k5p3K98
2582B04p5j48N7K1j70K25o0K9O0r5N6J13j24j93J54n0N2P1j29J14l9Q4j70j37
2606a50K13nj48J39MJ3Lj39n4K04j06J68k33J04M6j68l1M3j07J68k1J6K7J70j62
2631fO2oj25j06J00QJ63k36K00l50k6M96J3j85L6l5k32L59j95K25k38J23rj60
2655a24K40j82L5K12k24K00j89j86Q5J52l1q8N3n5J79k12J89k09J72l28K89k69
$$ plain form
2677 -291 -3 74 -280 -19 88 62 35 62 -41 384 -180 16 56 168 -29 -58 30 308 -30 25 23 13 -98 65
2701 65 -168 -282 58 -119 -93 -139 -88 -93 71 -27 -235 -32 99 82 -22 78 -74 -171 109 94 160 -191 98 161
2725 161 -21 120 -14 200 -119 75 108 -74 44 -77 117 -65 79 -38 96 122 109 -70 -164 29 -8 60
2747 60 -38 -159 -86 145 -73 218 -167 -86 -8 195 106 126 138 0 -67 -116 127 97 23 29 107 -218 -20 50 -85
2772 -85 16 142 111 -109 12 240 103 -53 -71 -104 -73 -60 -120 60 139 207 -10 -78 -78 -267 35 146 -78 92
2796 92 -32 175 -71 -33 -170 -69 113 31 40 150 18 -96 49 20 -2 348 110 221 -29 -205 23 127
2818 127 -385 -50 167 17 101 126 123 -82 41 -156 -184 -40 256 177 196 -94 -174 154 -245 43 -109 -121 123
2841 123 -206 -9 168 -224 -228 69 4 -142 -11 22 -80 71 -211 10 37 -190 -53 -93 28 35 138 0 -311
$$ packed form
2677b91K88P7l54K61J07k6k7K7j03M25n64J96M0J12j97k9Q8K78l38N5kj0j11J63
2701F5k33j14L40j77K6m6N1nJ64r8k08K03J31j7j04J00j52r7K80j5O6l51K89O3
2725A61j82J41j34K14l19J94L3j82J18j21J94j82J44j17J34K6j3j79r4J93l7O8
2747F0r8j21P3K31k18K91l85Q1P8K03q9K0J2j38o7m9K43l0p4OP8l25J98P0j35
2772h5J01J26l1k20J21K28j37j56j8l3L1J3o0J80P9O8k17o8%j89L02J11k24J70
2796I2j24K07k46L8j37J01J82q2RJ10j32j14J45k9k2L50k38J11k50j76K28J04
2818A27n12L35K17j50Q4K5lk05J23j97k8J44K96p9J9k90q0L28l99K88j52j2K44
2841A23l29J97J77l92mK97o5j46J31L3j02J51k82K21K7k27J37m0J21PJ03j38l11
$$ plain form
2864 -311 -14 -193 10 -170 -72 140 12 -44 -178 30 93 13 105 196 97 110 -119 -16 -118 294 297 124 115 130
2888 130 -73 -69 45 -40 2 216 -120 -148 292 -218 30 -182 68 -108 49 273 -25 -36 78 -54 -83 -187
2910 -187 -65 -16 4 -245 -241 179 -81 36 211 170 241 98 -50 230 -67 -62 101 -131 -20 103 45 -175 -82
2933 -82 -58 -92 -28 156 -60 -25 32 82 129 -20 2 -122 -72 64 -132 12 -152 -85 -42 -63 -141 54 -2 11 -325
2958 -325 -156 127 110 -155 -301 -66 20 20 -49 -65 -38 54 -72 -14 -23 32 269 88 237 255 -21 65 77 168 174 174 -80
2985 -80 -246 127 76 -144 161 -75 -110 -369 -151 95 125 -132 -259 70 1 -50 47 9 -4 -121 132 444 37
3008 37 -43 -98 268 96 203 188 -129 -70 201 -127 -16 69 -51 -487 -18 -32 -4 -4 -47 154 -207 114 -11 174
3032 174 -165 -79 -177 2 -13 164 -108 101 -140 -142 89 -44 -31 69 76 -45 -82 -217 -175 137 118 -173 54 -143
$$ packed form
2864c11K97j79K03j80R8K12j28n6j34K08O3q0R2R1r9J3k29J03j02M12Lj73rJ5
2888A30k03MJ14q5M2K14l36k8M40n10K48k12K50j76J57K24k98j1J14j32k9j04
2910a87J22M9K0k49MM20k60J17J75m1P1j43j48K80k97NJ63k32J11J23n8k20R3
2933h2K4l4O4J84k16L5N7N0M7j49K2j24N0J36j96J44j64O7M3k1p8J95n6J3l36
2958c25J69K83j7k65j46K35Q6%o9j6K7R2j26N8rN5K37j81J49J8k76Q6J2R1O%k54
2985h0j66L73n1k20L05k36l5k59K18K46L0k57j27L29o9n1R7l8j3j17K53L12m07
3008C7q0n5L66j72J07j5l17N9K71l28J11Q5j20m36M69j4K8%m3K01l61L21j25J85
3032A74l39Q6r8J79j5J77k72K09k41kK31j33J3J00Pj21l7j35M2L12j9k91K27j97
$$ plain form
3056 -143 -77 29 28 -110 -326 -193 -10 -217 102 290 -89 49 -76 226 202 -153 -83 12 -103 -216 156 226
3078 226 -105 268 0 29 -139 -28 57 -33 20 -34 24 140 -241 -151 -55 -27 -67 -95 -19 58 -54 -138 -68 102 -55
3103 -55 211 191 12 2 -61 206 240 -33 314 2 128 -34 84 396 64 71 -56 -108 39 26 21 -53 116 -250
3127 -250 -160 218 130 130 221 221 191 161 -47 -71 8 155 63 82 135 231 29 84 -236 -52 178 29 -419 206 -85
3152 -85 -77 -20 16 -41 -42 90 -60 -171 -135 177 189 -266 158 141 -174 -341 214 -154 6 18 25 97 34 -15 195 40
3178 40 -57 109 92 2 -116 82 3 -100 -177 4 109 -32 -128 -166 57 42 -269 203 4 -86 2 213 246 -2
3202 -2 -154 -100 104 -56 -159 65 32 -46 98 37 133 -7 270 52 29 -18 73 119 -80 -2 -43 -10 22 70 10 -106
3228 -106 26 34 16 -26 173 97 135 -55 148 68 37 188 -106 67 36 -142 33 80 132 -148 -30 112 39 10
$$ packed form
3056a43O6J06jj38k16J33J83k07L19J88l79J38j25L02k4l55P0R5j15j13L72P0
3078B26l31L73k68K9j68J11Q5r0N3n4N8J16l81R0R6K8m0k8P6P7j12q4P0J70j57
3103e5K66k0j79j0o3K67L4k73L47l12J26j62J18L12l32Pj27n2J47j3np4J69l66
3127b50R0L78q8%R1%l0l0k08k4P9J47r2J9N3R6k02N5l20J84K30j49m48O25k91
3152h5QN7L6n7jJ32j50j11L6L12J2m55M24j7l15j67N55l68J60J2PP2o3m9K10j55
3178D0r7J66j7r0j18J98p9j03p7J81J05j41r6l8K23j5l11M72j99r0Q8K11L3k48
3202bj52N4K04j60j03K24l3p8J44o1R6j40K77k18k3m7R1M6j99P8m1L3L2M8o0j16
3228a06J32Qj8m2J99p6L8j90K03q0l1J51k94J73l1j78J75M7N2k80J18J42p3k9
$$ plain form
3252 10 -35 -277 40 206 9 -45 -242 75 98 189 246 15 37 93 -94 50 -22 -41 -110 147 -64 112 -71 64
3276 64 145 88 -14 255 111 172 -101 206 3 -35 40 -192 8 32 61 -288 86 -239 -165 -88 -77 -53 51 56 148
3301 148 28 -157 -123 48 -38 132 37 -78 -64 -121 10 33 96 55 0 -232 -35 -113 96 190 43 132 -62 75
3325 75 75 -17 -49 -66 -21 158 75 93 182 145 65 57 -162 -102 49 -157 -146 -142 -74 -113 54 -24 176 -200 -238 -273 -71 -156
3353 -156 -188 26 18 3 122 159 159 101 330 -85 -117 69 128 -14 185 55 165 39 -111 -179 -222 -4 -83 35
3377 35 75 112 184 -387 -57 -84 69 -123 -4 -98 281 -213 -109 143 226 54 -173 -4 9 99 -47 63 -81
3400 -81 48 188 206 50 -77 5 -18 -143 -31 39 -13 235 35 -83 -224 169 -207 -118 97 -101 104 107 -58
3423 -58 199 -126 55 -175 46 205 0 258 39 86 91 154 7 -3 50 34 197 -60 -114 -112 6 -324 -97 -51
$$ packed form
3252A0m5k42L17J66j97n4j97L17K3R1N7k31K2N6j87J44p2j9o9K57k11J76j83J35
3276F4Q1n7j02K69j44O1k73L07k03l8P5k32K00K4K9l49L74l25P4P7J1K4J04NR2
3301A48j20j85L4J71q6J70r5j15J4n7J31K3O3m1n5k32J97p8K09R4j47Q9j94J37
3325G5%r2l2j7M5J79q3J8Q9l7q0qk19O0J51k06J1MO8l9J67p8K00l76l8l5K02q5
3353a56l2K14qj5J19L7%n8K29m15l2J86N9j42J99j30J10j26j50o8m3K18p9J18
3377C5M0L7P2n71L30k7J53j92J19r4L79m94J04K52Q3j72k27J69J3R0j46J10j44
3400h1J29J40J8j56j27Q2k3j25J12P0n2K48k00j18j41L93l76Q9K15j98K05Lj65
3423e8K57l25J81k30K21J59k05K58k19M7NO3j47j0N3j6J63k57n4KJ18l30K27M6
$$ plain form
3447 -51 102 -35 61 150 -97 105 -18 0 -101 197 19 114 -174 153 -54 29 141 -172 -14 -60 -44 160 200
3470 200 -225 8 -223 -75 175 -194 -196 -116 -119 -66 135 -245 -63 110 216 -49 124 -46 -77 27 -19 -157 213
3493 213 97 -75 -195 -129 -27 -82 -29 90 -124 17 102 18 -97 -155 -98 9 20 -24 -88 51 64 -82 -157 7
3517 7 -187 -103 15 -59 -40 346 24 -201 113 25 191 22 -120 31 -65 -13 41 159 -153 19 -82 114 18
3540 18 16 -105 -18 69 -257 -113 16 99 25 -147 -167 -60 321 216 34 -6 -49 -166 92 37 59 201 -102 -27
3564 -27 150 62 119 56 -38 2 46 -81 -13 -201 -114 20 -40 -11 -411 -148 152 73 -131 -145 -3 -44 167 -20 -21
3589 -21 60 -16 -181 119 217 89 276 -95 143 -124 74 -342 190 -231 -212 28 -61 204 80 -103 -13 -243
3611 -243 98 -117 134 -75 -14 95 -240 -199 80 -32 -146 63 24 110 110 -2 -57 -188 36 115 -93 -145 168
$$ packed form
3447e1J53j37R6Q9k47K02j23J8j01K98j78R5k88L27k07Q3J12l13J58m6J6K04M0
3470B00m25K33k31J48K50l69kQ0lN3K01l80J82J73J06k65J73j70l1J04m6j38L70
3493B13j16j72j20O6J02n5N3J19k14J41Q5q4j15n8N7J07J1m4o4J39J3j46p5J64
3517Gj94Q4J18p4J9L86l22k25L14q8J66j69j42J51r6N2N4J18l12J72j01J96r6
3540A8kj21Q7Q7l26J44J29Q3p4j72k0J07L81j05j82m0m3j17K58n5K2J42l03P5
3564b7J77q8N7o3r4M0M4j27O8j88Q7J34o0K9m00K63L00p9k04j4J42m1K11j87j
3589b1Q1p6j65L00R8j28J87l71K38k67J98m16N32m21J9K40q9K65j24j83R0k30
3611b43L41k15K51k09O1J09l35M1K79j12j14K09l9Q6%j12n5j31K24P9k08n2L13
$$ plain form
3634 168 72 126 -129 30 -149 -175 -73 278 -38 182 103 182 -84 -64 94 15 136 -25 12 73 76 87 -20 107
3658 107 147 -133 109 -116 8 29 103 -18 -30 7 -245 250 51 138 52 72 -37 -49 -183 -8 -327 -127 25
3681 25 -62 -80 129 -57 127 97 101 247 220 153 -249 -6 -71 -41 40 -125 14 -101 178 198 -93 -198 -91 -70
3705 -70 -169 117 -144 -253 -201 120 70 -14 109 -39 132 -194 61 -18 161 -4 22 -166 63 -164 228 -139
3727 -139 118 -36 52 -16 -38 10 -134 78 24 -60 108 -110 -55 39 112 -162 -92 -90 139 -35 18 144 43 81 98
3752 98 -54 -31 -39 29 -71 -78 -218 40 -198 206 -113 -181 103 108 184 -134 31 -187 -151 27 97 -91 125 156 56
3777 56 -124 -103 311 138 -114 105 -58 29 152 -66 -71 85 10 101 -130 -123 -80 180 -30 14 122 -55 -126 -59
3801 -59 -302 -62 -116 -46 55 77 51 -167 59 -192 54 -63 -126 110 240 41 6 -15 224 138 198 146 -39 57
$$ packed form
3634A68r6N4k55J59j79k6J02L51l16K20p9P9k66K0J58p9J21j61L7O1LJ1j07J27
3658A07M0k80K42k25J24K1P4j21j2L7k52M95j99Q7q6K0j09j2j34J75l19K00J52
3681B5q7j8K09j86J84l0MJ46k7o7m02K43o5L0Q1j65J39j15K79K0k91j05J07K1
3705g0r9K86k61j09N2L21n0q4J23j48J71l26K55p9J79j65K6j88K29k27L92l67
3727a39K57j54Q8o8k2M8j44K12n4q4J68k18N5R4P3k74P0KK29j74N3J26j01L8J7
3752I8j52K3qO8j00pj40K58k38M04l19o8K84NP6l18J65k18L6J78P0j88K16L1j00
3777E6j80K1M14j73k52K19j63Q7J23k18nJ56p5R1k31PM3K60k10M4J08j77p1O7
3801e9k43K40n4P0J01K2k6k18K26k51K46j17o3K36J30j99l5k1K39q6O0n2j85R6
$$ plain form
3825 57 43 94 -60 -60 -290 46 111 -24 60 85 278 0 58 51 110 55 153 88 -115 72 105 75 97 154 -39 -91 -114
3852 -114 7 -104 -50 10 173 31 -106 140 -63 -240 109 176 117 227 -122 -93 -6 33 -72 223 -90 120
3874 120 -78 -78 -121 -199 32 27 152 93 -126 26 -70 -45 196 74 -183 -36 -30 -179 9 36 152 31 254 61
3898 61 68 220 -25 -271 24 -18 112 279 -26 -67 -91 80 46 -95 -98 -47 -113 -9 -12 203 163 -22 217 190 -44
3923 -44 8 179 46 -99 -121 -129 4 -146 -103 -109 -361 -48 24 -18 49 -12 -176 117 84 -30 -120 -180 91 37 49 -72
3949 -72 190 180 43 -54 6 138 -55 -58 -137 -8 -46 162 -204 3 -18 131 18 -152 34 100 356 -202 30
3972 30 -92 -56 -102 -108 126 93 -118 155 -30 -106 96 -128 -31 -136 65 -113 168 -21 -136 -95 157 36 9
3995 9 6 -99 154 -16 134 54 -35 -75 116 -17 -261 -83 61 149 -185 -128 -96 -42 31 -7 127 24 -56 238 38
$$ packed form
3825E7j4N1j54%k30L36O5j35Q4K5J93k78N8pN9n5R8o5k03J87L3l0K2N7j93n2k3
3852a14J21j11N4O0J63j42j37K46k03j77L49O7n9J10l49K9Q7L9j05K95l13K10
3874A20j98%m3p8K31nJ25n9k19J52r6K5K41j22k57J47Oj49J88K7J16j21K23j93
3898F1PJ52k45k46K95m2J30J67l05m1k4J71l4j41lN1o6J04lK15m0j85K39k7k34
3923d4N2J71j33j45k2qJ33j50M3ok52L13P2m2O7o1j64K93l3j14r0o0K71n4J2j21
3949g2K62j0j37r7O0J32j93lp9J29l8K08l66K07k1J49j13j70J86O6K56n58K32
3972C0j22L6m6oK34l3k11K73j85p6K02k24R7j05K01j78K81j89j15M1K52j21k7
3995Ilj05K53j70J50q0q9m0J91j33k44J78J44Q8l34N7L2N4P3l8J34j03q0K94k00
$$ plain form
4020 38 97 -125 101 -347 -129 17 -46 -112 -93 49 -140 -6 59 161 -227 197 18 74 116 24 -95 -49 84
$$ packed form
4020C8N9k22K26m48K18J46o3o6J9J42j89J34O5J02l88M24j79N6M2r2j19M6J33
$$ [...]
8191I4
##END NTUPLES=NMR FID
##END=
