##TITLE=1H_Pr Q-2
 200.13MHz, CDCl3,
 8 sc
 
 15.1.2025
##JCAMPDX= 6.0         $$ Bruker NMR JCAMP-DX V2.0
##DATA TYPE= NMR FID
##DATA CLASS= NTUPLES
##ORIGIN= UXNMR, Bruker Analytische Messtechnik GmbH
##OWNER= pz
$$ XWIN-NMR		Version 3.5
$$ Wed Jan 15 15:47:02 2025 Russian Standard Time (UT+4h)  she@DPX200
##.OBSERVE FREQUENCY= 200.1313
##.OBSERVE NUCLEUS= ^1H
##.DELAY= (6, 6)
##.ACQUISITION MODE= SIMULTANEOUS
##.ACQUISITION SCHEME= undefined
##.AVERAGES= 8
##.DIGITISER RES= 18
##SPECTROMETER/DATA SYSTEM= spect
##.PULSE SEQUENCE= zg30
##.SOLVENT NAME= DMSO
##.SHIFT REFERENCE= (INTERNAL, DMSO, 0, 14.3821)
##AUDIT TRAIL= $$ (NUMBER, WHEN, WHO, WHERE, WHAT)
$$ ##TITLE= Audit trail, XWIN-NMR		Version 3.5
$$ ##JCAMPDX= 5.01
$$ ##ORIGIN= Bruker BioSpin GmbH
$$ ##OWNER= she
$$ F:/spectra/data/she/nmr/H-C/1/audita.txt
$$ ##AUDIT TRAIL=  $$ (NUMBER, WHEN, WHO, WHERE, WHAT)
(   1,<2025-01-15 15:45:43.75 +0400>,<she>,<DPX200>,
      <created by zg, POWCHK disabled, PULCHK disabled
       configuration hash MD5:
       00 E9 B6 7A A2 85 ED C7 34 08 36 98 17 FE 4E 26
       data hash MD5: 16K
       27 D4 4A 83 D4 E4 06 96 C0 F6 47 A9 F8 59 BF 67>)
$$ ##END=
$$ 
$$ hash MD5
$$ 66 19 73 07 65 FA 0D BA 33 88 2D 01 FA 65 37 22
##$RELAX= 
##$RELAX= 
##$RELAX= 
##$RELAX= 
##$RELAX= 
##$RELAX= 
$$ Bruker specific parameters
$$ --------------------------
##$DU= <F:/spectra>
##$EXPNO= 1
##$NAME= <H-C>
##$PROCNO= 1
##$TYPE= <nmr>
##$USER= <she>
##$AMP= (0..31)
100 100 100 100 100 100 100 100 100 100 100 100 100 100 100 100 100 100 
100 100 100 100 100 100 100 100 100 100 100 100 100 100 
##$AQSEQ= 0
##$AQ_mod= 1
##$AUNM= <au_zg>
##$AUTOPOS= <>
##$BF1= 200.13
##$BF2= 200.13
##$BF3= 200.13
##$BF4= 200.13
##$BF5= 200.13
##$BF6= 200.13
##$BF7= 200.13
##$BF8= 200.13
##$BYTORDA= 1
##$CFDGTYP= 0
##$CFRGTYP= 5
##$CHEMSTR= <none>
##$CNST= (0..31)
1 1 145 1 1 1 1 1 1 1 1 1 1 1 1 1 1 1 1 1 1 1 1 1 1 1 1 1 1 1 1 1 
##$CPDPRG= <>
##$CPDPRG1= <>
##$CPDPRG2= <>
##$CPDPRG3= <>
##$CPDPRG4= <mlev>
##$CPDPRG5= <mlev>
##$CPDPRG6= <mlev>
##$CPDPRG7= <mlev>
##$CPDPRG8= <mlev>
##$CPDPRGB= <>
##$CPDPRGT= <>
##$D= (0..31)
0 0.7 0 0 0 0 0 0 0 0 0 0.03 0 0 0 0 0 0 0 0 0 0 0 0 0 0 0 0 0 0 0 0 
##$DATE= 1736941543
##$DBL= (0..7)
120 120 120 120 120 120 120 120 
##$DBP= (0..7)
150 150 150 150 150 150 150 150 
##$DBP07= 0
##$DBPNAM0= <>
##$DBPNAM1= <>
##$DBPNAM2= <>
##$DBPNAM3= <>
##$DBPNAM4= <>
##$DBPNAM5= <>
##$DBPNAM6= <>
##$DBPNAM7= <>
##$DBPOAL= (0..7)
0.5 0.5 0.5 0.5 0.5 0.5 0.5 0.5 
##$DBPOFFS= (0..7)
0 0 0 0 0 0 0 0 
##$DE= 6
##$DECBNUC= <off>
##$DECIM= 32
##$DECNUC= <off>
##$DECSTAT= 4
##$DIGMOD= 1
##$DIGTYP= 9
##$DL= (0..7)
0 120 120 120 120 120 120 120 
##$DP= (0..7)
150 150 150 150 150 150 150 150 
##$DP07= 0
##$DPNAME0= <>
##$DPNAME1= <>
##$DPNAME2= <>
##$DPNAME3= <>
##$DPNAME4= <>
##$DPNAME5= <>
##$DPNAME6= <>
##$DPNAME7= <>
##$DPOAL= (0..7)
0.5 0.5 0.5 0.5 0.5 0.5 0.5 0.5 
##$DPOFFS= (0..7)
0 0 0 0 0 0 0 0 
##$DQDMODE= 0
##$DR= 18
##$DS= 0
##$DSLIST= <SSSSSSSSSSSSSSS>
$$ [...]
##$SUBNAM0= <"">
##$SUBNAM1= <"">
##$SUBNAM2= <"">
##$SUBNAM3= <"">
##$SUBNAM4= <"">
##$SUBNAM5= <"">
##$SUBNAM6= <"">
##$SUBNAM7= <"">
##$SUBNAM8= <"">
##$SUBNAM9= <"">
##$SW= 18.0517328524113
##$SWIBOX= (0..15)
0 0 2 0 0 0 0 0 0 0 0 0 0 0 0 0 
##$SW_h= 3612.71676300578
##$TD= 16384
##$TD0= 1
##$TE= 0
##$TE2= 300
##$TE3= 300
##$TEG= 300
##$TL= (0..7)
0 120 120 120 120 120 120 120 
##$TP= (0..7)
150 150 150 150 150 150 150 150 
##$TP07= 0
##$TPNAME0= <>
##$TPNAME1= <>
##$TPNAME2= <>
##$TPNAME3= <>
##$TPNAME4= <>
##$TPNAME5= <>
##$TPNAME6= <>
##$TPNAME7= <>
##$TPOAL= (0..7)
0.5 0.5 0.5 0.5 0.5 0.5 0.5 0.5 
##$TPOFFS= (0..7)
0 0 0 0 0 0 0 0 
##$TUNHIN= 0
##$TUNHOUT= 0
##$TUNXOUT= 0
##$USERA1= <user>
##$USERA2= <user>
##$USERA3= <user>
##$USERA4= <user>
##$USERA5= <user>
##$V9= 5
##$VALIST= <valist>
##$VCLIST= <CCCCCCCCCCCCCCC>
##$VD= 0
##$VDLIST= <DDDDDDDDDDDDDDD>
##$VPLIST= <PPPPPPPPPPPPPPP>
##$VTLIST= <TTTTTTTTTTTTTTT>
##$WBST= 1024
##$WBSW= 4
##$XGAIN= (0..3)
0 0 0 0 
##$XL= 0
##$YL= 0
##$YMAX_a= 534487
##$YMIN_a= -372271
##$ZGOPTNS= <>
##$ZL1= 120
##$ZL2= 120
##$ZL3= 120
##$ZL4= 120
##$ABSF1= 10
##$ABSF2= 0
##$ABSG= 5
##$ABSL= 3
##$ALPHA= 0
##$AQORDER= 0
##$ASSFAC= 0
##$ASSFACI= 0
##$ASSFACX= 0
##$ASSWID= 0
##$AUNMP= <proc_1d>
##$AZFE= 0.1
##$AZFW= 0.1
##$BCFW= 1
##$BC_mod= 2
##$BYTORDP= 1
##$COROFFS= 0
##$CY= -3
##$DATMOD= 1
##$DC= 2
##$DFILT= <>
##$DTYPP= 0
##$F1P= 0
##$F2P= 0
##$FCOR= 0.5
##$FTSIZE= 0
##$FT_mod= 4
##$GAMMA= 1
##$GB= 0.15
##$INTBC= 1
##$INTSCL= 1
##$ISEN= 128
##$LB= 0.25
##$LEV0= 0
##$LPBIN= 0
##$MAXI= 10000
##$MC2= 0
##$MEAN= 0
##$ME_mod= 0
##$MI= 1.114404
##$NCOEF= 0
##$NC_proc= 0
##$NLEV= 6
##$NOISF1= 3.799351
##$NOISF2= 2.8
##$NSP= 1
##$NTH_PI= 0
##$NZP= 0
##$OFFSET= 14.38212
##$PC= 1
##$PHC0= 253.4741
##$PHC1= 10.5922
##$PH_mod= 1
##$PKNL= yes
##$PPARMOD= 0
##$PSCAL= 0
##$PSIGN= 0
##$REVERSE= no
##$SF= 200.129724274929
##$SI= 16384
##$SIGF1= 3
##$SIGF2= 2
##$SINO= 400
##$SIOLD= 16384
##$SREGLST= <1H.CDCl3>
##$SSB= 0
##$STSI= 0
##$STSR= 0
##$SW_p= 3205.1282051282
##$SYMM= 0
##$S_DEV= 0
##$TDeff= 0
##$TDoff= 0
##$TI= <>
##$TILT= no
##$TM1= 0
##$TM2= 0
##$TOPLEV= 0
##$USERP1= <user>
##$USERP2= <user>
##$USERP3= <user>
##$USERP4= <user>
##$USERP5= <user>
##$WDW= 1
##$XDIM= 8192
##$YMAX_p= 0
##$YMIN_p= 0
$$ End of Bruker specific parameters
$$ ---------------------------------
##NTUPLES= NMR FID
##VAR_NAME=  TIME,          FID/REAL,        FID/IMAG
##SYMBOL=    X,             R,               I
##VAR_TYPE=  INDEPENDENT,   DEPENDENT,       DEPENDENT
##VAR_FORM=  AFFN,          ASDF,            ASDF
##VAR_DIM=   8192,          8192,            8192
##UNITS=     SECONDS,       ARBITRARY UNITS, ARBITRARY UNITS
##FACTOR=    0.0002768,     1,               1
##FIRST=     0,             0,               0
##LAST=      2.2672688,     0,               0
##MIN=       0,             -372271,         0
##MAX=       2.2672688,     534487,          0
$$ Real data points
##PAGE= N=1
##DATA TABLE= (X++(R..R)), XYDATA
$$ [...]
2436a497N23K320j467j613K231Q58j746M06K181j549k252K050N95k515K65K778
$$ -1497 -974 1346 -121 -1734 497 1355 -391 15 2196 647 -1605 445 1040 -1475 -1210 1568
2452A568j612j408J940P08k453O9K713j546j516K463O95l197Q13K455j559j722
$$ 1568 -44 -1452 488 1196 -1257 -1188 1525 -21 -1537 926 1621 -1576 -763 1692 133 -1589
2468a589K743Q63k622rK177j704k093K307O14k059L18K445j317j782K386J275
$$ -1589 1154 2017 -605 -614 1563 -141 -2234 73 687 -1372 -1054 1391 74 -1708 678 1953
2484A953k417K04K082j069k369J968O90k932O18K081j027j504K418N90j893r5
$$ 1953 -464 -260 1822 753 -1616 352 1042 -1890 -1272 809 -218 -1722 696 1286 -607 -702
2500g02K275q14j724J790M62j712p7J961j116j613J318O62j685L10J305o32j018
$$ -702 1573 759 -965 825 1287 -425 -502 1459 343 -1270 48 710 -975 -665 640 8 -1010
2517a010J004M85j559O91J503l1r43J188N07j669m12K45m09o65R47m4r18J72M66
$$ -1010 -6 479 -1080 -389 1114 1083 140 1328 1835 166 -246 -1 -410 -1075 -128 -172 -1090 -918 -452
2536d52o05K24Q31P20N04L34j68p06l33q38k19N04Q07n02n11j03l57j194J040
$$ -452 -1057 -833 -2 718 1222 1556 1388 682 349 -489 -708 -204 603 101 -410 -513 -870 -2064 -1024
2555a024O19K3J091J177j179j234N69K74q66M81K402r06j229K98p25k260Q3K260
$$ -1024 -405 -382 709 1886 707 -527 42 316 -550 -69 2333 1427 198 496 -229 -2489 -2406 -146
2573a46m19m58K050K66l193N8K544j053k82L214J325k971j045J333k731k299L298
$$ -146 -565 -1023 1027 1293 -1900 -1842 702 -351 -633 2581 3906 935 -110 1223 -1508 -3807 -509
2590e09K130k644L75K776l122k967L027J835k185J965M168k851l929K184M34l854
$$ -509 1621 -1023 -648 2128 -994 -3961 -934 901 -1284 681 4849 1998 -1931 253 687 -3167
2606c167J392N284j469l207K816l03n544L03N217q04k305M969R52o312k74L818
$$ -3167 -1775 3509 2040 -1167 1649 1346 -4198 -3895 1322 518 -1787 3182 4134 -2178 -2452 1366
2622A366k198k156N945K123n533m91L174m451l987N751L324m152J292M374m057
$$ 1366 -832 -2988 2957 5080 -453 -944 2230 -2221 -6208 -457 2867 -1285 7 4381 324
2637C24n295M563K536m402K300N796l117o115L400P17n489J161P343j679m077
$$ 324 -4971 -408 2128 -2274 26 5822 2705 -3410 -10 707 -4782 -3621 3722 2043 -2034
2652b034M288N77p180L15O590j648l153N527K022p206r26M733k957l344O168L337
$$ -2034 2254 2831 -4349 -4034 2556 908 -2245 3282 5304 -1902 -2828 1905 -1052 -4396 1772 5109
2668E109o012o84L919l976m656N353M207m506Q72N650l892n680M112K565m546
$$ 5109 -903 -1587 2332 -1644 -6300 -947 3260 -1246 -374 5276 1384 -4296 -184 2381 -2165
2683b165J340O049l026n719K995J435n579P57O990j168m085L890J729o115n93
$$ -2165 -825 5224 2198 -3521 -526 909 -4670 -3913 3077 1909 -2176 1714 3443 -2672 -3265
2698c265N627j260l199M392K557n972j674L990j969l418M386L686m630j072M082
$$ -3265 2362 1102 -2097 2295 4852 -1120 -2794 1196 -773 -4191 195 3881 -749 -1821 2261
2713B261k425m360L701L923l545K60M482k372m462K501K093l555k26M677j310
$$ 2261 -164 -4524 -823 3100 -445 -185 4297 1925 -2537 -36 2057 -1498 -1724 2953 1643
2728A643m584K401J434l973O6N004n02k473K145J600l819p26L404m43k734K425
$$ 1643 -2941 -540 894 -3079 -3013 1991 1489 -984 1161 2761 -1058 -1784 1620 1177 -1557 868
2744H68J823l634j040K646j102k403K545K326k120r43K464r99k761K057K408k346
$$ 868 2691 -943 -1983 663 -439 -2842 -297 2029 -91 -1034 1430 431 -2330 -273 2135 -211
2760b11k10K567r57k438Q39J563j823o49K554l82k195O11J319k021l52K481L38
$$ -211 -421 2146 1189 -1249 -410 1153 -670 -1319 1235 853 -1342 -731 588 -1433 -1785 696 1034
2777A034j444J181J177j975q28J543J00j512N15J047j504m57R99j98p05J033J044
$$ 1034 -410 771 1948 -27 -855 688 788 -724 -209 838 -666 -1123 -124 -322 -1027 6 1050
2794A050p42l62J010n32j112P87N65p31j91N39l40o87J50P09m83K26N82l1n94
$$ 1050 308 -54 956 424 -688 99 664 -67 -258 281 -59 -746 -596 113 -370 -144 438 407 -187
2813a87k01J122r22k55Q07Ll93K86K07p13m04N65pq00L25L02J34k08M18J80m5
$$ -187 -388 734 -188 -443 364 367 -26 260 467 -246 -650 -85 -92 -892 -567 -265 -131 -339 79 259 214
2834B14J83L68j23l51K84j51l68k66M6k98k05M2J63j67L02N63o5r4J32L67k68
$$ 214 397 765 642 291 575 424 56 -210 -164 -462 -667 -625 -462 -629 -327 236 171 77 209 576 308
2855C08J06N8l4m56j47L03n38J53M2lo4J3L21l18m0L24k02K21L29J07j55o4K59
$$ 308 414 472 438 -18 -165 138 -400 -247 -205 -208 -272 -259 62 -256 -296 28 -174 47 376 483 328 264 523
2878E23l90m2j95J51n21l9O6j72k6M04J50K68J20J79Q4j37j02q0j09p4m2l13M9
$$ 523 133 91 -104 47 -474 -513 -447 -619 -645 -241 -91 177 297 476 560 423 321 241 132 58 16 -297 -248
2901b48j67K24k30J46n6L14J3L00J30l97l7O4J03Q5K1J51l95k71K13k52k5J54
$$ -248 -415 -191 -421 -275 -331 -17 -4 296 426 29 -8 56 159 244 265 416 21 -250 -37 -289 -314 -160
2923a60J03n9K87l7J09r8j10R2K53L4QQ9l68m72k35J05J49k03J97O03k97k71L82
$$ -160 -57 -116 171 134 243 145 35 127 380 414 422 511 143 -329 -564 -459 -310 -513 -316 287 -10 -281 101
2946A01M44p70N53O34l46l37L91k89j461K85P87n50l57J174j65j026P81P01r69
$$ 101 545 -225 328 962 616 279 670 381 -1080 -795 -8 -558 -915 259 94 -932 -151 550 -419
2965d19L52R95Q9q48L97M08j294o67J146Q0j045Q37P38j874k04J180J57j107J032
$$ -419 -67 928 1017 169 566 974 -320 -987 159 239 -806 31 769 -1105 -1309 -129 28 -1079 -47
2984d7J537j295q31J945k17k015J282J281j991k89J702o98k375R41J650j609n38
$$ -47 1490 195 -636 1309 1092 -923 359 1640 -351 -640 1062 364 -2011 -1070 580 -1029 -1567
3001a567K716R1k456J388J734k321m67K449K48l082J250J916k884j074L186m09
$$ -1567 1149 1240 -1216 172 1906 -415 -882 1567 1815 -1267 -17 1899 -985 -2059 1127 718
3017G18k654J211K803k912j481L288J52l073K005K722l141j345L598n06l542J739
$$ 718 -1936 -725 2078 -834 -2315 973 1125 -1948 57 2779 -362 -1707 1891 1385 -2157 -418
3033d18K869l324j741M123k28m084J676L605l504j607M650q5m097K096L736l797
$$ -418 2451 -873 -2614 1509 1281 -2803 -1127 2478 -1026 -2633 2017 1932 -2165 -69 3667 -130
3049a30k364M473k13m706J850L978l906k174M785j33m841K397M299l743k410N298
$$ -130 -2494 1979 1766 -2940 -1090 2888 -1018 -3192 1593 1460 -3381 -984 3315 -428 -2838 2460
3065B460L40n396J638M119l989k522N640K56n336J881M074m543k342N302O10n118
$$ 2460 2800 -2596 -958 3161 -828 -3350 2290 2546 -2790 -909 3165 -1378 -3720 1582 2192 -2926
3081b926K613M350m134k958M950Q63n819K409N159m415l479N076K64o332K337
$$ -2926 -313 4037 -97 -3055 1895 2758 -3061 -652 4507 92 -3387 1689 1953 -4379 -2042
3096b042N121l598k510N782Q7o093J576N090l423k540N563R48o810J388M260m136
$$ -2042 3079 -519 -3029 2753 2840 -3253 -1677 3413 -10 -2550 3013 3961 -2849 -1461 2799 -1337
3112a337l045O016J175n589J857M267m372l113N391J495m974J815N149m103l633
$$ -1337 -4382 1634 2809 -2780 -923 3344 -1028 -4141 1250 2745 -2229 -414 4735 632 -3001
3127c001M371O65n665K138N362l419l745M885Q5n843J530N761l026k234M761P95
$$ -3001 1370 2035 -3630 -1492 3870 451 -3294 1591 1676 -4167 -2637 3124 98 -2136 2625 3420
3143C420n690L78M790l065k578M975J493n584K63L511l619l007N259J976l997
$$ 3420 -2270 -1892 2898 -167 -2745 2230 3723 -1861 -1598 1913 -1706 -4713 546 2522 -1475
3158a475J140M146l817l867M184J757l626J572M087l033l887L249Q78m319J370
$$ -1475 -335 3811 -6 -3873 311 2068 -1558 14 4101 1068 -2819 430 1308 -3011 -1641
3173a641M548j905k997L054L87m664N06M771j542j908L757M57m336j91L275j674
$$ -1641 2907 1002 -1995 1059 1446 -3218 -2712 2059 517 -1391 2366 2823 -1513 -1704 1571 -103
3189a03k153L733J126l382l90K184j971k369L277J945k001J23K196j708k750K144
$$ -103 -2256 1477 2603 -779 -1169 1015 -956 -3325 -48 1897 -104 19 2215 507 -2243 -99
3205i9J445k348P42K921j834k288R95P89k157O47K943p78j714J495J26k394J09
$$ -99 1346 -1002 -260 2661 827 -1461 -466 323 -1834 -1187 1756 978 -736 759 885 -1509 -1400
3222a400K218l72j045J981N18k378k88J166o89j058J917Q75j644k96J046p84j081
$$ -1400 818 446 -599 1382 1900 -478 -766 400 -289 -1347 570 1445 -199 -495 551 -233 -1314
3239a314J391N03j42p1J089j134j117O22N35q54L13J071o02j165M62Q0q42M57
$$ -1314 77 580 438 367 1456 322 -795 -173 362 -492 -179 892 290 -875 -413 -333 -1175 -718
3257g18J318K2n97Q86n73m31k00N01j22l08N81M54j086m52M05j22jN36K17o8k12
$$ -718 600 622 25 911 338 -93 -293 208 86 -222 359 813 -273 -725 -320 -442 -443 93 310 242 30
3278C0K66l31J08J32L72j98j8R3m73j92k43L60m4k98J55J67j11N4q2K84J65O9
$$ 30 296 -35 73 205 577 379 361 454 -19 -211 -454 -94 -138 -436 -281 -114 -225 -171 -253 31 196 265
3300B65K09M5N9j83k83L9m85L12p5r3l2q2k54K48L55l28P1L33R6K03k71K22j75
$$ 265 474 519 578 395 112 151 -334 -22 -97 -190 -222 -304 -558 -310 45 -283 -212 121 217 420 149 371 196
3323A96j50j24N05k48k58p8K6M9l90J0J81J59J07P1J15j83Q7Q9L08j57J20k96
$$ 196 46 -78 427 179 -79 -157 -131 -82 -472 -462 -281 -122 -15 56 171 -12 75 164 472 315 435 139
3345A39rj20J71m48j04L61j78q4J76J37k25K50L29k12k28L28J50l16jJ67n34K77
$$ 139 130 10 181 -267 -371 -10 -188 -272 -96 41 -184 66 395 183 -45 283 433 117 116 283 -251 26
3367B6Rl33J15J65J35o8m14J66M71l84JK83J54l89J35N6n4K1J23J01l83k34M25
$$ 26 35 -298 -183 -18 117 49 -365 -199 272 -112 -111 172 326 -63 72 128 74 95 218 319 -64 -298 127
3390A27j3n34N88l31J69n8J02K2p0L83j27l08k75N54k21k64M56l97j80K40K59
$$ 127 114 -420 168 -163 6 -52 50 72 2 385 258 -50 -325 229 8 -256 200 -197 -377 -137 122
3411A22j16m6jL51n00L39N60p66j81N75k34m58K88N47n51p80J102l21q24P14Q62
$$ 122 6 -40 -41 310 -190 149 709 -57 -238 337 103 -355 -67 480 -71 -851 251 -70 -894 -180 682
3432F82j096m2J001m31p18O67O91o17l29J171o17j292R85M40j258j82J924o90
$$ 682 -414 -456 545 114 -604 63 754 137 -192 979 362 -930 55 495 -763 -945 979 289
3450B89j264N08R92r87j82J634m83r24J122N20j772l84J720l20j294R38R41j487
$$ 289 -975 -467 525 -462 -644 990 507 -417 705 1225 -547 -931 789 469 -825 113 1054 -433
3468d33n31J562o63j414J336J439j592j09J663p98j694J025J457j509k28J898
$$ -433 -964 598 -65 -1479 -143 1296 -296 -405 1258 460 -1234 -209 1248 -261 -489 1409
3484A409m25k361J249J205k030n19K752o22k006J348J367k400l27K541j54j930
$$ 1409 984 -1377 -128 1077 -953 -1472 1280 658 -1348 0 1367 -1033 -1360 1181 1027 -903
3500i03J484J476k796q75K486m48k143J767J704k442n65K257p85k249J971K168
$$ -903 581 2057 -739 -1614 872 424 -1719 48 1752 -690 -1255 1002 217 -2032 -61 2107
3516B107k512o86K718q60k417J127K247k385m56K982o43l121J629J795k507p03
$$ 2107 -405 -1091 1627 767 -1650 -523 1724 -661 -1117 1865 1222 -1899 -270 1525 -982 -1685
3532a685L339m71k758J418J916k683o18K712j99k475J574K083k970j167K926R5
$$ -1685 1654 1183 -1575 -157 1759 -924 -1542 1170 971 -1504 70 2153 -817 -1984 942 1037
3548A037l148J936K470k818p73K747j39l180J360K602k645p97K585l73k657J158
$$ 1037 -2111 -175 2295 -523 -1296 1451 1312 -1868 -508 2094 -551 -1348 1237 864 -1793 -635
3564f35K460k697p62K959n9k953J539K017k165j443L158rl090J737J733k261j062
$$ -635 1825 -872 -1634 1325 1266 -1687 -148 1869 -296 -1739 1419 1410 -1680 57 1790 -471 -1533
3581a533K417J57k922J546K117k338r51K656j73k254J045J942k031n73K358j98
$$ -1533 884 1041 -1881 -335 1782 -556 -1507 1149 976 -1278 -233 1709 -322 -895 1463 1265
3597A265k282Q50J650j899j063J999K35k218J333J172j741o06J872J95j676R68
$$ 1265 -1017 -167 1483 -416 -1479 520 755 -1463 -130 1042 -699 -1305 567 762 -914 54
3613E4J745j592r61J573j4j924Q24J452j584n70J812k74j908N52J632j048l12
$$ 54 1799 207 -754 819 805 -1119 -295 1157 -427 -997 815 541 -1367 -815 817 -231 -543
3630e43J373N6j254K95Q58j236l67J390N57j586O39L75j108m89J051K43r05P40
$$ -543 830 886 -368 -73 785 -451 -818 572 1129 -457 182 557 -551 -1040 11 254 -651 89
3648H9P27q46o89J032j56q08R37O78o62j75L7k15j017O93P66k47j27O31j24p73
$$ 89 816 -30 -719 313 157 -651 286 964 302 127 164 -51 -1068 -375 391 144 17 648 524 -249
3668b49m61M52J95K81K03K0l28m68Qj99j38M97O72j03K31o18k89p5j00K21M27
$$ -249 -710 -258 -63 218 421 441 113 -355 -347 -546 -684 -187 485 382 613 -5 -294 -369 -469 -248 179
3689A79N12k58k03p3k62m54L67K16L2J48L63o57l61J53O5n3P07O26n23m44L15
$$ 179 691 433 230 157 -105 -559 -192 24 56 204 567 -90 -451 -298 -233 -286 421 1047 524 80 395
3710C95k08l94o9N35j0l20M78k65j042K20N22J31j45J051l41p30P3L18n84J5J188
$$ 395 187 -207 -276 259 249 -71 407 142 -900 -680 -158 -27 -172 879 538 -192 -119 199 -385 -370 818
3731H18j99q03K52J03q07k00Q37J37l19J30O86q33n86Q03k7m97P90N55l80m60
$$ 818 619 -184 68 171 -636 -836 1 138 -181 -51 635 -198 -784 19 -8 -505 285 840 460 0
3751@L64j78o70qQ30m39n39J080l01j147O80L30j60m62J406k89o31L0N40p19j6
$$ 0 364 186 -484 -492 338 -101 -640 440 139 -1008 -328 2 -158 -620 786 497 -134 -104 436 -283 -299
3772b99O54J91p95L42L80o38l05L61N30p88o4J100o72n66N21J76o11K43R05l00
$$ -299 355 546 -249 93 473 -165 -470 -109 421 -367 -431 669 -3 -569 -48 128 -483 -240 665 365
3792C65l65N67j25p03J51K54p0k23J78K1j81j84N72l56l29Q00p4m38n5K19k14
$$ 365 0 567 442 -261 -110 144 74 -149 29 50 -131 -315 257 -99 -428 372 298 -140 -195 24 -190
3813a90M5K59j11k91L42o3j83JK64K98n56L33J17k91m11O94j3m04p2N60j95k36
$$ -190 -145 114 3 -288 54 -9 -192 -191 73 371 -185 148 265 -26 -437 257 244 -160 -232 328 133 -103
3835a03L75m54p8K75n2J23k25P51l38o11J82J27K79l40R8K69m01K00k11J87j15
$$ -103 272 -182 -260 15 -37 86 -139 612 274 -337 -155 -28 251 -89 9 278 -123 77 -134 53 -62
3856f2O4j10N4J77j85K79k36j06L24O3k56L94n28k21K35K78o40J82L41J3j5J2
$$ -62 2 -108 -54 123 -62 217 -19 -125 199 262 6 400 -128 -349 -114 164 -476 -294 47 60 45 57
3878E7K71k25n0L40j12o66N75q6%j77J72J64k79k8K29n63J8M99M1m86P6L82k27
$$ 57 328 103 53 393 281 -385 190 104 104 -73 99 263 -16 -44 185 -378 -360 139 180 -306 -230 152 -75
3901g5j36M39J86l33J64L20p80J04M31l04l61L84Q3l45O9J52N1k01J39N71p29
$$ -75 -211 228 414 81 245 565 -215 -111 320 16 -345 39 122 -223 -154 -2 49 -152 -13 558 -171
3922a71M23k30jl46K21K03J2r8L33q8o53M01j8m31J86O98l14l47J48M17l65o49
$$ -171 252 22 21 -325 -104 99 111 13 346 258 -395 6 -12 -443 -257 441 127 -220 -72 345 -20 -669
3944f69R16J38q00N57M85j098J59N20j47l77N89n0m61L73J2J36j022O73N36p76
$$ -669 247 385 -415 142 627 -471 -312 208 61 -316 273 223 -238 135 147 283 -739 -66 470 -306
3964c06L71L19m46l73K31P06q71p3R13m1n71K50K32q32rR88j75o34P07M5o55k12
$$ -306 65 384 -62 -435 -204 502 -369 -442 471 430 -141 109 341 -491 -500 488 313 -321 386 431 -224 -436
3986d36P35j97n37O00L64n35m15M61m2l25K52Q26q31J74J98l49n61L99O30l77
$$ -436 299 102 -435 165 529 -6 -421 40 -2 -327 -75 751 -80 94 292 -57 -618 -219 411 34
4006C4j9N98n20m93m9L22j48J83O31p6n82K30l0k48m48R93k89k45K94J88n45k48
$$ 34 15 613 93 -400 -449 -127 -275 -92 539 463 -119 111 81 -167 -615 378 89 -156 138 326 -219 -467
4028d67N44l22%M84K33l76N6m7j05p49O91P05o69J52K76l92k35L4L87j93J7J89
$$ -467 77 -245 -245 239 472 96 152 105 0 -749 -58 647 -22 130 406 14 -221 -187 200 7 24 213
4050B13Ln42K57j81K0o6O28k08j03L98o18J77j79J39J3J49K17j55n02rK76l51
$$ 213 216 -326 -69 -250 -230 -296 332 124 21 419 -199 -22 -201 -62 -49 100 317 162 -340 -349 -73 -424
4072d24L02L29q2R9r7m79K56P3K88m08J86L65n02L2J7J73m15L95K55m05J87L39
$$ -424 -122 207 125 224 127 -352 -96 -23 265 -143 43 408 -94 -62 -45 128 -287 108 363 -42 145 484
4094D84m22n39K24N29q19L59O15r9o45M00J36m37j55Q12j96o67L31L98m29l63
$$ 484 62 -477 -253 276 -543 -184 431 332 -313 87 223 -214 -369 443 247 -420 -89 309 -120 -483
4114d83Q56j40o44M68M00q85M8O45J79j285O24O46j038K45R65l60j006Q47N21
$$ -483 373 233 -411 57 457 -428 -380 265 444 -841 -217 429 -609 -364 601 241 -765 82 603
4133F03o85l54J224n94p91Q19M96j275k77J235l03n87N94N49j056k94J343n45
$$ 603 -82 -436 788 194 -597 222 718 -557 -834 401 98 -489 105 654 -402 -696 647 102
4151A02r84R34R68j281k71J127k89j144R13M99p25m55J253j77j369P23P01r38
$$ 102 -882 52 1020 -261 -532 595 306 -838 75 574 -151 -606 647 470 -899 -176 525 -413
4169d13n46J793j39j421P42J050j274o17J195K47j346Q32M90j129l43J280M9j486
$$ -413 -959 834 695 -726 16 1066 -208 -825 370 617 -729 103 593 -536 -879 401 450 -1036
4187a036J275P04p71m74P68j23j087P17J065r66o43J204k89j495Q46R82p99l55
$$ -1036 239 943 172 -302 466 343 -744 -27 1038 72 -571 633 344 -1151 -305 677 -122 -477
4205d77J385n39q80J65J036q39m57J137L09j526O82Q65j247n21J126On96O25O51
$$ -477 908 369 -511 -346 690 -149 -606 531 840 -686 -4 861 -386 -907 219 225 -371 254 905
4224I05r72q54J096O1r05P24R27r75m05Q18O9r39j47J205o24n27J034N3j074K94
$$ 905 -67 -921 175 236 -669 55 982 7 -398 420 489 -450 -597 608 -16 -543 491 544 -530 -236
4244b36P10n76k09P42l1n92j02O44n02m52J061K05j142K25N59m25l07O21J07n07
$$ -236 474 -102 -311 431 400 -192 -294 350 -152 -604 457 662 -480 -255 304 -121 -428 193 300 -207
4264b07J79L45j15o18N66L3n82M00N69k34p17M89K5o42M01L25j19k22K53L85p37
$$ -207 -28 317 202 -416 150 183 -399 1 570 336 -381 108 133 -509 -108 217 98 -124 129 514 -223
4285b23o6N07p2k22K52J27o19Q2M49l42j62K32L70o31J84L49l16j11K14K04o04
$$ -223 -289 218 146 -76 176 303 -316 -234 215 -127 -289 -57 313 -318 -134 215 -101 -212 2 206 -398
4306c98M31K20j34m07K54K21n50K34L00O0o57M90k5l33L7L33j06k23J87J00p0
$$ -398 33 253 119 -288 -34 187 -363 -129 171 231 -426 64 39 -294 -257 76 -30 -253 -66 34 -36
4327c6m3M04j69m17M81R4l17J87k8j77k31J80J73n64M17R3q0j93J28K37q2m6J24
$$ -36 -79 325 156 -261 220 314 -3 184 156 -21 -252 -72 101 -463 -46 47 -33 -226 -98 139 57 11 135
4350A35j7k16P9nJ83j48K79o2m44J66K26l02K16R5j77k00M0J2L27l04J70o5Q5
$$ 135 118 -98 -19 -24 159 11 290 228 -216 -50 176 -126 90 185 8 -192 -152 -140 187 -117 53 -12 73
4373G3k0m4R7j28R9j13l8k7K28k25J36m7K70k27j48J56j60Q8M3J65n41N98j79
$$ 73 53 9 106 -22 77 -36 -74 -101 127 -98 38 -9 261 34 -114 42 -118 -30 13 178 -363 235 56
4396E6p6jr3K73l41J54L51l35r0K29n2j33j88L01j08J88K30l54m12N76j89L2k14
$$ 56 -20 -21 -114 159 -182 -28 323 -12 -102 127 75 -58 -246 55 -53 135 365 11 -401 175 -14 18 -196
4419a96M12l08j28k3K45L0Mj59O3J06k77K63q0l3J15r4K19k13KJ74l0k42K05j33
$$ -196 216 -92 -220 -243 2 32 36 -123 -60 46 -231 32 -48 -81 34 -60 159 -54 -52 122 92 -150 55 -78
4443g8M4M2K29q3L8j84J47O0k92Q2O4K46j63k68J28Q2k56J07Q6q9J14K14m31J59
$$ -78 -34 8 237 154 192 8 155 215 -77 5 69 315 152 -116 12 94 -162 -55 31 -58 56 270 -161 -2
4467bJ06j07N6L60k20j68K50m83J23j48J04J31j40M40j17k03k15L93j12q7L95
$$ -2 104 -3 53 413 193 25 275 -208 -85 -233 -129 2 -138 302 185 -18 -233 160 48 -39 356
4488C56J04m64r5M21o00K20o1L95j35k82M03k43m70L47J94l84J84L93J72p10J96
$$ 356 460 -4 -99 322 -278 -58 -119 276 141 -141 262 19 -451 -104 90 -294 -110 283 455 -255 -59
4509e9J13l29K53N11Q7n97K08No00L69N25p23K54J92L13n26n02O27r6m34N28O44
$$ -59 54 -275 -22 489 576 -21 187 192 -408 -39 486 -237 17 209 522 -4 -506 121 25 -409 119 763
4531G63r63j65O90m59l84M07N34m41j92M78k42l01N1N51n49oR74m51r51O86M15
$$ 763 -200 -365 325 -134 -518 -111 423 -18 -210 268 26 -275 -224 327 -222 -228 746 295 -656 30 445
4552D45j119K59J027k10q63Q92K51j195J4Q06k47n42O43L34p73m11R84k41n87
$$ 445 -674 -415 612 402 -461 431 682 -513 -499 307 60 -482 161 495 -278 -689 295 54 -533
4571e33N75P09p19j74R23p40r35Q47L48m96r4J003p80n82N16N69r39n7J451l55
$$ -533 42 751 32 -142 781 41 -894 -47 301 -195 -289 714 -66 -648 -132 437 -502 -559 892 537
4591E37j375R92O50j467L42R15k07p63Q69J13r46l85J335o90q20J023J050j463
$$ 537 -838 154 804 -663 -321 594 387 -376 493 606 -340 -725 610 -80 -900 123 1173 -290
4609b90l10J055l06j102J096P37j062k79Q01j22j198J011P48j254m7J406n76j232
$$ -290 -600 455 149 -953 143 880 -182 -461 340 218 -980 31 779 -475 -522 884 308 -924
4627i24R62O62q52l55J223k85j060M76Q89q94j32O35j31j230J247N54j074k45
$$ -924 38 700 -152 -507 716 431 -629 -153 736 -158 -290 345 214 -1016 231 785 -289 -534
4645e34J215m27p91O74P93j293k72J163m53q50P85P27j069n49J216J6j201R27
$$ -534 681 254 -537 137 930 -363 -635 528 75 -775 10 737 -332 -881 335 351 -850 77
4663G7N89q97l51R26M7j177Q64N73o97j75P75n71p36N05P25p75j29O71mn08J42
$$ 77 666 -231 -582 344 391 -786 78 651 -46 -221 554 -17 -753 -248 477 -298 -427 244 240 -268 -126
4684a26N76j026K22P48j33n62J6P59p24m5O47M9p54K12O93q00k50Q49K6j024N66
$$ -126 450 -576 -354 394 261 -301 -285 474 -250 -295 352 401 -353 -141 552 -248 -498 351 377 -647 -81
4705h1Q72q85m29N82K70m67L06K59l74n27M13K86p67J03R56m59n32R35k30p83
$$ -81 791 -94 -523 59 329 -138 168 427 53 -474 -61 225 -542 -439 517 58 -474 461 231 -552
4725e52K16O90n18j74O14p6m59J88O29o06m92Q30K03q45J57M69o09m05Q90M7l29
$$ -552 -336 354 -164 -338 276 200 -259 -71 558 -48 -540 290 493 -352 -195 274 -335 -740 150 197 -132
4746a32r7M65q8k41K94l3j56J83J95l59O0j41J20l95K28L13l24r7K56m8pj57Q7
$$ -132 -229 236 148 -93 201 168 12 195 390 31 91 -50 70 -325 -97 216 -108 -205 51 3 -4 -161 -74
4769g4j23K10L06j3n43J05L09n3j36J28J87k71O8J10m56L47j68K43J45k69K02
$$ -74 -197 13 319 306 -237 -132 177 124 -12 116 303 32 100 210 -246 101 -67 176 321 52 254
4790B54j92k81J89J69j92L5R1Q3l82L73j98q2J14o6J95k94o4N35k98J1q4J16j25
$$ 254 62 -219 -30 139 -53 -18 73 156 -226 147 -51 -133 -19 -85 110 -184 -248 287 -11 0 -84 32 -93
4813i3P2J84k61J88l07K8J38PJ59j76K5r9L03J8l7l4j27k08K82L7j86P6k30K12
$$ -93 -21 163 -98 90 -217 -189 -51 -44 115 -61 -36 -135 168 186 149 115 -12 -220 62 99 -87 -11 -241 -29
4837b9j25O3J87q5k8r5l3N4j15M08O1k97L44q7J41j65j34k13J57r6K64l11j64
$$ -29 -154 -91 96 11 -17 -112 -145 -91 -206 202 263 -34 310 223 364 199 65 -148 9 -87 177 -134 -298
4860b98J53rK1j7L58M3j69l09O72j89j63J02k54J33j32n2m2J77M2j53j87K1K52
$$ -298 -145 -154 -133 -150 208 251 82 -227 445 256 93 195 -59 74 -58 -110 -152 25 67 -86 -273 -252 0
4883@j36j33K97L03k19j86J64J24p9K04j58j17k09N7K26l88L0R9j28K84p3j19
$$ 0 -136 -269 28 331 112 -74 90 214 135 339 181 64 -145 -88 138 -250 -220 -121 -249 35 -38 -157
4905a57J77J00j29j08L04p0m28K21K25j06kj00O7j7j08K52j11J37Ml13Q4K1m4
$$ -157 20 120 -9 -117 187 117 -311 -90 135 29 27 -73 -6 -23 -131 121 10 147 151 -162 -78 -57 -101
4928a01m2K24k57M07l11j3L15P3l96p4K34k63o6R8L59j91o8L58j87l84M30j04
$$ -101 -143 81 -176 231 -80 -93 222 295 -101 -175 59 -204 -270 -172 187 -4 -72 286 99 -285 145 41
4950D1l62N63m7j47j21L17k30l34K40K56o7j46J95q7j41k39K67j44o8K52K37o59
$$ 41 -321 242 195 48 -73 244 14 -320 -80 176 109 -37 158 71 -70 -309 -42 -186 -254 -2 235 -424
4972d24M43L42o74P8M04K17n75j9M72m10l37M70J74l86J40Q5L9k39L72J40q02
$$ -424 19 361 -313 -235 169 386 -189 -208 264 -146 -483 -13 161 -225 -85 0 39 -200 172 312 -490
4993d90L35N32l36m13O47J12o72J1N21k29k59M32L0n53j10O49j86l80O46J13p03
$$ -490 -155 377 41 -372 275 387 -285 -274 247 18 -241 191 221 -332 -442 207 21 -359 287 400 -303
5014c03P7O85n52l31M99L76m74m6N93n91k91M66J79p07K62P99l66q12M39J85n35
$$ -303 -226 459 -93 -424 75 451 -23 -69 524 -67 -358 108 287 -420 -158 641 275 -537 -98 87 -448
5035d48K24O70k58q91O93P5m81m7P67j33o43P96K47j034m3Q77k55m38N99K88o95
$$ -448 -224 446 188 -703 -10 65 -416 -463 304 171 -472 324 571 -463 -506 371 116 -322 277 565 -130
5056a30m04R39l63p51R26M02p23r0P13l61r40O02O78r36K12Q46j74j095L95O64
$$ -130 -534 405 42 -709 217 619 -104 -194 519 158 -782 -180 498 -438 -226 620 446 -649 -254 410
5076D10j074J37Q91J11r62P36L11j083j26J141m90m81O80J77r03J28P10k5r41
$$ 410 -664 -527 364 475 -487 249 560 -523 -649 492 2 -479 201 378 -525 -397 313 288 -653
5095f53J128K28o79j79L71k75p24Q57L43n78j42N10j05m76J99M90q89K04J032
$$ -653 475 703 24 -155 216 -59 -783 74 417 -161 -303 207 102 -374 -175 315 -574 -370 662
5114F62m91n59M63q3l18M9N84J80q51K41M91m89k71O31M6o40N53M01m93j63J62
$$ 662 171 -388 75 -8 -326 -277 307 487 -364 -123 368 -121 -392 239 285 -355 198 599 106 -57 105
5135A05K08o21O19J18k34m98M72R7p75K50L78l06J05M19M7q07M87J58m47K53K83
$$ 105 313 -308 311 429 195 -303 169 266 -509 -259 119 -187 -82 337 384 -423 64 222 -225 28 311
5156C11j83o53N03J51k12m58P10k20l47P90l12k21r3N02j56j03n3M96k41k33J57
$$ 311 128 -525 -22 129 -83 -541 169 -51 -398 392 80 -141 -234 268 112 9 -44 452 211 -22 135
5177A35j57n0j15M23n75L26k73J99K04J43K05m81J92J16r8k47JL7N2k40K86Q8
$$ 135 -22 -72 -187 236 -339 -13 -286 -87 117 260 465 -16 176 292 194 -53 -52 -15 37 -203 83 171
5199A71k50J20m1J0J3J03k51K55M2j38K1J46l51J30j03J14k22K52r1J38k40K49
$$ 171 -79 41 0 10 23 126 -125 130 172 34 55 201 -150 -20 -123 -9 -231 21 -70 68 -172 77
5221G7o6l07J75K60m57L03M61l93k05M18m6j10l33M62k81k09K15j51J93j06J80
$$ 77 11 -296 -121 139 -318 -15 446 53 -152 266 220 110 -223 239 -42 -251 -36 -187 6 -100 80
5242H0j40l72K09N80l28k15J92J32l42J19J81k41J40r5J39j66L09k41rJ04Q0p3
$$ 80 -60 -432 -223 357 29 -186 6 138 -204 -85 96 -145 -5 -100 39 -127 182 -59 -68 36 116 43
5264D3l16L68J84l49p9M79k14l53J94L00n16M7M41K6n59M33k22o0k16N23J5m00
$$ 43 -273 95 279 -70 -149 330 116 -237 -43 257 -259 -212 229 255 -304 129 -93 -153 -369 154 169 -231
5286b31O4N35n8m36P2k6j24K17K93n48J60J90m43P7J64K16Lj65L20j08j88j7j31
$$ -231 -167 368 310 -126 -54 -80 -204 13 306 -242 -82 108 -335 -258 -94 122 125 -40 280 172 -16 -33 -164
5309a64K18j66L04qr4j63M16l50k6R5J42m05L88j41j91L7K19m8k67M63J47l10
$$ -164 54 -112 192 184 90 -73 343 -7 -33 62 204 -201 187 46 -145 -108 111 63 -204 259 406 96
5331I6l82K98K42m94L67k28Lj0N2j4j42N5M22j40m20O23k81r2kK44l64J56J15
$$ 96 -286 12 254 -240 127 -101 -98 -108 -56 -70 -212 -157 265 125 -295 328 47 -45 -47 197 -167 -11 104
5354A04N2k24J31k38R8p8J12j27p3N70k64j89j31J57K65k68J1Q5J38k25N2K0l79
$$ 104 156 -68 63 -175 -77 -155 -43 -170 -243 327 63 -126 -257 -100 165 -103 -92 -7 131 -94 -42 -22 -401
5377d01K66q6K1K04O2R3m1o9K8P3l35M15J19l38N1O8k02j47K57n9q1%J66m26K17
$$ -401 -135 -221 -200 4 66 159 118 49 77 150 -185 230 349 11 62 130 -72 -219 38 -21 -102 -102 64 -362 -145
5402a45J35L61k76N6K6q0j26J63k05J81l00N70l92r0J11J32k01r7J88j31M6J23
$$ -145 -10 351 75 131 157 77 -49 114 -91 90 -210 360 -32 -122 -11 121 -80 -177 11 -120 -74 49
5424D9L9O7k49L51p6l84K54J6k55L93J98m58j14q3J73k98L38M09k81m4l5J64k41
$$ 49 88 155 -94 257 181 -203 51 67 -188 205 403 -55 -169 -252 -79 -377 -39 370 89 45 10 174 -67
5447f7k23M91m40P7J00K82p03L00K77j22j89J22K9m1J17j8N5l23M61J12l53l7
$$ -67 -290 201 -239 -162 -62 220 -483 -183 94 -28 -217 -95 -66 -107 10 -8 47 -276 185 297 -56 -93
5469i3N65m69j6k46M01l24J26M12j83N7J30m04k02J36K36J93l08N1N0m30L20K60
$$ -93 472 3 -13 -259 142 -182 -56 356 173 230 360 -44 -246 -110 126 319 11 62 112 -318 2 262
5491B62j64j26M29q1l86j08L91q1m64M49L05o00M8K65l76j44M53K04m66K65M32
$$ 262 98 -28 401 320 -66 -174 217 136 -328 121 426 -174 -126 139 -237 -381 72 276 -190 75 507
5512E07n17j11J22N85r45L71K97m04Q4j43q0j73K59J34l10J81M40l02n10K53J60
$$ 507 -10 -121 1 586 -359 12 309 -95 -11 -154 -234 -407 -148 -14 -324 -143 297 -5 -515 -262 -102
5533a02j34L5O57k75k77J35J2k74QK69K06k60r4L94l94n61N72Rm4L80L2k79k02
$$ -102 -236 -201 456 181 -96 39 51 -223 -215 54 260 0 -94 300 -94 -655 -83 -74 -118 262 294 15 -187
5556a87J28L8j75L14N37k21m08J84k27k52k1M4L86j44k7K4j86j68K94L2J22L6
$$ -187 -59 -21 -196 118 655 434 26 210 -17 -269 -290 -246 140 -4 -31 -7 -193 -361 -67 -35 87 123
5578A23K34m20K51m52j4R5K09J41n6k2N0q7l75m3K85K44N2j55J38k62j42L6P0
$$ 123 357 -63 188 -264 -278 -183 26 167 111 89 139 52 -323 -366 -81 163 215 60 198 -64 -206 -170 -100
5601a00K56J78j25Lm56jJ18j02J22L91j59L48l29k78K49k00n2L84l27l56M40J14
$$ -100 156 334 209 212 -244 -245 -127 -229 -107 284 125 473 144 -134 115 -85 -137 247 -80 -436 4 118
5623A18n77J76J94k13K94J88j11j17P6L1j77k94M72M85o01J93L37o38j75J91L35
$$ 118 -459 -283 -89 -302 -8 180 69 -48 28 59 -118 -412 60 545 -56 137 474 -164 -339 -148 187
5644A87m15K16L08J9o75M30M0n67P40M27n41p3Q5J41o88J81O10l10k06L13L48
$$ 187 -228 -12 296 315 -360 70 110 -457 283 710 169 96 181 322 -366 -185 425 115 -91 222 570
5665E70j030K51K11Jk47O83Qo58K58K43l35m52P62j70n27J17O44j91m62J97K09
$$ 570 -460 -209 2 3 -244 439 447 -211 47 290 -45 -497 265 95 -432 -315 329 138 -324 -127 82
5686H2l92J47P97o10m84M71M35p47K64O97l89q41P43J36o87L4O47n84l33P78l8
$$ 82 -310 -163 634 24 -460 11 446 -301 -37 660 271 -570 173 309 -378 -344 303 -281 -614 164 126
5707A26o79J80O85J34o81L13M35q02R4P11l45p90N29N44j040K77P81m30l79M58
$$ 126 -553 -373 312 446 -235 78 513 -289 -195 516 171 -619 -90 454 -586 -309 472 42 -337 121
5727A21R8m67J25N89j87p53M66M44q37K82M27o4o26O11K20r52K90O83p74m84J021
$$ 121 219 -248 -123 466 279 -474 -8 436 -401 -119 308 244 -382 229 449 -503 -213 470 -304 -788 233
5748B33J65p03J50O71o73k26N50Q4k56l20O47O0q28O95L3n88K58L42k54o48Q30
$$ 233 398 -305 -155 516 -157 -383 167 251 -5 -325 322 382 -446 249 282 -306 -48 294 40 -608 222
5769B22K94r00L08N54m45o99P94J23l47j05L70l27j25L11J06j56p7M86l08l80
$$ 222 516 -384 -76 478 33 -666 128 251 -96 -201 169 -158 -283 28 134 -22 -99 387 79 -301
5789c01K31K23j67j31J67J81m67J70L70m68m7K87j44L0J33j75k6K6M03p9l81K50
$$ -301 -70 153 -14 -145 22 203 -264 -94 276 -192 -239 48 -96 -66 67 -108 -134 -108 295 216 -165 85
5811H5K62k90q7j01L43k65K71l83j27j0N38n10K57m1J31o1l04M40Qr0m2K80m27
$$ 85 347 57 -30 -131 212 -53 218 -165 -292 -302 236 -274 -17 -58 73 12 -292 148 156 66 24 304 -123
5834a23J09N1K4R2k54K91m83K04K92j06l23J04J26L3Q5j26j47J78J72M6k86o7
$$ -123 -14 37 61 153 -101 190 -293 -89 203 97 -226 -122 4 37 122 -4 -151 27 199 245 -41 -108
5856a08K48j29j41j80M80k36jN5K27l87J48L55l58k53K38O4K35m10p2L15j38J15
$$ -108 140 11 -130 -310 170 -66 -67 -12 215 -172 -24 331 -27 -280 -42 22 257 -153 -225 90 -48 67
5878F7J63k87m5QJ73k20K58r3j79J23L7p2J99n9M6l30K8L46l33J88j6p1o0J09
$$ 67 230 -57 -102 -94 79 -141 117 24 -155 -32 5 -67 132 73 119 -211 -183 163 -170 18 2 -69 -129 -20
5902b0K89m28K15j06P6j18J90MR3k87K3m0Q9N1l65R4j20K75L02j18J43j39N6m16
$$ -20 269 -159 56 -50 26 -92 98 102 195 -92 -69 -109 -20 31 -334 -240 -360 -85 217 99 242 103 159 -257
5926b57J24P8L5J35P2k99N0J6L7j00P8Q0l45Q7n6M89k98J52nj79M0j5K02J10K4
$$ -257 -133 -55 -20 115 187 -112 -62 -46 -9 -109 -31 49 -296 -209 -265 224 -74 78 73 -106 -66 -81 121 231 255
5951B55j09j7j08l86K77P4J97k78J53l01l2J39J69j15R6J52M0q3k07j63J53J47
$$ 255 146 129 21 -365 -88 -14 183 -95 58 -243 -275 -136 33 -82 14 166 206 123 -84 -247 -94 53
5973E3l7J12L05p78K04L1j92J88j30L04j23K4K27j50k52J65k3J06K06l11k8m6
$$ 53 16 128 433 -345 -141 -110 -302 -114 -244 60 -63 -39 188 38 -214 -49 -72 34 240 -71 -99 -145
5995a45J26Rk01L68p4j0j0j5j60J30J37k7J09m2rL5l62M7P1k14m3K78P2j25O6
$$ -145 -19 -10 -211 157 83 73 63 48 -112 18 155 128 237 195 186 221 -141 -94 -23 -237 -280 -2 70 -55 11
6020A1r5P7Q7K49l64J59l0L03q36N63j36p1n4L10P5n13L87K30n81j07L36Q8k58
$$ 11 -84 -7 80 329 -35 124 94 397 -439 124 -12 -83 -137 173 248 -265 122 352 -229 -336 0 88 -170
6043a70J34N5l22K98J29J04j96k05O71m34k09K56l32q0L51M40l77k44K76k24k65
$$ -170 -36 19 -303 -5 124 228 32 -173 498 64 -145 111 -221 -301 50 490 113 -131 145 -79 -344
6064c44J26N11k02j19N55j47p66Q9O9M8jQ58j85o24K8K08k93m16R18J09l75l9
$$ -344 -218 293 91 -28 527 380 -386 -297 -228 -180 -181 677 492 -132 -104 104 -189 -605 313 422 47 8
6086HM80l42o68L82K37m12K97Q34o79l38N20j81p04Q86K86m35k70O46n96n07J10
$$ 8 488 146 -522 -140 97 -315 -18 816 137 -201 319 138 -566 320 606 171 -99 547 -49 -556 -446
6107d46Q39n02j22Q09k98j080P21J81n89L17N44nn48J68K30o67m0O07K51m48K63
$$ -446 393 -109 -231 578 280 -800 -79 102 -487 -170 374 369 -179 -11 219 -448 -488 119 370 -78 185
6128A85O32q78l90O62k83k34P6J112q39l83O30k14o20M01P31q57L05M29j98r62
$$ 185 817 -61 -451 211 -72 -306 -230 882 43 -340 290 76 -544 -143 588 -269 36 465 267 -695
6148f95L94Q41n61m93R75j6q16K93J20m71j48Q16J59m33m4N90j000mJ040o6j045
$$ -695 -301 540 -21 -514 461 445 -371 -78 42 -429 -577 239 398 -35 -79 511 -489 -493 547 481 -564
6169e64M84P62r33j78R29m64k35L41O29q09l30Q98k22j005O96M21n92k0K83J14
$$ -564 -80 682 -251 -429 500 36 -199 142 771 -38 -368 530 308 -697 -1 420 -172 -192 91 205
6189B05q60N21L73j40k65N54Lq77K42N50l96k77M73L23q71L97N25m00l98L69L67
$$ 205 -655 -134 239 99 -166 388 391 -486 -244 306 -90 -367 106 429 -442 -45 480 80 -318 51 418
6210D18q35L50L92m19j16J28J97k18q5P02m69l65M95k14m85M93L82m00p4M67l10
$$ 418 -417 -67 325 -94 -210 -82 115 -103 -188 514 45 -320 175 -39 -524 -31 351 -49 -123 344 34
6231C4m9m03R10m42m06O63K04n72J3j2J26o98Q66n3l07K52K29j67n47N53L1j62
$$ 34 -15 -418 492 50 -356 307 511 -61 -48 -60 66 -632 234 181 -126 126 355 188 -359 194 225 63
6253F3j22M71m24K5J47L3j75R2O4ol54L06N5m21PK65j20L0L54j36j08j44M53j34
$$ 63 -59 412 -12 13 160 193 18 110 174 168 -186 120 175 -246 -239 26 -94 -64 290 154 46 -98 355 221
6277B21k28l6K06j6P8J00l63J49j3P5j11p5R3M9k37J67j69m9N9K25l43J79K27
$$ 221 -7 -43 163 147 225 325 -38 111 98 173 62 -13 80 129 -108 59 -110 -159 -100 125 -218 -39 188
6300A88J0j88j00K43j2l10M97J56n76k65L73k22O0L51k84K0K48m1k3k77K29l65
$$ 188 198 10 -90 153 141 -169 328 484 -92 -357 16 -206 -146 205 -79 -59 189 148 125 -152 77 -288
6322b88P4J46M3N7k16K97k39K0K94P3m19Q2K04J20k11K07l56J50k52K65K8j0n
$$ -288 -214 -68 -25 32 -184 113 -126 -106 188 261 -158 -76 128 248 37 244 -112 38 -214 51 79 69 64
6345F4Q9k70K08J02j93j58L19j16P0P4k44o7k6M13j95m73L56M31j87j11l37R5
$$ 64 153 -117 91 193 0 -158 161 45 115 189 -55 -122 -148 265 70 -403 -47 384 197 86 -251 -156
6367a56p0k8J86K01k32K2NL05m53L95j26j68M9j81M91k33l36L59j49Q4J9j08L23
$$ -156 -226 -254 -68 133 -99 -77 -72 233 -220 175 49 -119 -70 -251 240 7 -329 30 -119 -35 -16 -124 199
6390A99L8m11J45J90j82J23K5p9j69J36l47K67k0k52N73j56j00K83m86K24k8p4
$$ 199 237 -174 -29 161 -21 102 127 48 -121 15 -332 -65 -85 -337 236 80 -20 263 -223 1 -27 -101
6412a01K67j81K74m05J74n9j27J85k09K37l74K90J6j71K89M3k33P9PO5k3Nj26
$$ -101 166 -15 259 -146 28 -31 -158 27 -182 55 -319 -29 -13 -184 105 148 -85 -6 1 66 43 48 -78
6435g8L12k42p2K68q3J00L2l63j10K40M12m66J09J5N0o3k91K14J70n7j13K65l41
$$ -78 234 -8 -80 188 105 205 237 -126 -236 4 416 -50 59 74 124 61 -230 -16 154 97 -16 249 -92
6458i2j79L14j55j34L04J8j5j02K54l42P3o0R2Q0k24O51l47k41J2L47m62r2M48
$$ -92 -271 43 -112 -246 58 76 61 -41 213 -129 -56 -116 -24 56 -168 483 136 -105 -93 254 -208 -300 148
6481A48jl77K24J06k72L34M5p3l54L37J19k58j72L09k98j90M02K14k77P6l1j28
$$ 148 147 -230 -6 100 -172 162 207 134 -220 117 236 -22 -194 115 -183 -373 29 243 -34 42 11 -117
6503a17J13J21J38l33K66Q1K9o28J08L05J03m84O26j82m37L88J49m58lO70n21
$$ -117 -4 117 255 -78 188 269 298 -330 -222 83 186 -298 328 146 -291 97 246 -212 -215 455 -66
6524f6k98O48k60k90P5O28o5l26K46%m48j66K48m9l6J21N59l85o9j12P8o27O08
$$ -66 -364 284 24 -266 -191 437 372 46 292 292 -156 -322 -74 -123 -159 -38 521 136 67 -45 33 -594 14
6547A4J96l48j10P11n43n98O96L57o40K96L59j13p31J98M82n68j80P65j63l93
$$ 14 210 -138 -248 463 -80 -678 18 375 -265 31 390 277 -454 -256 226 -342 -522 243 80 -313
6567c13J45L92p79L2P36j82j81L62jl24m16N62pl91O14R1l22j04K72k07n28O91
$$ -313 -168 224 -555 -523 213 31 -150 212 211 -113 -529 33 26 -365 249 340 18 -86 186 -21 -549 142
6589A42J94l30j00N02k91l15k3M41n30Q1N30J14p51J63L73n26K74K33Nm42M90
$$ 142 336 6 -94 408 117 -198 -221 220 -310 -229 301 415 -336 -173 200 -326 -52 181 186 -256 234
6610B34k09m27j43P03o3J1N2L20m27l41K80n0l44M95K74m82L64L03m49n21L42
$$ 234 25 -402 -545 158 95 106 158 478 51 -290 -10 -60 -404 91 365 -117 247 550 101 -420 -78
6631g8M96j96k06N02n93O6mj44p4P0N92p5m72j78N11l68j97N63l5l84L44N6l36
$$ -78 418 222 16 518 -75 -9 -13 -157 -231 -161 431 356 -116 -294 217 -151 -348 215 180 -204 140 196 -140
6654a40j48K45L1j60L45J47l31k04L10q2l38M11L5R9k98J77k23j22J51J46l5r0
$$ -140 -288 -43 -12 -172 173 320 -11 -215 95 13 -325 86 121 220 -78 99 -124 -246 -95 51 16 -74
6676g4K81p7l14K87Pl33L33J53j83M8j41m4j90k58Q43k06l3J32p7j34j67L18j30
$$ -74 207 130 -184 103 110 -223 110 263 80 128 -13 -57 -247 -505 338 132 99 231 154 20 -147 171 41
6699D1lj98o0n%L75l69o6K33L16k39j29o8j11K05j02N38k63N3RLj56k15J62O9
$$ 41 38 -160 -220 -225 -225 150 -219 -285 -52 264 25 -104 -172 -283 -78 -180 358 95 148 157 160 4 -211 -49 20
6724B0k0O4N5j24K95q9k1k80J38k01L04j31j07j62J38J15QJ85l54M4n2L31j40
$$ 20 0 64 119 -5 290 201 180 -100 38 -163 141 10 -97 -259 -121 -6 2 187 -167 -123 -175 156 16
6747A6n0L0K56l72q5J84J51j73J93K4l38L6J28N8j02M8N8q4k66L49m3j8L32l18
$$ 16 -34 -4 252 -120 -205 -21 130 -43 150 174 -164 -128 0 58 -44 4 62 -22 -288 61 18 0 332 14
6771A4l9p0p9L7o5L12j62J47j42J6k36L14L4k71K43j31K24L5m84M58l47O0o9K54
$$ 14 -25 -95 -174 -137 -202 110 -52 95 -47 -31 -267 47 81 -190 53 -78 146 181 -303 155 -192 -132 -201 53
6795E3k11k2N66k18O5k03O0k86K02Q3J98l87K03m1j41J2J51K70m83L96p6m95L52
$$ 53 -158 -180 386 168 233 30 90 -196 6 89 287 -100 103 62 -79 -67 84 354 -129 267 191 -304 48
6818D8k48M39m85L27m9k40M8M86m07J46r5J31j10j9o1L58m48r4M85l79J04j51
$$ 48 -200 239 -246 81 32 -208 -160 326 -81 65 -30 101 -9 -28 -89 269 -179 -273 212 -167 -63 -214
6840b14L44k16L6O3m2m2J95k96N9P6K59q8k6J07m9k43L22m1j65O1q4jn8j75K93
$$ -214 130 -86 -50 13 -29 -71 124 -172 -113 -37 222 134 108 215 166 -77 245 204 39 100 16 15 -43 -218 75
6865G5J45m99L75M4j64J09K75m66J52j22jk49L98l80L55j26K71k13O2J33n3o5
$$ 75 220 -279 96 140 -24 85 360 -106 46 -76 -77 -326 72 -308 47 -79 192 -21 41 174 121 56
6887E6k49L71m5l02J48O4r2J87j15L9q4J89O9k14k67M65J76m65J21k2o0j47J45
$$ 56 -193 178 133 -169 -21 43 -49 138 23 62 -22 167 236 22 -245 220 396 -69 52 30 -30 -177 -32
6910c2K47m62J95J75l21R2J2l1L60l20J10Ol6k3Q2j54J9K42l71jK92K20k49m38
$$ -32 215 -247 -52 123 -198 -106 -94 -125 235 -85 25 31 -5 -28 54 -100 -81 161 -210 -211 81 301 52 -386
6934c86N10N6l69L96j58O2j24K56l94L08j49j0k6j58K51K0j02n0L18j81K6q7j19
$$ -386 124 180 -189 207 49 111 -13 243 -151 157 8 -2 -28 -186 65 85 -17 -67 251 70 96 9 -110
6957a10LM86k72j87q7L52k22j13K10J16l5J36mj76J8l38K20M7J12L1L29n83Q1
$$ -110 -107 379 107 -80 -167 185 -37 -150 60 176 141 277 273 97 115 -223 -3 44 156 187 516 -67 14
6980A4K4k10l8J28L05l68K18k74N6Q1J04j02mq4M13l16j18L97l62J29r7M9k2J01
$$ 14 38 -172 -210 -82 223 -145 73 -201 -145 -64 40 -62 -66 -150 263 -53 -171 226 -136 -7 -104 -55 -77 24
7004B4K04n34N38k91J03M9p5j15M07k76Q0Lj17r3R3O4p7k5K93m01L59p8l8k98
$$ 24 228 -306 232 -59 44 93 18 -97 310 34 114 117 0 -93 0 64 -13 -38 255 -146 213 135 97 -201
7028b01J83k04J37J76l5j39p9o9O8k06N54L52l20l50l3K33k81J66J8L44n14PK09
$$ -201 -18 -222 -85 91 56 -83 -162 -231 -163 -369 185 537 217 -133 -166 67 -214 -48 -30 314 -200 -193 16
7051A6m80M19J96k99J64r9O1j31J48j47J81l10L07J63r1J66k88q1k37N82l30J47
$$ 16 -464 -45 151 -148 16 -83 -22 -153 -5 -152 29 -281 26 189 98 264 -24 -105 -342 240 -90 57
7073E7j80K89j73j50J38J20r2K87l1q0o9l06K90l16L72j48J02N1j24k8n9j33K26
$$ 57 -123 166 -7 -157 -19 101 9 296 265 185 116 -190 100 -216 156 8 110 161 37 9 -50 -183 43
7096D3k0n5J79nQ9k35k48K01r4L75k70j20L50l60l41M52K3j57M33j93J08k20J22
$$ 43 23 -32 147 142 231 -4 -252 -51 -145 230 -40 -160 190 -170 -511 -59 -36 -193 240 47 155 -65 57
7119E7k49l6K39M2j50L16m03J03PJ03j84K35q8O8J36m68M41l33K87j7QJ99j34
$$ 57 -192 -228 11 53 -97 219 -184 -81 -74 29 -155 80 -8 60 196 -272 169 -164 123 106 114 313 179
7142A79k00K59m86j28N19r4j57L81k58j56m9J45j7KM2N68n11j35L42l59l34L72
$$ 179 -21 238 -248 -376 143 49 -108 273 15 -141 -190 -45 -62 -60 -18 550 39 -96 246 -113 -447 -75
7164g5L18j44j09J66k46k29J98l6J75l6K64j53j3J19j76j2j47J73K91n71L64K07
$$ -75 243 99 -10 156 -90 -319 -121 -157 18 -18 246 93 80 199 23 11 -136 37 328 -243 121 328
7186C28o15Q3K29j77M06j96L11l44Q3L6qn5j02L83l06l81L85q9k46K29J06k94
$$ 328 -287 -204 25 -152 254 58 369 25 108 144 136 81 -21 362 56 -325 60 -29 -275 -46 60 -234
7208b34j46M43j7m32M27L90n22J13Mr1l00K40P9j32J80k2J83k12K96j18k32N8
$$ -234 -380 63 46 -386 41 431 -91 22 26 -65 -365 -125 -46 -178 2 -20 163 -49 247 129 -103 -45
7230d5K12j68j64M28k28k3O2J27R2o88L84J71l59K06J21m0k88K54K7k43J34J60
$$ -45 167 -1 -165 263 35 12 74 201 293 -395 -11 160 -199 7 128 88 -200 54 81 -162 -28 132
7252A32q4m36N41L1k96QM41k78j61L15j68K26n68N17P6n18L23O5m66O6L82J05
$$ 132 48 -388 153 184 -112 -104 337 59 -102 213 45 271 -297 220 296 -222 101 166 -300 -234 148 253
7274B53l39L22r0k61j19K90k09K21k47J69j29n4K94j0k52Q0J32j95R9K25p4r5
$$ 253 -86 236 146 -115 -234 56 -153 68 -179 -10 -139 -193 101 91 -161 -81 51 -144 -45 180 106 11
7296A1N8K23l95JK21j99M24m52M03l44n6K78j63Q6K19j68k36j30M39J8m64M50
$$ 11 69 292 -103 -102 119 -80 344 -108 295 -49 -105 173 10 96 315 147 -89 -219 220 238 -226 224
7318B24q8M6j36j61K56j30P0l02M22n01M44ql78M22j39p9p0J65R5L1k01K90j39
$$ 224 136 182 46 -115 141 11 81 -221 201 -300 144 136 -242 180 41 -38 -108 57 152 183 -18 272 133
7341A33j71J82j81k34K15K24k83k9M6J88j54M0N9k75ML33r9k36O1K52N2k97J32
$$ 133 -38 144 -37 -271 -56 168 -115 -144 -98 90 -64 -24 35 -240 -236 97 -2 -238 -177 75 127 -170 -38
7364c8Pj69n2O4L70J8k14J44j56J54J07k37K8k0k15J85j35K51q4k19K23k2k61
$$ -38 -31 -200 -252 -188 182 200 -14 130 -26 128 235 -2 26 6 -209 -24 -159 92 8 -211 12 -10 -271
7387b71J46M9M85n78QK55j66K5k7j06R8P2O4k62J21M63l95j74O1K12J29m2j52
$$ -271 -125 -76 409 -169 -161 94 -72 -47 -74 -180 -82 -10 54 -208 -87 376 -19 -193 -132 80 209 167 15
7410A5q2P4j84K57j8l23O2j04K79R9k82J35o0k00J81J56j3q5J31J9k26J62j0l
$$ 15 -67 7 -177 80 62 -261 -199 -303 -24 75 -207 -72 -132 -332 -151 5 -8 -93 38 57 -169 -7 -17 -20
7434b0K9L00k42R1m46J87j59K85O1j88P7K30m12L00J4m90M34l4k21K0L9k9P9Q0
$$ -20 9 309 67 158 -288 -101 -260 25 86 -102 -25 205 -207 93 107 -383 51 17 -204 -184 -145 -174 -95 -15
7458a5K19p0R0l15r7K19M4r0j50K14l6r9L6P0K53l39j46K39J58k47M1J32mj07
$$ -15 204 134 224 -91 -188 31 75 -15 -165 49 13 -86 -50 20 273 -66 -212 27 185 -62 -21 111 107 0
7482@N4p8oO9j95K15K57l78l0L12l21P0p2J86m08L48R3j07p2J46j56J46K9J01
$$ 0 54 -24 -30 39 -156 59 316 -62 -92 220 -101 -31 -103 83 -325 23 116 9 -63 83 -73 73 102 203
7506B03j57Q9j33j76R8j07J35J70K05j97k82k1K20k0%n9K87k27j43j71J52m4K81
$$ 203 46 135 2 -174 -76 -183 -48 122 327 130 -152 -173 47 27 27 -32 255 28 -115 -286 -134 -178 103
7529A03j27j28J30K7J97l48L3O7M28l75J33n30J62K80j78J57N6n7J97k89N7k02
$$ 103 -24 -152 -22 5 202 -146 -113 -46 382 7 140 -390 -228 52 -126 31 87 30 227 -62 -5 -207
7551b07L91j97P0Ln4r7j16J12j63K02K49l52M54l35K07j57Q8q5Mn8K63k48J14
$$ -207 184 -13 57 60 6 -91 -207 -95 -258 -56 193 -159 295 -40 167 10 98 13 17 -41 222 -26 88
7574H8Qp0Q1R6l32J81k56K59j30ln5L43k4o1j32L76Nq00J91J71J77j65K24Q9m00
$$ 88 96 26 107 203 -129 52 -204 55 -75 -78 -133 210 186 125 -7 369 374 -426 -235 -64 113 -52 172 261 -139
7599a39J80k51J35m9L33k0l68Q8J03k98o2N14j63RK02M41o08j03K85k48k40L73
$$ -139 41 -210 -75 -124 209 189 -179 -91 12 -286 -348 166 3 12 214 655 47 -56 229 -19 -259 114
7621A14N6q8l83J86J37j77J81j13k9N4M15j23m61k9Q4J96m9L63j88q2l12M81j35
$$ 114 170 82 -301 -115 22 -155 26 -87 -116 -62 353 230 -231 -260 -176 20 -29 334 146 64 -248 233 98
7644I8k09J07J16k7l34M23m52k77N17J04J5k36K79J60k43J35j20j89Q5J89j62
$$ 98 -111 -4 112 85 -249 174 -278 -555 -38 66 81 -155 124 284 41 176 56 -133 -48 141 -21
7665b1j62K29Lk03j53M54k20J3J95K1l34L56pk84l0J79l3k72m7N54j11k62J62
$$ -21 -183 46 49 -154 -307 147 -73 -60 135 156 -178 178 171 -113 -143 36 3 -269 -316 238 127 -135 27
7688B7K95j62k04Q9j20k06L28P2j13r4O02m44l50J51J54l5N1Q3l48K08K41n4l72
$$ 27 322 160 -44 45 -75 -281 47 119 6 -88 514 70 -280 -129 25 -10 41 124 -224 -16 225 171 -201
7711b01J1J91N7m95O85M9m69j8K30M2o2j21J12j61QM16j79k93Q4K01N3Q6k10k52
$$ -201 -190 1 58 -437 248 297 -172 -190 40 82 20 -101 11 -150 -142 274 95 -198 -114 87 140 226 16 -236
7735b36Q2K01O5j75r5K99k68j37J86k0j46M32n4j63j91K37N8j17Q1J85k52l3M45
$$ -236 -154 47 112 -63 -158 141 -127 -264 -78 -98 -244 188 134 -29 -220 17 75 -42 39 224 -28 -61 384
7758C84l48k45J35K41K33l01J31j14l10J70k13K95j03J19m8j66l8J89M2j17M2
$$ 384 36 -209 -74 167 400 99 230 116 -194 -24 -237 58 -45 74 26 -140 -178 11 53 -64 -22
7779b2J25J9l63K39R5o7k77J95L39m24K18j55o4L9P6P3k48K33l4M9j16k9L39l70
$$ -22 103 122 -241 -2 93 26 -251 -56 283 -141 77 -78 -142 -103 -27 46 -202 31 -3 46 -70 -99 240 -130
7803a30n8L28j65R1J17m0k29l5K28k91L91j30j26L78k63l66K26J0K01j94P7q1
$$ -130 -188 140 -25 66 183 143 -86 -121 107 -184 207 77 -49 329 66 -300 -74 -64 137 -57 20 -61
7825f1J19r5P0K49l18j03L84j70j01m3No4j25M94k79l2O1n9K20j79j69J99J46
$$ -61 58 -37 33 282 -36 -139 245 75 -26 -69 -64 -128 -253 241 -38 -70 -9 -68 152 -27 -196 3 149
7848A49j53P7N6jr0p4Q0L2K6n9K10n25K05k03j25M93l39J86N0J92j71J32q2J22
$$ 149 -4 73 129 128 38 -36 44 76 102 43 253 -272 -67 -270 -395 98 -241 -55 -5 187 16 148 66 188
7872A88k28J60K8j95K0K56l49n1K13o3j91K63Q4q2k3J38k70K9L7p8M47n26K38
$$ 188 -40 120 148 -47 -27 229 -120 -171 42 -21 -212 51 135 53 30 168 -102 -73 -36 -114 333 -193 45
7895D5k79K99o4k1J45N6k36J99j74J69m03M21q0o4o9K0Q5m02L28q9J15j55K89
$$ 45 -234 65 1 -20 125 181 -55 144 -30 139 -264 157 77 13 -56 -36 49 -353 -25 -114 1 -154 135
7918A35m4k15P3K5j17Q0L0O8J54j15l2j26j08J24q5L81k73L11l24J66j79J0J28
$$ 135 91 -124 -51 -26 -143 -63 -33 35 189 74 42 -84 -192 -68 -153 228 -45 266 -58 108 -71 -61 67
7941F7j90K07K7p1m0J32j42r9K01o8m4o4j16J78j33L90j60j03R3j55J2j5K63l35
$$ 67 -123 84 111 40 0 132 -10 -109 92 24 -20 -84 -200 -22 -155 235 75 -28 65 -90 -78 -93 170 -165
7965a65J38j22K3L05l90K16K8j85k6L42k30r3K74m1K8j72Q0j01J7J58j50RJ50
$$ -165 -27 -149 -126 179 -211 5 33 -152 -178 164 -66 -159 115 74 102 -70 10 -91 -74 84 -66 -57 93
7988I3ll24J39l5Q4k09J72J57J16j70L14n28M08j29q7m58O49k73m4Q6q6j9J47
$$ 93 90 -234 -95 -130 -46 -255 -83 74 190 20 334 -194 214 85 -2 -460 189 -84 -128 -42 -128 -147 0
8011@l82M94r4N8j72K12j15j72O1J55J29j35lK1m7K74k16k69K8l7M99k40j45K32
$$ 0 -382 112 18 76 -96 116 1 -171 -110 45 174 39 36 57 10 284 68 -201 -173 -210 289 49 -96 136
8035A36o3k53LJ9Q0L3k9o1RJ81j57j1K77k85KM39k72J03K4r5ol99K92l8m7K4K20
$$ 136 73 -180 -177 -158 -78 -45 -74 -135 -126 55 -102 -113 164 -121 -119 320 48 151 175 80 74 -325 -33 -71 -118 -94 126
8062A26n80K53L63l52R0J55q0j18P1L22l1m98K73l3k40L04k2J66j33Q9k47L79
$$ 126 -454 -201 162 -190 -100 55 -25 -143 -72 250 219 -279 -6 -39 -279 25 3 169 36 125 -122 257
8084B57m48L13N0J4k45J8j53j8J05M33l80Q1M09m92o1J11O1k76K00J12r0J10k95
$$ 257 -191 122 172 186 -59 -41 -194 -212 -107 326 -54 27 436 -56 -117 -6 55 -221 -21 91 1 111 -184
8107a84K68l7J5M2J8K9j59j62K05j13oj63K18K21J2k62M30n24J52k78M21j39k51
$$ -184 84 47 62 104 122 151 -8 -170 35 -78 -84 -247 -29 192 204 -58 372 -152 0 -278 143 4 -247
8130b47J73J17j17R2J72l29K24k37N07n71K68lL1L1r6J60l18JK33j26n0r0K73
$$ -247 -74 43 -74 18 190 -139 85 -152 355 -216 52 49 80 111 15 175 -143 -142 91 -35 -85 -175 98
8153I8R8m76N22k65M5j35M32j95k74p3L27m74n8L02J78j2J00J13o6k20J54j30
$$ 98 196 -280 242 -23 22 -113 319 124 -150 -223 104 -370 -428 -126 52 40 140 253 187 -33 121 -9
8175iO4m5O1j9M3n2L9J7j85P1j8L9M3j52L12k00
$$ -9 55 10 71 52 95 43 82 99 -86 -15 -33 6 49 -103 209 9
8191I
$$ Imaginary data points
##PAGE= N=2
##DATA TABLE= (X++(I..I)), XYDATA
0@%%%%%%%%%qJ6j6J6k4L2m0M9n8P3q8J06j30J58j83K14k54K97l44L95m54N21n93
$$ 0 0 0 0 0 0 0 0 0 0 -8 8 -8 8 -16 16 -24 25 -33 40 -48 58 -72 86 -97 117 -137 160 -184 211 -243 278 -315
32c15O75p66Q64r76J097j230J378j538J714j905K115k346K596k869L166l491L851
$$ -315 360 -406 458 -518 579 -651 727 -811 903 -1002 1113 -1233 1363 -1506 1660 -1831 2020
49B020m244M675n149N672o258O913p645Q474r425J0523j1810J3343j5204J7522
$$ 2020 -2224 2451 -2698 2974 -3284 3629 -4016 4458 -4967 5556 -6254 7089 -8115 9407
63I407k0503K4500l0164L8880n4182Q8895l15529m0433L43872k45624J63050L25288
$$ 9407 -11096 13404 -16760 22120 -32062 56833 -258696 -299129 44743 -200881 -37831 287457
75B87457j54688l03215K68732J48904k26046P1581L38409k07624l47115R1355
$$ 287457 132769 -170446 98286 247190 21144 92725 431134 223510 -123605 -32250
85c2250J0073l48731M8727L64217m0063j73783K25618O9419l16531j698L26530
$$ -32250 -22177 -370908 -322181 42036 1973 -171810 53808 123227 -193304 -195002 131528
96A31528k9413j09290K72388J04644l37016r9719J66027j53206j90308K43288
$$ 131528 102115 -7175 265213 369857 32841 -66878 99149 -54057 -244365 -1077
106a077J45337k51685n4495J74387j57569j94941K52197K19865j15642P3659K45924
$$ -1077 144260 -107425 -161920 12467 -145102 -340043 -87846 132019 16377 90036 335960
117C35960j33857k54306J06934P5279k07919P935K17691j12813k34784Q2371N0339
$$ 335960 202103 -52203 54731 130010 -77909 -69974 147717 34904 -199880 -117509 -67170
128f7170j91527M5920K86160K4198r3317J49958O3362k21382n4705J63842m5286
$$ -67170 -258697 -212777 73383 97581 4264 154222 217584 -3798 -58503 105339 60053
139F0053j17921J30997O3944k03930p5205J10478o0069r8071J58503J33367j05251
$$ 60053 -57868 73129 137073 -66857 -142062 -31584 -91653 -189724 -31221 102146 -3105
150c105j9678J13813p3224j27495J09487J09492p6970P929J15390p2279j53496
$$ -3105 -22783 91030 17806 -109689 -202 109290 32320 40249 155639 83360 -70136
161g0136L3464M2230j02567M38J27609k4155j02040N0829M6503q0503J7154J40925
$$ -70136 -36672 5558 -97009 -96571 31038 6883 -95157 -44328 2175 -78328 -61174 79751
173G9751K1426n2634N3710K3253j18576n4960N6609k5933o2639N5436M3412p3534
$$ 79751 101177 48543 102253 125506 6930 -48030 8579 -17354 -79993 -24557 18855 -54679
185e4679k4856O2391m797l2565O9756O5908l9905j7711L7834l5803o6054K6022
$$ -54679 -79535 -17144 -21941 -54506 15250 81158 41253 23542 61376 25573 -40481 -14459
197a4459L6124l0059q92M5075j6392n1695J1589K0269l1012k667M3073l697l3059
$$ -14459 21665 -8394 -9286 35789 19397 -32298 -20709 -440 -31452 -34119 8954 5257 -27802
210b7802J3891J6010k1567N375M4553J4444j2698J2742N111l8039k5830N596j2269
$$ -27802 -13911 2099 -19468 -14093 30460 44904 32206 44948 50059 12020 -13810 -8214 -20483
223b0483k0903J0460J2174j1843r39K0456R307J241J9904J8982n454p393M47j3380
$$ -20483 -41386 -30926 -18752 -30595 -31534 -11078 -1771 -530 19374 38356 32902 25509 25956 12576
237A2576j9220k522J816m188O57P703J394m412Q78K419l316j734L008j040k370
$$ 12576 -6644 -9166 -7350 -11538 -10881 -3178 -1784 -6196 -5318 -2899 -6215 -7949 -4941 -5981 -8351
252h351J590K915M813P306Q603P491L312k066n823r958j2188j2403j0307n307
$$ -8351 -6761 -3846 967 8273 16876 24367 27679 25613 19790 9832 -2356 -14759 -25066 -30373
266c0373k692M64P686J1181R893J3780J3658P046L200J96n717j1787j2471r891
$$ -30373 -33065 -32601 -24915 -13734 -3841 9939 23597 30643 33843 34039 28322 16535 4064 -5827
280e827j1188q953o21K498J938P704J0324O249N274N599K044k364k938j365l684
$$ -5827 -17015 -25968 -26589 -24091 -22153 -14449 -4125 2124 7398 12997 15041 12677 9739 8374 4690
295D690m948P45Q13j231J618J721k021k409k810l998m508l326k31J357L133P750
$$ 4690 -258 487 1300 69 1687 3408 1387 -1022 -3832 -7830 -12338 -15664 -15895 -14538 -11405 -3655
311c655Q581P618Q196N052J079k555o478r800j1049j1593q933o820k077L768O943
$$ -3655 4926 12544 20740 25792 26871 24316 17838 8038 -3011 -14604 -23537 -30357 -32434 -28666 -21723
326b1723R632J2894J1510R169O698K141k836o288q744r183j0351q573l465j459
$$ -21723 -12091 803 12313 21482 28180 30321 27485 21197 12453 3270 -7081 -15654 -19119 -20578
340b0578k9N054O474M586M747M846K720j577j230J706k373l427L539K368k206
$$ -20578 -20607 -15553 -9079 -4493 254 5100 7820 6243 5013 6719 4346 919 4458 6826 4620
355D620K334L976k959n753j306l326j1060o186K715l617l493J1173J1922J870
$$ 4620 6954 10930 7971 2218 912 -2414 -13474 -19660 -16945 -20562 -24055 -12882 -960 910
369I10R474J6252J632n759L714p43j8874j2502J374j2880j7272P176R320q026
$$ 910 10384 26636 28268 22509 26223 25480 6606 -5896 -4522 -17402 -34674 -27498 -18178 -26204
383b6204P318K4846N118n947J5937J1185j8837p616J3795j1139k2961J0142R329
$$ -26204 -18886 5960 11078 5131 21068 32253 13416 5800 19595 8456 -14505 -4363 4966
396D966k1871l932K4463l709j8503J8690J7191k4885p773K5696q424k5528K2968
$$ 4966 -16905 -20837 3626 -83 -18586 104 17295 -7590 -15363 10333 1909 -23619 -651
409f51K3504k2909k270L4658q881l4420J6375J7540l7301j3240L3599j2031l8905
$$ -651 22853 -56 -2326 32332 23451 -10969 5406 22946 -14355 -27595 6004 -6027 -44932
422d4932K3462K8772k8562J073N4528K971l4748K4600K3079n0660k3697L9248
$$ -44932 -21470 7302 -21260 -20187 34341 37312 2564 27164 50243 -417 -24114 15134
434A5134j2599m7182K7162L1730m5665j4314N4964J124l7463M1643M5965m6231
$$ 15134 2535 -44647 -17485 14245 -31420 -45734 9230 10354 -27109 14534 60499 14268
446A4268k3769M5739j8855o2260L1347M5123m5207j6303N9419j3300o5930K9233
$$ 14268 -9501 36238 17383 -44877 -13530 31593 -13614 -29917 29502 16202 -49728 -20495
458b0495M7749m7438j3361P2503n885o9508K8076M3575n5932j4504Q2335N577
$$ -20495 27254 -20184 -33545 38958 33073 -36435 -8359 35216 -20716 -35220 47115 52692
470E2692o4369K7031L6049p8669m0857O8563O57n9704M6313N8598o3328l2338
$$ 52692 -11677 15354 51403 -27266 -68123 440 1097 -58607 -12294 46304 -17024 -49362
482d9362P2668L179n7065N3310O9294o2072m5058N0702k7520q9315L4815O9364
$$ -49362 23306 26485 -30580 22730 92024 29952 -15106 35596 8076 -81239 -46424 22940
494B2940m4882j8536P8029q051q5623K8432O5355m5917j3613R0190k83r0595J1398
$$ 22940 -21942 -40478 37551 29500 -56123 -27691 37664 -8253 -21866 68324 68041 -22554 -11156
507a1156M0563p0193k7012R4626K0382o6479K7075M3354q3572m9726P7021J7786
$$ -11156 29407 -40786 -67798 26828 47210 -19269 7806 51160 -32412 -82138 -5117 12669
519A2669n2703N1500O7515o8833n3255N9227J29o2686N1036P9403n3597n1246
$$ 12669 -40034 11466 78981 10148 -43107 16120 16249 -46437 4599 84002 30405 -20841
531b0841M2979k6526r0591L1001Q0554k3458j1043P5390l659q8119Q960N5292
$$ -20841 22138 -4388 -94979 -63978 16576 -6882 -17925 57465 53806 -34313 -25353 29939
543B9939l7091j2824Q1469O742q3684q261K4953n9881k4845Q5760L9189l9399
$$ 29939 -7152 -19976 61493 68235 -15449 -23710 1243 -58638 -83483 2277 41466 2067
555B067K1125L4761o8314n1945N3228K3286l2334L9039N2717n3149n7631K5831
$$ 2067 23192 57953 -10361 -62306 -9078 14208 -18126 20913 73630 20481 -37150 -11319
567a1319j853m2766M0549P1980k2344l6783K2016k1998o8055J5189O2986J161
$$ -11319 -13172 -55938 -15389 56591 34247 -2536 19480 -2518 -70573 -55384 7602 8763
579H763m25M9834l509o8011j2259K7696j9145m244N5568J3320n0967j7242M657
$$ 8763 8338 58172 54663 -13348 -25607 2089 -17056 -21300 34268 47588 -3379 -20621 -15964
592a5964l6595j3796N7106M1192o374J3499J3568m4318m1816J6434J4454o648
$$ -15964 -52559 -66355 -9249 31943 25569 39068 52636 8318 -33498 -17064 -2610 -9258
604i258K4208K7264k5852l8790l994m691j2746K7597M5622O368j2255k612k0991
$$ -9258 14950 42214 16362 -22428 -26422 -31113 -43859 -16262 29360 35728 23473 20861 -130
617a30l5508q72K7157J6198J2730J8713m829l1370j9827k018j945R860K4495J0070
$$ -130 -35638 -36510 -9353 6845 19575 38288 33459 2089 -17738 -19756 -21701 -11841 12654 22724
631B2724j1737j6304j6155j4004J200K2033K6613J9396P990q462k0594j9541j2488
$$ 22724 10987 -5317 -21472 -35476 -34276 -12243 14370 33766 41756 33294 12700 -6841 -19329
644a9329n61J3703J3181J517k863j0278j9282r187J2422J7050J4128J8435Q585
$$ -19329 -19890 -6187 6994 8511 5648 -4630 -23912 -33099 -20677 -3627 10501 28936 37521
657C7521j7589k2082p187p430n766J8367K1912l311p866P62j3211j9306Q188K0116
$$ 37521 19932 -2150 -9337 -16767 -22533 -4166 17746 14435 6569 7331 -5880 -25186 -16998 3118
671C118Q92J038J2891r612k6738q36J2627l121P703K8435M831k0517m353N80k2255
$$ 3118 4010 5048 17939 8327 -18411 -19247 -6620 -9741 -2038 26397 31228 10711 6358 6938 -15317
686a5317j0263K1868P036j3725P609J0369j9876r907K2700R635p459J5345J6181
$$ -15317 -25580 -3712 3324 -10401 -2792 7577 -12299 -22206 494 10129 2670 18015 34196
699C4196k1319k0499P309o290k0198J2455K2088r655p415J6743j532j9450R244
$$ 34196 12877 -7622 -313 -6603 -26801 -14346 7742 -1913 -9328 7415 5883 -13567 -4323
712d323K0438r710p160J6481m235k5627J923J3940j0833l299K2975N238j7673
$$ -4323 16115 6405 -755 15726 11491 -14136 -12213 1727 -9106 -12405 10570 15808 -1865
725a865K975J0119j6307j0873J6881L407j5300O277J3688j2372q083J7579N622
$$ -1865 1110 11229 -5078 -15951 930 4337 -10963 -4686 9002 -3370 -11453 6126 11748
738A1748j1731P101J2226j4228j3697Q323k367j6519N757J4740n802m182J4797
$$ 11748 17 7118 19344 5116 -8581 -258 -2625 -19144 -13387 1353 -4449 -8631 6166
751F166L595j1218M842J2089q586q310P704k149j4806Q63Q447n251k998J2253
$$ 6166 9761 -1457 3385 15474 6888 -1422 6282 4133 -10673 -9810 -1363 -6614 -9612 2641
765B641M876p483K348P335p243p231O001n37q896J481O667l306j750Q353M631
$$ 2641 7517 34 2382 9717 2474 -4757 1244 707 -8189 -6708 -41 -3347 -5097 3256 7887
780G887l945K222M755n389o681J158k050p327k48L757j135k0O261M284q72K505
$$ 7887 3942 6164 10919 5530 -1151 7 -2043 -9370 -9618 -5861 -6996 -7016 -755 3529 2657 5162
796E162M539k477l739M31j981m834j040J113j222l46K951K603j56J8J779j614
$$ 5162 9701 7224 3485 3916 1935 -2899 -3939 -2826 -4048 -4394 -1443 1160 1004 1022 2801 1187
812A187k442k80j306j678P9K126J288K078K828K877N74K4%k911m170k645l433
$$ 1187 -1255 -1535 -2841 -4519 -4440 -2314 -1026 1052 3880 6757 7331 7355 7355 4444 274 -2371 -5804
829e804l375j187Q23J591K648M334M174K953K537J958j046k678k399l410m387
$$ -5804 -9179 -10366 -9543 -7952 -5304 -970 3204 6157 8694 10652 9606 6928 4529 1119 -3268
844c268k361j214q14n1K749L034J043K427L132k40j833J233j096l805n63J587
$$ -3268 -5629 -6843 -7657 -7708 -4959 -1925 -882 1545 4677 4437 2604 3837 2741 -1064 -1627 -40
860d0j367j006L179K204k338K64L197l013m218K110o64m879N56M569o82j214O515
$$ -40 -1407 -2413 766 2970 632 896 4093 1080 -3138 -1028 -1692 -6571 -6015 -1446 -2128 -3342 3173
877C173M265l218Q64N270m913p067K367j191r035j109O073k188k707Q897O818
$$ 3173 7438 4220 5084 10354 5441 -1626 741 -450 -9485 -10594 -4521 -6709 -9416 -519 6299
892F299m202K507R030m165p996M099k6j1392k513O723m925o922R065O648o694
$$ 6299 2097 4604 13634 9469 1473 5572 5546 -5846 -8359 -1636 -6561 -13483 -4418 2230 -4464
907d464K721J2244l485q515P669K747j2386j530J0177n387q539R100O127j1691
$$ -4464 -1743 10501 7016 -1499 6170 8917 -3469 -4999 5178 -209 -8748 352 6479 -5212
921e212k24J2424n151r829R193M725j3190j103J2069m246q820J2412R860j0576
$$ -5212 -5436 6988 1837 -7992 1201 5926 -7264 -8367 3702 -544 -9364 3048 12908 2332
935B332n06J2213p633j4209P013M124j3959j456J3305m189j0896J0684R689r254
$$ 2332 1826 14039 6406 -7803 -790 3334 -10625 -12081 1224 -2965 -13861 -3177 6512 -2742
949b742L067J6733k992j3041N526J763j7296m219J2666k763q693J0769P900j2469
$$ -2742 325 17058 14066 1025 6551 8314 -8982 -13201 -535 -3298 -11991 -1222 6678 -5791
963e791j522J3895j873p409J1306O469j3904o374O950o543j0322J0927J1405p109
$$ -5791 -7313 6582 4709 -2700 8606 15075 1171 -5203 1747 -4796 -15118 -4191 7214 105
977A05n5J0060p491j2946N826O925n819K293J1183l607j2120K362L777o052K807
$$ 105 50 10110 2619 -10327 -4501 2424 -3395 -1102 10081 6474 -5646 -3284 493 -5559 -2752
992b752J3950M28q485j451l590j2445l093R887N871K096Q093L680q212n143K666
$$ -2752 11198 11626 3141 1690 -1900 -14345 -17438 -7551 -1680 416 8509 12189 3977 -1166 1500
1007A500P1P08O932K936p032q872p550o895j880P499J0960R117N550o12n895o133
$$ 1500 1571 2279 9211 12147 5115 -3757 -11307 -18202 -20082 -12583 -1623 7494 13044 12432 6537 404
1023D04l765O10O671O561P6l917n654j1907q440L850R273O340Q658P134q185j4009
$$ 404 -3361 -2751 3920 10481 10557 6640 986 -10921 -19361 -15511 -6238 102 8760 15894 7709 -6300
1039f300k600p2k306J0628J7324J326q785j513o408j6073l00J6613L384l300P979
$$ -6300 -8900 -8972 -11278 -650 16674 18000 9215 7702 1294 -14779 -15079 1534 4918 1618 9597
1054I597l461k2779p080J2133K429L642K3975J2567j6712r307K776j4923j3559
$$ 9597 6136 -16643 -23723 -11590 -9161 -5519 18456 31023 14311 5004 7780 -7143 -20702
1067b0702J8509J5181j2142j895Q482j8453k1080J5903J8350m297J2215K4800
$$ -20702 -2193 12988 846 -1049 7433 -11020 -32100 -16197 2153 -2144 10071 34871
1079C4871j3703k7933M141J987k0288Q211L1750l964j9619Q753l96l0074m00L2492
$$ 34871 21168 -6765 -2624 -637 -20925 -12714 19036 15072 -4547 4206 3810 -26264 -26664 5828
1093E828K592r999K1075O002l5739j1392K1071m970r725L0662J9171k8236j2209
$$ 5828 8420 -1579 19496 25498 -10241 -21633 -562 -5532 -15257 15405 34576 6340 -5869
1106e869J3650j8959k3796K6666K4266j7911m84K2185j8375l0505J9803K2140
$$ -5869 7781 -11178 -34974 -8308 15958 -1953 -2437 19748 1373 -29132 -9329 12811
1118A2811j5159P557L2942j4792l6545O851N949k8538L316L9036j378k2727J5764
$$ 12811 -2348 5209 38151 23359 -13186 -6335 -386 -28924 -25608 13428 12050 -10677 5087
1131E087Q673l3507l383L7366Q48j7505K3130J0566l9097j5012K3487q353j7616
$$ 5087 13760 -19747 -23130 14236 15084 -2421 20709 31275 -7822 -22834 653 -7700 -25316
1144b5316K9473K3268k7399j0485K1519j5112k6074K5559K5122j9971k589K5257
$$ -25316 4157 27425 26 -10459 11060 -4052 -30126 -4567 20555 584 -2005 23252
1156B3252j5517l1846J6576J9868j8865K109L1762r900l2777R028R751k6121p09
$$ 23252 7735 -24111 -7535 12333 -6532 -4423 27339 17439 -15338 -6310 3441 -22680 -23389
1169b3389L4541J17k0611J5529J1847k7690o922K9351l63j8268J6824J1747k9715
$$ -23389 11152 11269 -9342 6187 18034 -9656 -16578 12773 12410 -5858 10966 22713 -7002
1182g002j3074J9847m868j6990K1405K0488j8767p834J9465q713k2159J5955J7603
$$ -7002 -20076 -229 -5097 -22087 -682 19806 1039 -6795 12670 3957 -18202 -2247 15356
1195A5356j6179m866J9365q002k3454J0732J5456j3975r09K3275m260k1485O539
$$ 15356 -823 -5689 13676 5674 -17780 -7048 8408 -5567 -6476 16799 12539 -8946 -2407
1208b407Q610j7876l988K1361R68j4570R863J0638j6340n353J7722R1j3534Q790
$$ -2407 6203 -11673 -15661 5700 6668 -7902 1961 12599 -3741 -9094 8628 8719 -4815 3975
1222C975Q562j6321q859J1781j691j1141J0698J3363q959m560J1982k726j2763
$$ 3975 12537 -3784 -12643 -862 -2553 -13694 -2996 10367 1408 -3152 8830 6104 -6659
1235f659O236R015q700m850R819k486j1931M303Q985o487j279J0549j37r436K112
$$ -6659 -423 8592 -108 -4958 4861 2375 -9556 -5253 3732 -2755 -4034 6515 6378 -3058 -946
1250i46N265q019l173Q484J686o863M089O134n699l373O900k55p002K164L307
$$ -946 4319 -3700 -6873 1611 3297 -3566 523 6657 958 -2415 4485 4230 -2772 -608 2699
1265B699o332l921M318R55l714M297O218j302j181N024R6n103J01J548m352l907
$$ 2699 -3633 -7554 -3236 -2281 -5995 -1698 4520 3218 2037 7061 7157 2054 2155 3703 -649 -4556
1281d556J753r83l500J263L960M7P65L996J741j964Q93J346k527j530L38j92k216
$$ -4556 -2803 -3786 -7286 -6023 -2063 -2016 -1251 2745 4486 2522 3415 4761 2234 704 1042 850 -1366
1298a366o7J082q30j089J823J49j673M70J00n60o52J421J279J57J195K096N72
$$ -1366 -1433 -351 -1181 -2270 -447 -298 -1971 -1501 -1401 -1961 -2613 -1192 87 244 1439 3535 4107
1315D107P9Q79j143k013j799j540k208j633p80N76K10J409K589K055K060K044
$$ 4107 4186 5065 3922 1909 110 -1430 -3638 -5271 -6051 -5475 -5265 -3856 -1267 788 2848 4892
1331D892Q31J63m56j285j629k537j362j668j122l36P66N04J019J281J375K23P00
$$ 4892 5723 5886 5430 4145 2516 -21 -1383 -3051 -4173 -4509 -3743 -3239 -2220 -939 436 659 1359
1348A359M54k25l30J24j60n98K78J96K4l96M81o86q04j084q18o01r67N53O24L63
$$ 1359 1813 1588 1258 1382 1222 624 902 1098 1122 726 1207 521 -283 -1367 -2185 -2786 -3753 -3200 -2576 -2213
1368b213J821K196P50J025J139N2j110m49j641k111k040j213q19r43P61J574J434
$$ -2213 -392 1804 2554 3579 4718 4770 3660 3211 1570 -541 -2581 -3794 -4613 -5556 -4795 -3221 -1787
1385a787J427K365J355M17P30m70r57j303j135q80j099p10N5l03J00O71M76L56
$$ -1787 -360 2005 3360 3777 4507 4037 3080 1777 642 -238 -1337 -2047 -1992 -2295 -2195 -1524 -1048 -692
1403f92N92k26K18J02j84L57R89N97J49R16P89p80j274m43j099k410j039j78j663
$$ -692 -100 -326 -108 -6 -190 167 1156 1753 1902 2818 3607 2827 1553 1110 11 -2399 -3438 -3616 -5279
1422e279k42J831J477L78K907L218M8J63K882r52l557n91l07m468k745J159p34
$$ -5279 -5521 -3690 -2213 -1835 1072 4290 4338 4501 7383 6431 2874 2283 1976 -2492 -5237 -4078 -4812
1439d812k592K490L666r24j03N235R04l246K864L295l614k421L452j408n719J502
$$ -4812 -7404 -4914 -1248 -2172 -2275 2960 3864 618 3482 6777 3163 742 4194 2786 -2933 -1431
1455a431L267m027k521N147o80o459K164M714l927j414Q524K202n487L344O032
$$ -1431 1836 -2191 -4712 435 -245 -6704 -4540 174 -3753 -5167 3357 5559 72 3416 9448
1470I448o229m083P518o93r279J893M101r504n889Q393J355o780P383J1005o093
$$ 9448 3219 -864 6654 5961 -3318 -1425 2676 -6828 -12717 -4324 -2969 -9749 -2366 8639 2546
1485B546l902J0150J56j1353M532R245r664p008Q808k681j4072L955J1764p110
$$ 2546 -1356 8794 8950 -2403 2129 11374 1710 -5298 3510 829 -13243 -9288 2476 -4634
1499d634l425J4938J416j3978L554J0464r918n517J5845K662j4877L083R641j3019
$$ -4634 -8059 6879 8295 -5683 -2129 8335 -1583 -7100 8745 11407 -3470 -387 9254 -3765
1513c765r517J5593L680j4321N862J2795j3939j1519J5514L600j2892R646J8281
$$ -3765 -13282 2311 5991 -8330 -2468 10327 -3612 -15131 383 3983 -8909 737 19018
1526A9018j2179j1967J3530o81k0041N663J7619j1458j0789J5625j94k2097N598
$$ 19018 6839 -5128 8402 7721 -12320 -6657 10962 -496 -11285 4340 4146 -17951 -12353
1539a2353K0052q436n993K1948L389k3612K059J3891j5534j0298K1326O328k0959
$$ -12353 7699 -737 -6730 15218 18607 -5005 -2946 10945 -4589 -14887 6439 12767 -8192
1552h192L098J4855j7547j3274K2328Q756j6847Q381J8095j7129j7987J7023M772
$$ -8192 -5094 9761 -7786 -21060 1268 10024 -6823 1558 19653 2524 -15463 1560 6332
1565F332j8478R598K3134j3416j6907J4532O00k4062O199K3898r355j1985J8817
$$ 6332 -12146 -2548 20586 7170 -9737 4795 5395 -18667 -12468 11430 2075 -9910 8907
1578H907J515k6488L338K2189q405q802K3975N633k6781j412J4423j5238j3027
$$ 8907 10422 -16066 -12728 9461 1056 -7746 16229 21862 -4919 -6331 8092 -7146 -20173
1591b0173K3554R953k0914L058J6640j7283j5979K1613J0965j6008P322J9421
$$ -20173 3381 13334 -7580 -4522 12118 -5165 -21144 469 11434 -4574 2748 22169
1603B2169j6942j9807J3696N127j8543Q279K4375j0691j6608J3205J068k2839
$$ 22169 5227 -14580 -884 4243 -14300 -6021 18354 7663 -8945 4260 5328 -17511
1615a7511M425K3252n962j1364J6468K723k4277n65J9445o023q343K0488O801
$$ -17511 -13086 10166 4204 -7160 9308 12031 -12246 -12811 6634 611 -7732 12756 19557
1628A9557k1995l946J2288j2492j2067J9182J0856j5173M28J3977j2929j4367
$$ 19557 -2438 -6384 5904 -6588 -18655 527 11383 -3790 -3362 10615 -2314 -16681
1640a6681J5540J0397j1476M705J5640j1516j7867Q779M161j3879M731J9344n488
$$ -16681 -1141 9256 -2220 2485 18125 6609 -11258 -2479 1682 -12197 -7466 11878 6390
1653F390j2403Q726J986j6410J256J7536k607p786J0845L122j7401k694J2394
$$ 6390 -6013 2713 4699 -11711 -10455 7081 4474 -3312 7533 10655 -6746 -9440 2954
1666B954l459o142J3491O123j4050l845P353p343q648J1978Q918q290L41Q754
$$ 2954 -505 -6647 6844 12967 -1083 -4928 2425 -4918 -13566 -1588 7330 -960 -619 8135
1680H135p080j0187Q406O847o263J489R398o651j1285L110K769p697K449J1790
$$ 8135 1055 -9132 -726 6121 -142 1347 10745 4094 -7191 -4081 -1312 -9009 -6560 5230
1694E230p49o457M794J643q301j26Q696o07m766M638J302r048k920N424j230k458
$$ 5230 4481 -1976 2818 4461 -3840 -3966 4730 4123 -643 3995 5297 -3751 -6671 -1247 -2477 -4935
1710d935O769M041n644j838L093k628m084M877M082k929k33L586k989m728K392
$$ -4935 1834 5875 231 -1607 1486 -1142 -5226 -349 3733 804 571 4157 1168 -3560 -1168
1725a168L054k485Q32L051k297m399M28J020j814P42M895R45j885J873K51k839
$$ -1168 1886 -599 233 3284 987 -3412 -2984 -1964 -3778 -3036 1859 2804 919 2792 3043 204
1741B04p56K287l31j812O89J06k949r71J350L87L11K566J462p73q02J73n31j238
$$ 204 -552 1735 1404 -408 281 387 -2562 -3533 -2183 -1796 -1485 1081 2543 1770 968 1141 610 -628
1759f28L32R26p62k40M55l67l57K32P14N6K26M27k07j266n95p0m17K73R13P53
$$ -628 -296 630 -132 -372 83 -284 -641 -409 305 361 587 1014 807 -459 -1054 -1124 -1541 -1268 -355 398
1779C98K20M61j24L4j01j57j76k33l85n48k08l90N3L29Q23M70R8L92m67j12j93
$$ 398 618 1079 955 989 888 731 555 322 -63 -611 -819 -1209 -1156 -827 -4 466 564 956 489 377 184
1800A84j71j54n21L56l4j64L29P13lJ25L04N6n88j13m33k08o79j7L3jL01P06M91
$$ 184 13 -141 -662 -306 -340 -504 -175 538 535 660 964 1020 432 319 -114 -322 -1001 -1018 -985 -986 -685 21 512
1823E12L66Q12k41m49j85l94p11o63l10J13o9J87Q22L39J04O62L82q13J94o2p34
$$ 512 878 1690 1449 1000 815 421 -290 -953 -1263 -1150 -1219 -1032 -210 129 233 895 1277 464 658 596 -138
1844a38m83l38q4j08K06P64K0N58M81M33p08N2L1n61l53k1K45q12J85N64j64l9
$$ -138 -621 -959 -1043 -1151 -945 -181 -161 397 878 1311 603 655 686 125 -228 -249 -4 -816 -631 -67 -231 -270
1866b70P09L11r53k07M35k57n63N34O95n26J33R06M43p78O23J25j268j35J13q30
$$ -270 439 750 -203 -410 25 -232 -795 -261 434 -92 41 947 1390 612 1235 1360 92 -43 70 -760
1886g60j266K27P28r21L71K394L57o10J555Q02j731n66J344j194k128P92P44k334
$$ -760 -2026 -1799 -1071 -1992 -1621 773 1130 520 2075 2877 1146 580 1924 730 -1398 -606 138 -2196
1904b196n01K561n31j440K448J955k074m40K515j011k734J727J601k868q22L606
$$ -2196 -2697 -136 -667 -2107 341 2296 222 -218 2297 1286 -1448 279 1880 -988 -1810 1796
1920A796j483k609K066K266l564l62L720j350l230K434K456l866k59N081j006
$$ 1796 313 -2296 -230 2036 -1528 -1890 1830 480 -2750 -316 2140 -1726 -1985 3096 2090
1935B090l783L173K332m774j374M464j694m648L013L349m800o14N903q66m468
$$ 2090 -1693 1480 3812 -962 -2336 2128 434 -4214 -1201 2148 -2652 -3266 2637 1771 -2697
1950b697M159L912n666j337N885k219o453L290M089o489j604P074n47n915M871
$$ -2697 1462 5374 -292 -1629 4256 2037 -4416 -1126 2963 -3526 -5130 1944 1397 -4518 353
1965C53N138o233j639P416k138o512M104M529p315k279P706j645p233N022N567
$$ 353 5491 -742 -2381 5035 2897 -3615 489 5018 -2297 -4576 3130 1485 -5748 -726 4841
1980D841p367k018Q567j578p985M800O096p172k285R539j315q286M803N392q252
$$ 4841 -2526 -4544 4023 2445 -5540 -740 5356 -1816 -4101 5438 4123 -4163 640 6032 -2220
1995b220l122Q964q79r354N086N896q457k680J0157l97p810O365P394q731m183
$$ -2220 -5342 3622 2743 -6611 -1525 4371 -4086 -6766 3391 2994 -4816 1549 8943 212 -3971
2010c971Q683j425r550N150P278q402l943R315j542r774N696Q422o832l085J0320
$$ -3971 4712 3287 -6263 -1113 6165 -2237 -6180 3135 1593 -8181 -2485 5937 -895 -3980 6340
2025F340j276j0717L660P442p677l288J1511k05j0275L594O259r226l714J0845
$$ 6340 5064 -5653 -1993 5449 -2228 -5516 5995 5790 -4485 -891 5368 -3858 -7572 3273
2039C273J049r319M753O519r084m741R754J017p723O185Q112q633n377P067j202
$$ 3273 4322 -4997 -244 6275 -2809 -7550 2204 3221 -4502 1683 9795 1162 -4215 2852 1650
2054A650r422N276Q880o524m407Q197j693r828M017Q651m668j999Q751n71j0963
$$ 1650 -7772 -2496 6384 -140 -4547 3650 1957 -7871 -3854 4797 129 -1870 6881 6310 -4653
2069d653J441N950o214k637J0484J305q461K193M278p301m104Q956K950o065L260
$$ -4653 -3212 2738 -3476 -6113 4371 5676 -2785 -592 3686 -3615 -7719 1237 4187 -1878 1382
2084A382N363q229n707O412J892n078N096P411n850n560L631j354o652L922P851
$$ 1382 6745 -1484 -7191 -779 1113 -3965 1131 8542 2692 -2868 763 -591 -7243 -3321 4530
2099D530k791k473M331j522p714J581O264j795j38O123m26q394r79K220l522m22
$$ 4530 1739 -734 3597 2075 -5639 -4058 2206 411 273 6396 5970 -2424 -3403 -1183 -4705 -5127
2115e127P315K543m286K80J418m807k583N212L183j461J646J895n394m565J765
$$ -5127 2188 4731 445 725 2143 -2664 -5247 -35 3148 1687 3333 5228 -166 -4731 -2966
2130b966J021p84L541M198j797l488k20j667k696K078M514J011p4N73k006m150
$$ -2966 -1945 -2729 812 5010 3213 -275 -495 -2162 -4858 -2780 1734 2745 2671 3244 1238 -2912
2146b912m04K231J325J655K056l06l513k391j323l54J310L074K177L14m31k347
$$ -2912 -3316 -1085 240 1895 3951 3645 132 -2259 -3582 -3936 -2626 448 2625 2939 2508 161
2162A61k056k87M10K334J889J017j295j950j732k375K07K492K497J153N63o57
$$ 161 -1895 -2182 -1772 562 2451 3468 2173 223 -1509 -3884 -3677 -1185 1312 2465 3028 2371
2178B371k944k367M59J200L84K563J657j618k320l29q46j435K960L338o04p67
$$ 2371 -573 -2940 -2481 -1281 -897 1666 3323 1705 -615 -944 -1790 -3225 -265 3073 2469 1702
2194A702O67k439l690P76K486pO44K711o73l668p9J479j779K31M103J049l159
$$ 1702 2369 -70 -3760 -2984 -498 -505 139 2850 2177 -1491 -1570 -91 -1870 -1639 2464 3513 354
2211C54Q8L81k925j454L929J192j525J507J320l569k349K176K91j694K156K797
$$ 354 442 823 -2102 -3556 373 1565 40 1547 2867 -702 -3051 -875 -584 -2278 -122 2675
2227B675k383j688K082m78k414K102L370j601j416J790j089l906M87K461j033
$$ 2675 292 -1396 686 208 -2206 -104 3266 1665 249 2039 950 -2956 -2469 -8 -1041
2242a041m65K668M05l106O93K109j730o62K998O01k575L10J583k671j251K285
$$ -1041 -1506 1162 1567 -1539 -846 1263 -467 -1129 1869 2470 -105 205 1788 -883 -2134 151
2258A51R26k177R84J924k094j538J766K19j724J015K316j163j595K187k55j870
$$ 151 1077 -1100 -116 1808 -286 -1824 -58 161 -1563 -548 1768 605 -990 1197 942 -928
2274i28J027J995j547j454J648j68k350J30J607o99o96J980L86j493O13J105r03
$$ -928 99 2094 547 -907 741 573 -1777 -1647 -40 -739 -1435 545 931 -562 51 1156 253
2291B53m92J554j21j593M6O81r32j126J314O06q67M89J232n08q37P69O77j078
$$ 253 -239 1315 1194 -399 -353 328 -604 -1730 -416 190 -677 -188 1044 536 -301 468 1145 67
2309F7l24J088j025k95M78K48j189M97P35k88p33N79L71o62j28Q35m2p02Q41M25
$$ 67 -257 831 -194 -489 -11 237 -952 -455 280 -8 -741 -162 209 -453 -581 254 212 -490 351 776
2329G76o43N01L73k58p64k69N05j102K11k12M4o12J024M02R2L95O14p0k17K67
$$ 776 133 634 1007 749 -15 -284 221 -881 -670 -882 -838 -1450 -426 -24 68 463 1077 1007 790 1057
2349A057j8q64Nl11l07o46L51K29o23N22N23o5j38M31Q0j73p3O98l46j03L77l4
$$ 1057 1039 175 180 -131 -438 -1084 -733 -504 -1127 -605 -82 -147 -285 146 226 53 -20 678 332 229 606 572
2371E72o79Q1O55n86o38L36L80j118q2Q32j56m62R69L41m08L27Q58M3j062O20
$$ 572 -107 -26 629 43 -595 -259 121 -997 -1079 -247 -403 -865 104 445 37 364 1222 1265 203 823
2391H23J98j101m68P47o45r41R08L11p15R4J390j48j044J067P71j561K20J610
$$ 823 1021 -80 -548 199 -446 -1387 -479 -168 -883 -789 601 453 -591 476 1247 -314 -94 1516
2409A516q43j771J248P20j674K67J676n57j541J056Q00k028n25K420m97j847J914
$$ 1516 673 -1098 150 870 -804 -537 1139 582 -959 97 897 -1131 -1656 764 267 -1580 334
2426C34R61j990J20J964q85j510J861R95k518k54J942j247j637J387J373j989
$$ 334 1295 -695 -575 1389 504 -1006 855 1850 -668 -922 1020 -227 -1864 -477 896 -1093
2442a093L90K376j025j823J495J313k434KK606j308j948J604R26k486K87K560
$$ -1093 -703 1673 648 -1175 320 1633 -801 -799 1807 499 -1449 155 1081 -1405 -1118 1442
2458A442p51j963J748R44k841m19K683p14j953K527R70k197l93K613p19k099J778
$$ 1442 691 -1272 476 1420 -1421 -1840 843 129 -1824 703 1673 -524 -917 1696 977 -1122 656
2475F56J618k985o80K283j087k134J824J593k038O5K405l16k320J399J660k250
$$ 656 2274 -711 -1391 892 -195 -2329 -505 1088 -950 -885 1520 1204 -1116 283 1943 -307
2491c07q30K661p97k355J567R69k214j99K392o11j811J861J043j919j41K132j058
$$ -307 -1137 1524 727 -1628 -61 908 -1306 -1505 887 276 -1535 326 1369 -550 -691 1441 383
2508C83j337J204J256j710k40J635o83j495O02N55j691K68J280pr27J042N89j104
$$ 383 -954 250 1506 -204 -444 1191 508 -987 -385 170 -1521 -1253 27 20 -907 135 724 -380
2526c80r0J624j47l64N02J71j082r87J39n16k35O65L00l4M1JJ82l57O03O32O16
$$ -380 -470 1154 1007 643 1145 1316 234 -753 -614 -1130 -1365 -700 -400 -434 -393 -392 -210 -567 36 668 1284
2547A284N37m79r72l7r05q84Q64R12l49R7N9o99j485R20J091n00R41J686o52j592
$$ 1284 1821 1342 370 333 -572 -1456 -592 320 -29 68 127 -572 -2057 -1137 -46 -546 395 2081 1429 -163
2567a63L54N00j571P31K429m32k021P21o8l366l57K615Q8o51K527J297l408o68
$$ -163 191 691 -880 -149 2280 1848 -173 548 480 -2886 -3243 -628 -540 -1191 1336 2633 -775 -1443
2585a443K314q34j350L213K175l594j518K120k344l188L306K965k470P9L519k537
$$ -1443 871 37 -1313 1900 4075 481 -1037 1083 -1261 -4449 -1143 1822 -648 -569 2950 413
2601D13m466K690K807k824R91M939j493m760J627J114m279O31N532p47l768K769
$$ 413 -4053 -1363 1444 -1380 -389 4550 3057 -1703 -76 1038 -3241 -2610 2922 2175 -1593 1176
2617A176P94n840o10N604p18k356M633K289n873j756M449k115l505N330L738n122
$$ 1176 1970 -3870 -4480 1124 406 -1950 2683 4972 -901 -2657 1792 -323 -3828 1502 5240 118
2633A18j721L969l745n228M695M807l753L95N416l038o097L032L311m102M38O744
$$ 118 -1603 2366 -1379 -6607 -1912 2895 -858 -463 4953 1915 -4182 -1150 2161 -1941 -1503 5241
2649E241j942o234K361K004n454m39P598o01m157L235K186o639j952O481m58l653
$$ 5241 3299 -2935 -574 1430 -4024 -4463 3135 2534 -1623 1612 3798 -2841 -4793 1688 1230 -2423
2665b423M928L373o620k371M571j702m686N367M426n244j860M934k927n533M003
$$ -2423 2505 5878 -742 -3113 1458 -244 -4930 437 4863 -381 -2241 2693 -234 -5767 -1764
2680a764M962l613o8N445k007o334K258L677m841m8N969r66n802K329K352n398
$$ -1764 3198 -415 -483 4962 2955 -3379 -1121 2556 -2285 -2333 3636 2670 -3132 -803 1549 -3849
2696c849n42O663J16l842K808K783n707j935N191l46l701L405L555n086k528L846
$$ -3849 -4391 2272 2388 -1454 1354 4137 -1570 -3505 1686 1340 -2361 1044 4599 -487 -3015 831
2712H31r59m075L561M075l507j829M037j460m646K425M392k516p97M364j279m868
$$ 831 -128 -4203 -642 3433 -74 -1903 2134 674 -3972 -1547 2845 329 -468 3896 2617 -2251
2728b251J253K728l529o38M386l56m061J272K374l248r96M702O0k403J626K353
$$ -2251 -998 1730 -1799 -2437 1949 1593 -2468 -1196 1178 -2070 -3066 1636 1696 -707 919 3272
2744C272l539j851L300l42k268J499K392k722j407J874Ok568J677K365j508j250
$$ 3272 -267 -2118 1182 840 -1428 71 2463 -259 -1666 208 214 -2354 -677 1688 180 -1070
2760a070K109l35k327R31K126j270o74K238k61k461L01J337j591k21J741M9j567
$$ -1070 1039 704 -1623 -692 1434 164 -510 1728 1467 -994 -693 644 -947 -1168 573 622 -945
2777i45M97J053j062p63J870O52j530M44J421j491r92J381j71j379P29J195j241
$$ -945 -448 605 -457 -1220 650 1302 -228 216 1637 146 -846 535 364 -1015 -286 909 -332
2794c32p81J312J65j119P02J057n60r13Q12L1r63K05J021m63p02O22J35o61R2
$$ -332 -1113 199 364 -755 -53 1004 444 -469 343 374 -589 -384 637 174 -528 94 229 -432 -340
2813c40P40l88m18M15M80j097M28N00j5j52K43K7k25j35K25l84k87nr5r8k11N35
$$ -340 400 12 -406 9 489 -608 -180 320 305 153 396 423 198 63 288 -96 -383 -388 -483 -581 -792 -257
2835b57J98k07N64L00k11J11K09m48n4k97j87n6j69J2L03j09k88O24j78L76j2
$$ -257 -59 -266 298 598 387 498 707 259 205 -92 -279 -335 -504 -492 -189 -298 -586 38 -140 236 224
2856B24J79l25J30M67l84j81M03j40l65J90k07n00J86J26j32q6L29k00J87K00
$$ 224 403 78 208 675 291 110 513 373 8 198 -9 -509 -323 -197 -329 -415 -86 -286 -99 101
2876A01N7K41j05J43L79o58L14j42j97m56K61l59p6L10j23j12r8L13N49M6k52
$$ 101 158 399 294 437 816 158 472 330 133 -323 -62 -421 -497 -187 -310 -422 -520 -207 342 388 136
2897A36M46j00m0k78K9l31J00m81O78m65J71Q1j23L3K98j57M51j62j4k0j99J27
$$ 136 582 482 442 164 193 -138 -38 -519 159 -306 -135 -54 -177 -144 154 -3 448 286 272 252 53 180
2919A80j20l46K19J32k15M23n87J52j86K6pO37n9K97l68M95n61P1K1N08m61K7
$$ 180 60 -286 -67 65 -150 273 -314 -162 -348 -322 -329 308 249 546 178 673 112 183 204 712 251 278
2941B78M5l86p28R2K4k45P21O10q4m49O88j59l94K06N74m83j85L20k22j359L57
$$ 278 323 -63 -791 -699 -675 -920 -199 411 327 -122 566 407 13 219 793 310 125 445 223 -1136 -779
2962g79N35o94L0J424J29r89k64J139p86m17J473J89j011N56P43j398j224J244
$$ -779 -244 -938 -908 516 645 -344 -608 531 -255 -672 801 990 -21 535 1278 -120 -1344 -100
2980a00O44j639Q47J114j469j103J527L37j541J336J995j325j327K048K39k349
$$ -100 544 -1095 -248 866 -603 -1706 -179 158 -1383 -47 1948 623 -704 1344 1583 -766
2996g66O86J625j518j407J870K58k949L74K420j417r71K992O17k874N69K556j768
$$ -766 -80 1545 27 -1380 490 748 -2201 -1827 593 -824 -1795 1197 1814 -1060 -491 2065 297
3013B97j903L305L52l076O15K764k773k057K772J042l628J185L152k079k106L259
$$ 297 -1606 1699 2051 -1025 -410 2354 -419 -2476 296 1338 -2290 -1105 2047 -32 -2138 1121
3029A121P78l777J247L595k482k409L434O99m146P48L645k690l056M024J124m580
$$ 1121 1899 -1878 -631 2964 482 -1927 1507 2206 -1940 -1192 2453 -237 -3293 731 1855 -2725
3045b725J169M243k698k678L941J163m424Q81M844l315l350M121J283n218R83
$$ -2725 -1556 2687 -11 -2689 1252 2415 -2009 -1128 3716 401 -2949 1172 2455 -2763 -1780
3060a780M462k820l289M556J658n516J199M917l115l548N224J442n293J08N008
$$ -1780 2682 -138 -3427 1129 2787 -2729 -1530 3387 272 -3276 1948 3390 -1903 -1795 3213
3075C213l394l763N073J743n615R01M951l321m222N388J676n198J672N233l182
$$ 3213 -181 -3944 1129 2872 -2743 -1842 3109 -212 -4434 954 2630 -2568 -896 4337 1155
3090A155m376M713J432n518Q21N667l103m357M361J519n856L73N780j930l903
$$ 1155 -3221 1492 2924 -2594 -1773 3894 791 -3566 795 2314 -3542 -3169 2611 681 -3222
3105c222N182K157o425K31N291k829l520N156J919n838o02N036l393m152M901
$$ -3222 1960 4117 -2308 -2077 3214 385 -3135 2021 3940 -1898 -2500 2536 -857 -5009 -108
3120a08L421n332N27N183l305m578M474K742m804Q73N802l039m854L137J922n262
$$ -108 3313 -2019 -1492 3691 386 -4192 282 3024 -1780 -907 4895 1856 -2998 139 2061 -3201
3136c201N97N919k151m051L445J478n574K91N858j339l287M227K338n973j033
$$ -3201 -2604 3315 1164 -2887 558 2036 -3538 -3247 2611 1272 -2015 2212 4550 -1423 -2456
3151b456M623j930l542M584K240m755q83L962k513l775M165L325l903J08M095
$$ -2456 2167 237 -3305 1279 3519 -1236 -2119 1843 -670 -4445 -280 3045 -858 -750 3345
3166C345k403m355K970K434l341L86M585j948m148K186J374l456J00M781r23l418
$$ 3345 942 -3413 -443 1991 -1350 -964 3621 1673 -2475 -289 1085 -2371 -2271 2510 1587 -1831
3182a831K520R88m154M6L439rk230L080J402l822j194K704j044k556K790K435
$$ -1831 689 1677 -2477 -2431 1008 999 -1231 1849 3251 -571 -1765 939 -105 -2661 129 2564
3198B564k844q81K346j696k334K397K283j907j9K538j527k936J309J668j733k44
$$ 2564 -280 -1161 1185 -511 -2845 -448 1835 -72 -91 2447 920 -2016 -707 961 -772 -1016
3214a016K857m16k601R50P56j973l79K951k19j542R64P50j903o74K190J80j230
$$ -1016 1841 1425 -1176 -226 530 -1443 -1822 1129 910 -632 332 1082 -821 -1495 695 875 -355
3231c55R41J002j965o20J198m46j008J390R97r95o83Q80o25q32J153R73o17j34
$$ -355 586 1588 -377 -997 201 -245 -1253 137 1134 139 -544 336 -289 -1121 32 1005 388 254
3249B54R74o25j296L31J81k00J7Q19j64r31K92K81m49j03J060J09k68L00j83m42
$$ 254 1228 603 -693 -362 -181 -381 -364 455 291 -640 -348 -67 -516 -619 441 550 282 582 399 -43
3269d3n33J79Q26p33M33J02n01m32L52k75O0M48j5L56Q3k35Mk90K93K86J5K5J20
$$ -43 -576 -397 429 -304 129 231 -270 -702 -350 -625 -565 -117 -132 224 307 72 76 -214 79 365 380 405 525
3292E25k84m19j10l75K88lJ3J96J1M2l17O58q5L68L7L6m33J8J54l57k47j32L22
$$ 525 241 -178 -288 -663 -375 -378 -365 -169 -158 -116 -433 225 140 508 545 581 148 166 320 -37 -284 -416 -94
3315i4n9J38l70R2L3M1J4L56k42L87L1j49M7J0n6j68k4Q4k75q6J20k3l28L28L85
$$ -94 -153 -15 -385 -293 -260 -219 -205 151 -91 296 327 178 225 235 179 11 -13 71 -204 -290 -170 -193 -521 -193 192
3340A92n42J62K62L03j56R3L4J58l97K58k30j98J17J26n11J33P7J62k72J12J31
$$ 192 -350 -188 74 377 221 314 348 506 109 367 137 -61 56 182 -329 -196 -119 43 -229 -117 14
3361A4r0K4m5K90k51K20R9k21k6rL12k60l2L7l29j3L43j15j77K30K56j42l30L57
$$ 14 -76 -52 -97 193 -58 162 261 40 14 5 317 57 25 62 -267 -280 63 -52 -229 1 257 115 -215 142
3385A42J42k99K32M0m85J53rr9j09J20K36l32J11M84J02q66K77M85p7j64R4J26
$$ 142 284 -15 217 257 -228 -75 -84 -183 -292 -172 64 -268 -157 327 429 -437 -160 325 248 84 178 304
3407C04m60q8L59k96l90O43Q5o07K69K93n03j66J095P4o84K27M63q02k55Q91j20
$$ 304 -156 -244 115 -181 -571 72 157 -450 -181 112 -391 -557 538 612 -72 155 618 -184 -439 452 332
3428C32q47K95R19o21q11J134m24j067J043N45n55l11P93M6j231O88R52o91j009
$$ 332 -515 -220 699 78 -733 401 -23 -1090 -47 498 -57 -368 425 471 -760 -72 880 189 -820
3447h20J364N9j742Q21J011j286l12J528N7j578O84J169j303o35J728R5j451J148
$$ -820 544 603 -1139 -318 693 -593 -905 623 680 -898 -214 955 -348 -983 745 840 -611 537
3465E37R30j929p55J898l43j418R33J578j509j205J860k21j946J067J612j149
$$ 537 1467 -462 -1217 681 338 -1080 -147 1431 -78 -1283 577 356 -1590 -523 1089 -60
3481f0o53J925j90k640J223J851j893n17K177M4k820J107J216j592r09K961j96
$$ -60 -713 1212 1022 -1618 -395 1456 -437 -954 1223 1267 -1553 -446 770 -822 -1731 1230 1034
3498A034k125R21J932k334j271K901K46k472J423J750k524j116K451j48k180J102
$$ 1034 -1091 -170 1762 -572 -1843 1058 1304 -1168 255 2005 -519 -1635 816 668 -1512 -410
3514d10K357k201j283K641j41k995J249K511j868j252K678K52l458J050K567k144
$$ -410 1947 -254 -1537 1104 963 -2032 -783 1728 -140 -1392 1286 1538 -1920 -870 1697 -447
3530d47j330L396j29l066O41K496j990j854L300O90k795P77K226k193j684L031
$$ -447 -1777 1619 1490 -1576 -935 1561 -429 -2283 1017 1707 -1088 -311 1915 -278 -1962 1069
3546A069J47l002J140K607k238j573K792K2k822J563K515k091j918L035L72l181
$$ 1069 1216 -1786 -646 1961 -277 -1850 942 964 -1858 -295 2220 129 -1789 1246 1618 -1563
3562a563P61K642j862j706K627M98k971P65K451j890j699K960M71k931Q05K792
$$ -1563 -802 1840 -22 -1728 899 1397 -1574 -809 1642 -248 -1947 1013 1484 -1447 -642 2150
3578B150k097j884K776L18k358M45K421j715j686K110Q20k782Q82J821j491j188
$$ 2150 53 -1831 945 1263 -1095 -650 1771 56 -1630 480 1300 -1482 -600 1221 -270 -1458
3594a458K253M88k613O25K331j697j244K271M42k362M26J756j327j673K124L98
$$ -1458 795 1283 -1330 -705 1626 -71 -1315 956 1398 -964 -538 1218 -109 -1782 342 740
3610G40j859O08J909j280j383J618N83j402K61J950j355j080J383J81j899J37
$$ 740 -1119 -511 1398 118 -1265 353 936 -466 -205 1745 390 -690 693 874 -1025 -888
3626h88J866p25j175J186L76j396k00J380j37q66J151N76j654J59Q77p40r83J655
$$ -888 978 253 -922 264 640 -756 -956 424 287 -579 572 1148 -506 -347 530 -210 -1193 462
3644D62M06j110J44N12o33j069J258qr8K99O60n99n70L15J92o89O20N14k09j3
$$ 462 868 -242 -98 414 -219 -1288 -30 -38 -136 163 823 224 -346 -31 161 -528 92 606 397 384
3664C84p5n09m72k7R70o7L46J39l05n65j30pM0L01N04q3k15O4p78k55L46L24J9
$$ 384 309 -200 -672 -699 271 204 550 689 384 -181 -311 -318 -278 23 527 444 229 293 -485 -740 -394 -70 -51
3687e1O87q5n63j73m6j52J65O56J98k96q6j23k76q56P45K65m5L00r5Pm68k82M17
$$ -51 636 551 -12 -185 -231 -383 -218 438 636 340 254 131 -145 -1001 -256 9 -36 264 169 176 -292 -574 -157
3710a57k23K83J024k45n74R4j7r44K32P83K6k52K87j09q63m2R51l06k93J243j83
$$ -157 -380 -97 927 682 108 202 185 -759 -527 256 282 30 317 208 -655 -697 254 -52 -345 898 715
3731G15o98KJ06k60o03Q29P23p64lK86p69m08O73L67n47J77Q63n63r14R13J55
$$ 715 17 19 125 -135 -738 91 814 50 47 333 -436 -844 -171 196 -351 -174 689 126 -788 125 280
3752B80p16M99Q10k71q06L89K33r67l1P16j13n15N37M14j006J71L32r3pM10L64
$$ 280 -436 63 873 602 -204 185 418 -549 -580 136 23 -492 45 459 -547 -376 -44 -137 -144 266 630
3773F30q45J23M61n65n7K26K81j94N2L83p16m53O96K29p01L27P62o72m37O62L13
$$ 630 -215 -92 369 -196 -253 -27 254 60 112 495 -221 -674 22 251 -450 -123 639 -33 -470 192 505
3794E05r65K66O86j12m59J51J55m94k56N56j17j71L78J41o9l14O79n01k27M91
$$ 505 -460 -194 492 380 -79 72 227 -267 -523 33 -84 -255 123 264 195 -119 560 59 -168 323
3814C23J78m88l19L63j90j34j72P04o44LP40l58l91N54J98l25q1K42m9l75L48
$$ 323 501 13 -306 57 -133 -267 -439 265 -379 -376 364 6 -385 169 367 42 -39 203 154 -221 127
3835A27j2k69o7M78l55J44J05q4k22J05L4n8QK46j74j49j27M95p8n76M67J5k92
$$ 127 115 -154 -221 257 -98 46 151 67 -155 -50 -16 -74 -66 180 6 -143 -270 225 147 -429 38 53 -239
3858b39n8M66l25m03K97N03k08l00M96J30l82L89N9m04K58j17j99j15k53L89l55
$$ -239 -297 169 -156 -559 -262 241 33 -267 229 359 -23 366 425 21 279 162 -37 -152 -405 -16 -371
3879c71p7K88L8r8oJ41L10l52N78j43m69J92K54j47k24L34m66J77j34M07k17l75
$$ -371 -448 -160 -122 -220 -226 -85 225 -127 451 308 -161 31 285 138 -86 248 -218 -41 -175 232 15 -360
3901c60N22l54j05M93Pl88M5M38j34l64L44N14p43k75M32N2n57M61L47n87j40
$$ -360 162 -192 -297 196 203 -185 -140 298 164 -200 144 658 -85 -360 72 124 -433 28 375 -212 -352
3922c52L89j00m52N07K41m45L22J38k28l42K79K89n31K11L40j40n70M03M96n20
$$ -352 37 -63 -515 -8 233 -212 110 248 20 -322 -43 246 -285 -74 266 126 -444 -41 455 -65
3942f5l45M31L82q65M93M74m94p28R69J4m68L27L36l81q07Q17P4p09N15N42o56
$$ -65 -410 21 403 -462 31 505 11 -717 252 266 -202 125 461 80 -727 90 164 -545 -30 512 -144
3963a44m0J27K54r45N15O50o40j18O01n2r97N81L77m21n8P63k4o51L15J67p12
$$ -144 -184 -57 197 -748 -233 417 -223 -341 260 208 -789 -208 169 -252 -310 453 429 -222 93 260 -452
3984d52O6P11m36l45N69K69n32m75O99j1o37R16O47q95o39P63j40l57J56P27o48
$$ -452 -386 325 -111 -456 113 382 -150 -625 74 63 -574 342 989 94 -545 218 78 -279 -123 604 -44
4005d4R0M02k68p99K00M92j07k65Q54k04r39J73N61m32j4P88j60l72L66j00l20
$$ -44 46 448 180 -619 -419 73 -34 -299 555 351 -588 -415 146 -286 -300 488 328 -44 322 222 -98
4026i8m75N54P7k49L36J73l24l14K04Q5J9r8M58n53J59O1l29j22N57K26r1l16
$$ -98 -573 -19 58 -191 145 318 -6 -320 -116 -31 -12 -110 348 -205 -46 15 -314 -436 121 347 256 -60
4048f0K61M8l80O8L8k8p1M13K24n19j05J57l10P2J52K64J12k39j3j80K08J11k23
$$ -60 201 249 -131 -63 -25 -53 -124 289 513 -6 -111 46 -264 -192 -40 224 336 97 84 -96 112 223 0
4071@j24N67m29m4K6j16j39J47J51j0J78r2k50j46J91J11o1K99L25n56k7R9o1
$$ 0 -124 443 14 -30 -4 -120 -259 -112 39 29 207 115 -135 -281 -90 21 -40 259 584 28 1 100 39
4094C9k41K45M77q91q1M98M5p20M35R60q78j37O13J08p34J44M81n71n39Q80L00
$$ 39 -202 43 520 -371 -452 46 91 -629 -194 766 -112 -249 364 472 -262 -118 363 -208 -747 133 433
4115D33p69K79M75o93j98P77j3p89N05P92r89m75R10J6r02M12Q88r50m67J313
$$ 433 -336 -57 418 -275 -473 304 291 -498 7 799 -190 -665 245 261 -641 -229 659 -291 -758 555
4135E55j90r58P81O21r76m34J034l4p86J78R38j079o30J262o4q60M91J041j014
$$ 555 365 -593 188 809 -167 -601 433 399 -387 -209 729 -350 -980 282 218 -642 -151 890 -124
4154a24m96J024L86j542Q44P50r92k96J069m8j237M54O50n06p57J554m47j177
$$ -124 -620 404 790 -752 92 842 -150 -446 623 575 -662 -208 442 -64 -821 733 286 -891
4172h91N14J075o27q37J509K5j377O73P93j143l97J181j59j065O17Q36r20r87
$$ -891 -377 698 71 -766 743 768 -609 64 857 -286 -683 498 339 -726 -109 727 -193 -1180
4190a180J452j95p44L05J484r92p93R81L0j123N16J277p65o39N33J68j062L08
$$ -1180 272 77 -667 -362 1122 130 -663 318 348 -775 -259 1018 253 -386 147 315 -747 -439
4208d39J180n19r66J492l07j141K01R45n14n72J035L56j050R1R33n80j087J098
$$ -439 741 222 -744 748 441 -700 -499 446 -68 -640 395 751 -299 -208 725 145 -942 156
4226A56M05j005N04Q17r78o03R04K40j176M48R88o40n54N77K56j250L37J191k77
$$ 156 561 -444 60 877 -101 -704 200 440 -736 -288 700 60 -494 83 339 -911 -574 617 340
4245C40n82M89J61r49L18P75n16l35Q30J23r50J37N55p99l90J011K60p54O6M74
$$ 340 -242 247 408 -541 -223 552 36 -299 531 654 -296 -159 396 -403 -793 218 478 -276 -210 264
4265B64k37m57J87O89m15k29P09l81p53P97J54p50K55O90m02p52N66K46o21J10
$$ 264 27 -430 -243 446 31 -198 511 130 -623 174 328 -422 -167 523 121 -631 -65 181 -440 -330
4285c30Q00k68k66L89Q3m90j75N58k91J21j45L35n65RM57k04k08J30J92j6L04
$$ -330 470 202 -64 325 408 -82 -257 301 10 131 -14 321 -244 -235 222 18 -190 -60 132 116 420
4306D20J65m80j39J72J89l58J27m9k2J86l46K58j43p8L56k31l05O3O24n42k87
$$ 420 585 105 -34 138 327 -31 96 47 25 211 -135 123 -20 -98 258 27 -278 -215 409 -133 -420
4327d20N12k1l75M52K06k19r9k1J24n9N7l3m59K15M10l30k04L48k49J73j25L28
$$ -420 92 71 -304 148 354 135 36 15 139 80 137 104 -355 -140 270 -60 -264 84 -165 8 -117 211
4349B11j62j06n4M97o27M32q9j16km3J76ML6k54L6j28M0K28m05L07l4K10Or9Q7
$$ 211 49 -57 -111 386 -241 191 102 -14 -16 -59 117 121 157 -97 -61 -189 -149 79 -326 -19 -53 157 163 64 151
4374A51k79J67Mk9o8p2J28n2J69o6K73k55k54L53j54P2n44N43j31rJ20k19K19
$$ 151 -128 39 43 14 -54 -126 2 -50 119 53 326 71 -183 170 16 88 -456 87 -44 -53 67 -152 67
4397F7J66q2j98K9o4M2N3J02q0k56J89K1m5K41q7j2k57K15N7m5J4P6j37j63l8
$$ 67 233 151 -47 -18 -82 -40 13 115 35 -221 -32 -11 -56 185 98 86 -171 44 101 56 70 146 9 -154 -192
4422a92J86k06J52Q6K14j9k93Q6j15P8O1K15j8Rp1k54n2p9K58O7k29p0J02J93
$$ -192 -6 -212 -60 26 240 221 -72 14 -101 -23 38 253 235 244 173 -81 -133 -212 46 113 -116 -186 -84 109
4446A09J31l37J82j57M9K02k64L65m11j82M42m01K99j48j3M0K3L66m12o5M3JJ41
$$ 109 240 -97 85 -72 -23 179 -85 280 -131 -313 129 -272 27 -121 -134 -94 -71 295 -117 -182 -139 -138 3
4469CJL97n55n9K71j61K02J59k56L43m48j42J89r6J20r1o5QK68M9m34O12o44N1
$$ 3 4 401 -154 -213 58 -103 99 258 2 345 -103 -245 -56 -152 -32 -123 -188 -180 88 137 -297 315 -329 -278
4493b78M85J55r4l43K54k91j82P5N34m27l9K74j21l75m1O07k97j46O63l59k76
$$ -278 207 362 268 -75 179 -112 -294 -219 315 -112 -151 123 2 -373 -414 193 -104 -250 413 54 -222
4514b22R9K49n33J49M34L07o78L31Mm17r8L86K13n13M98L02o93j74N66k53o44
$$ -222 -123 126 -407 -258 176 483 -195 136 140 -277 -375 11 224 -289 209 511 -182 -356 210 -43 -687
4535f87O19P50o07l25Q37m30p54N51M48m93k47Q09l39q46M87L95n49J65O83J1
$$ -687 -68 682 75 -250 587 157 -597 -46 402 -91 -338 471 132 -714 -227 168 -381 -216 467 478
4555D78r10L58K06m47j00N38K73r21M04P92q52o98J294l91q63J045Q12j201n00
$$ 478 -432 -74 132 -315 -415 123 396 -525 -121 671 -181 -879 415 24 -839 206 1018 -183 -683
4574f83J168l70r09Q03O55q29j37P66k47r24M13P04n52k14R01k94q91N26O01q11
$$ -683 485 115 -794 9 664 -165 -302 464 217 -707 -294 410 -142 -356 545 251 -640 -114 487 -324
4594c24m52J469l09j115N40Q37r92k88J117K0j243P93Q00j036n00J057K7r34M31
$$ -324 -776 693 384 -731 -191 646 -346 -634 483 503 -740 53 853 -183 -683 374 401 -533 -102
4613a02Q07j047n21J451l32j098O27R44n51j066J472r1j199M26J186j195m49J241
$$ -102 705 -342 -863 588 256 -842 -215 729 178 -888 584 493 -706 -280 906 -289 -738 503
4631E03j11j166O21P24q70m08J124L15j412O07Q80j093l51R96J68j520O72J226
$$ 503 392 -774 -153 571 -299 -707 417 732 -680 -73 807 -286 -637 359 527 -993 -321 905
4649I05j407j77J181o1j343Q55P94q93m14J033L55j594O57Q22q72o09J127n7j025
$$ 905 -502 -679 502 441 -902 -47 747 -146 -560 473 828 -766 -109 713 -159 -768 359 302 -723
4668g23M58P64n39o32J098j75q76L61J028p65o34R62j10q90O65N59m43q86Q86
$$ -723 -265 499 -40 -672 426 251 -625 -264 764 -1 -635 327 217 -673 -8 551 108 -778 108
4687A08L99j103L44O28n24m11J011J11r28J58N83l10n75Q64K14r70K67O36p65
$$ 108 507 -596 -252 376 -148 -559 452 563 -365 -207 376 66 -509 355 569 -401 -134 502 -263
4706b63m24R70J47p87K43O29k86m57L06L42p22K52N72p16o8K68K44l88J4L36P7
$$ -263 -687 283 430 -357 -114 515 229 -228 78 420 -302 -50 522 -194 -262 6 250 -138 -124 212 289
4727B89o05M48J66p86K21L07J94l67K33K20o67J60N14l25j02L14K19m73l5K60
$$ 289 -316 132 298 -488 -267 40 234 -133 100 320 -347 -187 327 2 -100 214 433 -40 -75 185
4747A85n50Q5J77M09n50M4M55k85m7K34r4j39J03K51j40k48J3K61k25k63N52k46
$$ 185 -365 -280 -103 306 -244 -200 255 -30 -77 157 63 -76 27 278 138 -110 -97 164 -61 -324 228 -18
4769a8m6J44n5o7k56L95j44R5ojNl11N55l45J98Kj58j51K40n0j71mR1M03m62L3
$$ -18 -64 80 25 -42 -298 97 -47 48 42 41 46 -265 290 -55 143 145 -13 -164 76 26 -145 -149 -58 345 -117 -84
4795h4K92k70N1K79j41l88L82j0K5j90k2k48K17J04M6J47k84L61k97jO2J32k13
$$ -84 208 -62 -11 268 127 -261 121 111 136 -54 -76 -324 -107 -3 43 190 -94 267 -30 -31 31 163 -50
4818e0j88N6R4J00k11K65K19n96J84J6K24j78r0J22K57j69j7J64k18q6R4J2k04
$$ -50 -238 -182 -88 12 -199 66 285 -311 -127 -111 113 -65 -155 -33 224 55 38 202 -16 -102 -8 4 -200
4841b00K3M07l85K26l34J44L76l00M79n2l48m3J22N0q1PL2m5j49j58P7K62k36
$$ -200 -177 230 -155 71 -263 -119 257 -43 436 384 36 -7 115 165 84 91 123 78 -71 -229 -152 110 -126
4864a26J22j4j8R3J19M5k40j98Q6K46O0q0J07l66M25k06k12J57j13k17N31k71
$$ -126 -4 -18 -36 57 176 221 -19 -217 -131 115 175 95 202 -164 261 55 -157 0 -113 -330 201 -70
4886g0q7L23m1k59N0K92k77L98l12O2j3j01J39J65n81K77k3J34J0j56J10o4lJ3
$$ -70 -157 166 125 -134 -84 208 -69 329 17 79 66 -35 104 269 -312 -35 -58 76 86 -70 40 -24 -27 -14
4910a4n4l6J30j07J8M1K09K1p9qn6j89j28M11j71M4k1r1j03J24M1j87P3N3L53
$$ -14 -68 -104 26 -81 -63 -22 187 208 129 121 65 -124 -252 159 -12 32 11 -80 -183 -59 -18 -205 -132 -79 274
4935B74l70K5Q5P7j42K11J85m10j49L61r9j96J45K7Qj83K28k14N8lK54l16J47
$$ 274 -96 -71 14 91 -51 160 345 -65 -214 147 48 -148 -3 24 32 -151 77 -137 -79 -82 172 -144 3
4958CJ81J4n57L52Q5l24J40M05j20k38K17Q2k78k07M74n6l83K78M91o26k02L33
$$ 3 184 198 -359 -7 78 -246 -106 299 179 -59 158 240 -38 -245 229 173 -210 68 559 -67 -269 64
$$ [...]
8191a88
##END NTUPLES=NMR FID
##END=
