##TITLE=1H_Pr Q-18n
 200.13MHz, CDCl3,
 8 sc
 
 16.1.2025
##JCAMPDX= 6.0         $$ Bruker NMR JCAMP-DX V2.0
##DATA TYPE= NMR FID
##DATA CLASS= NTUPLES
##ORIGIN= UXNMR, Bruker Analytische Messtechnik GmbH
##OWNER= pz
$$ XWIN-NMR		Version 3.5
$$ Thu Jan 16 14:22:58 2025 Russian Standard Time (UT+4h)  she@DPX200
##.OBSERVE FREQUENCY= 200.1313
##.OBSERVE NUCLEUS= ^1H
##.DELAY= (6, 6)
##.ACQUISITION MODE= SIMULTANEOUS
##.ACQUISITION SCHEME= undefined
##.AVERAGES= 8
##.DIGITISER RES= 18
##SPECTROMETER/DATA SYSTEM= spect
##.PULSE SEQUENCE= zg30
##.SOLVENT NAME= DMSO
##.SHIFT REFERENCE= (INTERNAL, DMSO, 0, 14.3821)
##AUDIT TRAIL= $$ (NUMBER, WHEN, WHO, WHERE, WHAT)
$$ ##TITLE= Audit trail, XWIN-NMR		Version 3.5
$$ ##JCAMPDX= 5.01
$$ ##ORIGIN= Bruker BioSpin GmbH
$$ ##OWNER= she
$$ F:/spectra/data/she/nmr/H-C/1/audita.txt
$$ ##AUDIT TRAIL=  $$ (NUMBER, WHEN, WHO, WHERE, WHAT)
(   1,<2025-01-16 14:21:13.20 +0400>,<she>,<DPX200>,
      <created by zg, POWCHK disabled, PULCHK disabled
       configuration hash MD5:
       00 E9 B6 7A A2 85 ED C7 34 08 36 98 17 FE 4E 26
       data hash MD5: 16K
       8C 68 DA F0 31 04 8A 16 35 61 7D 1B EC A8 15 66>)
$$ ##END=
$$ 
$$ hash MD5
$$ 74 0E 0F A9 42 D3 91 8F C6 8D 82 87 26 7A 91 64
##$RELAX= 
##$RELAX= 
##$RELAX= 
##$RELAX= 
##$RELAX= 
##$RELAX= 
$$ Bruker specific parameters
$$ --------------------------
##$DU= <F:/spectra>
##$EXPNO= 1
##$NAME= <H-C>
##$PROCNO= 1
##$TYPE= <nmr>
##$USER= <she>
##$AMP= (0..31)
100 100 100 100 100 100 100 100 100 100 100 100 100 100 100 100 100 100 
100 100 100 100 100 100 100 100 100 100 100 100 100 100 
##$AQSEQ= 0
##$AQ_mod= 1
##$AUNM= <au_zg>
##$AUTOPOS= <>
##$BF1= 200.13
##$BF2= 200.13
##$BF3= 200.13
##$BF4= 200.13
##$BF5= 200.13
##$BF6= 200.13
##$BF7= 200.13
##$BF8= 200.13
##$BYTORDA= 1
##$CFDGTYP= 0
##$CFRGTYP= 5
##$CHEMSTR= <none>
##$CNST= (0..31)
1 1 145 1 1 1 1 1 1 1 1 1 1 1 1 1 1 1 1 1 1 1 1 1 1 1 1 1 1 1 1 1 
##$CPDPRG= <>
##$CPDPRG1= <>
##$CPDPRG2= <>
##$CPDPRG3= <>
##$CPDPRG4= <mlev>
##$CPDPRG5= <mlev>
##$CPDPRG6= <mlev>
##$CPDPRG7= <mlev>
##$CPDPRG8= <mlev>
##$CPDPRGB= <>
##$CPDPRGT= <>
##$D= (0..31)
0 0.7 0 0 0 0 0 0 0 0 0 0.03 0 0 0 0 0 0 0 0 0 0 0 0 0 0 0 0 0 0 0 0 
##$DATE= 1737022872
##$DBL= (0..7)
120 120 120 120 120 120 120 120 
##$DBP= (0..7)
150 150 150 150 150 150 150 150 
##$DBP07= 0
##$DBPNAM0= <>
##$DBPNAM1= <>
##$DBPNAM2= <>
##$DBPNAM3= <>
##$DBPNAM4= <>
##$DBPNAM5= <>
##$DBPNAM6= <>
##$DBPNAM7= <>
##$DBPOAL= (0..7)
0.5 0.5 0.5 0.5 0.5 0.5 0.5 0.5 
##$DBPOFFS= (0..7)
0 0 0 0 0 0 0 0 
##$DE= 6
##$DECBNUC= <off>
##$DECIM= 32
##$DECNUC= <off>
##$DECSTAT= 4
##$DIGMOD= 1
##$DIGTYP= 9
##$DL= (0..7)
0 120 120 120 120 120 120 120 
##$DP= (0..7)
150 150 150 150 150 150 150 150 
##$DP07= 0
##$DPNAME0= <>
##$DPNAME1= <>
##$DPNAME2= <>
##$DPNAME3= <>
##$DPNAME4= <>
##$DPNAME5= <>
##$DPNAME6= <>
##$DPNAME7= <>
##$DPOAL= (0..7)
0.5 0.5 0.5 0.5 0.5 0.5 0.5 0.5 
##$DPOFFS= (0..7)
0 0 0 0 0 0 0 0 
##$DQDMODE= 0
##$DR= 18
##$DS= 0
##$DSLIST= <SSSSSSSSSSSSSSS>
$$ [...]
##$SUBNAM0= <"">
##$SUBNAM1= <"">
##$SUBNAM2= <"">
##$SUBNAM3= <"">
##$SUBNAM4= <"">
##$SUBNAM5= <"">
##$SUBNAM6= <"">
##$SUBNAM7= <"">
##$SUBNAM8= <"">
##$SUBNAM9= <"">
##$SW= 18.0517328524113
##$SWIBOX= (0..15)
0 0 2 0 0 0 0 0 0 0 0 0 0 0 0 0 
##$SW_h= 3612.71676300578
##$TD= 16384
##$TD0= 1
##$TE= 0
##$TE2= 300
##$TE3= 300
##$TEG= 300
##$TL= (0..7)
0 120 120 120 120 120 120 120 
##$TP= (0..7)
150 150 150 150 150 150 150 150 
##$TP07= 0
##$TPNAME0= <>
##$TPNAME1= <>
##$TPNAME2= <>
##$TPNAME3= <>
##$TPNAME4= <>
##$TPNAME5= <>
##$TPNAME6= <>
##$TPNAME7= <>
##$TPOAL= (0..7)
0.5 0.5 0.5 0.5 0.5 0.5 0.5 0.5 
##$TPOFFS= (0..7)
0 0 0 0 0 0 0 0 
##$TUNHIN= 0
##$TUNHOUT= 0
##$TUNXOUT= 0
##$USERA1= <user>
##$USERA2= <user>
##$USERA3= <user>
##$USERA4= <user>
##$USERA5= <user>
##$V9= 5
##$VALIST= <valist>
##$VCLIST= <CCCCCCCCCCCCCCC>
##$VD= 0
##$VDLIST= <DDDDDDDDDDDDDDD>
##$VPLIST= <PPPPPPPPPPPPPPP>
##$VTLIST= <TTTTTTTTTTTTTTT>
##$WBST= 1024
##$WBSW= 4
##$XGAIN= (0..3)
0 0 0 0 
##$XL= 0
##$YL= 0
##$YMAX_a= 569535
##$YMIN_a= -624776
##$ZGOPTNS= <>
##$ZL1= 120
##$ZL2= 120
##$ZL3= 120
##$ZL4= 120
##$ABSF1= 10
##$ABSF2= 0
##$ABSG= 5
##$ABSL= 3
##$ALPHA= 0
##$AQORDER= 0
##$ASSFAC= 0
##$ASSFACI= 0
##$ASSFACX= 0
##$ASSWID= 0
##$AUNMP= <proc_1d>
##$AZFE= 0.1
##$AZFW= 0.1
##$BCFW= 1
##$BC_mod= 2
##$BYTORDP= 1
##$COROFFS= 0
##$CY= -3
##$DATMOD= 1
##$DC= 2
##$DFILT= <>
##$DTYPP= 0
##$F1P= 0
##$F2P= 0
##$FCOR= 0.5
##$FTSIZE= 0
##$FT_mod= 4
##$GAMMA= 1
##$GB= 0.15
##$INTBC= 1
##$INTSCL= 1
##$ISEN= 128
##$LB= 0.25
##$LEV0= 0
##$LPBIN= 0
##$MAXI= 10000
##$MC2= 0
##$MEAN= 0
##$ME_mod= 0
##$MI= 1.114404
##$NCOEF= 0
##$NC_proc= 0
##$NLEV= 6
##$NOISF1= 3.799351
##$NOISF2= 2.8
##$NSP= 1
##$NTH_PI= 0
##$NZP= 0
##$OFFSET= 14.38212
##$PC= 1
##$PHC0= 252.3142
##$PHC1= 9.792202
##$PH_mod= 1
##$PKNL= yes
##$PPARMOD= 0
##$PSCAL= 0
##$PSIGN= 0
##$REVERSE= no
##$SF= 200.129724274929
##$SI= 16384
##$SIGF1= 3
##$SIGF2= 2
##$SINO= 400
##$SIOLD= 16384
##$SREGLST= <1H.CDCl3>
##$SSB= 0
##$STSI= 0
##$STSR= 0
##$SW_p= 3205.1282051282
##$SYMM= 0
##$S_DEV= 0
##$TDeff= 0
##$TDoff= 0
##$TI= <>
##$TILT= no
##$TM1= 0
##$TM2= 0
##$TOPLEV= 0
##$USERP1= <user>
##$USERP2= <user>
##$USERP3= <user>
##$USERP4= <user>
##$USERP5= <user>
##$WDW= 1
##$XDIM= 8192
##$YMAX_p= 0
##$YMIN_p= 0
$$ End of Bruker specific parameters
$$ ---------------------------------
##NTUPLES= NMR FID
##VAR_NAME=  TIME,          FID/REAL,        FID/IMAG
##SYMBOL=    X,             R,               I
##VAR_TYPE=  INDEPENDENT,   DEPENDENT,       DEPENDENT
##VAR_FORM=  AFFN,          ASDF,            ASDF
##VAR_DIM=   8192,          8192,            8192
##UNITS=     SECONDS,       ARBITRARY UNITS, ARBITRARY UNITS
##FACTOR=    0.0002768,     1,               1
##FIRST=     0,             0,               0
##LAST=      2.2672688,     0,               0
##MIN=       0,             -624776,         0
##MAX=       2.2672688,     569535,          0
$$ Real data points
##PAGE= N=1
##DATA TABLE= (X++(R..R)), XYDATA
$$ [...]
$$ plain form
2107 1282 386 1080 320 -707 1132 562 498 1223 -765 -1198 -953 -1786 -187 674 -664 -3 -705 -1397
2125 -1397 248 242 868 2017 123 394 1207 367 1379 1565 -43 7 -1401 -1692 -383 -1011 -830 -300
2143 -300 -1917 -927 86 -33 1642 1640 234 834 71 287 1460 864 1000 877 -1250 -1196 -604 -1219 -555
2162 -555 -855 -2174 -877 -1135 -165 1788 1194 1351 1201 -243 894 1395 946 1802 732 -744 -485 -1351
2180 -1351 -1280 -403 -1362 -1157 -1054 -1751 -258 730 482 1716 482 152 1168 679 855 1601 330 115
2198 115 -268 -1502 -10 -515 -1189 -474 -1742 -1791 -711 -721 781 1256 463 1075 1085 426 1864 1354 367
2217 367 973 -967 -1341 -14 -831 -200 64 -1509 -909 -1278 -1620 501 74 99 1370 215 534 1701
2235 1701 825 1296 1054 -756 -39 -192 -769 559 -397 -1035 -665 -2122 -1567 -250 -913 325 419 -469
$$ packed form
2107A282q96O94p60j027J839n70o4P25j988m33K45q33J599Q61j338O61p02o92
2125a397J645oO26J149j894K71Q13q40J012J86j608N0j408k91J309o28J81N30
2143c00j617R90J013j19J675kj406O00p63K16J173n96J36j23k127N4N92o15O64
2162e55l00j319J297k58R70J953n94J57j50j444J137N01m49Q56j070j476K59q66
2180a351P1Q77r59K05J03o97J493R88k48J234j234l30J016m89J76P46j271k15
2198A15l83j234J492n05o74P15j268m9J080j0J502M75p93O12J0o59J438n10r87
2217C67O06j940l74J327q17O31K64j573O00l69l42K121m27K5J271j155L19J167
2235A701q76M71k42j810P17j53n77J328r56o38L70j457N55J317o63J238R4q88
$$ plain form
2253 -469 739 784 493 2252 960 50 856 -878 -59 958 -208 342 -57 -1867 -891 -1102 -1340 270
2271 270 -755 -988 182 -691 503 1982 562 1518 1382 -14 982 1056 78 1357 -403 -1220 -448 -1587
2289 -1587 -587 239 -1292 -884 -742 -1895 97 690 538 2009 802 294 1054 182 793 1395 -12
2306 -12 414 386 -926 258 -299 -995 -250 -2113 -2338 -573 -1133 -4 1294 91 557 1179 294 1894
2324 1894 1323 701 1463 -107 -486 492 -660 -257 -150 -2035 -1108 -1320 -1251 161 -154 -263 309 -186 200
2343 200 1309 988 1466 1296 -333 378 365 -465 574 152 -777 -258 -1901 -1102 -496 -971 -295 -188 -1218
2362 -1218 112 653 755 1666 1116 448 746 -462 60 791 -277 618 -140 -1367 -462 -606 -1085 -286
2380 -286 -999 -1083 215 -274 317 968 595 937 678 -415 724 478 688 1278 43 -279 -435 -846 -359
$$ packed form
2253d69J208M5k91J759j292r10Q06j734Q19J017j166N50l99j810R76k11k38J610
2271B70j025k33J170q73J194J479j420R56j36j396R96P4r78J279j760q17P72j139
2289a587J000Q26j531M08J42j153J992N93j52J471j207n08P60q72O11O02j407
2306a2M26k8j312J184n57o96P45j863k25J765n60J129J298j203M66O22q85J600
2324A894n71o22P62j570l79R78j152M03J07j885R27k12O9J412l15j09N72m95L86
2343B00J109l21M78j70j629P11j3q30J039m22r29N19j643P99O06m75O76J07j030
2362a218J330N41J02R11n50o68K98j208N22P31j068Q95p58j227R05j44m79P99
2380b86p13q4J298m89N91O51l73L42k59j093J139k46K10N90j235l22j56m11M87
$$ plain form
2399 -359 -37 -675 -533 -811 -1065 525 265 464 1025 158 103 820 -15 1148 884 -290 169 -716 -543
2418 -543 315 -233 -237 240 -1060 -879 -620 -512 252 519 -104 718 116 170 1157 298 456 242 -649 -38 85
2439 85 170 733 -113 -822 -473 -1030 -758 558 -225 123 308 -286 634 703 132 963 -39 -693 269 -118
2459 -118 134 788 -74 -276 94 -1028 -134 -169 -617 517 -216 -708 252 127 414 1192 -77 112 156 -826
2479 -826 47 290 -103 483 -438 -772 546 -280 51 787 -593 -286 132 -703 528 516 28 868 -121
2498 -121 -571 394 -280 -138 629 -571 240 311 -445 780 403 -698 114 -995 -854 726 -288 274
2516 274 884 -451 -91 -33 -624 341 197 -331 669 -185 -351 994 -36 -18 12 -1031 -46 232 -678
2535 -678 216 130 -802 181 -77 -640 634 90 160 443 -400 196 536 -113 965 235 -505 236 -741 -648
$$ packed form
2399c59L22o38J42k78k54J590k60J99N61q67n5P17q35J163k64j174M59q85J73
2418e43Q58n48mM77j300J81K59J08P64K67o23Q22o02N4R87q59J58k14q91O11J23
2439H5Q5N63q46p09L49n57K72J316p83L48J85n94R20O9n71Q31j002o54R62l87
2459a18K52O54q62k02L70j122Q94l5m48J134p33m92R60j25K87P78j269J89M4r82
2479h26Q73K43l93N86r21l34J318q26L31P36j380L07M18q35J231j2m88Q40r89
2498a21m50R65o74J42P67j200Q11P1p56J225l77j101Q12j109J41J580j014N62
2516B74O10j335L60N8n91R65j44n28J000q54j66J345j030J8L0j043R85K78r10
2535f78Q94q6r32R83k58n63J274n44P0K83q43N96L40o49J078p30p40P41r77R3
$$ plain form
2555 -648 305 -899 -298 -128 -882 -26 479 18 624 -127 -383 389 -396 -33 1215 -11 122 304 -353
2574 -353 -73 -156 -609 323 -310 -669 379 -72 -194 579 -139 -374 168 -480 411 752 329 887 184 -161
2594 -161 352 -170 -151 494 -566 -149 171 -745 2 -82 -413 91 -472 -422 249 8 255 789 -2 404 382
2615 382 109 833 566 249 463 -631 -575 136 -641 119 16 -885 -129 -335 -332 -10 -192 -335 201 211 433
2636 433 1010 572 1003 562 -188 471 -208 -621 209 -711 -783 -237 -1094 -502 -203 -948 -379 -163 -654 384
2656 384 477 540 1667 493 546 700 -217 525 668 -139 114 -435 -991 -288 -703 -999 -288 -985 -467 -13
2676 -13 -275 421 774 306 958 854 183 990 282 107 585 -641 -545 -258 -1335 -206 -259 -827 -260 -370
2696 -370 -897 512 149 184 836 271 638 1020 62 799 340 -351 148 -397 -711 257 -287 -769 -144 -981
$$ packed form
2555f48R53j204O01J70p54Q56N05m61O06p51k56P72p85L63J248j226J33J82o57
2574c53K80q3m53R32o33l59J048m51j22P73p18k35N42o48Q91L41m23N58p03l45
2594a61N13n22J9O45j060M17L20r16P47q4l31N04n63N0O71k41K47N34p91M06k2
2615C82k73P24k67l17K14j094N6P11p77P60j03r01P56k06LL22j82j43N36J0K22
2636D33N77m38M31m41p50O59o79m13Q30r20p2N46q57N92K99p45N69K16m91J038
2656C84R3O3J127j174N3J54r17P42J43q07K53n49n56P03m15k96P11o97N18M54
2676a3k62O96L53m68O52j04o71Q07p08j75M78j226R6K87j077J129n3n68N67j10
2696c70n27J409l63L5O52n65L67L82r58P37m59o91M99n45l14R68n44m82O25q37
$$ plain form
2716 -981 -756 -158 -766 313 438 24 763 514 255 1373 288 388 681 -63 -87 23 -517 258 -292
2735 -292 -1159 -224 -542 -506 -42 -496 -426 82 -324 652 902 71 793 433 -168 551 233 -381 649 -21
2755 -21 -325 -161 -857 -214 -163 -698 -137 -212 -719 261 229 232 1155 514 373 1146 114 304 504 -211 206 -259
2777 -259 -731 -84 -677 -475 -103 -802 -916 -433 -429 357 418 131 813 538 255 1034 512 305 772 57 -98
2798 -98 -94 -674 -224 -225 -1221 -403 -842 -788 108 92 26 718 321 557 1125 534 734 773 59 125 -147 -424 -126
2821 -126 -872 -471 -126 -1341 -811 -327 -592 -36 -117 -10 664 441 490 1193 617 650 594 -88 -176 4 -719
2842 -719 -122 -534 -961 -664 -801 -613 -212 -375 -117 331 -60 770 680 584 1058 637 122 496 18 37 51
2863 51 -479 -471 -474 -995 -541 -542 -679 -305 -327 -123 455 333 611 919 402 570 665 343 741 -4 -205 229 -535
$$ packed form
2716i81K25N98o08J079J25m14P39k49k59J118j085J00K93p44k4J10n40P75n50
2735b92q67R35l18L6M64m54P0N08m06R76K50q31P22l60o01P19l18o14J030o70
2755b1l04J64o96O43N1n35N61p5n07R80l2LR23o41j41P73j032J90K00p15M17m65
2777b59m72O47n93K02L72o99j14M83MP86O1k87O82k75k83P79n22k07M67p15j55
2798i8Mn80M50jr96Q18m39N4Q96j6o6O92l97K36N68n91K00L9p14O6k72k77K98
2821a26p46M01L45j215N30M84k65N56q1J07O74k23M9P03n76L3n6o82q8J80p23
2842g19N97m12m27K97j37J88M01j63K58M48l91Q30r0r6M74m21n15L74m78J9J4
2863E1n30Qln21M54jj37L74k2K04N78j22K78L08n17J68R5l22L98p45k01M34p64
$$ plain form
2886 -535 -503 -212 -671 -429 -289 -834 -93 -100 -460 338 -91 239 720 339 590 1010 333 460 477 -475 -80
2907 -80 -238 -478 -64 -379 -1179 -462 -682 -846 42 -444 131 433 198 1077 721 362 1012 331 -97 339
2927 339 -298 123 442 -712 -385 -257 -1009 -372 -388 -383 46 -207 -20 585 162 408 1051 412 626 500 -410
2948 -410 467 65 -478 -82 -817 -809 -511 -896 -433 103 -592 264 248 -199 648 774 329 1074 70 317 544
2969 544 -389 61 208 -755 -319 -123 -806 -338 -444 -705 26 -320 -267 298 107 394 908 122 338 534
2989 534 117 471 -41 -263 482 -492 -394 84 -843 -238 -371 -753 -347 58 -155 356 169 149 447 20 200
3010 200 649 24 246 281 -365 169 -200 -489 213 -202 -440 -118 -528 -318 91 -97 77 11 -406 583 296
3031 296 149 780 37 -192 213 -185 -187 42 -54 240 5 -413 -8 -111 -301 102 -229 -327 354 -122 279
$$ packed form
2886e35L2K91m59K42J40n45P41pl60P98m29L30M81l81K51M20o77J27J7r52L95
2907h0j58k40M14l15q00P17k20j64Q88m86N75L02k35Q79l56l59O50o81m28M36
2927C39o37M21L19j154L27J28p52O37j6NM29k53J87O05m23K46O43o39K14j26r10
2948d10Q77m02n43L96p35QK98l85M63N36o95Q56j6m47Q47J26m45P45j004K47K27
2969E44r33M50J47r63M36J96o83M68j06k61P31l46N3N65j91K87N14p86K16J96
2989E34m17L54n12k22P45r74R8M78r27O05j33l82M06M05k13N11j87k0K98m27J80
3010B00M49o25K22L5o46N34l69k89P02m15k38L22m10K10M09j88J74o6m17R89k87
3031B96j47O31p43k29M05l98kK29r6K94k35m18M05j03j90M03l31r8O81m76M01
$$ plain form
3052 279 632 143 472 484 221 520 54 -85 281 -262 -193 -18 -858 -365 -348 -608 -26 -98 -177 502 159 140
3074 140 439 162 168 466 109 67 54 -159 4 -81 -355 -107 -96 -181 101 -741 -288 165 -142 27 403 45
3096 45 604 -306 449 776 47 -116 408 -347 11 28 -550 -123 -102 -332 -51 -456 -335 342 -282 -76 215
3117 215 -104 315 396 -192 320 139 -453 324 19 254 543 27 172 -30 -338 -80 43 -526 50 -437
3137 -437 -437 27 -266 -418 332 -150 110 516 -246 398 300 167 832 508 6 441 -414 -26 -52 -403 -397 -497
3159 -497 -802 -325 -215 -383 196 -110 -332 465 53 629 723 126 735 703 -141 121 318 -714 -228 -709
3179 -709 -544 -414 -979 -377 -89 -385 208 78 -146 802 565 295 916 524 683 675 85 -183 71 -639 -431
3200 -431 -503 -946 -470 -377 -678 -42 -282 -81 467 192 385 1059 369 879 909 249 612 158 -123 -64 -630
$$ packed form
3052B79L53m89L29J2k63K99m66j39L66n43O9J75q40M93J7k60N82p2p9O79l43j9
3074A40K99k77OK98l57m2j3k13J63q5k74K48J1q5K82q42M53M53l07J69L76l58
3096D5N59r10P55L27p29j63N24p55L58J7n78M27K1k30K81m05J21O77o24K06K91
3117B15l19M19Q1n88N12j81n92P77l05K35K89n16J45k02l08K58J23n69N76m87
3137d37%M64k93j52P50m82K60M06p62O44r8j33O65l24n02M35q55L88k6l51Oj00
3159d97l05M77J10j68N79l06k22P97m12N76R4n97O09l2q44K62J97j032M86m81
3179g09J65J30n65O02K88k96N93j30k24R48k37k70O21l92J59qn90k68K54p10K08
3200d31p2m43M76R3l01O36k40K01N48k75J93O74o90N10L0o60L63m54k81N9n66
$$ plain form
3221 -630 -331 -422 -711 -437 -370 -847 172 212 -347 211 97 129 557 222 345 613 62 461 451 -275 266
3242 266 -370 -734 -89 -309 -313 -427 -336 -185 66 -69 98 384 -147 680 526 515 773 440 158 -6 -67 -26
3264 -26 16 -410 -214 -388 -720 -196 -323 -363 -100 -320 -173 136 102 452 522 190 608 459 188 871 62 -114
3286 -114 336 -593 -508 -233 -779 -322 -128 -843 -50 -213 -149 380 232 360 664 585 496 731 169 385 217
3307 217 -335 146 -205 -299 -316 -852 -377 -194 -629 -291 -4 -171 430 391 275 803 400 373 914 347 -14
3328 -14 281 -524 -308 -337 -700 -365 -751 -841 -336 -407 -373 414 201 282 634 382 816 767 330 428 385 -246 191
3351 191 -220 -172 73 -609 -540 26 -616 -23 -34 42 392 84 319 516 333 136 724 7 207 466 -193
3372 -193 -67 70 -240 78 -596 -605 31 -476 -434 98 -305 116 189 -275 245 462 124 373 314 245 561 -250
$$ packed form
3221f30K99r1k89K74O7m77J019M0n59N58j14L2M28l35J23K68n51L99j0p26N41
3242B66o36l64O45k20mj14R1J51K51j35J67K86n31Q27j54j1K58l33k82j64o1M1
3264b6M2m26J96j74l32N24j27m0K63k20J47L09l4L50P0l32M18j49k71O83q09j76
3286a14M50r29Q5K75n46M57J94p15P93j63O4N29j48J28L04p9q9K35n62K16j68
3307B17n52M81l51r4j7n36M75J83m35L38K87j67O01l9j16N28m03k7N41n67l61
3328a4K95q05K16k9l63L35l86r0N05p1L4P87k13Q1L52k52M34m9m37R8m3o31M37
3351A91m11M8K45o82O9N66o42N93j1P6L50l08K35J97j83j97N88p17K00K59o59
3372a93J26J37l10L18o74rO36n07M2N32m03M21P3m64N20K17l38K49n9o9L16q11
$$ plain form
3394 -250 136 449 -250 -155 -1 -455 -165 -85 -523 -50 -417 -97 357 -227 174 499 135 385 441 -130 548
3415 548 240 -472 310 -290 -250 -121 -279 -64 -175 -376 -72 -32 -370 116 270 157 454 287 42 609 98
3436 98 266 433 -210 307 -76 -444 115 -232 -644 -192 -203 -359 -249 69 51 327 -77 394 341 337 374 43
3458 43 -189 280 -70 -265 203 -374 -64 -60 -596 -138 -208 -505 -61 -290 6 296 -125 75 636 64 402
3479 402 425 -194 579 343 -91 35 23 -489 -130 -523 -461 -125 -340 -21 12 -7 339 199 144 69 38 -121 240
3502 240 -32 175 437 -187 81 432 -165 162 -266 -521 59 -378 -218 72 -269 -36 192 -200 144 66
3522 66 -7 412 364 -41 595 -127 97 202 -197 -59 69 -259 -288 -442 -215 -165 -295 -116 165 -253 -80 211
3544 211 53 269 107 174 165 161 51 302 -76 -276 7 -226 -321 -33 -432 68 -78 -126 292 1 -71 360 -81
$$ packed form
3394b50L86L13o99R5J54m54K90Q0m38M73l67L20M54n84M01L25l64K50N6n71O78
3415E48l08p12P82o00M0J29j58K15j11k01L04M0l38M86J54j13K97j67k45N67n11
3436I8J68J67o43N17l83l68N59l47m12M52j1j56J10L18j8K76m04M71n3mL7l31
3458D3k32M69l50j95M68n77L10Mn36M58p0k97M44k29K96K90m21K00N61n72L38
3479D02K3o19P73k36m34J26j2n12L59l93O2L36k15L19L3j9L46j40n5p5l1j59L61
3502B40k72K07K62o24K68L51n97L27m28k55N80m37J60K90l41K33K28l92L44p8
3522F6p3M19m8m05O36p22K24J05l99J38J28l28k9j54K27N0j30J79K81m18J73K91
3544B11j58K16j62O7rmj10K51l78k00K83k33r5K88l99N00j46m8M18k91p2M31m41
$$ plain form
3567 -81 248 364 108 210 273 -348 5 -207 -373 83 -194 -159 -152 -301 -268 -119 -423 -68 -200 -121 -56 -226 273
3590 273 320 23 42 487 -151 153 -6 -97 -121 97 -358 278 -272 -374 250 -87 -119 153 -456 -27 231 -9
3612 -9 154 396 121 389 18 -154 106 -169 -181 158 -308 -317 -50 -503 -84 -162 -355 -52 -170 -153 123 -125
3634 -125 -79 468 -101 144 500 20 139 -14 -244 105 -133 -160 -197 -291 -383 -204 -309 -43 31 -156 82 -29
3656 -29 -10 339 112 180 400 85 -11 -4 -3 76 42 -513 40 -313 -703 83 -100 -361 72 -49 73 333 -114
3679 -114 284 185 -99 597 94 -93 -58 -258 -253 164 -382 39 51 -479 97 189 -19 11 235 39 314 116
3701 116 109 243 -59 84 59 -255 -164 -132 -335 -128 -274 -511 -158 -278 -210 142 -94 -235 264 84 210 71
3723 71 -57 184 -64 127 70 -296 -387 -165 -492 -92 -442 -354 20 72 -232 223 114 185 173 -204 292 271 85
$$ packed form
3567h1L29J16k56J02O3o21L53k12j66M56k77L5Pj49L3J49l04L55j32P9O5j70M99
3590B73M7k97J9M45o38L04j59r1k4K18m55O36n50j02O24l37l2K72o09M29K58k40
3612iJ63K42k75K68l71j72K60k75j2L39m66rK67m53M19p8j93L03j18J7K76k48
3634a25M6N47n69K45L56m80J19j53k30L49k38k7l7r4r2J79j05K66P4j87K38j11
3656b9J9L49k27O8K20l15r6PJP9l4n55N53l53l90P86j83k61M33j21J22K60m47
3679a14L98r9k84O96n03j87L5k00NM17n46M21J2n30N76R2k08L0K24j96K75j98
3701A16pJ34l02J43k5l14R1L2k03K07j46k37L53j20O8L52k36j41M99j80J26j39
3723G1j28K41k48J91n7l66r1K22l27M00l50Q8L74N2l04M55j09P1j2l77M96k1j86
$$ plain form
3746 85 109 -19 184 441 -47 -163 6 -513 -118 41 -105 -326 -56 -51 56 123 4 475 -126 13 588 -242
3768 -242 327 306 -11 46 93 -198 251 -77 -220 289 -359 -296 -168 -345 -177 214 -145 -98 227 -4 279 -90
3790 -90 20 170 -36 -73 138 -129 -70 -119 -372 -270 -327 -492 210 86 -108 164 -308 -122 378 -183 99 188
3812 188 -98 267 250 -375 95 -157 -243 192 -309 -346 -152 -392 88 41 -168 404 107 -64 424 206 3
3833 3 574 -35 231 95 -28 -139 -67 -129 30 -213 -217 -47 -168 -145 322 -117 289 284 10 266 451 371 241
3856 241 128 -317 -111 -148 -355 51 -246 -142 -90 -345 132 -277 -207 41 116 -90 367 271 186 454 -184 23
3878 23 267 -1 -84 -492 -478 60 -127 -77 67 -325 -55 42 -86 148 535 -27 120 118 121 399 108 -112 100
3901 100 -150 -174 -140 -465 21 143 -372 -51 -184 -229 281 -313 78 2 -81 3 257 -31 119 225 -464 244
$$ packed form
3746H5K4j28K03K57m88j16J69n19L95J59j46k21K70NJ07O7j19M71o01J39N75q30
3768b42N69k1l17N7M7k91M49l28j43N09o48O3J28j77J68L91l59M7L25k31K83l69
3790i0J10J50k06l7K11k67N9m9k53J02n7j65P02j24j94K72m72J86N00n61K82Q9
3812A88k86L65j7o25M70k52q6M35n01l7J94k40M80m7k09N72k97j71M88k18k03
3833CN71o09K66j36j23j11P2o2J59k43mJ70j21K3M67m39M06nk74K56J85q0j30
3856B41j13m45K06l7k07M06k97J04N2k55M77m09P0K48P5k06M57r6q5K68o38K07
3878B3K44k68q3m08J4N38j87N0J44l92K70R7j28K34L87n62J47kLK78k91k20K12
3901A00k50k4L4l25M86J22n15L21j33m5N10n94L91p6q3Q4K54k88J50J06o89P08
$$ plain form
3923 244 -69 -419 -325 6 -112 163 -224 -142 71 -149 132 34 96 153 -84 51 383 -187 66 62 -50 108
3945 108 306 -67 96 -334 -220 250 -171 -1 -61 -92 186 165 -439 -47 46 -193 251 32 141 223 -203 -38
3967 -38 412 1 56 150 -230 -87 29 -475 -69 75 -187 -49 -174 5 161 -42 -23 260 -107 -93 -46 -14
3989 -14 -69 -231 -181 -34 87 219 -285 -22 -30 -151 -264 51 65 142 151 -68 174 117 77 334 14 -266 70 -80
4013 -80 -209 35 -63 16 23 -120 -203 -15 218 98 -54 -203 283 191 -22 190 90 -4 145 -358 -69 170 -192
4036 -192 -186 106 -143 -110 -33 -8 8 9 -17 -20 17 -213 313 104 89 -21 -263 -33 -14 1 105 -21 123 180 37
4061 37 -91 114 -205 240 367 -250 1 52 -179 113 -168 67 198 -281 -69 98 -109 148 55 -37 375
4082 375 -140 -313 73 -335 -273 123 -234 -213 -106 -256 116 151 -230 32 -5 -221 201 -43 -126 -90 4 131
$$ packed form
3923B44l13l50R4L31j18K75l87Q2K13k20K81r8O2N7k37J35L32n70K53mj12J58
3945A08J98l73J63m30J14M70m21J70o0l1K78k1o04L92R3k39M44k19J09Q2m26J65
3967c8M50m11N5R4l80J43J16n04M06J44k62J38j25J79J56k03J9K83l67J4M7L2
3989a4n5j62N0J47J21J32n04K63qj21j13L15J4P7Rk19K42n7m0K57l20k80L36j50
4013h0j29K44r8P9Pj43q3J88K33j20j52j49M86r2k13K12j00r4J49n03K89K39l62
4036a92OK92k49L3P7K5J6Jk6lL7k30N26k09j5j10k42K30J9J5J04j26J44N7j43
4061C7j28K05l19M45J27o17K51N1k31K92k81K35J31m79K12J67k07K57r3r2M12
4082C75n15j73L86m08O2L96l57K1J07j50L72L5l81K62l7k16M22k44q3L6R4J27
$$ plain form
4104 131 243 -124 237 86 -314 6 -343 -167 20 -46 -277 17 -27 129 301 196 31 44 70 251 118
4125 118 -249 49 -393 -312 24 -181 185 -64 -207 139 -49 89 124 -36 -157 345 -114 -43 324 -368 -34
4146 -34 297 -387 160 84 143 -92 -10 -162 -58 -352 73 213 -218 56 -179 44 -98 160 74 359 238 -51
4168 -51 275 -132 179 143 -6 120 -288 -284 141 60 13 -67 -218 -51 98 -188 164 52 -98 179 247 -16 107
4191 107 -79 -56 84 -249 -69 -10 -95 -21 -101 -39 12 65 1 115 245 0 121 -72 49 -99 175 67 38
4214 38 -277 -164 -254 -360 -21 -14 -140 -54 -31 -53 33 54 219 101 -252 259 79 58 238 120 60 219 -124 32
4238 32 -62 -385 -125 -218 -181 29 180 -40 34 208 89 156 -230 105 225 -165 -103 -200 -243 122 -255 -235 139
4261 139 -173 -273 192 -279 188 43 13 222 91 -105 -94 263 168 429 -219 -267 -22 -83 -137 -113 -344 -78
$$ packed form
4104A31J12l67L61j51m00L20l49J76J87o6k31K94m4J56J72j05j65J3K6J81j33
4125A18l67K98m42Q1L36k05L66k49j43L46j88J38L5j60j21N02m59P1L67o92L34
4146c4L31o84N47p6N9k35Q2j52J04k94M25J40m31K74k35K23j42K58q6K85j21k89
4168e1L26m07L11l6j49J26m08MM25q1m7q0j51J67J49k86L52j12j50K77O8k63J23
4191A07j86K3J40l33J80N9q5P4q0O2N1N3o4J14J30k45J21j93J21j48K74j08k9
4214C8l15J13r0j06L39Pj26Q6K3k2Q6K1J65j18l53N11j80k1J80j18o0J59l43J56
4238C2r4l23K60r3L7K10J51k20P4J74j19O7l86L35J20l90O2r7m3L65l77K0L74
4261A39l12j00M65m71M67j45l0K09j31j96J1L57r5K61o48m8K45o1n4K4k31K66
$$ plain form
4283 -78 -310 -227 159 11 -157 -27 -192 27 469 -85 79 7 -127 176 96 -255 93 -139 -53 -21 42 -168
4305 -168 196 -433 -171 -191 -85 106 275 98 161 81 171 185 -39 -179 262 62 179 -189 -327 147 -12 54
4327 54 -154 -181 -48 85 73 112 -54 -132 22 -3 22 197 -112 305 -24 -33 -130 109 -471 -190 48 -300 -171
4350 -171 -306 -337 302 -191 -56 153 -107 230 128 29 57 17 -286 -36 -42 48 -149 -73 -241 11 -282 -165 -264
4373 -264 -299 57 -194 143 443 -14 26 53 -22 215 175 -75 8 -26 -40 87 -381 -598 249 -242 -285 143 -71
4396 -71 -9 -33 -300 214 149 -24 264 95 73 390 2 -378 258 -179 -223 -192 -241 -114 -292 -132 61 -258 49
4419 49 168 87 291 298 211 133 97 -76 9 120 5 181 -302 -137 331 -128 3 -233 65 -97 -4 4 259 -190
4443 -190 52 46 319 -49 484 49 -58 144 -80 117 -75 -133 221 10 -369 59 -340 -239 -29 -177 171
$$ packed form
4283g8k32Q3L86j48j68J30j65K19M42n54J64p2j34L03q0l51L48k32Q6L2O3k10
4305a68L64o29K62k0J06J91J69j77O3q0R0J4k24j40M41k00J17l68j38M74j59O6
4327E4k08k7J33J33j2L9j66p8J54k5K5J75l09M17l29rr7K39n80K81K38l48J29
4350a71j35l1O39m93J35K09k60L37j02r9K8m0l03K50oR0j97P6j68K52k93J17r9
4373b64l5L56k51L37L00m57M0K7p5K37m0k50Q3l4j4J27m68k17Q47m91m3M28k14
4396g1O2k4k67N14o5j73K88j69k2L17l88l80O36m37m4L1m9J27j78J60J93l19L07
4419D9J19q1K04Pq7p8l6j73Q5J11j15J76m83J65M68m59J31k36K98j62R3QK55m49
4443a90K42oK73l68N33m35j07K02k24J97j92n8L54k11l79M28l99J01K10j48L48
$$ plain form
4464 171 77 -215 144 321 26 173 460 48 147 127 -56 83 -35 -32 -257 -12 16 -165 -531 66 35 -98
4486 -98 206 -114 475 248 164 13 -114 153 92 -147 -72 22 -214 -169 247 -185 -47 -88 -184 -137 -67 -149 309 67
4510 67 114 373 -9 300 375 -199 -35 -14 37 -178 133 -107 -38 17 -18 -1 -124 -98 342 109 460 64 -15 103
4534 103 113 -213 246 -29 -152 89 -166 -132 -34 1 -37 57 -281 -96 26 -103 134 -132 -198 185 178 -63 37
4557 37 93 175 -131 -162 -22 -52 -21 325 -104 -92 128 -107 -107 34 20 264 87 -64 9 167 -1 -24 -13 -257
4581 -257 168 30 101 170 235 105 181 -169 -14 179 -119 176 -193 -26 14 -146 -259 198 -127 11 -99 276
4603 276 110 8 26 331 82 -99 67 -543 -188 -109 -268 131 -72 63 -110 -233 41 141 -148 -32 290
4624 290 -198 -108 207 -44 58 106 -200 102 -228 -225 -121 -344 188 -22 14 194 -230 -122 -45 -322 -134 290
$$ packed form
4464A71r4k92L59J77k95J47K87m12R9k0j83J39j18Lk25K45K8j81l66N97l1j33
4486i8L04l20N89k27q4j51j27K67o1k39P5R4k36M5M16m32J38m1r6M7P0q2M58k42
4510F7M7K59l82L09P5n74J64K1N1k15L11k40O9N5l5J7j23K6M40k33L51l96p9J18
4534A03J0l26M59k75j23K41k55L4R8L5l8R4l38J85J22j29K37k66o6L83pk41J00
4557C7N6Q2l06l1J40l0L1L46m29J2K20k35%J41j4K44j77j51P3J58j68k3J1k44
4581b57M25j38P1O9O5j30P6l50J55J93k98K95l69J67M0j60j13M57l25J38j10L75
4603B76j66j02J8L05k49j81J66o10L55P9j59L99k03J35j73j23K74J00k89J16L22
4624B90m88R0L15k51J02M8l06L02l30LJ04k23N32k10L6J80m24J08P7k77J88M24
$$ plain form
4646 290 342 54 128 186 224 351 -353 23 -86 -14 268 -205 -137 126 -32 -18 -117 -59 50 -37 52 50 179 -55
4670 -55 133 13 123 -50 52 -188 -206 4 -190 -194 -244 44 -185 -287 235 -163 13 49 -156 -44 174 -40
4692 -40 38 -53 286 109 158 233 10 164 -94 167 125 -19 -132 -249 90 -337 30 -55 -227 -89 393 -69
4714 -69 -54 80 100 214 -52 138 132 -63 -39 -33 -247 -131 130 -146 -42 -189 -218 -327 33 -134 -177 74 -152
4737 -152 343 35 172 154 133 -229 12 -126 -59 46 -211 -36 109 -111 432 -228 -212 -66 -137 246 24 -194
4759 -194 191 457 6 468 -302 -19 273 -258 -269 180 -187 86 -82 140 -139 -245 -85 26 105 9 181
4780 181 214 72 8 -133 181 -66 -292 80 -42 -215 121 -63 -262 -98 -42 169 -164 -164 -123 154 1 49
4802 49 138 170 317 -2 36 -50 138 20 -17 -92 -92 35 -322 76 -16 -74 230 -13 -64 330 66 -205 -24 35
$$ packed form
4646B90N2k88P4N8L8J27p04L76j09P2K82m73O8K63j58J4r9N8J09q7Q9kJ29k34
4670e5J88j20J10j73J02k40j8K10j94mn0K88k29j02N22l98J76L6k05J12K18k14
4692d0P8r1L39j77M9P5k23J54k58K61m2j44j13j17L39m27L67q5j72J38M82m62
4714f9J5J34K0J14k66J90oj95K4Ok14J16K61k76J04j47k9j09L60j67m3K51k26
4737a52M95l08J37j8k1l62K41j38O7J05k57J75J45k20N43o60J6J46p1L83k22k18
4759a94L85K66m51M62p70K83K92n31j1M49l67K73j68K22k79j06J60J11P9r6J72
4780A81L3j42o4j41L14k47k26L72j22j73L36j84j99J64N6K11l33%M1K77j53M8
4802D9Q9L2J47l19L8q6J88j18l7p5%J27l57L98r2n8L04k43n1L94k64k71J81N9
$$ plain form
4826 35 68 -130 163 166 28 155 33 -154 -35 28 164 22 35 -169 -373 58 -133 90 116 160 131 260 39
4849 39 204 253 -84 -183 113 -11 15 -243 -1 7 -58 -76 -156 202 214 -142 107 63 -130 167 75 -191 28 38
4873 38 -150 -26 -149 123 191 -100 -11 -3 -85 5 -49 -267 263 213 14 -9 38 -55 205 -39 227 115 -290 -142
4897 -142 -91 110 126 104 -189 151 -63 -63 -14 -79 257 106 -98 233 -119 25 -129 -245 26 -50 -221 -57 10
4920 10 -138 -146 -252 -269 129 163 103 -77 55 10 109 -16 -62 -241 -286 -73 7 -33 -14 -91 119 205 -90 -40 76
4945 76 44 -7 -26 -35 20 -225 148 321 58 152 25 -347 -216 -131 142 46 148 -81 230 39 355 103 -153
4968 -153 -281 -157 -108 -66 213 124 -12 26 -220 -91 91 -151 395 -145 167 -86 -95 199 187 -169 -151 29 -321
4991 -321 171 98 -158 127 -122 -236 56 -279 132 242 69 41 -4 -3 224 42 -150 -165 25 -83 -322 -80
$$ packed form
4826C5L3j98K93Lj38J27j22j87J19O3J36j42J3k04k04M31j91K23K6M4k9J29k21
4849C9J65M9l37r9K96j24K6k58K42Qo5j8q0L58J2l56K49m4j93K97r2k66K19J0
4873C8j88J24j23K72O8k91Q9Qq2R0n4k18N30n0j99k3M7r3K60k44K66j12m05J48
4897a42N1K01J6k2k93L40k14%M9o5L36j51k04L31l52J44j54j16K71p6j71J64O7
4920A0j48qj06j7L98L4o0j80J32m5R9j25m6j79m5K13Q0m0J9p7K10Q6k95N0J16
4945G6l2n1j9rN5k45L73J73k63R4j27l72J31Q5K73r6J02k29L11j91L16k52k56
4968a53j28J24M9M2K79q9j36L8k46J29J82k42N46n40L12k53rK94j2l56J8J80l50
4991c21M92p3k56K85k49j14K92l35M11J10j73k8m5JK27j82j92j5J90j08k39K42
$$ plain form
5013 -80 -22 -211 -38 255 -174 -135 -184 -116 -28 169 252 -140 178 -24 -222 -328 -80 10 8 219 29 -179 353
5036 353 16 13 39 51 128 6 -80 53 155 287 147 51 36 302 418 201 -291 -53 -58 199 -64 -34 -13 -60
5060 -60 302 217 -19 287 108 -151 -72 -82 -294 247 136 -286 -198 235 -8 -109 78 11 155 -153 186 -302
5082 -302 -61 -35 -119 5 187 -479 243 -155 -164 17 -415 -349 -80 57 37 52 -14 -178 -74 85 226 88 -357
5105 -357 -210 -233 -120 -160 -253 -139 208 -114 24 66 -316 25 471 -81 135 33 1 277 -114 19 128 -239
5127 -239 -140 89 -154 -174 131 -80 75 421 -38 -135 -62 5 -175 41 -49 -159 -77 34 -125 141 152 125 -268
5150 -268 1 -166 -499 -141 -21 94 -81 -22 -89 139 -60 167 -138 -187 256 -247 339 270 18 -65 99 13
5172 13 66 -6 -138 522 243 -155 -68 -256 16 360 85 -64 -60 -232 216 -202 -215 167 -87 90 -14 -94 -137
$$ packed form
5013h0N8j89J73K93m29L9m9O8Q8J97Q3l92L18k02j98j06K48R0kK11j90k08N32
5036C53l37lK6J2P7j22q6J33J02J32j40r6j5K66J16k17m92K38nK57k63L0K1m7
5060f0L62q5k36L06j79k59P9j0k12N41j11m22Q8M33k43j01J87o7J44l08L39m88
5082c02K41K6q4J24J82o66P22l98rJ81m32O6K69J37k0J5o6j64J04J59J41j38m45
5105c57J47k3J13m0r3J14L47l22J38M2l82L41M46n52K16j02l2K76l91J33J09l67
5127b39R9K29k43k0L05k11J55L46m59r7P3O7j80K16r0j10Q2J11j59K66J1k7l93
5150b68K69j67l33L58J20J15j75N9o7K28j99K27l05m9M43n03N86o9k52q3J64q6
5172A3N3p2j32O60k79l98Q7j88K72L44k75j49Mj72M48m18j3L82k54J77j04q0m3
$$ plain form
5195 -137 25 42 88 212 -122 143 -244 -254 227 124 111 223 -25 95 110 168 26 211 -80 -199 190 -167
5217 -167 -29 -109 45 -154 -134 98 431 250 38 -206 136 149 96 10 44 40 -262 24 -137 132 150 -95 97
5240 97 -39 -267 35 -215 77 91 -22 -53 207 128 257 184 17 144 8 143 28 -70 -99 156 -27 -99 -58
5263 -58 -196 45 -101 -23 -12 107 151 30 78 -102 52 55 -83 -192 -178 -93 -7 -103 11 56 -27 127 -1 -97 -216
5288 -216 -156 -1 159 -49 -7 -97 -133 -77 228 -23 -154 104 99 -141 -2 54 -39 8 17 52 -14 2 217 -276 -46
5313 -46 -325 265 149 -253 -111 -424 -127 -169 177 -115 70 108 154 21 -36 160 63 20 106 114 76 -21 34 -143
5337 -143 -115 27 324 -15 -88 -104 -135 41 16 13 -222 -61 32 -136 38 -75 -406 131 -43 39 -88 -175 91
5360 91 159 -50 -107 103 -56 -9 111 -49 18 33 187 227 -141 -38 95 -11 65 40 -34 274 127 113 113 -212
$$ packed form
5195a37J62J7M6J24l34K65l87j0M81j03j3J12k48J20J5N8j42J85k91j19L89l57
5217a67J38q0J54j99K0K32L33j81k12k44L42J3n3q6L4ml02K86j61K69J8k45J92
5240I7j36k28L02k50K92J4j13l1K60p9J29p3j67J27j36J35j15r8k9K55j83p2M1
5263e8j38K41j46P8J1J19M4j21M8j80J54Lj38j09J4Q5Q6r6J14M5q3J54j28r6j19
5288b16O0J55J60k08M2r0l6N6L05k51j31K58nk40J39N6r3M7RL5o6J6K15m93K30
5313d6k79N90j16m02J42l13K97m2L46k92J85L8M6j33n7J96r7m3Q6Ql8r7N5j77
5337a43K8J42K97l39p3j6l1J76k5lk35J61R3j68J74j13l31N37j74Q2j27q7K66
5360I1O8k09n7K10j59M7J20j60O7J5J54M0l68J03J33j06P6k5p4L08j47j4%l25
$$ plain form
5384 -212 247 111 -123 151 212 25 379 122 -28 141 -191 -249 57 -240 -75 -13 156 122 -34 -201 -71
5405 -71 141 15 277 -187 32 4 -43 26 -8 -102 -139 -77 -276 -69 5 -67 263 10 -38 -148 98 36 51 -133
5429 -133 14 96 -55 21 -107 16 -34 241 205 172 -27 195 117 -160 0 249 1 -28 131 13 90 -151 -35
5452 -35 115 -61 -402 -176 18 -12 -74 246 181 -236 -85 -164 -192 -306 39 -38 -146 -147 -100 -37 -188 182 -37 -23
5476 -23 59 -42 -178 180 -64 98 115 79 176 -27 -88 -72 -133 -22 167 -167 146 92 18 -166 284 233 274 -77
5500 -77 -193 -12 41 -83 -8 37 -72 70 305 143 95 310 -271 254 101 286 -71 -218 -210 -112 -147 -79 -207
5523 -207 44 338 10 135 14 -91 65 110 67 196 -230 -65 9 115 -287 -2 156 -107 -87 -171 56 28
5545 28 -1 321 16 -59 169 112 72 135 -12 -78 129 51 -204 199 -63 -213 59 -15 -87 -125 132 63 188 119
$$ packed form
5384b12M59j36k34K74O1j87L54k57j50J69l32n8L06k97J65O2J69l4j56j67J30
5405g1K12j26K62m64K19k8m7O9l4r4l7O2j99K07P4p2L30k53m8j10K46o2J5j84
5429a33J47Q2j51P6j28J23n0K75l6l3j99K22p8k77J60K49k48k9J59j18P7k41J16
5452c5J50j76l41K26J94l0o2L20o5m17J51p9k8j14L45p7j08jM7O3j51L70k19J4
5476b3Q2j01j36L58k44J62J7l6R7k03o1J6o1J11J89l34L13n4p4j84M50n1M1l51
5500g7j16J81N3j24P5M5j09J42K35j62m8K15n81N25j53J85l57j47QR8l5O8j28
5523b07K51K94l28J25j21j05J56M5m3J29m26J65P4J06m02K85J58k63K0q4K27k8
5545B8k9L22l05p5K28n7m0O3j47o6K07p8k55M03k62j50K72p4p2l8K57o9J25o9
$$ plain form
5569 119 28 71 -23 15 -72 146 186 -52 -321 54 -57 19 -103 -245 -38 -210 58 -6 -360 112 -28 -22 387
5592 387 -32 197 -155 -61 -445 26 -51 -68 -251 -15 32 -204 -131 18 -70 33 -45 161 38 92 120 168 170 -85
5616 -85 195 -210 -115 -98 -41 -253 -170 -76 24 57 -336 104 116 -59 124 -101 -167 63 75 -122 -261 -124 269
5639 269 114 66 -87 101 -263 46 17 -173 -50 155 -65 47 -20 127 -6 466 -51 162 -182 35 113
5660 113 137 50 61 -111 -53 -62 69 235 -128 -159 -147 109 -72 89 133 132 54 29 -99 62 243 17 -134 163
5684 163 -127 199 -161 362 -70 -151 -191 -91 -61 131 46 -274 147 -154 188 -18 -22 -8 141 72 -54 66 23
5707 23 -119 243 -97 -98 60 68 88 210 -124 155 100 54 -52 28 -208 80 5 -70 262 -180 62 195 123 40
5731 40 -21 60 182 88 -320 72 -56 93 422 34 -125 -108 -26 23 386 50 -175 25 -194 -34 -32 18 38 -36
$$ packed form
5569A19r1M3r4L8q7K18M0k38k69L75j11P6j22j42K07j72K68o4l54M72j40OM09
5592C87m19K29l52R4l84M71p7j7j83K36M7k36P3J49q8J03p8K06j23N4K8M8Kk55
5616h5K80m05R5J7N7k12Q3R4J00L3l93M40J2j75J83k25o6K30J2j97j39J37L93
5639B69j55m8j53J88l64L09k9j90J23K05k20J12o7J47j33M72n17K13l44K17P8
5660A13K4q7J1j72N8rJ31J66l63l1J2K56j81J61M4jp8k5j28J61J81k26j51K97
5684A63k90L26l60N23m32q1m0J00L0J92q5l20M21l01L42k06mJ4J49o9j26J20m3
5707B3j42L62l40jJ58QK0J22l34K79n5m6j06Q0k36K88p5p5L32m42K42J33p2q3
5731D0o1Q1J22r4m08L92j28J49L29l88j59J7Q2M9L63l36k25K00k19J60KN0K0p4
$$ plain form
5755 -36 94 -67 134 -48 122 84 184 -88 110 -172 118 31 -38 71 -156 -11 -23 61 -28 114 136 156 -29
5778 -29 -144 85 14 283 92 -50 132 191 -158 -246 -67 -65 -237 -35 219 16 157 27 18 -51 -170 -219 -70
5801 -70 33 209 -155 -10 123 29 -80 2 167 -48 -28 75 8 48 97 152 -136 -33 80 50 69 -44 230
5824 230 -195 -118 101 93 91 265 80 -37 -40 9 31 67 128 31 89 -13 51 -154 -30 8 82 200 -104 -227 -246 32
5850 32 148 332 8 -134 97 -132 50 127 -69 73 -7 125 241 -171 276 59 -61 133 293 31 17
5871 17 -99 -35 26 -88 204 -65 155 -292 92 -279 -122 -9 -107 -24 -138 -87 -263 -142 -234 -102 169 -106
5893 -106 -41 122 142 189 -78 -37 40 24 237 23 204 -159 -126 -162 2 35 179 96 191 160 83 154 -31 -322 -50
5918 -50 202 189 -50 101 348 35 -90 35 -76 86 13 -309 206 -151 294 -214 126 111 -203 -114 -304 223
$$ packed form
5755c6J30j61K01j82J70l8J00k72J98k82K90q7o9J09k27J45j2Q4q9J42K2K0j85
5778b9j15K29p1K69j91j42J82N9l49q8J79Kj72K02K54k03J41j30ro9j19m9J49
5801g0J03J76l64J45J33r4j09Q2J65k15K0J03o7M0M9N5k88J03J13l0J9j13K74
5824B30m25P7K19qkJ74j85j17lM9K2L6O1r7N8j02O4k05J24L8P4J18l04j23j9K78
5850C2J16J84l24j42K31k29J82P7j96J42q0J32J16m12M47k17j20J94J60k62j4
5871A7j16O4O1j14K92k69K20m47L84l71J57J13r8Q3j14N1j76J21r2J32K71k75
5893a06O5J63K0M7k67M1P7j6K13k14J81l63L3l6J64L3J44q3R5l1p7P1j85k91K72
5918e0K52j3k39J51K47l13j25J25j11J62p3l22N15l57M45n08L40j5l14Q9j90N27
$$ plain form
5940 223 -58 60 -18 10 394 44 12 60 177 -5 7 -313 88 26 161 -144 273 -249 86 195 137 168 -73
5963 -73 311 -275 -230 -233 43 161 -198 -2 171 -58 -3 -68 -366 179 233 18 -7 14 26 73 32 125 -23 142
5987 142 65 36 -65 148 62 328 129 86 -56 -67 -255 -91 46 -122 -54 138 19 -111 100 78 -71 -8 42
6010 42 108 -10 27 -152 -238 83 -12 -138 -112 283 -152 -137 -277 14 -278 101 67 77 96 16 15 -84 184 -201 -141
6035 -141 84 -190 12 154 -351 36 171 -40 -59 -220 -69 -55 19 52 23 84 -74 -3 -49 -174 -36 -135 57
6058 57 -238 -347 53 303 170 144 -34 -27 -104 -43 -75 32 -55 -66 121 30 219 266 72 2 -214 98 -99 40
6082 40 -34 -144 -208 241 -62 255 267 75 8 -39 -25 -30 1 207 107 -189 102 -101 -16 -64 -63 33 43 -28 104 -60
6108 -60 -14 -26 -150 -39 156 -132 227 176 210 25 -68 144 -52 213 -15 -295 -34 20 -254 -54 103 295
$$ packed form
5940B23k81J18p8K8L84l50l2M8J17j82J2l20M01o2J35l05M17n22L35J09n8L1k41
5963g3L84n86M5lK76J18l59J96J73k29N5o5k98N45N4k15k5K1J2M7m1R3j48J65
5987A42p7k9j01K13q6K66j99m3j42j1j88J64J37j68O8J92j19j30K11k2j49O3N0
6010D2O6j18L7j79q6L21r5j26K6L95m35J5j40K91k92L79l4J0J9q0jr9K68l85O0
6035a41K25k74K02J42n05L87J35k11j9j61J51J4P4L3k9O1j58P1m6j25J38r9J92
6058E7k95j09M00K50j33k6j78Pp7O1l2J07q7j1J87r1J89M7j94p0k16L12j97J39
6082D0p4j10o4M49l03L17J2j92o7m7J4nL1K06j00k96K91k03Q5m8JR6J0p1J32j64
6108f0M6j2j24J11J95k88L59n1L4j85r3K12j96K65k28k80K61N4k74K00J57J92
$$ plain form
6130 295 -101 -220 114 23 36 39 48 -279 47 253 107 -128 -7 -193 129 74 -35 258 -61 27 -43 -43 -83 -94
6154 -94 -111 52 86 89 -52 121 99 -50 106 -107 31 -6 44 83 147 -107 -40 131 79 -160 47 -100 172 -195
6178 -195 157 152 285 -43 -342 -58 -9 377 -18 141 8 15 45 -86 48 43 -204 171 -106 155 -117 168 431
6201 431 -275 116 -243 29 41 -80 -225 128 -68 235 123 -62 -59 -114 -147 -75 57 -248 -12 -45 105 12 -261
6224 -261 -183 242 68 -45 -265 220 -58 -129 148 -27 -272 0 61 132 -47 133 -177 42 145 -113 196
6245 196 -216 106 53 186 171 106 -58 4 74 38 101 -47 203 51 -8 -60 -24 -17 94 -56 -31 -72 73 -239 -103
6270 -103 -58 -63 -25 76 46 72 -238 -204 67 -237 60 -44 49 -86 65 -300 -15 255 -178 114 -31 183 -113
6293 -113 -144 99 29 -333 12 -145 -60 -156 194 51 -111 -256 276 29 22 33 -210 36 -398 64 -53 -44 318
$$ packed form
6130B95l96j19L34r1J3LRl27L26K06j46k35J21j86L22n5j09K93l19Q8p0%m0j1
6154i4j7J63L4Lj41J73k2j49J56k13J38l7N0L9O4k54O7J71n2k39K07j47K72l67
6178a95L52nJ33l28k99K84M9L86l95J59j33PL0j31J34nk47L75k77K61k72K85K63
6201D31p06L91l59K72J2j21j45L53j96L03j12j85Ln5l3P2J32l05K36l3J50r3k73
6224b61P8M25j74j13k20M85k78p1K77j75k45K72O1P1j79J80l10K19J03k58L09
6245A96m12L22n3J33j5o5j64O2P0l6O3j48K50j52n9n2L6PJ11j50K5m1J45l12J36
6270a03M5nL8J01l0K6l10L4K71l04K97j04R3j35J51l65K85K70m33K92j45K14k96
6293a13l1K43p0l62L45j57Q5r6L50j43j62j45N32k47pJ1k43K46m34M62j17RL62
$$ plain form
6316 318 265 -22 368 10 176 22 -128 196 25 -303 58 -80 -27 191 -159 90 -208 61 134 247 138
6337 138 -45 -45 0 221 -155 -329 -56 -35 -122 -6 -110 189 160 140 98 98 116 -62 -484 -68 49 -92 -70 274
6361 274 -110 57 78 -30 -137 223 -256 122 -110 295 82 144 -33 -40 200 197 1 6 151 88 -105 -249 -36
6384 -36 29 -35 -227 6 -151 67 60 78 -248 -145 -78 43 112 237 222 -47 47 -225 263 -120 -46 -136 98 61
6408 61 -238 173 333 8 21 -246 233 72 44 121 32 -122 -269 90 -223 -269 -84 -89 -323 -243 70 67 12 44
6432 44 145 -223 -168 28 62 -158 19 241 18 -131 75 62 -78 86 201 -139 -39 -27 -117 25 -77 17
6454 17 269 -150 -23 -82 -55 -35 -60 20 0 -151 45 -239 73 47 -111 -111 -32 -107 51 229 -297 41 31 233
6478 233 -42 29 -97 3 200 -83 387 131 -33 -15 266 65 -236 -324 101 -10 121 -82 -39 -4 -10 -107 182
$$ packed form
6316C18n3k87L90l58J66j54j50L24j71l28L61j38N3K18l50K49k98K69P3J13j09
6337A38j83%M5K21l76j74K73K1q7J16j04K99k9k0m2%J8j78m22M16J17j41K2L44
6361B74l84J67K1j08j07L60m79L78k32M05k13O2j77pK40lj96NJ45o3j93j44K13
6384c6O5o4j92K33j57K18pJ8l26J03O7J21O9J25j5k69R4k72M88l83P4r0K34l7
6408F1k99M11J60l25J3k67M79j61k8P7q9j54j47L59l13m6J85nk34Q0L13ln5L2
6432D4J01l68N5J96L4k20J77K22k23j49K06j3j40J64J15l40J00J2r0J42j02R4
6454A7K52m19J27n9K7K0k5Q0k0j51J96k84L12k6j58%P9p5J58J78n26L38j0K02
6478B33k75P1j26J00J97k83M70k56j64J8K81k01l01q8M25j11J31k03M3L5or7K89
$$ plain form
6501 182 224 -38 117 113 54 44 71 25 -140 -51 82 -89 -178 -156 139 -70 159 113 25 -152 -19 197 90 -111
6525 -111 -120 89 439 -20 50 54 64 -47 43 87 -167 0 56 302 -85 105 62 -168 166 280 -173 61 89 108
6549 108 -112 -208 359 -73 -136 -123 -130 -376 226 155 -46 -7 -81 -55 163 87 77 -265 131 36 199 141 32 85 207
6574 207 -59 -72 -194 76 55 48 44 41 -119 39 74 -144 84 -242 -93 -60 -18 -208 218 17 -52 54 -70 17
6598 17 -13 92 252 112 123 19 253 -93 151 -226 68 1 96 197 125 -37 123 121 26 -51 -197 -107 257 46
6622 46 157 67 121 -101 89 205 28 -231 -58 -273 167 -99 11 158 -226 -182 42 73 -199 138 -129 -168
6644 -168 51 24 -266 -18 -278 110 -121 -65 -230 157 -182 49 210 -61 125 -19 44 292 -51 150 37
6665 37 72 10 168 62 -80 121 63 -129 -141 175 -382 -47 -122 -24 146 2 -58 234 271 68 -231 -215 -110
$$ packed form
6501A82M2k62J55mn9j0K7m6j65Q9J33j71q9K2K95k09K29m6q8j77J33K16j07k01
6525a11rK09L50m59P0MJ0j11R0M4k54J67N6K46l87J90m3k30L34J14m53K34K8J9
6549A08k20r6N67m32o3J3pk46O02p1k01L9p4K6K18p6j0l42L96r5J63n8j09N3J22
6574B07k66j3j22K70k1pmlj60J58L5k18K28l26J49L3M2j90M26k01o9J06j24Q7
6598A7l0J05J60j40J1j04K34l46K44l77K94o7R5J01p2j62J60kr5p7j46R0L64k11
6622D6J11r0N4k22J90J16j77k59J73k15M40k66J10J47l84M4K24L1k72L37k67l9
6644a68K19k7k90K48k60L88k31N6j65L87l39K31J61k71J86j44O3K48l43K01j13
6665C7L5o2J58j06j42K01n8j92j2L16n57L35p5R8J70j44o0K92L7k03k99J6J05
$$ plain form
6688 -110 -107 -36 150 -106 161 -99 -168 -52 44 214 85 220 -149 -484 -55 22 -168 80 -76 228 -302 1
6710 1 166 111 19 -319 117 184 240 -42 -133 46 -6 2 -20 76 111 -193 44 -253 -9 112 153 123 157 -166 60
6735 60 -10 -93 -68 -28 -74 38 41 45 190 144 -75 243 -174 -374 21 -34 274 44 129 130 -92 186 -259 -15 20
6760 20 -186 -76 -152 -179 79 -82 -41 85 -93 259 46 -223 -59 92 23 111 122 -124 128 -42 31 331 71
6783 71 -69 7 -236 -29 -282 63 121 -130 20 63 -294 132 119 260 162 70 167 -13 -233 -136 -90 3 -214 -192
6807 -192 187 -229 233 121 -81 -44 -23 42 137 20 71 -14 -133 -17 -22 -116 41 -25 2 -221 -19 45 -78 72
6831 72 13 -203 -9 -170 -223 -154 -176 4 -9 -70 -56 102 -198 305 -116 -191 -4 106 -100 -149 132 -103 -190 195
6855 195 -71 -42 -1 -16 -378 -214 -141 175 -255 -42 160 -311 -98 421 -266 -1 -119 64 -206 -247 139 -189
$$ packed form
6688a10LP1J86k56K67k60o9J16R6J70j29J35l69l35M29P7j90K48j56L04n30L03
6710AJ65n5r2l38M36O7N6k82r1J79n2Qk2R6L5l04K37k97K44J21M1l0L4l23K26
6735F0p0q3K5M0m6J12LMJ45m6k19L18m17k00L95n5L08k30Q5Jk22K78m45K44L5
6760B0k06J10p6k7K58j61M1J26j78L52k13k69J64J51o9Q8J1k46K52j70P3L00k60
6783G1j40P6k43K07k53L45N8k51J50M3l57M26j3J41r8r2R7j80k20R7M6R3k17K2
6807a92L79m16M62j12k02L7K1O5R5j17N1q5j19J16nr4J57o6K7k23K02O4j23J50
6831G2n9k16J94j61n3O9k2J80j3o1J4J58l00N03m21p5J87J10k06m9K81k35q7L85
6855A95k66K9M1j5l62J64P3L16m30K13K02m71K13N19o87K65j18J83k70m1L86l28
$$ plain form
6877 -189 99 5 -150 -184 29 100 -92 -72 -165 -96 -126 100 74 -55 74 144 -92 140 -79 -125 -22 -178 -153 141
6901 141 -145 23 -128 -54 113 44 6 -24 113 -96 112 82 156 55 -207 -82 -83 -22 -77 98 233 -39 59 188
6925 188 -47 69 146 94 -123 -84 202 -46 -383 -19 -50 83 -62 104 118 -145 78 -42 147 -47 75 5
6947 5 113 167 223 83 8 -171 11 87 -91 -160 -177 -82 -112 -283 112 -42 -337 -8 -201 -188 8 -12 8 177
6971 177 51 -75 -165 16 -11 82 144 -51 -228 -323 -106 -99 -158 -284 -77 -20 -55 207 211 26 -393 132 -287 3
6995 3 -138 198 4 -84 298 -3 -142 -38 96 101 -127 -149 1 65 345 128 -169 -132 203 -67 -310 -7 -76
7018 -76 -159 159 -44 -66 17 -117 -105 50 249 35 178 -78 -191 -126 -165 -178 -3 -29 163 173 -99 89 4 -107
7042 -107 -56 206 -161 115 219 -324 51 -124 137 -138 71 131 -108 6 -242 59 -231 154 -204 -31 275
$$ packed form
6877a89K88r4j55l4K13P1j92K0r3O9l0K26k6j29J29P0k36K32k19m6J03j56K5K94
6901A41k86J68j51P4J67o9l8l0J37k09K08l0P4j01k62J25jO1n5J75J35k72R8J29
6925A88k35J16P7n2k17L9K86k48l37L64l1J33j45J66J4k63K23j20J89j94J22p0
6947EJ08N4N6j40p5j79J82P6j78o9j7R5l0j71L95j54k95L29j93J3J96k0K0J69
6971A77j26j26r0J81k7R3O2j95j77r5K17Pn9j26K07N7l5K62Mj85m19N25m19K90
6995Cj41L36j94q8L82l01j39J04J34Nk28k2J50O4K80k17k97L7L35k70k43L03o9
7018g6q3L18k03k2Q3j34J2J55J99k14J43k56j13O5l9j3J75k6J92J0k72J88q5j11
7042a07N1K62l67K76J04n43L75j75K61k75K09O0k39J14k48L01k90L85l58J73L06
$$ plain form
7063 275 163 -36 21 17 -169 -114 66 -242 84 70 62 142 -245 7 214 21 -278 82 -199 -60 -89 -74 2 -113
7087 -113 97 -96 -22 135 102 96 -121 27 113 66 132 337 -206 133 -213 -224 -115 -72 -357 13 229 29 -285
7110 -285 -115 90 -24 -308 -103 215 -64 -227 213 -44 -227 111 -66 -191 -1 135 40 151 -124 202
7130 202 -330 -207 131 30 -12 -34 -54 56 152 -22 -75 149 143 42 -14 -248 -124 161 -71 -162 83 33 -24 14
7154 14 -149 226 56 -63 113 -184 62 4 -242 216 -261 -65 15 -26 -61 -56 57 -80 56 -18 -12 -170 -181 87
7178 87 97 135 -126 276 -53 118 -80 -84 281 28 -39 68 89 31 216 249 -3 190 245 87 -53 56 -311
7201 -311 -134 30 5 53 21 -197 -46 -62 126 -117 -65 -32 160 -124 -167 115 -467 -35 57 -79 -93 -172 -185 172
7225 172 -219 -190 165 -75 -155 -62 -415 -305 301 44 16 27 -73 -81 -3 171 84 116 280 6 163 174 -34 172
$$ packed form
7063B75j12j99N7mj86N5J80l08L26j4qQ0l87K52K07j93k99L60k81J39k9J5P6j15
7087a13K10j93P4J57l3ok17J48Q6m7O6K05n43L39l46j1J09M3k85L70K16k00l14
7110b85J70K05j14k84K05L18k79j63M40k57j83L38j77j25J90J36r5J11k75L26
7130B02n32J23L38j01m2k2k0J10R6j74n3K24oj01n6k34J24K85k32r1K45n0n7L8
7154A4j63L75j70j19J76k97K46n8k46M58m77J96Q0m1l5NJ13j37J36p4Oj58j1K68
7178H7J0L8k61M02l29J71j98mL65k53o7J07K1n8J85L3k52J93N5j58j40J09l67
7201c11J77J64k5M8l2k18J51j6J88k43N2L3J92k84m3K82n82M32R2j36j4p9j3L57
7225A72l91K9L55k40q0R3l53J10O06k57k8J1j00qP8J74q7L2J64k74J57J1k08K06
$$ plain form
7249 172 158 9 45 -4 62 28 49 -160 -11 26 84 -362 101 52 186 -125 284 -10 93 102 -42 -148 -94 -253
7273 -253 110 -201 -94 -147 81 166 -163 -402 87 189 -128 6 -187 -7 -37 -104 339 125 -132 -3 122
7294 122 7 -173 42 64 -57 119 -135 -10 -119 -378 38 -74 14 -216 -125 140 25 53 -156 140 -313
7315 -313 -175 47 -137 -213 9 -30 -85 59 -172 64 282 65 41 139 224 162 -127 -46 -165 68 333 -14 -15
7338 -15 -131 197 -146 -196 -249 35 186 -52 -130 93 36 -154 -101 -29 1 31 156 36 40 -135 133 104 -169 -157
7362 -157 14 106 -201 48 46 -135 -137 -73 -177 -436 -3 -149 114 -93 -30 132 293 149 116 -96 70 21 150
7385 150 156 289 176 76 188 183 -107 345 -129 -362 -365 -85 105 5 129 -133 16 5 281 54 213 -169
7407 -169 -53 -187 105 6 86 20 -84 121 94 204 -215 -130 -108 73 -32 -10 -149 -70 340 60 29 218 -211
$$ packed form
7249A72j4j49L6m9O6l4K1k09J49L7N8m46M63m9J34l11M09k94J03Rj44j06N4j59
7273b53L63l11J07n3K28Q5l29k39M89J02l17J34j93J80l0o7M43k14k57J29J25
7294A22j15j80K15K2j21J76k54J25j09k59M16j12Q8k30R1K65j15K8k09K96m53
7315c13J38K22j84p6K22l9n5J44k31K36K18k17k4R8Q5o2k89Q1j19K33K65l47j
7338a5j16L28l43n0n3K84J51k38p8K23n7j90N3P2L0L0J25j20Mj75K68k9k73J2
7362a57J71R2l07K49kj81kO4j04k59M33j46K63k07O3J62J61j44l3k12J66m9J29
7385A50OJ33j13j00J12nk90M52m74k33lK80J90j00J24k62J49j1K76k27J59l82
7407a69J16j34K92r9Q0o6j04K05k7J10m19Q5K2J81j05K2j39P9M10k80l1J89m29
$$ plain form
7430 -211 101 14 -71 -108 98 -195 -62 184 -69 309 187 -221 -53 -15 84 -163 -100 102 109 -112 -83 -162 -168 222
7454 222 -60 126 -19 -19 -277 -41 52 83 -25 -59 -239 61 -27 -68 -6 93 222 35 85 -106 14 91 -104 -132
7478 -132 -46 99 -65 99 316 16 -92 -135 5 -49 133 44 -20 10 193 3 -187 -141 33 -342 -56 -45 176
7501 176 238 -108 30 146 -123 233 -19 219 -109 151 -146 225 105 -7 130 -215 12 -61 64 125 68
7522 68 -97 1 -166 107 17 106 -205 -111 7 -115 239 49 20 -179 140 10 -312 49 -46 71 283 -189
7544 -189 -290 109 -45 148 107 177 -157 153 49 -17 44 -106 207 55 45 47 20 -235 240 -83 -128 -110 -60 154
7568 154 -227 -66 -241 -17 80 -39 -207 215 376 -7 112 380 94 -140 -78 -220 20 69 -214 69 -135
7589 -135 -8 -234 179 -99 -140 -45 175 115 104 113 -143 23 77 13 -125 -5 -214 105 6 -395 221 -13 -79
$$ packed form
7430b11L12q7q5l7K06k93J33K46k53L78j22m08J68L8R9k47O3K02Pk21K9p9oL90
7454B22k82J86j45%k58K36R3L1j08l4j80L00q8m1O2R9J29j87N0j91J20P7j95k8
7478a32Q6J45j64J64K17l00j08m3J40n4J82q9o4L0J83j90j90M6J74l75K86J1K21
7501A76O2l46J38J16k69L56k52K38l28K60k97L71j20j12J37l45K27p3J25O1n7
7522F8j65R8j67K73r0Q9l11R4J18j22L54j90k9j99L19j30l22L61r5J17K12m72
7544a89j01L99j54J93m1P0l34L10j04o6O1j50L13j52j0Kk7k55M75l23m5J8N0K14
7568A54l81J61j75K24R7j19j68M22J61l83J19K68k86k34O2j42K40M9k83K83k04
7589a35J27k26M13k78m1R5K20o0j1Rk56J66N4o4j38J20k09L19r9m01O16k34o6
$$ plain form
7612 -79 -89 61 72 192 -111 116 127 22 -74 330 4 21 194 116 38 5 -162 -105 160 130 -108 -31 -202 60
7636 60 23 52 -144 -13 12 31 -310 71 -254 30 -97 -221 -175 -128 107 -131 -22 106 39 101 -105 -6 -68 -5
7660 -5 182 -217 35 259 72 -15 -216 222 183 49 -118 71 135 124 68 -35 133 245 -71 104 36 -96 73
7683 73 -157 -316 211 73 -151 -109 -215 -112 75 -223 -62 -136 116 43 -72 83 125 -101 -35 150 137 -66
7705 -66 -36 -143 -41 75 160 290 -183 89 109 77 -77 -40 -158 189 81 -223 -97 292 56 145 53 -76 -9
7728 -9 54 -97 209 -25 384 61 195 181 153 115 165 112 -129 167 32 -176 -11 42 168 -185 277 125 6
7751 6 -2 -27 13 34 192 16 -119 17 42 124 150 182 -4 -157 -53 156 -138 18 185 -107 -207 -14 151 86
7775 86 106 -69 195 142 -119 -5 -207 -273 16 -41 -184 150 341 33 60 -23 171 106 -186 -142 -108 -140 -89 -209
$$ packed form
7612g9j0J50J1J20l03K27J1j05r6M04l26J7J73p8p8l3j67N7K65l0k38P7j71K62
7636F0l7K9j96J31K5J9l41L81l25K84j27j24M6M7K35k38J09J28o7O2k06R9o2O3
7660eJ87l99K52K24j87q7k01M38l9j34j67J89O4j1n6j03J68J12l16J75o8j32J69
7683G3k30j59N27j38k24M2j06J03J87k98J61p4K52p3j15J55M2k26O6J85j3k03
7705f6L0j07J02J16Q5J30m73K72K0l2j54L7j18L47j08l04J26L89k36Q9r2j29O7
7728iO3j51L06k34M09l23J34j4k8l8N0n3k41K96j35k08J65N3J26l53M62j52j19
7751Fqk5M0K1J58j76j35J36K5Q2K6L2j86j53J04K09k94J56J67k92j00J93J65o5
7775H6K0j75K64n3k61J14k02o6K89n7j43L34J91l08K7q3J94o5k92M4L4l2N1j20
$$ plain form
7799 -209 152 -86 85 -30 -394 -2 22 -241 -92 -78 -23 27 -42 85 -287 -92 253 26 -210 2 23 -116
7821 -116 -116 -94 -53 -61 -6 16 122 -132 -196 241 -177 -119 378 -83 -52 217 27 128 59 54 166 -209 -4 443 -294
7846 -294 -120 86 -77 23 39 8 -210 -58 67 173 -330 141 -61 -228 -68 -142 -217 22 108 -245 8 -33
7868 -33 -225 163 202 -66 -114 150 -167 26 -3 -7 -43 -169 -127 116 51 140 -12 19 27 -53 39 129 172 199 11 15 -197
7895 -197 55 130 197 -122 189 157 -139 78 -80 95 67 81 43 20 188 -1 101 -154 -54 123 -286 206
7917 206 51 -1 -113 -52 7 2 -120 47 67 -40 -236 185 -228 82 -29 -47 276 -144 335 138 -122 72
7939 72 98 101 -354 -180 -139 122 -97 -218 -45 -206 46 12 153 -99 180 64 -10 108 -139 -289 69 -21 -11
7962 -11 158 -152 26 34 -123 -60 -7 270 171 -59 -86 89 164 6 125 -176 55 187 -100 -63 -246 -318 -274 -155
$$ packed form
7799b09L61k38J71j15l64L92K4k63J49J4N5N0o9J27l72J95L45k27k36K12K1j39
7821a16%K2M1qN5K2J06k54o4M37m18N8M97m61L1K69j90J01o9nJ12l75K05M47p37
7846b94J74K06j63J00J6l1k18J52J25J06n03M71k02j67J60p4p5K39Q6l53K53m1
7868c3j92L88L9k68m8K64l17J93k9ml6j26M2K43o5Q9j52L1Qq0R2R0M3K7j88Mk12
7895a97K52P5O7l19L11l2k96K17j58J75k8J4l8k3J68j89J02k55J00J77m09M92
7917B06j55n2j12O1N9nj22J67K0j07j96M21m13L10j11j8L23m20M79j97k60J94
7939G2K6Lm55J74M1K61k19j21J73j61K52l4J41k52K79j16p4J18k47j50L58r0J0
7962a1J69l10J78Qj57O3N3K77r9k30k7J75P5j58J19l01K31J32k87L7j83p2M4J19
$$ plain form
7986 -155 -220 89 -359 -6 -103 -49 51 221 -70 -191 5 -51 -311 95 -146 -85 45 320 -106 -133 169 -29
8008 -29 -179 124 -130 85 -47 -241 115 -147 101 56 195 -189 -129 -252 -167 -43 50 -106 -199 -120 43 116 -242
8031 -242 40 22 -68 129 -18 -273 116 -84 76 66 62 -53 97 63 26 119 4 -169 -259 32 -240 -156 293
8054 293 242 -48 -212 -81 -1 277 -143 -265 37 -38 -61 -102 179 165 69 -5 -79 -134 104 132 -250 2 -159 204
8078 204 364 -148 102 224 16 0 85 -284 155 -150 -107 32 170 -79 -216 20 -144 -4 -195 201 -89
8099 -89 123 -54 46 260 -161 -8 -5 71 389 -308 323 120 64 -354 -127 53 -129 -137 101 400 -104 -51 86
8122 86 145 223 -49 -177 331 -43 -214 329 -81 272 113 -136 -249 154 181 53 -49 -24 -24 -226 -85 470
8144 470 10 -183 -129 -285 139 60 140 -168 305 41 197 -93 -187 -120 -306 187 150 -86 296 -80 141 298
$$ packed form
7986a55o5L09m48L53r7N4J00J70k91j21J96n6k60M06k41O1J30K75m26k7L02j98
8008b9j50L03k54K15j32j94L56k62K48m5J39l84O0j23Q5J24R3j56r3P9J63P3l58
8031b42K82j8r0J97j47k55L89k00J60j0mj15J50l4l7R3j15j73r0K91k72Q4M49
8054B93n1k90j64J31Q0K78m20j22L02p5k3m1K81j4r6p4p4n5K38K8l82K52j61L63
8078B04J60n12K50J22k08j6Q5l69M39l05M3J39J38k49j37K36j64J40j91L96k90
8099h9K12j77J00K14m21J53LP6L18o97O31k03n6m18K27J80j82qK38K99n04N3J37
8122H6N9P8k72j28N08l74j71N43m10L53j59k49j13M03K7j28j02K5%k02J41N55
8144D70m60j93N4j56M24p9Q0l08M73k64J56k90r4O7j86M93l7k36L82l76K21J57
$$ plain form
8166 298 164 214 93 150 34 -46 -56 101 6 348 -6 111 119 271 -94 319 245 -38 -81 -5 -78 -20 73 -215
8190 -215 56
$$ packed form
8166B98j34N0j21N7j16q0j0J57r5L42l54J17QJ52l65M13p4k83m3P6p3N8R3k88
8190b15K71
8191E6
$$ Imaginary data points
##PAGE= N=2
##DATA TABLE= (X++(I..I)), XYDATA
$$ plain form
0 0 0 0 0 0 0 0 8 -8 8 -8 15 -16 16 -24 32 -40 48 -64 72 -89 110 -129 152 -184 215 -248 289 -334 385 -441
30 -441 505 -575 653 -740 835 -941 1058 -1187 1324 -1477 1643 -1828 2026 -2246 2482 -2741
46 -2741 3026 -3337 3678 -4051 4463 -4915 5420 -5981 6610 -7318 8124 -9048 10126 -11397
60 -11397 12920 -14793 17151 -20236 24454 -30601 40442 -58766 104655 -471871 -596450 216173
72 216173 -116983 -411679 -246129 222155 231387 116500 139275 229322 179625 322676 388581
83 388581 171328 -52994 116542 340806 142131 -375190 -478165 -203447 -114236 -266597
93 -266597 -293051 -177481 -56005 -16727 45240 105307 94950 157982 310209 258029 95320
104 95320 115595 259672 281474 140210 -6338 -92846 -218078 -259222 -154881 -180706 -331725
$$ packed form
0@%%%%%%Qj6J6j6K3l1L2m0N6p2Q8j12J36j61J99k39K81l36L99m63N37o23P19q26
30d41R46j080J228j393J575j776J999k245K511k801L120l471L854m272M728n223
46b741N767o363P015p729Q514r378J0335j1401J2591j3928J5442j7172J9174k1523
60a1397K4317k7713L1944l7387M4690n5055P1043r9208J63421n76526j24579Q12623
72B16173l33156k94696J65550M68284R232j14887K2775R0047m9697J43051O5905
83C88581k17253k24322J69536K24264j98675n17321j02975K74718Q9211j52361
93b66597k6454J15570J21476L9278O1967O0067j0357O3032J52227n2180j62709
104I5320K0275J44077K1802j41264j46548q6508j25232m1144J04341k5825j51019
$$ plain form
115 -331725 -291683 -94111 -8572 -64757 -31815 150365 202485 76022 42213 100579 114595
126 114595 152134 233933 221229 42885 -103671 -13267 64209 -125696 -296376 -213427 -99772
137 -99772 -150987 -216924 -87568 91525 77231 3557 33681 54376 51945 127787 221516 202875
149 202875 94228 67658 123301 68020 -55467 -74872 -66416 -138800 -220310 -199073 -86635
160 -86635 -24553 -41651 -32809 -10377 -17105 -9339 29680 87692 130216 123301 102557 86090 83511
173 83511 122146 118156 17497 -83845 -124242 -128383 -134151 -143507 -104768 -48642 -46867 -57691 -45172
186 -45172 -13677 51358 102814 89464 44966 33349 97121 160225 127027 70507 49832 9216
198 9216 -61800 -123250 -124404 -70701 -54922 -82150 -90456 -79960 -42553 10725 29575 21716 7128
$$ packed form
115c31725M0042J97572Q5539n6185L2942J82180N2120j26463l3809N8366J4016
126A14595L7539Q1799j2704j78344j46556R0404P7476j89905j70680Q2949J13655
137i9772n1215o5937J29356J79093j4294p3674L0124K0695k431P5842R3729j8641
149B02875j08647k6570N5643n5281j23487j9405Q456p2384q1510K1237J12438
160h6635O2082j7098Q842K2432o728P766L9019N8012M2524o915k0744j6467k579
173H3511L8635l990j00659j01342m0397m141n768r356L8739N6126J775j0824J2519
186d5172L1495O5035N1456j3350m4498j1617O3772O3104l3198n6520k0675m0616
198I216p1016o1450j154N3703J5779k7228q306J0496L7407N3278J8850p859j4588
$$ plain form
211 7128 11138 57190 90660 102200 134976 136108 73736 -4680 -57805 -54552 -40740 -68379 -89598
224 -89598 -95006 -97104 -65527 -27713 -4357 17904 10948 -5405 -636 10990 57742 109871 107115
237 107115 80027 46286 14001 14408 8894 -10663 -24466 -65014 -97367 -83554 -63044 -31800
249 -31800 -3137 -7348 -14795 -26905 -31673 11549 49764 63981 77843 59531 35880 44257 51101
262 51101 53598 28604 -32638 -63575 -71564 -76421 -46888 -18492 -8718 -5266 -34108 -53025 -29551
275 -29551 -6286 24517 43218 21389 18539 41735 63085 85048 68329 31801 10372 -31471
287 -31471 -61187 -42769 -24759 -12400 -15409 -49137 -61423 -53786 -35600 3571 11803 -4323 5591
300 5591 14240 31495 66167 77530 77571 56743 6157 -13956 -11804 -13142 -3317 -14988 -43609 -55034
$$ packed form
211G128M010M6052L3470J1540L2776J132o2372p8416n3125L253J3812k7639k1219
224h9598n408k098L1577L7814K3356K2261o956j6353M769J1626M6752N2129k756
237A07115k7088l3741l2285M07n514j9557j3803m0548l2353J3813K0510L1244
249c1800K8663m211p447j2110m768M3222L8215J4217J3862j8312k3651Q377O844
262E1101K497k4994o1242l0937p989m857K9533K8396R774L452k8842j8917K3474
275b9551K3265L0803J8701k1829k850K3196K1350K1963j6719l6528k1429m1843
287c1471k9716J8418J8010J2359l009l3728j2286P637J8186L9171Q232j6126R914
300E591Q649J7255L4672J1363M1k0828n0586k0113K152j338R825j1671k8621j1425
$$ plain form
314 -55034 -65866 -50623 -14068 -9837 -14060 -16367 -29257 -11503 26739 57957 82831 71324 45415
327 45415 36688 17193 9391 20419 4310 -23529 -48899 -68056 -51671 -26935 -17583 -11959 -30800
340 -30800 -50778 -37484 -15557 17411 54148 60861 57736 46336 26936 34597 46194 33825 12041
353 12041 -22619 -46580 -41034 -33682 -19885 -11583 -33909 -50496 -51753 -47270 -17850 15879 33976
366 33976 40253 26251 21234 40555 52554 58378 51148 16447 -12208 -25042 -27513 -12798 -9812
379 -9812 -24384 -37870 -55459 -57151 -35929 -15740 4385 11780 -67 848 14827 36001 66364
392 66364 72502 49707 21717 -4239 -7242 2685 827 -4604 -21037 -45168 -48329 -42833 -36933 -20198
406 -20198 -12559 -16395 -23388 -25637 4806 48299 66341 64139 42073 17257 17297 22929 23052 19566
$$ packed form
314e5034j0832J5243L6555M231m223k307j2890J7754L8242L1218K4874j1507k5909
327D5415q727j9495p802J1028j6109k7839k5370j9157J6385K4736R352N624j8841
340c0800j9978J3294K1927L2968L6737O713l125j1400j9400P661J1597j2369k1784
353A2041l4660k3961N546P352J3797Q302k2326j6587j257M483K9420L3729J8097
366C3976O277j4002n017J9321J1999N824p230l4701k8655j2834k471J4715K986
379i812j4572j3486j7589j692K1222K0189K0125P395j1847R15J3979K1174L0363
392F6364O138k2795k7990k5956l003R927j858n431j6433k4131l161N496N900J6735
406b0198P639l836o993k249L0443M3493J8042k202k2066k4816M0N632J23l486
$$ plain form
420 19566 -2498 -22888 -31889 -44327 -45272 -34966 -24552 -17245 -35811 -55042 -28873 14162 44862
433 44862 53242 35032 24038 29281 34163 44818 42066 21731 9754 -8813 -32026 -39364 -39438 -23243
447 -23243 -8710 -36728 -67582 -59945 -23844 17090 23834 10346 18764 28378 34305 51777 53899
460 53899 47264 39059 14207 -8465 -25985 -35184 -11253 2919 -26360 -59548 -70299 -44317 -6163
473 -6163 -6174 -12258 1413 7746 17830 31867 41949 59327 57118 33160 16195 -4705 -11048 10399
487 10399 13188 -7462 -37738 -65702 -52826 -27723 -27243 -23507 -15753 -11971 -3992 -3226 17438 56740
501 56740 58120 36650 26863 18031 19492 20980 16381 18743 -6164 -45806 -47265 -34281 -27365 -20049
515 -20049 -22715 -22554 -29179 -41257 -9087 35113 34811 23819 26111 35842 39807 23071 24494 46057
$$ packed form
420A9566k2064k0390r001j2438r45J0306J0414P307j8566j9231K6169M3035L0700
433D4862Q380j8210j0994N243M882J0655k752k0335j1977j8567k3213p338p4J6195
447b3243J4533k8018l0854P637L6101M0934O744j3488Q418R614N927J7472K122
460E3899o635q205k4852k2672j7520r199K3931J4172k9279l3188j0751K5982L8154
473f163j1o084J3671O333J0084J4037J0082J7378k209k3958j6965k0900o343K1447
487A0399K789k0650l0276k7964J2876K5103M80L736P754L782P979P66K0664L9302
501E6740J380k1470r787q832J461J488m599K362k4907l9642j459J2984O916P316
515b0049k666J61o625j2078L2170M4200l02j0992K292R731L965j6736J423K1563
$$ plain form
529 46057 24908 -17004 -34949 -34660 -20020 -12724 -20034 -25799 -47178 -58228 -24240 5222 7712
542 7712 9550 17645 34184 34857 15762 27981 54657 47817 18663 -14873 -25874 -4791 2892
555 2892 -7875 -23668 -48700 -54402 -36702 -23822 -11998 -6955 -2863 16561 19365 6187 18960
568 18960 48686 67861 49975 1958 -12550 9654 16133 2845 -18323 -36162 -39517 -42210 -36171
581 -36171 -18933 -18754 -17642 -405 448 -10911 -3980 31835 70377 57466 13282 5079 21231
594 21231 25017 14756 -1680 -10623 -21011 -36996 -33943 -24599 -27015 -21525 -12792 -18767 -27487 -21715
608 -21715 13941 50797 45293 22393 15992 19884 26871 25779 18234 13089 -4401 -23089 -25054 -25123
622 -25123 -21811 -15406 -18969 -25589 -31937 -31967 -9329 16193 26407 24461 10563 7324 23517 32777
$$ packed form
529D6057k1149m1912j7945K89J4640P296p310n765k1379j1050L3988K9462K490
542G712J838Q095J6539O73j9095J2219K6676o840k9154l3536j1001K1083P683
555B892j0767j5793k5032n702J7700J2880J1824N043M092J9424K804j3178J2773
568A8960K9726J9175j7886m8017j4508K2204O479j3288k1168j7839l355k693O039
581c6171J7238J79J112J7237Q53j1359O931L5815L8542j2911m4184q203J6152
594B1231L786j0261j6436q943j0388j5985L053R344k416N490Q733n975q720N772
608b1715L5656L6856n504k2900o401L892O987j092p545n145j7490j8688j965o9
622b5123L312O405l563o620o348l0K2638K5522J0214j946j3898l239J6193R260
$$ plain form
636 32777 33676 29050 12733 -1909 -14397 -19614 -10605 -9937 -16554 -16970 -26287 -36359 -28654 -9249
650 -9249 12227 13243 -4507 -3834 12281 25094 36015 34287 25872 15327 -2422 -6686 840 -2475
664 -2475 -2190 -2518 -18498 -33497 -37096 -22042 914 -2451 -14972 -11443 -6278 7290 26015 30251
678 30251 30363 22569 8333 7036 5530 5628 15190 9088 -8409 -21714 -32738 -23051 -5327 -8116
692 -8116 -13729 -19437 -23641 -8442 6087 14485 24337 20627 15323 14621 6663 13208 26183 18430 5468
707 5468 -11157 -25428 -17038 -6928 -5504 -7286 -22000 -27706 -17314 -13524 -1722 14399 14963 14678
721 14678 9734 2858 15439 25394 23550 17552 -2774 -14039 -7150 -4595 654 976 -14407 -20503
735 -20503 -23058 -26296 -11973 1417 7075 10500 204 -1490 12686 18935 25535 23329 4789 -2664
$$ packed form
636C2777Q99m626j6317j4642j2488n217R009O68o617m16r317j0072P705J9405
650i249K1476J016j7750O73J6115J2813J0921j728q415j0545j7749m264P526l315
664b475K85l28j5980j4999l599J5054K2956l365j2521L529N165J3568J8725M236
678C0251J12p794j4236j297j506R8R562o102j7497j3305j1024R687J7724k789
692h116n613n708m204J5199J4529Q398R852l710n304p02p958O545J2975p753j2962
707E468j6625j4271Q390J0110J424j782j4714n706J0392L790J1802J6121N64k85
721A4678m944o876J2581R955j844n998k0326j1265O889K555N249L22j5383o096
735b0503k555l238J4323J3390N658L425j0296j694J4176O249O600k206j8540p453
$$ plain form
749 -2664 -3703 -4533 4726 4972 -3407 -9132 -21851 -24963 -12963 -5716 3432 4822 -7799 -8282 -546
764 -546 6599 20842 21271 11209 5645 -3198 -1410 8774 7917 7225 1942 -14227 -17982 -14071 -8759
779 -8759 2222 -192 -10069 -12329 -12500 -2322 14298 16562 15410 9295 -2642 -928 4479 6564
793 6564 12490 7234 -4770 -9320 -11647 -4482 5340 855 -5457 -12832 -20190 -10845 894 6998 12425
808 12425 6833 -1487 -1495 -499 8546 17201 12325 5254 -3258 -9442 -1810 4092 2973 339 -10896 -18839
824 -18839 -14953 -8832 1739 8726 4220 -61 -4463 -5325 6553 13776 13240 9677 -582 -5318 -377
839 -377 3778 9518 8170 -3330 -10037 -15270 -15351 -4740 422 -126 -2631 -10244 -8590 1958 10000
854 10000 16569 13611 2994 -215 -1383 2954 11782 9986 3991 -3024 -13466 -14219 -7287 -2974 1828
$$ packed form
749b664j039q30R259K46q379n725j2719l112J2000P247R148J390j2621m83P736
764e46P145J4243M29j0062n564q843J788J0184q57o92n283j6169l755L911N312
779h759J0981k414r877k260j71J0178J6620K264j152o115j1937J714N407K085
793F564N926n256j2004m550k327P165R822m485o312p375p358R345J1739O104N427
808A2425n592q320qR96R045Q655m876p071q512o184P632N902j119k634j1235p943
824a8839L886O121J0571O987m506m281m402q62J1878P223n36l563j0259m736M941
839c77M155N740j348j1500o707n233q1J0611N162n48k505p613J654J0548Q042
854A0000O569k958j0617l209j168M337Q828j796n995p015j0442p53O932M313M802
$$ plain form
869 1828 -3469 -12458 -10891 -6601 2731 13482 10448 4140 645 -3707 3086 11606 13529 14100 4832
884 4832 -6145 -7045 -8164 -4448 2170 -4613 -12152 -15354 -16157 -3973 6099 6625 7593 1410 -4205
899 -4205 2618 7617 13799 16849 7306 1177 -1552 -7126 -419 5461 724 -4410 -15710 -19835 -9102
914 -9102 -3408 1980 5251 -4181 -7050 -2383 1643 12689 15175 10064 10384 3554 -2153 4203 7072
929 7072 8435 3865 -13464 -19503 -14461 -11211 -533 656 -6483 -6194 -7603 -3402 8392 9343 9967
944 9967 12243 3945 1536 3519 6520 16928 12726 -4385 -10794 -13506 -9850 -1073 -4234 -6702 -7346
959 -7346 -14704 -10193 -939 1726 8350 8899 4194 4470 961 6259 21252 17833 5197 -3769 -10033
974 -10033 -5192 -1777 -5582 -2054 -6620 -16309 -12544 -7978 -2844 5181 3724 2905 1485 -5537 2640
$$ packed form
869A828n297q989J567M290R332J0751l034o308l495m352O793Q520J923N71r268
884D832j0977r00j119L716O618o783p539l202q03J2184J0072N26R68o183n615
899d205O823M999O182L050r543o129k729n574O707N880m737n134j1300m125J0733
914i102N694N388L271r432k869M667M026J1046K486n111L20o830n707O356K869
929G072J363m570j7329o039N042L250J0678J189p139K89j409M201J1794R51O24
944I967K276q298k409J983L001J0408m202j7111o409k712L656Q777l161k468o44
959g346p358M511R254K665O624N49m705K76l509N298J4993l419j2636q966o264
974a0033M841L415l805L528m566r689L765M566N134Q025j457q19j420p022Q177
$$ plain form
989 2640 15955 17479 13336 3079 -3021 2055 678 -155 3994 -3037 -11428 -14907 -15206 -6166 -634
1004 -634 -2256 1159 -2136 -8642 -1619 7653 15135 16810 6398 2231 4310 1900 4793 6565 1991
1019 1991 -3672 -13073 -15693 -5058 -2138 -2496 -593 -4690 -8709 -9180 -3468 9698 13196 5773 4299
1034 4299 2957 3347 8680 9837 9447 4532 -8764 -11745 -6050 -4375 -2724 -3291 -5075 -6783 -13405
1049 -13405 -9528 5528 9794 7124 4317 869 2787 5510 8305 13143 7020 -3394 -5368 -6030
1063 -6030 -4159 -726 -1785 -1149 -4566 -13056 -10691 -1310 5517 7022 413 -2812 790 1222 7038
1078 7038 13763 9920 3935 -1648 -5589 -3230 -1617 -631 905 -5188 -10873 -9871 -5732 4227 8510
1093 8510 1088 -1310 -1043 -1607 4417 8364 9454 7594 -2237 -5548 -2484 -3027 873 3726 -2073 -5694
$$ packed form
989B640J3315J524m143j0257o100N076j377q33M149p031q391l479k99R040N532
1004f34j622L415l295o506P023R272P482J675j0412m167K079k410K893J772m574
1019A991n663r401k620J0635K920l58J903m097m019m71N712J3166L498p423j474
1034D299j342L90N333J157l90m915j3296k981N695J675J651n67j784j708o622
1049a3405L877J5056M266k670k807l448J918K723K795M838o123j0414j974o62
1063f030J871L433j059O36l417q490K365R381O827J505o609l225L602M32N816
1078G038O725l843n985n583l941K359J613R86J536o093n685J002M139R959M283
1093H510p422k398K67n64O024L947J090j860r831l311L064n43L900K853n799l621
$$ plain form
1109 -5694 -8710 -7143 2981 5440 1912 351 -4147 -3226 1434 4007 10301 9695 -291 -2417 -2762
1124 -2762 -3032 2517 2673 -502 -3757 -11535 -8389 97 2038 5249 3750 -3484 -2129 -1108 1375
1139 1375 9256 7281 1092 -761 -5311 -2492 2803 2054 3932 -108 -9111 -7165 -3817 -859 5843
1154 5843 2296 -2219 -2683 -6309 -562 6857 5109 5726 2462 -3208 662 2462 3167 7530 445 -6567
1170 -6567 -7303 -8697 -2620 3668 869 634 -3579 -7440 -502 3292 4340 7089 1700 -2312 -24
1185 -24 -606 4987 9041 3304 420 -4138 -8271 -2343 903 526 707 -6312 -8538 -4168 -2964 2875
1201 2875 7363 2580 1346 5 -725 6646 8674 6392 5232 -3288 -7059 -3094 -2522 172 144 -5892
1217 -5892 -6651 -6712 -5784 2909 4809 2464 2141 -2264 -2042 3832 5927 9676 7524 -265 -1592 -2148 -2376
$$ packed form
1109e694l016J567J0124K459l528j561m498R21M660K573O294o06r986k126l45
1124b762k70N549J56l175l255p778L146Q486J941L211j499p234J355J021K483
1139A375P881j975o189j853m550K819N295p49J878m040r003J946L348K958O702
1154E843l547m515m64l626N747P419j748O17l264n670L870J800P05M363p085p012
1170f567p36j394O077O288k799k35m213l861O938L794J048K749n389m012K288
1185b4n82N593M054n737k884m558m133N928L246l77J81p019k226M370J204N839
1201B875M488m783j234j341p30P371K028k282j160q520l771L965N72K694k8o036
1217e892p59o1R28Q693J900k345l23m405K22N874K095L749k152p789j327n56k28
$$ plain form
1234 -2376 2114 677 -3520 -6019 -10666 -7682 -275 844 3260 2754 -2740 -1311 1497 5143 10696
1249 10696 7144 2216 223 -3513 -2241 2069 1131 -153 -4363 -9424 -6427 -3447 -308 4552 1759
1264 1759 -2179 -2351 -2671 2494 7367 6213 5439 1224 -2888 -470 1847 3033 3455 -2339 -6493 -6859
1280 -6859 -6968 -1521 2957 907 -67 -2810 -3597 1206 4079 6050 6490 700 -1959 -1291 -543 3890
1296 3890 4603 218 -2437 -5924 -6116 -782 1074 2226 1025 -4537 -4728 -1738 -89 5140 5078 952
1312 952 -152 -2213 -451 4612 4837 4237 1306 -4760 -4924 -2528 -999 2574 944 -3675 -3908 -4682
1328 -4682 -1902 3906 3317 1976 421 -4202 -1162 2475 3889 6973 3057 -2109 -1839 -2492 -174 3340
1344 3340 282 -1706 -4207 -7925 -3357 255 1029 3181 -368 -3499 -799 451 4753 8277 3441
$$ packed form
1234b376M490j437m197k499m647K984P407J119K416n06n494J429K808L646N553
1249A0696l552m928j993l736J272M310r38j284m210n061K997K980L139M860k793
1264A759l938j72l20N165M873j154p74m215m112K418K317J186M22n794m154l66
1280f859j09N447M478k050r74k743p87M803K873J971M40n790k659O68P48M433
1296C890P13m385k655l487j92N334J856J152j201n562j91K990J649N229o2m126
1312I52j104k061J762N063K25o00k931o066j64K396J529L573j630m619k33p74
1328d682K780N808n89j341j555m623L040L637J414L084l916n166K70o53K318L514
1344C340l058j988k501l718M568L612P74K152l549l131K700J250M302L524m836
$$ plain form
1359 3441 1846 171 -3416 496 2485 977 1105 -4108 -7589 -3971 -3140 409 3589 -963 -2722
1374 -2722 -2564 -2660 3555 5725 4324 4822 834 -2163 1722 1656 3022 2855 -3592 -5253 -5945 -6544 329
1391 329 2188 -990 -424 -3547 -2954 2200 3576 5638 5425 -751 -1060 254 -95 3946 3222 -1229 -1867
1408 -1867 -5821 -5328 753 996 710 698 -4013 -3161 -585 778 5719 4156 -535 53 -1519 -527 4378
1425 4378 2608 1382 -262 -5261 -4459 -1127 -207 3495 1267 -2477 -1170 -1896 408 4881 2697 1012
1441 1012 -1027 -4624 -1233 903 744 2672 656 -3196 -2409 -2146 1497 5469 1844 -155 -632 -3037
1457 -3037 -344 2540 2549 2507 -2216 -4422 -1476 -1728 398 3437 866 -1351 -3080 -3870 1837 3814 2261
1474 2261 2525 -197 -1680 354 1378 3462 3430 -1721 -3842 -3599 -4261 -727 1147 890 636 -2855 -3145
$$ packed form
1359C441j595j675l587L912J989j508J28n213l481L618Q31L549L180m552j759
1374b722J58r6O215K170j401M98l988k997L885o6J366j67o447j661o92n99O873
1391C29J859l178N66l123N93N154J376K062k13o176l09J314l49M041p24m451o38
1408a867l954M93O081K43k86j2m711Q52K576J363M941j563m691N88j572R92M905
1425D378j770j226j644m999Q02L332R20L702k228l744J307p26K304M473k184j685
1441A012k039l597L391K136j59J928k016l852P87K63L643L972l625j999m77k405
1457c037K693K884Rm2m723k206K946k52K126L039k571k217j729p90N707J977j553
1474B261K64k722j483K034J024K084l2n151k121K43o62L534J874k57k54l491k90
$$ plain form
1491 -3145 1589 2984 4449 3799 320 -783 -1029 -122 2791 2853 -364 -1738 -4307 -3544 -401 121 1880
1508 1880 1255 -2949 -2851 -1472 1445 4404 2576 676 440 -1720 -727 2889 3065 2546 -658 -4048 -2795
1525 -2795 -2481 -1299 1917 528 -1776 -2426 -2682 1168 4089 2490 2441 452 -2775 -1282 165 2389
1541 2389 3873 -393 -1857 -1293 -2423 264 2506 1252 55 -2852 -4263 -788 713 1385 2440
1556 2440 -1196 -2359 -1590 -1302 3005 4430 1319 997 -651 -2031 665 1225 1790 1343 -3505 -4021 -1758
1573 -1758 -1589 1400 1886 -1321 -1453 -2751 -2668 1989 2398 2384 2098 -1176 2 2112 1862 4511 3597 -1298
1591 -1298 -2678 -3973 -3146 37 -1083 -1719 -1211 -4696 -3069 1015 1375 3801 3113 195 1333 1117
1607 1117 1803 5660 3548 971 -1039 -4895 -3320 -781 -2108 -311 -1532 -5164 -3245 -1732 -105
$$ packed form
1491c145M734J395J465o50l479j103k46R07K913O2l217j374k569P63L143N22J759
1508A880o25m204R8J379K917K959j828j900k36k160R93L616J76n19l204l390J253
1525b795L14J182L216j389k304o50k56L850K921j599m9j989l227J493J447K224
1541B389J484m266j464N64j130K687K242j254j197k907j411L475J501O72J055
1556B440l636j163P69K88M307J425l111l22j648j380K696N60N65m47m848n16K263
1573a758J69K989M86l207j32j298Q3M657M09j4k86l274J178K110k50K649r14m895
1591a298j380j295Q27L183j120o36N08l485J627M084L60K426o88k918J138k16
1607A117O86L857k112k577k010l856J575K539j327J797j221l632J919J513J627
$$ plain form
1622 -105 3456 1748 1056 2016 159 2803 5699 4043 3562 606 -3412 -2319 -2356 -2097 -234 -3307 -4870
1639 -4870 -3766 -4354 -288 2587 2052 2882 1319 -256 2658 3617 3991 4875 1109 -1149 -1267 -2910 -930
1656 -930 192 -2661 -2806 -4369 -5272 -1158 418 1317 2783 -84 -398 1383 1294 4554 5204 1872 1267
1673 1267 -758 -1907 203 31 -839 -1302 -4886 -4832 -2282 -1306 1295 2150 -488 -153 -702 -60 3744
1690 3744 3615 2978 2197 -991 -590 896 232 1755 427 -3190 -3096 -3201 -2349 88 -76 -431 -859 -2562
1708 -2562 -562 1671 1982 3543 2616 -171 289 471 1780 3647 1853 113 -1658 -3639 -2140 -743
1724 -743 -1051 -288 -2232 -3716 -1694 -1259 593 2708 1195 600 556 -44 3093 4447 3835 3387 355
1741 355 -1908 -1114 -1397 -926 -448 -2777 -3560 -3915 -3811 -429 585 -167 779 -572 -483 2279 3205 4780
$$ packed form
1622a05L561j708o92R60j857K644K896j656m81k956m018J093l7K59J863l073j563
1639d870J104n88M066K875n35Q30j563j575K914R59L74Q84l766k258j18j643J980
1656i30J122k853j45j563r03M114J576Q99J466k867l14J781q9L260O50l332o05
1673A267k025j149K110j72q70m63l584N4K550R76K601Q55k638L35n49O42L804
1690C744j29o37p81l188M01J486o64J523j328l617R4j05Q52K437j64l55m28j703
1708b562K000K233L11J561r27k787M60J82J309J867j794j740j771j981J499J397
1724g43l08P63j944j484K022M35J852K115j513n95m4o00L137J354o12m48l032
1741C55k263P94k83M71M78k329p83l55J04L382J014p52R46j351Q9K762R26J575
$$ plain form
1759 4780 4681 1631 807 393 -544 1020 123 -1953 -2751 -5009 -4804 -2315 -1765 -145 336 -1479 -844 233
1777 233 1723 5040 4298 2908 3034 782 486 2128 499 105 -1356 -4510 -4060 -2986 -2517 318 -795
1794 -795 -1893 -1192 -2372 151 3089 2279 3040 2564 789 2051 2281 2210 3107 99 -2354 -2278 -3930 -2468
1812 -2468 -139 -1090 -1054 -1779 -3408 -580 917 1005 3144 1284 -226 1230 647 2025 3486 846 414
1829 414 -461 -2582 -603 160 -118 510 -2056 -2633 -972 -1504 249 1770 -810 -401 -658 -957 2019
1846 2019 2636 1901 2678 -174 -1302 302 -523 635 967 -2064 -1480 -1447 -2021 793 754 -327 329 -2016
1864 -2016 -1914 466 260 2204 2171 -461 352 270 -317 2108 1266 -237 153 -1923 -1760 608 -506 255
1882 255 196 -2589 -1636 -611 -271 2274 1795 429 803 -517 43 1824 685 582 78 -2546 -1427
$$ packed form
1759D780r9l050q24m14r37J564q97k076p98k258K05K489N50J620M81j815O35J077
1777B33J490L317p42j390J26k252k96J642j629l94j461l154M50J074M69K835j113
1794g95j098P01j180K523K938q10P61m76j775J262K30p1Q97l008k453P6j652J462
1812b468K329r51L6p25j629K828J497Q8K139j860j510J456n83J378J461k640m32
1829D14q75k121J979P63k78O28k566n77J661n32J753J521k580M09k57k99K976
1846B019O17p35P77k852j128J604q25J158L32l031N84L3n74K814l9j081O56k345
1864b016J02K380k06J944l3k632Q13q2n87K425q42j503L90k076J63K368j114P61
1882B55n9k785R53J025L40K545m79j366L74j320N60J781j139j03n04k624J119
$$ plain form
1899 -1427 -460 -359 1652 193 -807 -412 -1589 -93 1665 782 774 199 -1295 256 1375 1327 2178 300
1917 300 -1576 -1061 -1982 -836 609 -648 -257 -873 -1822 101 843 938 1860 481 -495 149 -58 1472
1935 1472 1688 -133 -647 -1560 -2562 -174 356 219 829 -684 -600 192 -118 1091 1579 -356 -391 -1001
1953 -1001 -710 1288 1113 902 632 -1351 -1330 -397 -679 461 519 -1051 -343 -1333 -560 1835 1437 945 610
1972 610 -1695 -613 154 -174 1467 236 -1180 -818 -929 -165 1717 491 148 37 -1131 95 927
1989 927 762 1229 -404 -1739 -704 -1561 -336 1178 -61 -160 -53 -750 983 1677 527 1197 -366
2006 -366 -1700 -272 -368 645 1920 -412 -711 -650 -1818 -158 -44 -609 520 -623 -1391 725 604
2023 604 1282 2252 14 109 127 -772 1049 1062 -448 237 -1231 -2075 -222 -840 -23 852 -1736 -781 537
$$ packed form
1899a427R67J01K011j459j000L95j177J496J758q83qn75j494J551J119m8Q51j878
1917C00j876N15r21J146J445j257L91o16r49J923P42R5R22j379r76O44k07J530
1935A472K16j821n14r13j002K388N30j37O10j513Q4P92l10J209M88j935l5o10
1953a001K91J998j75k11k70j983K1R33k82J140N8j570P08r90P73K395l98m92l35
1972F10k305J082P67l28J641j231j416L62j11P64J882j226l43j11j168J226Q32
1989I27j65M67j633j335J035q57J225J514j239r9J07o97J733O94j150O70j563
2006c66j334J428r6J013J275k332k99O1j168J660J14n65J129j143p68K116j21
2023F04O78R70k238R5J8q99J821J3j510O85j468q44J853o18Q17Q75k588R55J318
$$ plain form
2042 537 -287 1567 1915 496 838 -663 -748 995 766 459 864 -1671 -909 -14 -975 787 85 -1578
2060 -1578 -569 -1152 -1079 1447 572 1231 1525 -502 95 602 -12 1365 357 -1272 -11 -945 -510 1466
2078 1466 100 -214 -313 -2282 -761 161 -552 1158 673 -762 487 -200 291 1867 -29 134 383
2095 383 -1393 390 1156 80 1049 -719 -1884 -731 -1335 -865 904 -582 -369 -82 -1281 746 1580
2112 1580 691 1459 414 -680 880 304 691 1628 -348 -765 -693 -1928 -580 -283 -1238 -317 -1438 -1441
2130 -1441 687 700 1469 2185 343 259 435 93 1321 1254 85 135 -1098 -1419 -302 -1067 -682 -661 -1954
2149 -1954 -1302 -361 56 1507 1748 788 1387 5 519 1676 867 989 760 -974 -911 -818 -1085 -287 -780
2168 -780 -1916 -1066 -1525 -565 1448 662 1444 1240 130 1281 1167 963 1487 143 -732 -779 -1582 -855 231
$$ packed form
2042E37q24J854L48j419L42j501q5J743k29l07M05k535P62Q95r61J762p02j663
2060a578J009n83P3K526q75O59K94k027N97N07o14J377j008j629J261r34M35J976
2078A466j366l14r9j969J521R22p13J710m85j435J249o87M91J576j896J63K49
2095C83j776J783P66j076R69j768j165J153o04M70J769j486K13K87j199K027Q34
2112A580q89P68j045j094J560n76L87R37j976m17P2j235J348K97r55R21j121l
2130a441K128J3P69P16j842q4J76l42J228o7j169N0j233l21J117p65L85K1j293
2149a954O52R41M17J451K41r60N99j382N14J157q09J22k29j734O3R3k67P98m93
2168g80j136Q50m59R60K013p86P82k04j110J151j14k04N24j344q75m7q03P27J086
$$ plain form
2187 231 -835 -598 -1111 -2055 -632 -100 29 1631 494 495 1385 986 1814 1703 55 71 -771 -1626 -407
2206 -407 -428 -630 -90 -1507 -1897 -877 -1305 463 780 128 1262 609 366 1810 1285 624 1088 -915
2224 -915 -1140 -309 -966 200 -9 -1282 -726 -1490 -1601 474 200 90 830 -567 370 1476 892 1909
2242 1909 1607 -2 576 -121 -606 586 -492 -1100 -655 -1983 -1239 277 -593 278 132 -1163 443
2259 443 -50 155 1922 971 831 1294 -466 29 674 -924 1 -418 -1551 -479 -899 -736 368 -1126
2277 -1126 -1252 -605 -1247 240 1498 665 1700 1064 53 1537 733 396 1081 -434 -798 -231 -1694
2294 -1694 -514 6 -1273 -405 -983 -1870 -78 -67 120 1459 -86 124 1790 460 1337 1735 134
2311 134 658 -19 -1058 146 -572 -936 -287 -1695 -1750 -262 -1239 72 765 -287 645 531 647 2126
$$ packed form
2187B31j066K37n13r44J423N32J29J602j137JQ90l99Q28j11j648J6q42q55J219
2206d07k1k02N40j417l90J020m28J768L17o52J134o53k43J444n25o61M64k003
2224i15k25Q31o57J166k09j273N56p64j11K075k74j10P40j397R37J106n84J017
2242A909l02j609N78o97m85J192j078o08M45j328P44J516q70Q71j46j295J606
2259D43m93K05J767r51j40M63j760M95O45j598R25m19j133J072m20J63J104j494
2277a126j26O47o42J487J258q33J035o36j011J484q04l37O85j515l64N67j463
2294a694J180N20j279Q68n78q87J792J1J87J339j545K10J666j330Q77L98j601
2311A34N24o77j039J204p18l64O49j408n5J488r77J311O93j052R32j14J16J479
$$ plain form
2329 2126 1747 1269 1498 -211 -545 180 -1024 -145 25 -1055 -534 -1111 -1220 -177 -671 -843 -158 -623
2347 -623 389 1705 753 1933 1471 378 942 1 -483 802 -73 -774 -363 -1811 -1379 -494 -1343 -267
2365 -267 -566 -920 387 120 522 1808 966 637 808 -227 668 1105 60 436 -383 -1305 -322 -557 -610
2384 -610 271 -563 -595 -511 -1118 -135 948 -164 1112 544 139 1018 701 513 746 -611 -418 -380 -1120 -61
2404 -61 48 -710 -11 -987 -1082 52 -510 337 773 263 541 790 256 1037 802 -150 -9 -823 -226 429
2424 429 -29 269 181 -925 -745 -442 -838 382 -38 -207 701 -29 231 1346 258 956 356 -780 157
2443 157 -163 -436 458 -228 -689 169 -906 -121 468 -127 307 61 -759 220 452 128 1201 -37 -136
2462 -136 404 -600 -135 423 -355 71 -87 -1074 582 149 -412 152 -619 -792 139 -392 402 989 -235
$$ packed form
2329B126l79m78K29j709l34P25j204Q79J70j080N21n77j09J043m94j72O85m65
2347f23J012J316r52J180m62j093N64r41m84J285q75p01M11j448M32Q85q49J076
2365b67k99l54J307k67M02J286q42l29J71j035Q95M37j045L76q19r22R83k35n3
2384f10Q81q34l2Q4o07R83J083j112J276n68m05Q79l17j88K33j357J93L8p40J059
2404f1J09p58O99r76r5J134n62Q47M36n10K78K49n34P81k35r52J41q14N97O55
2424D29m58K98q8j106J80L03l96J220m20j69R08p30K60J115j088O98o00j136R37
2443A57l20k73Q94o86m61Q58j075P85N89n95M34k46q20R79K32l24J073j238r9
2462a36N40j004M65N58p78M26j58r87J656m33n61N64p71j73R31n31P94N87j224
$$ plain form
2481 -235 542 381 -499 48 138 -515 617 -334 -960 588 -353 42 434 -552 -112 -265 -1117 622 27
2500 27 -118 421 -181 -40 540 -116 315 1068 -565 -179 51 -909 256 322 -72 442 -850 -760 245 -602
2520 -602 -61 402 -466 154 230 -199 1251 369 -95 649 -355 -598 863 257 444 377 -864 301 -89
2539 -89 -733 99 -222 -658 280 -68 -30 670 302 529 275 -451 353 508 -183 982 334 -78 474 -525
2559 -525 -275 220 -529 -215 -533 -1002 197 133 -170 1000 280 -406 586 45 116 831 -152 40 45 -334 458
2580 458 130 -526 599 -208 -528 108 -833 -97 408 -22 66 -79 -83 513 188 26 915 -126 -304 658
2600 658 -70 577 647 -206 -30 -676 -806 324 -358 -312 189 -431 -434 467 -222 166 320 -311 -16 54 129 1190
2622 1190 764 541 674 -538 -40 -105 -558 -32 -413 -970 -426 -572 -582 8 -234 -453 168 -284 552 946
$$ packed form
2481b35P77j61q80N47R0o53J132r51o26J548r41L95L92r86M40j53q52J739n95
2500B7j45N39o02J41N80o56M31P53j633L86K30r60J165O6l94N14j292R0J005q47
2520f02N41M63q68O20P6m29J450q82m64P44j004k43J461o06J87o7j241J165l90
2539h9o44Q32l21m36R38l48L8P00l68K27k54p26Q04J55o91J165o48m12N52r99
2559e25K50M95p49L14l18m69J199o4l03J170p20o86R92n41P1P15r83J92Nl79P92
2580D58l28o56J125q07l20O36r41P36N05m30Q8j45mN96l25j62Q89j041j78R62
2600F58p28O47P0q53J76o46j30J130o82M6N01o20lR01o89L88J54o31K95P0P5J061
2622A190m26k23J33j212M98o5m53N26l81n57N44j46j0N90k42k19O21m52Q36L94
$$ plain form
2642 946 524 799 683 96 787 247 -24 188 -662 -589 -477 -1169 -387 -254 -465 36 -39 -783 572 -11
2662 -11 329 942 237 862 962 211 639 274 72 -54 -670 -1262 -564 -955 -872 48 -1090 -326 -199 -571
2682 -571 460 649 179 1048 628 617 1228 471 264 637 -511 -548 -493 -797 -150 -153 -692 -121 -595 -824 276
2703 276 -134 287 1082 94 581 1095 272 842 386 156 815 -56 -648 394 -765 -565 -144 -1142 -503
2722 -503 -89 -728 502 309 -250 749 -191 426 870 226 716 735 -231 -75 252 -884 -340 -328 -738 -153
2742 -153 -463 -426 304 -296 -254 102 -684 339 659 338 1189 676 -5 1004 163 127 390 -656 -312 -88
2762 -88 -876 -217 -213 -693 -367 -346 -656 -22 -137 78 1072 43 543 588 114 722 772 38 483 -238 -875 136
2784 136 -751 -359 222 -1254 -731 -254 -688 29 242 149 555 619 445 1143 962 730 599 -187 -244 -104 -845
$$ packed form
2642I46m22K75j16n87O91n40k71K12q50P3J12o92P82J33k11N01p5p44J355n83
2662a1L40O13p05O25J00p51M28l65k02j26o16n92O98l91Q3R20j138P64J27l72
2682e71J031J89m70Q69m20j1O11p57k07L73j148l7N5l04O47ln39N71m74k29J100
2703B76m10M21P95r88M87N14q23N70m56k30O59q71n92J042j159K00M21r98O39
2722e03M14o39J230j93n59R99r40O17M44o44M90J9r66J56L27j136N44J2m10N85
2742a53l10L7P30o00M2L56p86J023L20l21Q51n13o81J009q41l6K63j046L44K24
2762h8p88O59Mm80L26K1l10O34j15K15R94j029N00M5m74O08N0p34M45p21o37J011
2784A36q87L92N81j476N23M77m34P17K13r3M06O4j74O98j81k32j31p86n7J40p41
$$ plain form
2805 -845 -579 -343 -776 -382 -527 -640 -150 -794 72 270 -71 498 669 541 1205 963 2 473 -285 -359
2825 -359 -368 -585 -492 -601 -998 -856 -497 -680 50 -132 -96 676 522 662 1214 596 679 666 -219 79 -221 -482
2847 -482 -228 -660 -798 -682 -913 -482 -301 -493 125 56 -42 796 316 515 1204 409 423 848 -60 199 307
2868 307 -164 -436 -611 -1285 -547 -443 -593 -121 -659 -59 185 -135 488 883 421 1032 696 254 545 374
2888 374 -107 161 -481 -373 -178 -715 -214 -103 -924 -319 -365 -320 302 159 160 576 13 510 836 428 698
2909 698 362 -247 394 86 -754 -176 -722 -923 -550 -870 -438 225 -440 74 219 9 598 472 339 1256
2929 1256 222 155 683 -262 -323 85 -529 219 -418 -1113 -143 -820 -634 91 -403 -453 416 -100 332 1022
2949 1022 588 837 896 264 588 12 -318 -26 -903 -380 -136 -1061 -160 -90 -601 179 37 -362 597 351
$$ packed form
2805h45K66K36m33L94j45j13M90o44Q66J98l41N69J71j28O64k42r61M71p58p4
2825c59rk17R3j09l97J42L59j83P30j82L6P72j54J40N52o18Q3j3q85K98l00k61
2847d82K54m32j38J16k31M31J81j92O18o9r8Q38m80J99O89p95J4M25r08K59J08
2868C07m71k72j75o74P38J04j50M72n38O00K44l20O23L95m62O11l36m42K91j71
2888C74m81K68o42J08J95n37N01J11q21O05m6M5O22j43JM16n63M97L26m08K70
2909F98l36o09O41l08q40N78n46k01L73l20M32O63o65N14J45k10N89j26j33R17
2929A256j034o7N28r45o1M08o14P48o37o95R70o77J86P25m94n0Q69n16M32O90
2949A022m34K49N9o32L24n76l30K92q77N23K44r25R01P0n11P80j42l99R59k46
$$ plain form
2969 351 395 833 311 304 790 -374 95 331 -320 -51 -422 -779 -237 -617 -508 -69 -615 -343 -20 -181 327
2990 327 306 -45 797 464 -165 747 141 -136 100 -560 -470 -45 -387 -237 -225 -411 203 -222 -327 431 -184
3011 -184 -250 429 -131 364 669 -191 488 531 24 239 349 -462 -51 -477 -175 -47 -535 -230 27 -463 48
3032 48 272 -437 428 411 116 652 146 246 427 -143 118 320 -226 80 -378 -620 10 -79 -539 -58 -602
3053 -602 -427 -127 -330 182 121 204 669 315 374 528 25 80 -62 -413 -256 -204 -575 -196 -73 -482 337 -514
3075 -514 -168 250 -167 364 522 -107 345 751 96 458 469 -109 -93 -295 -465 276 -586 -108 -231 -622 -95
3096 -95 -239 -650 164 -93 -373 516 84 246 436 64 182 249 -233 -274 -62 -106 74 -350 -240 288 -386
3117 -386 -27 330 -625 26 -22 -366 124 217 -141 469 256 56 464 -191 20 391 -277 441 402 -497 54
$$ packed form
2969C51M4M38n22pM86j164M69K36o51K69l71l57N42l80J09M39n46K72L23j61N08
2990C27k1l51Q42l33o29R12o06k77K36o60R0M25l42J50J2j86O14m25j05P58o15
3011a84o6O79n60M95L05q60O79M3n07K15J10q11M11m26L02J28m88L05K57m90N11
3032D8K24p09Q65j7k95N36n06J00J81n70K61K02n46L06m58k42O30q9m60M81n44
3053f02J75L00k03N12o1Q3M65l54N9J54n03N5j42l51J57N2l71L79J23m09Q19q51
3075e14L46M18m17N31J58o29M52M06o55L62J1n78J6k02j70P41q62M78j23l91N27
3096i5j44m11Q14k57k80Q89m32J62J90l72J18O7m82m1K12m4J80m24J10N28o74
3117c86L59L57r55O51m8l44M90R3l58O10k13k00M08o55K11L71o68P18l9q99N51
$$ plain form
3138 54 -143 -701 72 -422 -872 297 -204 -478 132 -340 398 76 -186 605 319 145 650 231 -4 519
3158 519 -140 -96 268 -600 -225 -340 -913 -301 -580 -599 -212 -412 181 729 100 606 692 183 728 777 266
3179 266 484 154 -375 -188 -794 -703 -277 -1071 -671 -167 -499 -5 93 19 984 347 477 624 150 625 602
3200 602 42 258 194 -415 -201 -625 -688 -358 -880 -726 -355 -546 -96 213 -142 438 743 287 757 757 341
3221 341 921 210 13 106 -367 -373 -392 -943 -392 -476 -576 -124 -157 -132 529 251 501 381 248 549 444 21
3243 21 392 314 -66 107 -268 -701 -467 -537 -660 -39 -788 -405 -9 -435 179 159 -144 493 154 534 757
3264 757 352 278 641 -14 189 -121 -383 -285 -229 -566 -342 -601 -487 -93 -399 11 384 149 216 304 395 649
3286 649 458 435 762 370 -6 238 -434 -565 -600 -771 -448 -439 -671 -294 -142 -158 222 235 256 464 91 459
$$ packed form
3138E4j97n58P73m94m50J169n01k74O10m72P38l22k62P91k86j74N05m19k35N23
3158E19o59M4L64q68L75j15n73O12k79j9L87k00N93N48o29N06Q6n09N45M9n11
3179B66K18l30n29J87o06R1M26p94M00N04l32M94R8p4R65o37J30J47m74M75k3
3200F02n60K16o4o09K14m24o3L30n22J54L71j91M50L09l55N80L05m56M70%m16
3221C41N80p11j97R3m73oj9n51N51q4j00M52l3K5O61k78K50j20j33L01j05m23
3243B1L71p8l80J73l75m33K34p0j23O21p49L83L96m26O14k0l03O37l39L80K23
3264G57m05p4L63o55K03l10k62R8N6l37K24k59J14L94l06M10L73k35O7Q8R1K54
3286F49j91k3L27l92l76K44o72j31l5j71L23Rk32L77J52j6L80J3K1K08l73L68
$$ plain form
3308 459 623 81 483 110 -395 186 -350 -564 -336 -691 -696 -230 -817 -152 -4 -399 439 152 308 803 120
3329 120 646 894 392 320 296 -380 -24 -395 -444 -205 -617 -902 -382 -461 -255 14 -195 446 316 10 719
3350 719 437 23 439 586 230 194 -117 -310 18 -558 -438 -402 -533 -145 -489 -352 217 -83 52 536 -82
3371 -82 204 611 299 322 246 10 248 -147 -399 122 -446 -532 -247 -488 -340 -198 -427 124 109 25 567 238
3393 238 -54 406 -121 220 313 -15 210 166 -318 -57 -134 -358 74 -263 -415 249 -302 -256 408 -468 18
3414 18 600 1 438 404 -25 728 350 -127 234 -9 -316 -57 -520 -397 -127 -504 -68 60 -259 434 281
3435 281 13 456 109 521 695 -121 630 68 -226 135 455 -226 -24 -399 -294 -286 -196 -379 -11 -72 -161 108
3457 108 -53 363 248 22 524 268 210 310 -128 344 121 -366 33 172 -320 -238 -293 -307 22 -45 -142 143
$$ packed form
3308D59J64n42M02l73n05N81n36k14K28l55nM66n87O65J48l95Q38k87J56M95o83
3329A20N26K48n02p2k4o76L56l71m9K39m12k85N20p9K06K69k09O41j30l06P09
3350G19k82m14M16J47l56l6l11j93L28n76J20L6j31L88l44J37N69l00J35M84o18
3371h2K86M07l12K3p6k36K38l95k52N21n68q6K85k41J48J42k29N51j5q4N42l29
3393B38k92M60n27L41R3l28K25m4m84K61p7k24M32l37j52O64n51M6O64q76M86
3414A8N82n99M37l4m29P53l78m77L61k43l07K59m63J23K70l77M36J28l19O93j53
3435B81k68M43l47M12J74q16P51n62k94L61L20o81K02l75J05QR0j83L68o1q9K69
3457A08j61M16j15k26N02k56n8J00m38M72k23m87L99J39m92Q2n5j4L29o7r7K85
$$ plain form
3479 143 -19 257 245 151 400 136 14 265 141 -1 -163 -196 -71 -28 -553 -221 -200 -401 -10 -78 24 302
3501 302 97 133 235 269 383 233 55 303 365 22 32 148 -191 217 -211 -359 -57 -351 -149 -33 -377
3522 -377 9 24 -68 184 111 -55 546 75 289 502 97 116 3 -41 248 -48 -248 -104 -99 -297 -233 -388 -404
3545 -404 -235 -272 -63 141 -230 313 410 -29 619 118 312 135 -169 200 -96 -567 -65 -398 -423 -201 -258
3566 -258 -354 -119 -60 -234 422 -20 104 296 -107 434 279 -276 147 98 -114 -82 -151 -204 -112 -373 102 -58
3588 -58 -346 37 -72 23 422 208 -99 574 -331 197 444 -72 123 7 -291 -96 -62 -359 -342 -293 -192 -129
3610 -129 -611 -183 -12 -295 91 552 108 394 340 -73 575 44 -27 262 96 3 6 -463 -76 9 -505 -60
3632 -60 44 -87 -63 -292 -265 421 -225 189 174 -225 385 335 -22 304 -50 -305 276 -173 -67 -58 -346 -276 -142
$$ packed form
3479A43j62K76j2r4K49k64j22K51j24j42j62l3J25M3n25L32K1k01L91o8J02K78
3501C02k05L6J02L4J14j50j78K48O2l43J0J16l39M08m28j48L02k94K02J16l44
3522c77L86J5r2K52p3j66O01m71K14K13m05J9j13m4K89k96k00J44Nj98O4j55j6
3545d04J69l7K09K04l71N43R7m39O48n01J94j77l04L69k96m71N02l33k5K22n7
3566b58r6K35N9j74O56m42J24J92m03N41j55n55M23m9k12L2o9n3R2k61M75j60
3588e8k88L83j09R5L99k14l07O73r05N28K47n16J95j16k98J95L4k97J7M9J01O3
3610a29m82M28J71k83L86M61m44K86n4m13O48n31p1K89j66r3Lm69L87Q5n14M45
3632f0J04j31K4k29K7O86o46M14j5l99O10n0l57L26l54k55N81m49J06Rk88P0J34
$$ plain form
3655 -142 -433 -105 -257 -98 114 313 -126 131 -89 264 414 231 127 247 -153 57 11 -282 -119 -412
3675 -412 -247 -79 -402 -213 299 184 -66 562 368 277 149 48 408 -33 -179 53 -101 -374 -53 -588
3695 -588 -244 -10 -304 -283 -83 -30 521 -209 126 264 171 344 369 182 444 259 -390 74 17 -478 132 -309
3717 -309 -279 -309 -497 273 244 157 570 76 70 429 299 317 261 -245 195 38 -197 42 -12 -264 -240 0 -284
3740 -284 236 -207 27 134 -78 125 414 38 238 592 211 25 -20 26 338 -15 -154 -194 -171 -31 -122 -401
3762 -401 328 -207 79 162 320 -28 442 -347 164 374 -37 -49 68 -122 -38 -62 -478 30 -217 70 58 -527
3784 -527 -236 67 -297 -158 130 -38 462 85 -53 283 214 -4 324 -310 256 346 -247 -35 -50 -367 -178
3805 -178 -87 -365 40 -154 -118 243 -328 297 336 -71 178 280 -218 187 -161 -253 -98 -305 -288 46 -368 -207
$$ packed form
3655a42k91L28j52J59K12J99m39K57k20L53J50j83j04J20m00K10m6k93J63k93
3675d12J65J68l23J89N12j15k50O28j94r1j28j01L60m41j46K32j54k73L21n35
3695e88L44K34k94K1K00N3N51p30L35J38r3J73K5j87K62j85o49M64n7m95O10m41
3717c09L0l0j88P70k9q7M13m94oL59j30J8n6n06M40j57k35K39n4k52K4K40k84
3740b84N20m43K34J07k12K03K89l76K00L54l81j86m5M6L12l53j39m0K3J40r1k79
3762d01P29n35K86Q3J58l48M70p89N11K10m11j2J17j90Q4k4m16N08k47K87j2n85
3784e27K91L03l64J39K88j68N00l77j38L36o9k18L28o34N66R0n93K12j5l17J89
3805a78R1k78M05j94L6L61n71O25L9m07K49J02m98M05l48r2J55k07J7L34m14J61
$$ plain form
3827 -207 -107 -218 -41 -149 -77 211 43 40 277 144 310 325 139 124 109 -213 257 -16 -423 -38 -305 -29
3849 -29 183 94 -388 -184 -7 104 310 -4 452 125 99 405 44 68 136 -59 21 233 -632 -226 -61 -360
3871 -360 -233 -365 159 134 255 103 425 -38 239 268 -68 310 107 -563 229 -159 -427 -94 -372 -257 -158
3892 -158 -331 -323 -41 -238 84 429 3 98 66 -52 467 -8 186 45 -118 -303 -183 -481 67 -29 -113 46
3914 46 -300 2 -17 19 9 420 -142 29 183 52 275 176 67 246 188 -250 72 -10 -79 115 -252 21 -109
3937 -109 -41 -84 2 -179 223 -212 186 284 222 27 311 49 202 -113 -309 130 -111 -352 -145 -101 -103 66 85
3960 85 79 -108 -241 216 188 34 359 135 69 246 -29 207 -276 -202 -59 -167 -347 -262 144 -229 -265 -2 -42
3983 -42 78 112 300 187 218 124 126 47 139 -127 -137 112 -280 -228 -39 -244 75 -131 -314 -213 -44 97 239
$$ packed form
3827b07J00j11J77j08P2K88j68lK37j33J66J5j86j5j5l22M70k73m07L85k67K76
3849b9K12q9m82K04J77J11K06l14M56l27k6L06l61K4O8j95Q0K12q65M06J65k99
3871c60J27j32N24k5J21j52L22m63K77K9l36L78k03o70P92l88k68L33k78J15R9
3892a58j73QK82j97L22L45m26R5l2j18N19m75J94j41j63j85J20k98N48r6q4J59
3914D6l46L02j9L6j0M11n62J71J54j31K23r9j09J79n8m38L22q2o9J94l67K73j30
3937a09O8m3Q6j81M02m35L98R8o2j95K84k62J53l15j96M39k41k41K07M4kJ69J9
3960H5oj87j33M57k8j54L25k24o6J77k75K36m83P4J43j08j80Q5M06l73l6K63m0
3983d2J20L4J88j13L1r4Kp9R2k66j0K49l92N2J89k05L19k06j83J01J69J41J42
$$ plain form
4006 239 -172 149 -79 175 174 -58 -22 23 35 -258 221 -84 -197 -87 -82 -183 166 -121 -99 -123 -244 113 108 -118
4030 -118 39 53 -181 344 -27 86 119 -3 124 133 -253 22 -39 -9 40 -131 -141 296 -264 36 217 72 14
4053 14 191 -140 132 160 -177 103 -122 -273 98 -308 -48 -197 -166 142 271 -8 -133 -358 -478 125 -258
4074 -258 210 84 -421 -19 -21 -177 302 -55 14 276 335 -196 146 -45 157 277 -100 -193 43 430 136 81
4096 81 -353 332 -97 45 384 -11 -39 233 79 121 282 76 217 212 -166 114 -222 -320 195 -60 -348 -11
4118 -11 -395 52 239 -102 285 84 -41 10 -100 -51 57 237 -405 124 22 -67 -155 65 -109 -77 -226 48
4140 48 -256 -57 329 -156 -179 -20 132 10 213 72 50 16 -176 97 -183 98 -46 -312 -120 -88 149 -24
4162 -24 -7 -184 184 -20 -88 153 55 277 50 -190 135 113 -9 81 211 -344 -174 -203 -80 90 -16 154
$$ packed form
4006B39m11L21k28K54jk32L6M5J2k93M79l05j13J10Nj01L49k87K2k4j21L57nk26
4030a18J57J4k34N25l71J13L3j22J27Rl86K75o1L0M9j71j0M37n60L00J81j45n8
4053A4J77l31K72K8l37K80k25j51L71m06K60j49L1L08J29k79j25k25j20O03l83
4074b58M68j26n05M02kj56M79l57O9K62N9n31L42j91K02J20l77r3K36L87k94n5
4096H1m34O85m29J42L39l95k8K72j54M2J61k06J41nl78K80l36r8N15k55k88L37
4118a1l84M47J87l41L87k01j25N1j10M9J08J80o42N29j02q9q8K20j74L2j49K74
4140D8l04J99L86m85k3J59J52j22K03j41k2l4j92K73k80K81j44k66J92L2K37j73
4162b4J7j77L68k04o8K41r8K22k27k40L25k2j22R0J30n55J70k9J23J70j06J70
$$ plain form
4184 154 90 -211 11 35 45 70 -13 -42 330 203 0 178 -260 -70 195 -105 20 -161 -182 -42 -51 -185 -87
4207 -87 122 21 368 235 -133 -18 10 325 -43 -163 487 35 -33 -160 51 1 23 -208 -133 -146 30 301
4229 301 255 107 75 206 -11 213 -111 68 387 -141 -42 -46 -87 213 -273 -358 89 -117 -128 -201 -146 -187 296 -170
4253 -170 291 410 175 335 84 97 459 61 -253 25 -45 -152 -83 -393 -30 -109 -214 69 25 -152 151 203
4275 203 132 329 -71 45 173 128 53 259 -219 -70 -65 -274 -93 -113 -239 -126 -306 64 39 -118 199 526
4297 526 -216 127 174 130 -7 -5 -85 -55 -50 174 35 -80 343 -70 -94 29 37 -65 208 139 82 200 170 23 224
4322 224 67 73 132 102 203 102 29 -434 -240 -241 -200 -148 -252 -301 -195 219 14 136 326 46 -159 -48 209
4345 209 321 341 -251 -57 120 -46 -196 10 -370 -140 -301 -468 -104 -153 -292 268 -88 93 356 -94 135
$$ packed form
4184A54o4l01K22K4J0K5q3k9L72j27k03J78m38J90K65l00J25j81k1J40rj34R8
4207h7K09j01L47j33l68J15K8L15l68j20O50m52o8j27K11n0K2k31P5j3J76K71
4229C01m6j48l2J31k17K24l24J79L19n28R9mm1L00m86q5M47k06j1p3N5m1M83m66
4253a70M61J19k35J60k51J3L62l98l14K78p0j07O9l10L63p9j05K83m4j77L03N2
4275B03p1J97m00J16J28m5p5K06m78J49Nk09J81k0j26J13j80L70k5j57L17L27
4297E26p42L43M7m4j37Kq0L0NK24j39j15M23m13k4J23Qj02K73o9n7J18l0j47K01
4322B24j57ON9l0J01j01p3m63J94jM1N2j04m9J06M14k05J22J90k80k05J11K57
4345B09J12K0n92J94J77j66j50K06l80K30j61j67L64m9j39N60l56J81K63m50K29
$$ plain form
4366 135 329 271 250 51 -141 271 48 -182 5 73 -324 106 7 -113 -51 12 -48 119 213 269 464 197 -13
4389 -13 126 107 -36 43 128 -265 -415 78 -369 -320 -78 -44 -123 180 -41 114 191 11 227 -90 135 -44 -114
4412 -114 57 -67 74 85 119 -337 -102 -127 -180 35 -230 -10 294 -15 237 390 -88 32 131 5 267 12
4434 12 -202 256 -141 -325 -424 -129 -7 0 -383 162 -14 -67 58 295 79 263 130 -8 5 -38 76 -9 21
4457 21 -63 85 -283 -102 -148 -392 180 -263 -298 -32 -440 -231 -214 163 58 -14 343 71 96 170 54 -242 43
4480 43 -107 -131 -53 -257 -344 -231 -237 -129 -114 -22 10 -72 -142 176 64 141 276 137 41 83 270 97 236 59 -253
4505 -253 53 -142 -184 -131 42 267 -206 -6 129 110 82 -18 36 53 152 2 90 14 -131 -12 181 -206 24
4528 24 -2 69 -60 -442 -75 179 -136 86 261 258 168 96 114 396 -112 173 256 -4 299 4 -330 12 36
$$ packed form
4366A35J94n8k1j99j92M12k23k30J87O8l97M30r9j20O2O3o0J67R4N6J95k67k10
4389a3J39j9j43P9Q5l93j50M93m47M9K42L4p9L03k21J55P7j80K16l17K25j79p0
4412a14J71j24J41J1L4m56K35k5n3K15k65K20L04l09K52J53m78J20R9j26K62k55
4434A2k14M58l97j84r9K95J22Pl83N45j76n3J25K37k16J84j33j38J3m3J14q5L0
4457B1q4J48l68J81m6k44N72m43l5K66m08K09J7L77j05p2L57k72K5P4j16k96K85
4480D3j50k4P8k04q7J13oJ08J5R2L2q2p0L18j12P7J35j39r6M2J87j73J39j77l12
4505b53L06j95m2N3J73K25m73K00J35j9k8j00N4J7R9j50Q8p6j45J19J93l87K30
4528B4k6P1j29l82L67K54l15K22J75lr0p2J8K82n08K85Q3k60L03k95l34L42K4
$$ plain form
4551 36 -16 102 -77 0 178 125 84 76 320 138 259 -52 234 97 -184 287 119 -268 -61 -58 -306 236 -548
4574 -548 -9 -176 -102 373 -186 -131 67 119 -63 146 22 -19 236 -122 -56 117 -216 33 227 161 207 -108
4596 -108 -63 51 8 56 -100 -84 -149 -87 -11 112 117 11 70 40 -5 348 53 -68 46 24 -16 131 -337 -360 -209
4621 -209 -126 117 -274 128 245 32 23 -189 -75 291 161 24 126 -158 -272 -13 -87 -294 -20 -88 -143 -120
4643 -120 -349 23 31 -96 -77 100 -72 -10 136 -64 118 -80 261 132 -344 -307 28 71 -180 -45 85 -36
4665 -36 -15 148 -27 -116 237 -71 169 391 -82 -106 -144 139 69 336 136 89 4 127 164 19 -69 -96 -184 -150
4689 -150 -96 -51 118 25 -80 71 3 62 103 -93 148 241 355 170 138 76 0 106 -112 9 -180 -294 -16
4712 -16 -85 -74 23 36 -31 39 -73 168 18 -82 414 51 -139 303 32 -66 195 -148 -46 233 -225 -88 -89
$$ packed form
4551C6n2J18j79P7J78n3m1qK44j82J21l11K86j37k81M71j68l87K07Lk48N42p84
4574e48N39j67P4M75n59N5J98N2j82K09j24m1K55l58O6J73l33K49J94o6M6l15
4596a08M5J14m3M8j56J6o5O2P6J23Nj06N9l0m5L53k95j21J14k2m0J47m68k3J51
4621b09Q3K43l91M02J17k13rk12J14L66j30j37J02k84j14K59p4k07K74o8n5K3
4643a20k29L72Qj27J9J77j72O2J46k00J82j98L41j29m76L7L35M3k51J35J30j21
4665c6K1J63j75q9L53l08K40K22m73k4l8K83p0K67k00m7q5J23L7j45q8k7q8L4
4689a50N4M5J69r3j05J51o8N9M1j96K41R3J14j85l2o2p6J06k18J21j89j14K78
4712a6o9J1R7J3o7P0j12K41j50j00M96l63j90M42k71r8K61l43J02K79m58J37j
$$ plain form
4735 -89 -533 -334 3 -269 146 -87 19 139 165 -66 68 107 374 -17 -202 -74 -149 -69 -83 -208 -113 147
4757 147 151 -371 36 -87 272 178 174 212 163 85 154 -259 -95 63 -192 -95 0 -155 37 239 -166 -16 1 -323
4781 -323 2 104 12 8 80 130 117 -33 109 223 -44 363 -115 -69 -214 -239 -140 265 -135 57 15 -52 -23 155
4805 155 -74 295 -4 -172 41 -26 11 24 -58 -40 227 49 -46 111 -96 -190 -1 -91 -164 -144 -218 262 120 218
4829 218 69 38 153 30 71 60 -253 -79 -112 -113 48 119 -263 78 12 45 -205 -88 101 91 103 -70 -83 -48
4853 -48 123 98 117 238 -8 -110 -137 -251 78 -284 -53 158 156 -176 -81 91 -288 145 256 -93 23 -219
4875 -219 243 144 -176 127 -164 -26 188 213 -25 244 -116 -115 -12 -432 74 25 -274 81 196 -12 101 -45
4897 -45 -52 187 -15 59 13 -56 -4 107 -11 -243 -161 -47 75 -165 -68 -69 -141 -14 241 -19 4 439 -21 208
$$ packed form
4735h9m44J99L37k72M15k33J06J20K6k31J34L9K67l91j85J28p5Q0j4j25R5K60
4757A47Mn22M07j23L59r4mL8m9p8O9m13J64J58k55R7R5j55J92K02m05J50J7l24
4781c23L25J02r2mP2N0j3j50J42J14k67M07m78M6j45k5R9M05m00J92m2o7K9J78
4805A55k29L69k99j68K13o7L7J3q2J8K67j78r5J57k07r4J89r0p3K0p4M80j42R8
4829B18j49l1J15j23M1j1l13J74l3jJ61P1l82L41o6L3k50J17J89j0J2j73j3L5
4853d8J71k5J9J21k46j02k7j14L29l62K31K11kl32R5J72l79M33J11l49J16k42
4875b19M62r9l20L03k91J38K14K5k38K69l60JJ03m20N06m9k99L55J15k08J13j46
4897d5pK39k02P4m6o9N2J11j18k32Q2J14J22k40R7jp2J27K55k60K3M35m60K29
$$ plain form
4921 208 152 -169 -53 -18 5 28 -12 -108 260 -130 -224 -34 -50 151 190 -125 151 61 4 66 -84 -158 47 -39 -116
4946 -116 -235 -67 24 -1 -56 53 -66 -2 249 -57 -13 -12 -2 -153 -137 -21 -47 45 -244 239 -93 3 -112 67
4970 67 -8 129 107 -99 232 -306 371 65 -75 218 84 -117 179 70 58 -120 8 -45 -3 20 -28 -78 170
4993 170 217 303 -37 112 -117 -28 -44 -76 346 154 1 115 -42 -16 88 -86 102 186 -45 -38 -119 -9 156
5016 156 52 -213 -10 190 -62 192 117 61 -115 -108 34 372 -76 263 4 -20 71 194 62 -194 -169 2
5038 2 87 118 -88 -11 34 269 -103 147 187 -110 162 -211 -124 -3 79 12 95 -56 73 64 135 -88 -127 -43 -448
5063 -448 126 125 -271 122 -91 -97 -61 22 -6 189 -164 155 -302 -98 -64 -40 155 -242 -490 -94 -50 -400 181
5086 181 -39 -1 3 -111 58 339 -10 117 -81 -85 -100 39 -85 -27 207 117 -40 89 -133 -100 -196 -34 203
$$ packed form
4921B08n6l21J16L5K3K3m0r6L68l90r4J90j6K01L9l15K76r0n7O2j50p4K05q6p7
4946a16j19J68R1k5n5J09j19O4K51l06M4JJ0j51J6J16k6R2k89M83l32R6j15J79
4970F7p5J37k2k06L31n38O77l06j40K93j34k01K96j09j2j78J28n3M2K3m8n0K48
4993A70M7Q6l40J49k29Q9j6l2M22j92j53J14j57K6J04j74J88Q4k31Pq1J10J65
5016A56j04k65K03K00k52K54p5n6j76PJ42L38m48L39k59k4R1J23j32k56K5J71
5038BQ5L1k06P7M5K35l72K50M0k97K72l73Q7J21Q2o7Q3j51J29rP1k23l9Q4m05
5063d48N74jl96L93k13oL6Q3k8J95l53L19m57K04L4K4J95l97k48L96M4l50N81
5086A81k20L8Mj14J69K81l49J27j98mj5J39j24N8K34r0j57J29k22L3r6J62K37
$$ plain form
5109 203 239 55 88 -170 -27 -356 -24 217 -127 102 240 64 105 -128 -204 127 -71 -57 303 363 134 22
5131 22 -148 -64 -39 60 -91 -189 17 -50 -32 -99 88 -113 64 -155 -143 -115 1 27 134 12 -184 132 84 -249
5155 -249 -14 -25 -88 -88 -132 -80 -83 -38 224 40 31 59 -14 11 -99 -11 84 -36 179 40 116 -20 -105 111 160 27
5181 27 182 -294 -236 -304 -218 -8 -16 122 -204 -310 176 -260 -45 359 -254 111 -69 -84 29 186 -206 -208 -86
5204 -86 -255 -48 -491 -155 -65 -79 153 141 84 181 251 53 152 30 194 -62 335 51 -40 -270 -67 -106 39
5227 39 21 51 -68 18 18 25 -34 70 -114 58 90 -26 66 101 -289 33 -200 -74 5 -200 5 -1 -180 125 -150
5252 -150 124 50 19 32 -182 44 -76 57 -71 99 -21 -193 -28 -69 -319 207 -33 102 -36 -100 255 103
5274 103 222 -2 -253 -85 -153 163 162 -103 -59 128 16 -213 -155 -255 -252 186 -172 2 -43 -150 -18 65 19
$$ packed form
5109B03L6j84L3k58J43l29L32K41l44K29J38j76M1k33p6L31j98J4L60O0k29j12
5131B2j70Q4K5R9j51r8K06o7J8o7J87k01J77k19J2K8J16K6J07j22j96L16m8l33
5155b49K35j1o3%m4N2lM5K62j84rK8p3K5j10Q8R5j20K15j39P6j36q5K16M9j33
5181B7J55m76N8o8Q6K10qJ38l26j06M86m36K15M04o13L65j80j5J13J57l92kJ22
5204h6j69K07m43L36R0j4K32j2n7R7P0j98R9j22J64k56L97k84r1k30K03l9J45
5227C9j8L0j19Q6%Pn9J04j84J72L2j16R2L5l90L22k33J26P9k05K05oj79L05k75
5252a50K74p4l1J3k14K26j20J33j28J70j20j72J65m1k50N26k40J35j38o4L55j52
5274A03J19k24k51J68o8L16jk65M4J87j12k29N8j00LM38l58J74m5j07J32Q3m6
$$ plain form
5297 19 37 259 134 158 -42 -2 -339 203 106 38 -281 31 -53 175 -57 -173 -146 -3 -353 -77 92 -158 129
5320 129 150 4 205 27 10 65 53 30 -2 -17 64 166 -7 95 103 -47 -107 -35 -287 94 -23 63 89 68 -224
$$ packed form
5297A9J8K22j25K4k00M0l37N42r7o8l19L12q4K28k32j16K7J43l50K76J69k50K87
5320A29K1j46K01j78j7N5j2k3l2j5Q1J02j73J02Qj50o0P2k52L81j17Q6K6k1k92
$$ [...]
8191A09
##END NTUPLES=NMR FID
##END=
