##TITLE=1H_Pr Q-17
 200.13MHz, CDCl3,
 8 sc
 
 16.1.2025
##JCAMPDX= 6.0         $$ Bruker NMR JCAMP-DX V2.0
##DATA TYPE= NMR FID
##DATA CLASS= NTUPLES
##ORIGIN= UXNMR, Bruker Analytische Messtechnik GmbH
##OWNER= pz
$$ XWIN-NMR		Version 3.5
$$ Thu Jan 16 14:15:57 2025 Russian Standard Time (UT+4h)  she@DPX200
##.OBSERVE FREQUENCY= 200.1313
##.OBSERVE NUCLEUS= ^1H
##.DELAY= (6, 6)
##.ACQUISITION MODE= SIMULTANEOUS
##.ACQUISITION SCHEME= undefined
##.AVERAGES= 8
##.DIGITISER RES= 18
##SPECTROMETER/DATA SYSTEM= spect
##.PULSE SEQUENCE= zg30
##.SOLVENT NAME= DMSO
##.SHIFT REFERENCE= (INTERNAL, DMSO, 0, 14.3821)
##AUDIT TRAIL= $$ (NUMBER, WHEN, WHO, WHERE, WHAT)
$$ ##TITLE= Audit trail, XWIN-NMR		Version 3.5
$$ ##JCAMPDX= 5.01
$$ ##ORIGIN= Bruker BioSpin GmbH
$$ ##OWNER= she
$$ F:/spectra/data/she/nmr/H-C/1/audita.txt
$$ ##AUDIT TRAIL=  $$ (NUMBER, WHEN, WHO, WHERE, WHAT)
(   1,<2025-01-16 14:14:44.15 +0400>,<she>,<DPX200>,
      <created by zg, POWCHK disabled, PULCHK disabled
       configuration hash MD5:
       00 E9 B6 7A A2 85 ED C7 34 08 36 98 17 FE 4E 26
       data hash MD5: 16K
       FA 1D 3C 0F 9E 5A 3D D4 02 40 6C B2 40 8C F3 ED>)
$$ ##END=
$$ 
$$ hash MD5
$$ B9 B0 A0 E9 4F 91 56 DA FC CF 1F 10 7F 33 D3 BB
##$RELAX= 
##$RELAX= 
##$RELAX= 
##$RELAX= 
##$RELAX= 
##$RELAX= 
$$ Bruker specific parameters
$$ --------------------------
##$DU= <F:/spectra>
##$EXPNO= 1
##$NAME= <H-C>
##$PROCNO= 1
##$TYPE= <nmr>
##$USER= <she>
##$AMP= (0..31)
100 100 100 100 100 100 100 100 100 100 100 100 100 100 100 100 100 100 
100 100 100 100 100 100 100 100 100 100 100 100 100 100 
##$AQSEQ= 0
##$AQ_mod= 1
##$AUNM= <au_zg>
##$AUTOPOS= <>
##$BF1= 200.13
##$BF2= 200.13
##$BF3= 200.13
##$BF4= 200.13
##$BF5= 200.13
##$BF6= 200.13
##$BF7= 200.13
##$BF8= 200.13
##$BYTORDA= 1
##$CFDGTYP= 0
##$CFRGTYP= 5
##$CHEMSTR= <none>
##$CNST= (0..31)
1 1 145 1 1 1 1 1 1 1 1 1 1 1 1 1 1 1 1 1 1 1 1 1 1 1 1 1 1 1 1 1 
##$CPDPRG= <>
##$CPDPRG1= <>
##$CPDPRG2= <>
##$CPDPRG3= <>
##$CPDPRG4= <mlev>
##$CPDPRG5= <mlev>
##$CPDPRG6= <mlev>
##$CPDPRG7= <mlev>
##$CPDPRG8= <mlev>
##$CPDPRGB= <>
##$CPDPRGT= <>
##$D= (0..31)
0 0.7 0 0 0 0 0 0 0 0 0 0.03 0 0 0 0 0 0 0 0 0 0 0 0 0 0 0 0 0 0 0 0 
##$DATE= 1737022483
##$DBL= (0..7)
120 120 120 120 120 120 120 120 
##$DBP= (0..7)
150 150 150 150 150 150 150 150 
##$DBP07= 0
##$DBPNAM0= <>
##$DBPNAM1= <>
##$DBPNAM2= <>
##$DBPNAM3= <>
##$DBPNAM4= <>
##$DBPNAM5= <>
##$DBPNAM6= <>
##$DBPNAM7= <>
##$DBPOAL= (0..7)
0.5 0.5 0.5 0.5 0.5 0.5 0.5 0.5 
##$DBPOFFS= (0..7)
0 0 0 0 0 0 0 0 
##$DE= 6
##$DECBNUC= <off>
##$DECIM= 32
##$DECNUC= <off>
##$DECSTAT= 4
##$DIGMOD= 1
##$DIGTYP= 9
##$DL= (0..7)
0 120 120 120 120 120 120 120 
##$DP= (0..7)
150 150 150 150 150 150 150 150 
##$DP07= 0
##$DPNAME0= <>
##$DPNAME1= <>
##$DPNAME2= <>
##$DPNAME3= <>
##$DPNAME4= <>
##$DPNAME5= <>
##$DPNAME6= <>
##$DPNAME7= <>
##$DPOAL= (0..7)
0.5 0.5 0.5 0.5 0.5 0.5 0.5 0.5 
##$DPOFFS= (0..7)
0 0 0 0 0 0 0 0 
##$DQDMODE= 0
##$DR= 18
##$DS= 0
##$DSLIST= <SSSSSSSSSSSSSSS>
$$ [...]
##$SUBNAM0= <"">
##$SUBNAM1= <"">
##$SUBNAM2= <"">
##$SUBNAM3= <"">
##$SUBNAM4= <"">
##$SUBNAM5= <"">
##$SUBNAM6= <"">
##$SUBNAM7= <"">
##$SUBNAM8= <"">
##$SUBNAM9= <"">
##$SW= 18.0517328524113
##$SWIBOX= (0..15)
0 0 2 0 0 0 0 0 0 0 0 0 0 0 0 0 
##$SW_h= 3612.71676300578
##$TD= 16384
##$TD0= 1
##$TE= 0
##$TE2= 300
##$TE3= 300
##$TEG= 300
##$TL= (0..7)
0 120 120 120 120 120 120 120 
##$TP= (0..7)
150 150 150 150 150 150 150 150 
##$TP07= 0
##$TPNAME0= <>
##$TPNAME1= <>
##$TPNAME2= <>
##$TPNAME3= <>
##$TPNAME4= <>
##$TPNAME5= <>
##$TPNAME6= <>
##$TPNAME7= <>
##$TPOAL= (0..7)
0.5 0.5 0.5 0.5 0.5 0.5 0.5 0.5 
##$TPOFFS= (0..7)
0 0 0 0 0 0 0 0 
##$TUNHIN= 0
##$TUNHOUT= 0
##$TUNXOUT= 0
##$USERA1= <user>
##$USERA2= <user>
##$USERA3= <user>
##$USERA4= <user>
##$USERA5= <user>
##$V9= 5
##$VALIST= <valist>
##$VCLIST= <CCCCCCCCCCCCCCC>
##$VD= 0
##$VDLIST= <DDDDDDDDDDDDDDD>
##$VPLIST= <PPPPPPPPPPPPPPP>
##$VTLIST= <TTTTTTTTTTTTTTT>
##$WBST= 1024
##$WBSW= 4
##$XGAIN= (0..3)
0 0 0 0 
##$XL= 0
##$YL= 0
##$YMAX_a= 152920
##$YMIN_a= -192501
##$ZGOPTNS= <>
##$ZL1= 120
##$ZL2= 120
##$ZL3= 120
##$ZL4= 120
##$ABSF1= 10
##$ABSF2= 0
##$ABSG= 5
##$ABSL= 3
##$ALPHA= 0
##$AQORDER= 0
##$ASSFAC= 0
##$ASSFACI= 0
##$ASSFACX= 0
##$ASSWID= 0
##$AUNMP= <proc_1d>
##$AZFE= 0.1
##$AZFW= 0.1
##$BCFW= 1
##$BC_mod= 2
##$BYTORDP= 1
##$COROFFS= 0
##$CY= -3
##$DATMOD= 1
##$DC= 2
##$DFILT= <>
##$DTYPP= 0
##$F1P= 0
##$F2P= 0
##$FCOR= 0.5
##$FTSIZE= 0
##$FT_mod= 4
##$GAMMA= 1
##$GB= 0.15
##$INTBC= 1
##$INTSCL= 1
##$ISEN= 128
##$LB= 0.25
##$LEV0= 0
##$LPBIN= 0
##$MAXI= 10000
##$MC2= 0
##$MEAN= 0
##$ME_mod= 0
##$MI= 1.114404
##$NCOEF= 0
##$NC_proc= 0
##$NLEV= 6
##$NOISF1= 3.799351
##$NOISF2= 2.8
##$NSP= 1
##$NTH_PI= 0
##$NZP= 0
##$OFFSET= 14.38212
##$PC= 1
##$PHC0= 252.7391
##$PHC1= 6.392201
##$PH_mod= 1
##$PKNL= yes
##$PPARMOD= 0
##$PSCAL= 0
##$PSIGN= 0
##$REVERSE= no
##$SF= 200.129724274929
##$SI= 16384
##$SIGF1= 3
##$SIGF2= 2
##$SINO= 400
##$SIOLD= 16384
##$SREGLST= <1H.CDCl3>
##$SSB= 0
##$STSI= 0
##$STSR= 0
##$SW_p= 3205.1282051282
##$SYMM= 0
##$S_DEV= 0
##$TDeff= 0
##$TDoff= 0
##$TI= <>
##$TILT= no
##$TM1= 0
##$TM2= 0
##$TOPLEV= 0
##$USERP1= <user>
##$USERP2= <user>
##$USERP3= <user>
##$USERP4= <user>
##$USERP5= <user>
##$WDW= 1
##$XDIM= 8192
##$YMAX_p= 0
##$YMIN_p= 0
$$ End of Bruker specific parameters
$$ ---------------------------------
##NTUPLES= NMR FID
##VAR_NAME=  TIME,          FID/REAL,        FID/IMAG
##SYMBOL=    X,             R,               I
##VAR_TYPE=  INDEPENDENT,   DEPENDENT,       DEPENDENT
##VAR_FORM=  AFFN,          ASDF,            ASDF
##VAR_DIM=   8192,          8192,            8192
##UNITS=     SECONDS,       ARBITRARY UNITS, ARBITRARY UNITS
##FACTOR=    0.0002768,     1,               1
##FIRST=     0,             0,               0
##LAST=      2.2672688,     0,               0
##MIN=       0,             -192501,         0
##MAX=       2.2672688,     152920,          0
$$ Real data points
##PAGE= N=1
##DATA TABLE= (X++(R..R)), XYDATA
$$ plain form
0 0 0 0 0 0 0 0 0 0 0 0 0 0 0 0 0 0 0 0 0 -2 8 -8 8 -8 8 -8 13 -16 16 -19 24 -24 29 -32 37 -40 45 -52 57 -61 69
41 69 -77 86 -96 106 -117 129 -142 157 -172 190 -210 232 -255 282 -313 348 -388 436 -493 562 -649
62 -649 756 -904 1112 -1424 1949 -3004 5964 -33878 -120176 -72027 47546 148150 152920 94980
76 94980 42846 43901 61715 45274 -18102 -79556 -97392 -74668 -52386 -55298 -70675 -59787 -13524
89 -13524 37279 52589 29874 2545 9250 49233 84651 79006 31696 -20522 -37815 -18827 7735
102 7735 10735 -11959 -38142 -44963 -33740 -23424 -27100 -33355 -25679 -444 29060 41429 33032
115 33032 22089 25460 36812 37346 17477 -11578 -26044 -14138 8567 14796 -6209 -37753 -53406
128 -53406 -42684 -16930 1593 4231 809 5729 18187 27400 24774 14962 9235 12202 17296 13339
$$ packed form
0@%%%%%%%%%%%%%%%%%%%kJ0j6J6j6J6j6K1k9L2l5M3m8N3o1O9p7Q5r7J09j18J30
41F9j46J63j82K02k23K46k71K99l29L62m00M42m87N37n95O61p36Q24r29J055j211
62f49J405j660K016k536L373m953Q968l9842q6298M8149J19573J00604M770n7940
76I4980n2134J055J7814j6441o3376o1454j7836K2724K2282k912j5377J0888M6263
89a3524N0803J5310k2715k7329O705L9983L5418n645m7310n2218j7293J8988K6562
102G735L000k2694k6183o821J1223J0316l676o255P676K5235K9504J2369q397
115C3032j0943L371J1352N34j9869k9055j4466J1906K2705O229k1005l1544j5653
128e3406J0722K5754J8523K638l422M920J2458R213k626r812n727K967N094l957
$$ plain form
142 13339 -2598 -17855 -21176 -13336 -5261 -7205 -15698 -18538 -7923 10858 21523 13978 -3125
155 -3125 -15818 -15179 -3292 7549 9557 7391 7700 10580 11565 6420 -1427 -5947 -2287 5630 7274
170 7274 634 -9076 -14762 -13555 -9590 -10227 -14017 -14601 -6787 7584 18879 21117 14822 7441 4913
185 4913 8596 11369 9433 4407 -839 -4746 -9137 -15937 -22680 -24560 -19108 -7399 2623 7889 8735
200 8735 8550 10570 13159 12376 7885 3213 3160 6546 9166 6107 -1719 -11528 -16900 -16912 -14173 -10865 -7441
217 -7441 -2834 2134 6999 7595 5279 3267 4635 8913 12158 11732 8090 3597 -903 -3547 -6403 -10655
233 -10655 -14174 -13374 -9477 -3941 -67 1116 -124 171 2812 5857 8502 9920 10220 10383 8532 4512
249 4512 -1903 -8100 -11363 -10740 -8485 -6576 -5108 -4978 -2593 258 2265 3389 4331 5472 7402 9359
$$ packed form
142A3339j5937j5257l321P840Q075j944q493k840J0615J8781J0665p545j7103
155c125j2693O39J1887J0841K008k166L09K880R85n145p847m520L660P917J644
170G274o640r710n686J207L965o37l790n84P814J4371J1295K238o295p381k528
185D913L683K773j936n026n246l907m391o800o743j880N452J1709J0022N266Q46
200H735j85K020K589p83m491m672n3L386K620l059p826r809n372j2K739L308L424
217g441M607M968M865N96k316k012J368M278L245m26l642m493m500k644k856m252
233a0655l519Q00L897N536L874J183j240K95K641L045K645J418L00J63j851m020
249D512o415o197l263O23K255J909J468J30K385K851K007J124R42J141J930J957
$$ plain form
265 9359 8993 6251 1672 -2692 -4978 -6289 -6300 -6000 -5171 -3461 -2100 -1472 -1872 -2071 -1089 2050 5597
282 5597 7781 7978 5868 3595 1424 -695 -2618 -4055 -4557 -3477 -1569 -563 -847 -2446 -3619 -3538
298 -3538 -2229 -264 1830 3654 5263 6072 5326 2606 -88 -2194 -2227 -1107 342 685 158 -720 -2431
315 -2431 -3622 -4351 -3888 -3505 -877 1960 3837 4214 3248 1359 -124 -656 -533 518 1283 2687 3272
332 3272 2254 623 -1869 -4173 -5042 -4201 -2338 -934 67 816 855 173 -369 -1043 -683 650 2686
349 2686 4249 5102 4414 2816 854 -909 -2155 -3069 -3043 -2468 -1944 -1713 -2006 -2723 -3219 -3180 -1724 302
367 302 2343 3962 5276 5500 4868 4019 2076 371 -456 -978 -1554 -1767 -2922 -3884 -4919 -5236 -4519 -3734
385 -3734 -2334 341 2255 3794 4905 4861 4437 4059 3549 3293 2568 1381 -20 -1751 -3145 -4823 -5878
$$ packed form
265I359l66k742m579m364k286j311j1L00Q29J710J361O28m00j99R82L139L547
282E597K184J97k110k273k171k119j923j437n02J080J908J006k84j599j173Q1
298c538J309J965K094J824J609Q09p46k720k694k106l3J120J449L43n27q78j711
315b431j191p29M63L83K628K837J877L77r66j889j483n32J23J051P65J404N85
332C272j018j631k492k304q69Q41J863J404J001P49L9o82n42o74L60J333K036
349B686J563Q53o88j598j962j763j246r14K6N75N24K31k93p17m96L9J456K026
367C02K041J619J314K24o32q49j943j705q27n22n76k13j155r62j035l17P17P85
385c734J400K675J914J539J111m4m24l78n10k56p25j187j401j731j394j678j055
$$ plain form
402 -5878 -6061 -5238 -3664 -2033 -425 864 1905 2236 3027 3643 4108 4585 4702 4147 3281 1503 -913 -3013
420 -3013 -4544 -5108 -4772 -3918 -2879 -2279 -1499 -1150 -797 -346 631 2113 3612 4628 5478 4954 3747 2105
438 2105 -108 -1442 -2406 -2948 -2618 -2528 -1901 -1959 -2597 -3185 -3117 -2428 -1379 455 2138 3567 4524 4384 3582
457 3582 2135 1284 252 28 16 96 -148 -1029 -2075 -3053 -4053 -4151 -3615 -2536 -962 1056 2218 2708
475 2708 2639 2329 1993 1594 1660 1960 1928 1659 1151 135 -1126 -2444 -3556 -3902 -3447 -2768 -1782 -815 -289 333
495 333 407 869 1283 1759 2589 3207 3197 2635 2191 962 -303 -1346 -2209 -2310 -2350 -2522 -2351 -2105 -1443 -1479 -1004
516 -1004 -425 1094 1731 2401 2745 3073 2536 1736 1213 767 162 -489 -654 -1567 -1752 -2362 -2814 -2513 -2049 -1493
536 -1493 -774 376 1188 1828 1905 1580 1671 1552 1067 1127 1115 957 247 -247 -1348 -2029 -2409 -2202 -1846 -1059 -358
$$ packed form
402e878j83Q23J574J631J608J289J041L31P91O16M65M77J17n55q66j778k416k100
420c013j531n64L36Q54J039O00P80L49L53M51R77J482J499J016Q50n24j207j642
438B105k213j334r64n42L30R0O27n8o38n88O8O89J049J834J683J429R57j40q02
457C582j447q51j032k24j2Q0k44q81j046r78j000r8N36J079J574K018J162M90
475B708o9l10l36l99O6L00l2k69n08j016j261j318j112l46M55O79R86R67N26O22
495C33P4M62M14M76Q30O18j0n62m44j229j265j043q63j01m0j72J71K46O62l6M75
516a004N79J519O37O70L44L28n37q00n23m46o05o51j65r13j85o10m52L01M64N56
536a493P19J150Q12O40P7l25R1j19m85O0j2j58p10m94j101o81l80K07L56P87P01
$$ plain form
557 -358 -18 875 824 353 441 475 742 1077 1611 1580 1583 506 -20 -938 -1560 -1541 -1269 -1004 -181 432 211 362
579 362 40 -213 -617 -631 110 632 875 1189 947 325 -83 -395 -1073 -745 -378 243 561 742 920 340 -213
600 -213 -952 -1191 -919 -670 -277 -44 62 155 -396 -404 -531 -502 -62 309 1009 1353 1259 1201 656 -111 -25 -570 -944
623 -944 -705 -263 -519 -259 -486 -643 -594 -951 -218 163 798 948 1320 1106 1026 735 402 419 -303 20 -54 -640
645 -640 -636 -809 -1240 -872 -1089 -744 -337 -77 452 662 723 688 897 907 1016 1204 732 495 51 109 -425 -585
667 -585 -724 -435 -483 -535 -268 -717 -610 -745 -509 -167 247 949 1245 1418 1296 1191 613 283 153 248 53
688 53 1 26 -189 -418 -756 -1280 -1338 -1664 -1148 -234 162 650 985 1245 918 791 760 868 1098 813 718 727 232
711 232 -376 -1059 -1640 -1933 -1768 -1710 -1051 -465 -169 307 573 560 440 1051 805 1368 1581 1599 1138 658 15
$$ packed form
557c58L40Q93n1m71Q8L4K67L35N34l1Lj077n26r18o22J9K72K65Q23O13k21J51
579C62l22k53m04j4P41N22K43L14k42o22m08l12o78L28L67O21L18J81J78n80n53
600b13p39k39K72K49L93K33J06R3n51qj27K9M40L71P00L44r4n8n45p67Q6n45l74
623i44K39M42k56K60k27j57M9l57P33L81O35J50L72k14q0k91l33J7p22L23p4n86
645f40Mj73m31L68k17L45M07K60N29K10O1l5K09J0J09J88m72k37m44N8n34j60
667e85j39K89m8n2K67m49J07j35K36L42M14P02K96J73j22j05n78l30j30R5j95
688E3n2K5k15k29l38n24n8l26N16R14L96M88L35K60l27j27l1J08K30k85r5Rm95
711B32o08o83n81k93J65N8O59N86K96M76K66j3j20O11k46N63K13J8m61m80o43
$$ plain form
732 15 -700 -1267 -1162 -1658 -1483 -1003 -1047 -779 -357 -451 -348 88 473 1078 1452 1634 1857 1955 1068 726 83 -262
754 -262 -874 -1056 -1230 -1229 -1348 -1314 -975 -982 -902 -299 -196 496 1106 1270 1608 1168 1434 1083 583 404 366 -75 -694
777 -694 -874 -1305 -1356 -1044 -1312 -781 -925 -584 -180 171 151 656 829 859 1073 930 1062 881 407 172 -190
798 -190 -314 -646 -592 -594 -830 -774 -636 -651 -486 -495 -307 109 411 893 1165 1305 682 579 539 171 19 111 146 -35
822 -35 -318 -383 -595 -1196 -1257 -1225 -821 -247 -224 287 504 840 595 714 413 199 816 570 694 429 486 -293
844 -293 -433 -727 -923 -863 -1101 -665 -513 -331 245 -24 -51 390 -19 349 574 648 1238 911 856 290 -5 -425
866 -425 -658 -916 -407 -280 -633 -465 -410 -252 -318 -551 -226 128 204 636 840 1026 1147 739 384 163 -23
887 -23 -307 -90 -349 -365 -629 -590 -550 -559 -624 -370 -566 -400 -143 140 657 683 418 579 374 556 514 40 346
$$ packed form
732A5p15n67J05m96J75M80m4K68M22r4J03M36L85O05L74J82K23R8q87l42o43l45
754b62o12j82j74Jj19L4L39pQ0O03J03O92O10J64L38m40K66l51n00j79l8m41o19
777f94j80m31n1L12k68N31j44L41M04L51k0N05J73L0K14j43J32j81m74k35l62
798a90j24l32N4kk36N6J38j5J65rJ88M16L02M82K72J40o23j03m0l68j52R2L5j81
822c5k83o5k12o01o1L2M04N74K3N11K17L36k45J19l01k14O17k46J24k65N7p79
844b93j40k94j96O0k38M36J52J82N76k69k7M41m09L68K25P4N90l27n5n66k95m20
866d25k33k58N09J27l53J68N5J58o6k33L25L54P6M32K04J86J21m08l55k21j86
887b3k84K17k59j6k64L9M0ro5K54j96J66K57K83N17K6k65J61k05J82m2m74L06
$$ plain form
910 346 27 -76 -615 -460 -527 -548 -741 -549 -553 -508 -82 -78 152 285 365 595 655 440 456 476 439 381 322 331 2 -72
936 -72 -386 -573 -984 -895 -615 -587 -268 -33 17 187 393 142 565 336 339 526 854 827 849 184 118 -532 -621 -1092
960 -1092 -922 -791 -696 -352 -21 -367 -204 -148 -27 211 343 672 978 1256 1196 811 874 274 -544 -627 -416 -552
982 -552 -716 -546 -626 -560 -582 -668 -640 -376 -105 488 582 916 1229 770 939 345 542 165 -366 -70 -69 -630 -673
1005 -673 -834 -797 -1009 -859 -735 -492 -167 265 511 552 929 1036 779 466 894 434 445 246 51 -123 -584
1026 -584 -706 -959 -1095 -922 -628 -790 -325 -295 -4 381 427 497 631 1037 959 1011 665 506 365 -379 -498 -597
1048 -597 -584 -915 -935 -901 -867 -640 -448 -331 108 162 706 525 658 1028 863 693 743 498 310 -153 -256 -331
1070 -331 -684 -1062 -787 -1185 -758 -643 -532 -111 130 399 369 858 748 610 950 1036 761 400 655 28 -464
$$ packed form
910C46l19j03n39J55o7k1j93J92mM5M26MK30J33Q0K30O0k15J6K0l7n8n9Rl29p4
936g2l14j87m11Q9K80K8L19K35N0J70K06k51M23k29LJ87L28k7K2o65o6o50q9m71
960a092J70J31R5L44L31l46J63N6J21K38J32L29L06K78o0l85O3o00q18q3K11j36
982e52j64J70q0O6k2q6K8K64K71N93R4L34L13m59J69n94J97l77n31K96Jn61m3
1005f73j61L7k12J50J24K43L25M32K46M1L77J07k57l13M28m60J1j99j95j74m61
1026e84j22k53j36J73K94j62M65L0K91L85M6P0J34M06p8N2l46j59j41p44j19r9
1048e97J3l31k0L4L4K27J92J17M39N4N44j81J33L70j65j70N0k45j88m63j03p5
1070c31l53l78K75l98M27J15J11M21K41K69l0M89j10j38L40Q6k75l61K55o27m92
$$ plain form
1091 -464 -555 -747 -921 -563 -588 -960 -389 -395 -148 -45 -6 100 573 640 838 1102 1113 547 483 -137 -110 -586 -562
1114 -562 -656 -599 -551 -458 -442 -504 -513 -415 87 24 366 702 934 631 767 433 235 664 76 -180 -60 -61 -490 -321
1138 -321 -470 -875 -717 -614 -715 -150 -203 250 274 524 221 547 742 412 784 517 264 414 79 -352 -175
1159 -175 -428 -861 -561 -651 -562 -337 -225 -392 141 171 331 120 498 536 533 538 501 538 178 350 -125 -512 -321
1182 -321 -943 -634 -559 -729 -376 -361 -95 94 -43 -27 148 246 404 508 285 381 539 251 111 225 -169 -348
1204 -348 -501 -357 -341 -423 -316 -305 -39 -42 88 208 64 379 235 634 660 765 508 207 297 41 16 -267 -86
1227 -86 -406 -385 -602 -402 -254 -591 -464 -318 58 -27 89 661 637 607 508 333 248 134 299 -127 -73 -48 -226
1250 -226 -424 -373 -577 -544 -526 -628 -64 -157 -5 319 345 504 248 171 318 398 324 7 271 28 226 -377 -518
$$ packed form
1091d64r1j92j74L58k5l72N71oK47J03L9J06M73O7J98K64J1n66o4o20K7m76K4
1114e62r4N7M8R3J6o2rR8N02o3L42L36K32l03J36l34j98M29n88k56J20jm29J69
1138c21j49m05J58J03j01N65n3M53K4K50l03L26J95l30L72k67k53J50l35m31J77
1159a75k53m33L00r0Q9K25J12j67N33L0J60k11L78L8lNl7L7l60J72m75l87J91
1182c21o22L09P5j70L53J5K66J89j37J6J75R8J58J04k23R6J58k88j40J14l94j79
1204c48j53J44J6q2J07J1K66lJ30J20j44L15j44L99K6J05k57l01R0k56k5k83J81
1227h6l20K1k17K00J48l37J27J46L76q5J16N72k4l0r9j75q5j14J65m26N4K5j78
1250b26j98N1k04L3J8j02N64r3J52L24K6J59k56p7J47Q0p4l17K64k43J98o03j41
$$ plain form
1273 -518 -410 -585 -692 -561 -522 -203 -6 -122 209 320 365 556 583 492 450 533 140 304 102 -98 -317 -384
1295 -384 -607 -525 -585 -568 -179 -86 -234 -209 36 230 468 257 644 524 314 801 247 415 -21 -218 -66 -332
1317 -332 -677 -568 -441 -158 -558 -168 -163 140 178 103 122 67 627 537 484 315 482 444 364 252 -177 -449 -401 -581
1341 -581 -493 -455 -364 -446 -165 -448 -153 188 156 388 669 883 898 371 364 194 69 -87 -230 -9 -39 -253 -612
1364 -612 -477 -592 -474 -435 -214 -278 -42 237 326 402 390 661 416 476 181 402 202 167 161 -135 -319 -353 -631
1387 -631 -467 -684 -149 -473 97 111 89 28 124 261 417 519 701 527 305 105 170 -45 -335 -472 -603 -676
1409 -676 -692 -357 -484 -250 -316 -287 235 60 167 481 439 606 675 460 636 90 98 -287 -440 -308 -706 -664 -509
1432 -509 -327 -483 -303 -497 -159 6 6 493 324 529 487 572 610 558 188 -114 71 -130 -405 -181 -456 -634
$$ packed form
1273e18J08j75j07J31L9L19J97j16L31J11M5J91K7r1m2Q3l93J64k02k00k19o7
1295c84k23Q2o0J7L89R3j48K5K45J94K38k11L87j20k10M87n54J68m36j97J52k66
1317c32l45J09J27K83m00L90NL03L8p5J9n5N60r0n3j69J67l8q0j12m29k72M8j80
1341e81Q8L8R1q2K81k83K95L41l2K32K81K14J5n27pj70j25j56j43K21l0k14l59
1364f12J35j15J18L9K21o4K36K79Q9P6j2K71k45O0k95K21k00l5ok96j84l4k78
1387f31J64k17N35l24N70J4k2o1R6J37J56J02J82j74k22k00O5k15k90j37j31p3
1409f76j6L35j27K34o6K9N22j75J07L14m2J67O9k15J76n46Ql85j53J32l98M2J55
1432e09J82j56J80j94L38J65%M87j69K05m2Q5L8n2l70l02J85k01k75K24k75j78
$$ plain form
1454 -634 -313 -485 -528 70 -154 -68 348 288 406 424 297 348 530 475 141 81 -76 -364 -103 -564 -400 -363 -448
1477 -448 -452 -599 -318 -305 41 249 248 209 396 426 421 376 403 126 -47 300 22 -210 -274 -254 -436 -558 -364 -420 -55
1502 -55 -336 -275 65 148 394 701 576 342 472 350 228 361 78 287 -156 -37 -356 -329 -525 -384 -338 -278
1524 -278 7 -399 -81 46 -28 440 463 441 290 319 325 112 -217 34 -102 -346 -299 -472 -291 -269 -331 -560 192
1547 192 -196 -375 -16 447 238 244 455 309 261 248 142 39 53 -32 -321 -108 -460 -100 -341 -343 -381 -205 46
1570 46 -189 169 120 54 196 307 492 351 504 157 290 111 99 -217 -148 -303 -267 -441 -283 -479 -594 -276
1592 -276 41 -175 -120 -58 196 358 460 474 425 92 100 284 178 71 61 -359 -386 -210 -319 -128 -546 -295 -364
1615 -364 -182 -183 -78 31 -77 230 344 477 216 145 146 3 360 -304 244 -312 -286 -332 -328 -533 -238 -2 -343
$$ packed form
1454f34L21j72m3N98k24Q6M16o0J18J8j27N1J82n5l34o0j57k88K61m61J64L7q5
1477d48mj47K81J3L46K08jl9J87L0nm5K7k77j73L47k78k32o4K0j82j22J94n6L65
1502e5k81O1L40Q3K46L07j25k34J30j22j22J33k83K09m43J19l19K7j96J41M6O0
1524b78K85m06L18J27p4M68K3k2j51K9Ok13l29K51j36k44M7j73J81K2o2k29P52
1547A92l88j79L59M63k09OK11j46m8j3j06j03J4q5k89K13l52L60k41kl8J76K51
1570D6k35L58m9o6J42J11J85j41J53l47J33j79j2l16O9j55L6j74J58j96j15L18
1592b76L17k16N5O2K54J62J02J4m9l33QJ84j06j07j0m20k7J76j09J91m18K51o9
1615c64J82jJ05J09j08L07J14J33k61p1Jj43L57o64N48n56K6m6Mk05K95K36l41
$$ plain form
1638 -343 -185 45 -263 159 43 346 436 405 541 247 296 247 -120 -306 -500 -336 -438 -340 -271 -557 -531 -217
1660 -217 -215 -172 132 132 118 381 384 150 315 495 135 127 -6 -327 -157 -109 -389 -260 -659 -199 -319 -319 -90 -122 269
1685 269 194 482 5 226 480 160 580 348 84 49 -38 -70 -198 -270 -454 -564 -461 -417 -183 -211 17 79 -9
1708 -9 337 367 183 316 439 156 379 232 182 52 -68 -160 -241 -226 -337 -499 -329 -203 -383 -168 258 94
1730 94 224 136 474 289 -87 282 435 222 366 -128 279 -169 -307 -271 -353 -378 -309 191 155 -379 201 22
1752 22 300 261 160 349 67 492 244 107 201 175 76 -66 -300 -179 -373 -168 -339 -239 -46 -448 -287 -279
1774 -279 -90 -173 133 177 425 233 568 37 309 246 -156 17 -66 -302 -225 -368 -422 -187 -472 -260 -12 -304
1796 -304 -134 218 109 73 280 395 379 318 195 273 179 39 -13 -157 -317 -263 -275 -165 -263 -223 -224 -54 -291 237
$$ packed form
1638c43J58K30l08M22j16L03R0l1J36k94M9m9l67j86j94J64j02R8O9k86K6L14
1660b17KM3L04%j4K63Lk34J65J80l60qj33l21J70M8k80J29l99M60j20%K29l2L91
1685B69p5K88m77K21K54l20M20k32k64l5q7l2j28p2j84j10J03M4K34k8K28O2q8
1708iL46L0j84J33J23k83K23j47n0j30j20r2q1J5j11j62J70J26j80K15M26j64
1730I4J30q8L38j85l76L69J53k13J44m94M07m48j38L6q2k5O9N00l6n34N80j79
1752B2K78l9j01J89k82M25k48j37R4k6r9j42k34J21j94K05j71J00J93m02J61Q
1774b79J89q3L06M4K48j92L35n31K72o3m02J73q3k36P7j43n4K35k85K12K48k92
1796c04J70L52j09l6K07J15j6o1j23P8r4j40n2j44j60N4j2J10r8M0jJ70k37N28
$$ plain form
1820 237 108 467 520 346 174 376 265 -77 92 91 -76 -16 -304 -512 -270 -188 -283 -374 -236 -324 72 -142 11
1843 11 172 391 71 408 311 277 221 163 146 -7 -55 -401 15 -204 -345 -370 -323 -345 -214 180 48 21 383 43
1867 43 299 185 332 282 270 289 148 3 300 -138 -130 -247 -547 -86 -289 -179 -306 -68 211 99 179 133 367
1890 367 325 499 326 295 104 66 -132 -221 -402 -201 -255 -232 -535 -11 -369 -364 -230 -109 -47 -97 80 420 313
1913 313 399 35 -9 91 199 33 98 181 -65 -144 -304 -328 -308 -235 -381 32 -127 225 93 136 401 299 310
1936 310 377 401 258 376 138 -64 181 -144 -92 -431 -357 -457 -424 -342 -97 -30 -55 130 91 198 190 330 393 296
1960 296 116 131 105 72 205 -73 -157 -189 -39 -492 -319 -296 -188 -130 -34 -251 -140 109 30 383 139 104 195 301
1984 301 37 47 26 -45 41 -149 -279 -267 -151 -81 -131 -44 -188 182 35 278 237 191 168 -33 320 292 569 -37
$$ packed form
1820B37j29L59N3j74j72K02j11l42J69jj67O0k88k08K42Q2r5r1J38q8L96k14J53
1843A1J61K19l20L37r7l4n6n8j7j53m8l46M16k19j41k5M7k2J31L94j32k7L62l40
1867D3K56j14J47n0j2J9j41j45K97m38Qj17l00M61k03J10j27K38K79j12Q0m6K34
1890C67m2J74j73l1j91l8j98q9j81K01n4K3l03N24l58NJ34J21O2n0J77L40j07
1913C13Q6l64m4J00J08j66O5Q3k46p9j60k4K0P3j46M13j59L52j32M3K65j02J1
1936C10O7K4j43J18k38k02K45l25N2l39P4j00L3Q2K45O7k5J85l9J07qJ40O3r7
1960B96j80J5k6l3J33k78q4l2J50m53J73K3J08N8R6k17J11K49p9L53k44l5R1J06
1984C01k64J0k1p1Q6j90j30J2J16P0n0Q7j44L70j47K43m1m6k3k01L53k8K77o06
$$ plain form
2008 -37 368 67 148 54 -332 -303 -279 -242 14 -296 -312 -17 234 227 47 253 226 271 354 234 257 331 -2 -127 -100
2033 -100 60 -244 -91 -168 -366 -173 8 -50 -90 203 345 6 156 245 249 162 104 212 230 -88 92 -100 22
2056 22 68 -121 -570 -287 -303 -279 -84 -125 -126 383 -85 -11 38 183 339 500 162 433 519 245 43 -250 -126
2079 -126 -129 -306 -380 -254 -147 -273 -288 -13 -99 47 204 84 88 113 594 21 412 68 229 79 97 -287 -239
2102 -239 -289 -453 -277 -296 -71 -505 -301 53 30 20 115 95 340 247 335 29 251 108 -156 -215 -162 -436 -254
2125 -254 -49 -200 -299 -96 -503 -181 -286 -181 164 -78 269 183 143 185 247 264 231 -14 219 -244 -207 56 -24
2148 -24 -345 -223 25 -278 -521 -155 137 35 337 366 292 467 -52 269 220 254 86 128 -96 -185 -95 -243 -167
2171 -167 -314 -266 -35 -162 -99 -9 -275 36 295 249 118 214 297 225 355 255 19 -38 -22 -178 -120 -314 -330 -254
$$ packed form
2008c7M05l01Q1r4l86K9K4L7K56l10j6K95K51pj80K06k7M5Q3j20K3P4l33j25K7
2033a00J60l04J53p7j98J93J81n8m0K93J42l39J50Q9Mq7n8J08J8l18J80j92J22
2056B2M6j89m49K83j6K4J95m1jN09m68P4M9J45J56J61l38K71Q6k74k02k93J24
2079a26lj77p4J26J07j26j5K75q6J46J57j20MK5M81n73L91l44J61j50J8l84M8
2102b39n0j64J76j9K25m34K04L54k3j0R5k0K45r3Q8l06K22j43k64n9N3k74J82
2125b54K05j51r9K03m07L22j05J05L45k42L47q6m0M2O2J7l3k45K33m63L7K63q0
2148b4l21J22K48l03k43L66K92j02L02K9p4J75n19L21m9L4j68M2k24q9R0j48P6
2171a67j47M8K31j27O3R0k66L11K59m6j31R6Q3p2J30j00k36n7J6j56N8j94j6P6
$$ plain form
2195 -254 165 -207 -262 -108 48 71 198 149 249 222 210 443 102 -4 30 89 -125 -287 -346 -113 10 -218 -143
2218 -143 -7 -283 -87 32 -137 137 142 162 44 35 398 187 97 -2 71 28 7 -43 -346 -132 -328 -392 -53 -122
2242 -122 -116 -26 121 -161 150 276 295 99 257 48 136 57 72 -243 -144 42 -128 -210 -334 -282 -321 -41 -238 -143
2266 -143 -123 -149 72 109 258 125 58 224 84 186 -73 39 -7 -105 133 -414 -195 -209 -78 -299 -151 -374
2288 -374 -99 -98 -16 -51 112 288 167 229 -29 259 3 45 -15 8 -252 -418 -212 -98 4 -330 -436 39 -77
2311 -77 160 51 52 117 117 256 229 374 40 42 154 -129 -242 21 -108 -153 -407 -304 -58 -259 -339 131 8 -165
2335 -165 -45 -201 249 326 337 156 243 333 15 -231 -60 52 -245 -359 -10 15 -141 -364 -149 171 -27 -12
2357 -12 -399 274 302 124 25 37 636 313 300 149 246 -161 -129 -167 -248 -359 -332 -344 -217 -357 117 -77 110 153
$$ packed form
2195b54M19l72n5J54J56K3J27m9J00k7j2K33l41j06L4N9k14j62n9K33J23k28P5
2218a43J36k76J96J19j69K74NK0j18rL63k11r0r9P3m3k1n0l03K14j96o4L39o9
2242a22OR0J47k82L11J26J9j96J58k09Q8p9J5l15R9J86j70q2j24N2l9K80j97R5
2266a43K0k6K21L7J49j33o7J66j40J02k59J12m6r8K38n47K19j4J31k21J48k23
2288c74K75JQ2l5J63J76j21O2k58K88k56M2o0K3k60j66K06J14J02l34j06M75j16
2311g7K37j09JO5%J39k7J45l34KJ12k83j13K63j29m5k54J03K46k01q0M70j23j73
2335a65J20j56M50P7J1j81Q7R0l18k46J71J12k97j14L49K5j56k23K15L20j98J5
2357a2l87O73K8j78r9J2N99l23j3j51R7m07L2l8q1j11K7j2J27j40M74j94J87M3
$$ plain form
2381 153 -66 246 28 172 258 165 117 187 -125 251 127 19 -70 -170 -128 -287 -207 34 -130 223 255 151 98
2404 98 315 -77 168 231 92 131 240 -16 -85 -197 -1 -50 -323 -224 -453 -77 -93 -334 -239 -271 -104 20 45
2427 45 61 147 223 198 -24 203 113 -214 -63 -189 121 -145 7 -30 -306 -397 -78 98 -66 357 -51 12 291
2450 291 73 31 94 220 194 308 -171 -109 222 57 67 19 -222 -147 -190 -61 -241 -109 24 18 165 216 265 255
2474 255 157 -187 88 221 -299 89 4 173 -86 -285 58 -179 -300 -155 -310 -164 -27 -65 53 136 -113
2495 -113 72 306 210 103 282 -42 69 50 146 -191 -370 -26 -138 -268 -150 -86 -183 118 281 139 188 -81
2517 -81 246 110 202 168 303 78 175 14 -46 -92 133 -178 -269 -108 -64 -204 -209 -65 -28 237 -89 -129 142 -105
2541 -105 151 301 219 34 44 -198 -208 139 -281 -115 -218 -270 -176 -152 -213 -56 -252 -270 -264 206 133 -26 -142 139
$$ packed form
2381A53k19L12k18J44Q6r3m8P0l12L76j24j08q9j00M2j59Q0K41j64L53L2j04n3
2404I8K17l92K45O3j39L9J09k56o9j12J96m9k73R9k29L76j6k41R5l2J67J24K5
2427D5J6Q6P6k5k22K27r0l27J51j26L10k66J52l7k76r1L19J76j64M23m08O3K79
2450B91k18m2O3J26k6J14m79O2L31j65J0m8k41P5m3J29j80J32J33oJ47N1M9j0
2474B55r8l44K75J33n20L88q5J69k59j99L43k37j21J45j55J46J37l8J18Q3k49
2495a13J85K34r6j07J79l24J11j9R6l37j79L44j12j30J18O4r7L01J63j42M9k69
2517h1L27j36R2l4J35k25R7j61o0m6K25l11r1J61M4j40nJ44L7K65l26m0K71k47
2541a05K56J50q2j85J0k42j0L47m20J66j03n2R4K4o1J57j96j8OM70p3j59j16K81
$$ plain form
2565 139 -63 20 16 269 109 -80 -64 36 -355 156 -57 -188 -26 -428 31 -65 -148 -55 1 56 203 -191 137
2588 137 -94 306 -498 77 -117 -189 -173 -395 -53 -253 62 -195 -45 -136 -175 -17 271 121 347 197 87
2609 87 -141 282 179 40 -153 -76 -110 -17 -56 -456 -113 27 -22 -285 31 -62 -82 -330 132 115 -93 106 243
2632 243 183 182 167 19 -69 15 -5 12 -136 -168 -60 -221 -205 11 -19 -46 -179 107 246 276 96 297 389 65 -21
2657 -21 69 -199 -16 -42 -191 -292 -197 -154 -149 -281 -134 -115 113 -113 60 135 208 119 -163 341 43 61 -177 56
2681 56 -147 -208 324 -188 -76 -220 -133 -19 -106 -38 75 -81 -103 -67 62 46 170 72 175 84 125 234 35 11
2705 11 40 64 22 -178 -199 -117 -257 -39 -33 -46 260 -218 221 65 55 -143 117 346 440 461 333 -128 -190 -280 8
2730 8 -293 88 27 -40 -247 115 177 -120 147 179 177 50 279 88 170 0 16 -3 -15 -29 52 -135 -177 4 67
$$ packed form
2565A39k02Q3mK53j60j89J6J00l91N11k13j31J62m02M59r6q3R3N6N5J47l94L28
2588A37k31M00q04N75j94p2J6k22L42k00L15k57J50r1l9J58K88j50K26j50j10
2609H7k28M23j03j39j93P7l4R3l9m00L43J40m9k63L16r3k0k48M62j7k08J99J37
2632B43o0jj5j48q8Q4k0J7j48l2J08j61J6K16l0k7j33K86J39L0j80K01R2l24q6
2657b1R0k68J83k6j49j01R5M3Nj32J47J9K28k26J73P5P3q9k82N04k98J8k38K33
2681E6k03o1N32n12J12j44Q7J14q7O8J13j56k2L6J29j6J24r8J03r1M1J09j99k4
2705A1K9K4m2k00k1Q2j40K18Oj3L06m78M39j56j0j98K60K29R4K1j28m61o2r0K88
2730Hl01L81o1o7k07L62O2k97K67L2kj27K29j91Q2j70J6j9j2j4Q1j87m2J81O3
$$ plain form
2755 67 -265 -68 43 91 -56 -116 91 -93 91 113 11 351 0 316 147 396 123 61 287 -497 -100 84
2777 84 -90 -172 222 -12 24 208 125 76 105 243 78 140 131 -229 33 68 -92 -148 -176 61 -177 -197 -91 -171 -38
2802 -38 -210 -213 -24 117 131 148 217 170 26 264 26 171 115 -113 -154 -215 -35 -101 -36 -310 26 -195 -276 -251 -99
2827 -99 -113 -4 149 61 4 150 400 124 87 123 57 46 -157 75 85 -18 -48 -244 -460 -116 -7 -85 6 234
2851 234 139 16 2 237 257 119 -121 -45 74 167 13 27 -75 -178 58 -52 91 -151 -274 -140 -31 150
2873 150 28 -25 75 333 22 97 132 106 83 118 -159 228 -54 -35 -261 -147 -19 -373 -10 8 -158 318 -79
2896 -79 -40 -2 -102 -236 221 221 194 33 79 -123 -239 -153 -209 33 135 -192 -59 -86 -158 14 154 -51 362 -72
2920 -72 65 108 75 106 53 180 284 226 -150 78 -120 -278 8 11 -247 -454 -368 57 -4 85 -76 99 21 -38
$$ packed form
2755F7l32J97J11M8j47o0K07j84J84K2j02L40l51L16j69K49k73o2K26p84L97J84
2777H4j74q2L94k34L6J84q3m9K9J38j65O2rl60K62L5j60n6k8K37k38k0J06q0J33
2802c8j72lJ89J41J4J7O9m7j44K38k38J45n6k28m1o1J80o6O5k74L36k21q1K5J52
2827i9j4J09J53q8n7J46K50k76l7L6o6j1k03K32J0j03l0j96k16L44J09p8R1K28
2851B34r5j23j4K35K0j38k40P6J19R3j54J4j02j03K36j10J43k42j23J34J09J81
2873A50j22n3J00K58l11P5L5k6k3L5k77L87k82J9k26J14J28l54L63J8j66M76l97
2896g9L9L8j00j34M57%k7j61M6k02j16Q6n6K42J02l27J33k7p2J72J40k05M13m34
2920g2J37M3l3L1n3J27J04n8l76K28j98j58K86Lk58k07Q6M25o1Q9j61J75p8n9
$$ plain form
2944 -38 197 219 114 -80 -197 -130 131 -114 83 -123 -242 25 -326 -6 -421 173 356 -192 -19 41 247
2965 247 149 -4 169 381 233 189 -131 234 51 -166 -67 -133 -173 -122 -209 -51 49 -46 -138 229 40 45 149 163
2989 163 94 3 -117 149 56 -218 251 115 -20 -163 -129 53 -380 -129 -88 -87 -112 -38 17 -34 19 -123 237 32
3013 32 271 110 17 -2 -78 172 115 195 274 -245 -89 -309 -163 -132 -42 -212 -118 148 10 -68 281 177 138 191
3037 191 -145 100 -131 -140 101 -5 -197 -384 -92 -27 -23 -318 -151 104 167 130 313 -119 199 166 -45 143 -80
3060 -80 24 -14 -73 128 62 161 -49 -168 -33 -59 -231 -179 32 35 115 173 61 130 -83 297 22 193 37 89
3084 89 -11 -115 -67 -174 117 109 -56 -265 -174 -61 308 -59 -167 57 34 250 263 192 146 342 43 39 -134 -22
3108 -22 -41 137 -1 -79 -347 -209 69 91 -149 -20 264 18 87 169 158 -57 187 194 250 206 -28 312 392 -191
$$ packed form
2944c8K35K2j05j94j17O7K61k45J97k06j19K67l51L20m15N94J83n48J73O0K06
2965B47r8j53J73K12j48m4l20L65j83k17R9o6m0N1q7J58J00r5r2L67j89NJ04J4
2989A63o9r1j20K66r3k74M69j36j35j43L4J82m33K51M1Jk5P4N5n1N3j42L60k05
3013C2K39j61r3j9p6K50n7Q0P9n19J56k20J46L1R0j70R4K66j38p8L49j04l9N3
3037A91l36K45k31rK41j06j92j87K92O5Mk95J67K55O3l7J83m32L18l3k11J88k23
3060h0J04l8n9K01o6R9k10j19J35k6j72N2K11LQ0N8j12O9k13L80k75J71j56N2
3084H9j00j04M8j07K91qj65k09R1J13L69l67j08K24k3K16J3p1m6J96k99mj73J12
3108b2j9J78j38p8k68J38K78K2k40J29K84k46O9Q2j1k15K44PN6m4k34L40Q0n83
$$ plain form
3132 -191 -146 -128 -164 -121 -158 71 -47 295 68 11 -120 -137 71 244 215 45 96 107 -17 141 122 -6 69 -139
3156 -139 105 -106 -113 -77 -33 -229 -151 -44 -61 -27 -75 1 127 -12 145 -191 213 -148 120 -75 -85 88 -293
3179 -293 -59 -158 -312 -43 -99 -26 30 61 113 -25 -79 266 64 -187 356 113 -15 19 174 126 -275 -300 -237 -37
3203 -37 -13 188 99 -2 51 -111 -67 -218 -171 69 116 286 -9 109 -279 -137 -165 18 1 34 -68 127 -1
3226 -1 -77 -54 -93 248 -169 -32 120 88 54 321 149 -100 180 137 328 -302 61 -106 -126 -58 174 -70 -266
3249 -266 52 -8 71 -177 91 7 23 -111 -209 17 288 330 124 121 -20 -18 -206 -107 110 -18 -156 -160 0 -29 4
3274 4 -114 -217 39 109 -135 212 88 215 53 71 57 -90 255 215 20 -96 36 9 -325 -468 -12 11 -167
3297 -167 -103 -148 -59 227 168 -80 -141 2 -168 73 -4 241 -220 -144 -44 -321 -213 -58 -127 19 36 -2 -140
$$ packed form
3132a91M5J8l6M3l7K29j18L42k27n7j31j7K08J73k9j70N1J1j24J58j9j28P5k08
3156a39K44k11pL6M4j96P8J07j7L4m8P6J26j39J57l36M04l61K68j95j0J73l81
3179b93K34r9j54K69n6P3N6L1N2j38n4L45k02k51N43k43j28L4J55m8m01k5O3K00
3203c7K4K01q9j01N3j62M4j51M7K40M7J70k95J18l88J42k8J83j7L3j02J95j28
3226ap6K3l9L41m17J37J52l2l4K67j72k49K80m3J91o30L63j67k0O8K32k44j96
3249b66L18o0P9k48K68q4J6j34r8K26K71M2k06lj41Kj88R9K17j28j38mJ60k9L3
3274Dj18j03K56P0k44L47j24J27j62J8j4j47L45m0j95j16J32k7l34j43M56K3j78
3297a67O4m5Q9K86n9k48o1J43j70K41p7K45m61P6J00k77J08J55o9J46J7l8j38
$$ plain form
3320 -140 224 -165 -18 192 74 -146 485 124 180 172 -96 284 -339 -55 -40 -114 41 -115 -233 -236 -16 126
3342 126 -66 -150 8 -313 73 349 126 -129 239 193 273 -27 50 18 49 17 -306 -176 116 -449 80 82 153
3365 153 95 110 188 102 -16 69 132 57 21 60 -153 -73 -113 -38 -127 -101 133 -58 -188 -300 -46 12 157 15 -306
3390 -306 167 37 219 -197 66 441 231 4 75 255 9 -39 93 -17 -397 -59 -112 -79 42 -208 91
3411 91 79 -121 110 -162 192 124 110 -89 57 -85 -115 -219 -422 61 -116 105 -28 -23 -109 -2 -103 22 47
3434 47 259 330 -42 46 25 59 -51 -18 105 -23 6 134 -264 -89 -77 -95 -85 -259 -73 -69 -112 286 -12 -192
3458 -192 6 212 -182 -48 157 -21 -56 15 44 28 30 -158 -45 103 33 -157 -118 -167 97 233 -86 72 159
3481 159 251 -73 200 359 -167 14 212 118 48 -21 -167 -136 -76 48 153 -30 -172 -33 23 -64 -122 165 -1
$$ packed form
3320a40L64l89J47K10j18k20O31l61N6qk68L80o23K84J5p4J55j56j18lK20J42
3342A26j92q4J58l21L86K76k23k55L68m6Q0l00P7l2L1l2l23J30K92n65N29KP1
3365A53n8J5P8q6j18Q5O3p5l6L9k13Q0m0P5q9K6K34j91j30j12K54N8J45j42l21
3390c06M73j30J82m16K63L75k10k27P1J80k46m8J32j10l80L38n3L3J21k50K99
3411I1j2k00K31k72L54o8j4j99J46j42l0j04k03M83j77K21j33Nq6J07j01J25K5
3434D7K12P1l72Q8k1L4j10L3J23j28K9J28l98J75J2j8J0j74J86Mm3L98k98j80
3458a92J98K06l94J34K05j78l5P1K9j6Kj88J13J48p0j90L9m9K64J36l19J58Q7
3481A59R2l24K73J59n26J81J98r4p0o9j46L1O0J24J05j83j42J39N6q7n8K87j66
$$ plain form
3504 -1 167 -124 180 -41 242 -120 113 166 259 143 331 -199 -197 -311 -8 -141 -219 -121 -100 -73 177 16 138
3527 138 -278 338 123 -55 -32 135 -33 -39 57 -278 -177 -144 19 -64 -122 -100 7 143 74 -28 -45 157 -15
3550 -15 13 108 274 44 93 -16 -333 39 246 -104 45 -106 -121 -130 -173 -11 -11 -129 87 94 455 -47 -74 88
3574 88 18 269 -62 71 -299 -270 -133 -184 -69 -337 -70 -261 -64 127 -223 -202 -16 173 82 -45 -3 96 -141
3597 -141 22 100 -404 120 90 121 -78 21 14 -173 -65 73 37 -169 24 268 -260 213 -88 213 254 101 -156
3620 -156 393 113 87 18 -119 -1 -199 -6 -83 101 5 -74 17 2 -72 -23 39 -53 57 205 283 103 -222 -90
3644 -90 -42 111 21 170 155 37 67 -26 -330 -153 48 1 -126 -142 141 -26 114 38 -3 163 -108 222 -274
3667 -274 237 152 -34 -203 -118 29 -60 -157 -257 261 -111 80 192 -547 145 20 -109 -136 149 51 19 259
$$ packed form
3504aJ68k91L04k21K83l62K33N3R3j16J88n30Kj14L03j33p8R8K1K7K50j61J22
3527A38m16O16k15j78K3J67j68oR6l35J01L3J63q3n8K2J07J36o9j02j7K02j72
3550a5K8R5J66k30M9j09l17L72K07l50J49j51j5rm3J62%j18K16PL61n02k7J62
3574H8p0K51l31J33l70K9J37n1J15k68K67j91J97J91l50K1J86J89r1j27M2R9k37
3597a41J63P8n04N24l0L1j99R9pj87J08J38l6k06J93K44n28M73l01L01M1j53k57
3620a56N49k80k6o9j37J18j98J93p7J84r6p9R1j5p4M9O2r2J10J48P8j80l25J32
3644i0M8J53r0J49j5j18L0r3l04J77K01m7j27j6K83j67J40p6m1J66k71L30m96
3667b74N11q5j86j69Q5J47q9r7j00N18l72J91J12p39O92j25j29k7K85r8l2K40
$$ plain form
3689 259 177 211 -179 199 149 25 -367 -458 109 -123 1 96 177 -33 43 176 -117 -220 -86 229 -67 15 -84
3712 -84 315 -113 -148 -110 -71 -178 -328 -30 -55 -200 53 98 68 324 -65 28 -102 202 297 1 54 2 -301 60
3736 60 -51 51 -157 -121 76 -134 -153 -25 146 75 125 -41 18 -58 -81 160 80 -13 -104 110 65 106 75 245 -100
3761 -100 -120 50 -256 -19 -183 47 -340 84 -76 200 27 -37 175 86 -184 -49 -33 16 163 -133 -78 45
3783 45 -103 -76 -277 -127 -55 -67 -142 127 -135 96 163 -290 205 15 -356 -125 128 -78 -105 191 67 -199
3805 -199 -47 -6 -167 -67 -30 166 -125 -228 189 60 -120 137 197 3 97 -171 156 302 -209 127 -307
3826 -307 -91 -79 -74 -59 -48 37 -158 63 68 -359 -15 -204 102 190 -84 157 9 -72 -213 -7 144 -96 -25 82
3850 82 31 -69 118 317 -39 -7 -272 -124 7 -204 47 126 167 -139 -20 101 -246 77 -71 -76 102 -18
$$ packed form
3689B59q2L4l90L78n0j24l92r1N67k32J24R5Q1k10P6J33k93j03J34L15k96Q2r9
3712h4L99m28l5L8L9j07j50K98k5j45K53M5l0K56l89R3j30L04R5k96N3n2l03L61
3736F0j11J02k08L6J97k10j9J28J71p1N0j66N9p6k3K41q0r3r1K14m5M1l1J70l45
3761a00k0J70l06K37j64K30l87M24j60K76j73o4K12q9k70J35J6M9J47k96N5J23
3783D5j48K7k01J50P2j2p5K69k62K31O7m53M95j90l71K31K53k06k7K96j24k66
3805a99J52M1j61J00L7J96k91j03M17j29j80K57O0j94R4k68L27J46n11L36m34
3826c07K16J2NJ5J1Q5j95K21Nm27L44j89L06Q8k74K41j48q1j41K06J51k40P1J07
3850H2n1j00J87J99l56L2k65J48J31k11K51P9M1l06J19J21l47L23j48nJ78j20
$$ plain form
3872 -18 -79 4 208 -57 -110 64 54 -172 58 -284 -100 -5 180 218 -192 189 10 -37 -175 66 -91 -152 -1
3895 -1 33 -76 -24 -161 295 -114 -130 -79 118 -224 173 50 237 111 11 49 14 -30 -7 62 -79 -331 47 -380
3919 -380 -134 -95 -203 -260 -288 -9 65 -47 75 196 99 28 183 -15 280 7 -45 88 146 -10 105 201 -464
3942 -464 222 -41 -96 68 -22 -69 -88 57 5 103 -178 -94 259 10 181 85 -100 -202 36 -197 61 -43 76
3965 76 0 -73 -168 -40 -60 -21 58 -173 -2 -106 -67 51 21 -101 139 136 -33 -19 149 -63 -35 -20 146 -2 17
3990 17 -84 3 87 21 113 154 440 -51 -249 33 225 35 93 222 6 -117 -151 -131 -12 -100 78 107 -12 -162
4014 -162 251 -25 -3 77 119 29 -279 30 -17 -196 131 151 98 22 -115 -251 9 63 -339 256 -185 -38 -14
4037 -14 -123 56 73 -20 189 -78 -39 117 -130 135 -24 -220 65 -14 -23 12 -15 -87 -284 4 213 82 116 3
$$ packed form
3872a8o1Q3K04k65n3J74j0k26K30l42J84R5J85L8m10L81j79m7j38K41j57o1J51
3895aL4j09N2j37M56m09j6N1J97l42L97j23J87j26j00L8l5m4K3O9j41k52L78m27
3919c80K46L9j08n7k8K79P4j12J22J21r7p1J55j98K95k73n2J33N8j56J15R6o65
3942d64O86k63n5J64r0m7j9J45n2R8k81Q4L53k49J71r6j85j02K38k33K58j04J19
3965G6p6p3r5J28k0L9P9k31J71j04L9J18l0j22K40lj69J4J68k12K8J5J66j48J9
3990A7j01Q7Q4o6R2M1K86m91j98K82J92j90N8J29k16j23l4K0J19q8J78K9j19j50
4014a62M13k76K2Q0M2r0l08L09m7j79L27K0n3p6j37j36K60N4m02N95m41J47K4
4037a4j09J79J7r3K09k67L9J56k47K65j59j96K85p9rL5k7p2j97K88K09j31L4j13
$$ plain form
4061 3 14 364 81 13 71 97 -4 -270 -144 15 192 -79 -410 -28 100 88 164 153 -47 71 139 -66 -49 -148
4085 -148 3 -29 102 -109 160 117 36 227 -144 113 82 129 2 -164 -56 -54 -257 -118 -117 -62 251 -156 248
4108 248 -118 14 -149 13 77 80 -26 269 71 216 -86 -86 193 -87 -251 -211 -176 -132 94 -223 -72 220 -51
4131 -51 116 -127 48 -32 313 159 37 22 -154 -73 -153 159 157 18 20 184 69 -195 73 392 18 80 264
4154 264 40 87 123 0 -76 -61 -84 6 184 -199 44 -91 53 -14 -100 45 -132 -58 19 149 -5 181 -109
4177 -109 -70 17 33 -89 57 -111 30 118 137 -176 -153 -54 92 -169 -246 14 55 152 -50 146 -6 0 -102 34
4201 34 37 -34 71 -8 186 94 30 -163 130 254 -84 196 213 31 -49 -432 -34 243 379 23 -77 273 -19
4224 -19 -142 -120 6 -57 271 -183 -18 -302 -35 -21 -163 -136 114 34 -86 -119 82 73 -83 262 -220 -93 68
$$ packed form
4061CJ1L50k83o8N8K6j01k66J26J59J77k71l31L82J28j2P6j1k00J18O8k05J7r9
4085a48J51l2J31k11K69m3q1J91l71K57l1M7j27j66J08Kk03J39JN5L13m07M04
4108B48l66J32j63J62O4Lj06K95j98J45l02%K79k80j64M0L5M4K26l17J51K92k71
4131e1J67k43J75q0L45j54j22j5j76Q1q0L12kj39KJ64j15k64K68L19l74O2J84
4154B64k24M7L6j23p6J5k3R0J78l83K43j35J44o7q6J45j77P4P7J30j54J86k90
4177a09L9Q7J6j22J46j68J41Q8J9l13K3R9J46k61p7K60M1R7k02J96j52Oj02J36
4201C4Lp1J05p9J94r2o4j93K93J24l38K80J7j82q0l83L98K77J36l56j00L50k92
4224a9j23K2J26o3L28m54J65k84K67J4j42K7K50q0j20l3K01rj56L45m82J27J61
$$ plain form
4247 68 169 -186 212 137 241 -100 -40 5 149 8 -154 334 90 -54 -34 199 -72 22 271 -144 -238 -103
4269 -103 341 -153 -146 -304 -211 -93 -147 -235 -20 -118 37 9 -31 197 101 143 90 171 164 54 -46 -5 -65 7 16 -428
4295 -428 158 92 62 -169 -87 -121 80 -2 -70 6 -234 -80 5 -141 -98 -133 36 246 12 135 223 134 -59 121
4319 121 -3 -67 34 -138 -87 -13 -165 -255 -4 26 -37 171 62 216 -78 84 128 24 25 -106 -262 175 139
4342 139 17 180 -25 -141 -2 -137 -120 170 -32 -43 197 -91 -19 -379 -52 52 -56 90 152 154 154 6 -86
4365 -86 -57 113 74 -124 -134 -220 -57 3 -182 -132 -149 207 -85 199 -221 -29 -76 50 131 93 -236 -26 -234 54
4389 54 129 170 132 -48 -44 -102 -5 216 113 199 -111 -80 -191 -152 -14 26 119 41 -173 -90 -202 -105 219 -190 81
4414 81 -305 24 -82 29 -65 -13 80 -297 -70 -40 226 -347 221 -65 -8 -38 149 -36 -55 -328 -136 -129 -10
$$ packed form
4247F8J01l55L98p5J04l41O0M5J44j41j62M88k44j44K0K33k71R4K49m15r4J35
4269a03M44m94Pj58R3J18n4q8K15r8J55k8m0K28r6M2n3Q1pj10j00M1o0P2Rm44
4295d28N86o6l0k31Q2l4K01q2o8P6k40J54Q5j46M3l5J69K10k34J23Q8q9j93J80
4319A21j24o4J01j72N1P4j52r0K51L0o3K08j09J54k94J62M4j04Jj31j56M37l6
4342A39j22J63k05j16J39j35J7K90k02j1K40k88P2l60L27J04j08J46O2K%j48r2
4365h6K9J70l9j98j0q6J63O0j85N0j7L56k92K84m20J92m7J26Q1l8l29K10k08K88
4389E4P5M1l8j80Mn8R7K21j03Q6l10L1j11L9J38M0R3p8k14Q3j12R7L24m09K71
4414H1l86L29j06J11r4N2R3l77K27L0K66n73N68k86N7l0J87j85j9k73J92PJ19
$$ plain form
4437 -10 -238 -181 331 3 76 232 -97 -55 233 49 -29 -11 35 -33 -47 294 7 107 24 -170 -165 222 -243 -245 -153
4462 -153 112 77 182 -28 116 122 -347 34 44 78 -171 -16 -108 -9 84 -13 -51 -22 -52 -51 63 -119 73 294 -57
4487 -57 -114 77 174 93 -73 267 62 124 129 173 202 116 -205 89 111 -51 199 -46 -219 -119 134 12 -38 -29 118
4512 118 360 21 -13 -212 -112 12 134 -132 189 -459 25 18 -30 64 -147 113 -185 -56 -172 157 -5 102
4534 102 290 168 255 -92 47 -177 31 23 66 25 290 42 -96 101 -69 -13 166 127 41 0 -79 -13 -16 148
4558 148 -21 154 97 -54 60 -92 -271 344 158 37 -14 11 -8 43 -1 -42 6 -347 51 20 -86 326 111
4581 111 230 314 -2 -4 -33 79 -84 148 -77 -124 12 -92 -41 336 -88 -238 28 80 -57 74 -159 -115 -44
4604 -44 54 -32 76 -172 -13 -15 138 36 1 40 129 -115 -381 16 -153 -204 -82 141 -13 36 51 46 166 -269
$$ packed form
4437a0k28N7N12l28P3J56l29M2K88j84p8J8M6o8j4L41k87J00q3j94NL87m65kR2
4462a53K65l5J05k10J44Om69L81J0L4k49J55r2R9R3r7l8K9l0JJ14j82J92K21l51
4487e7n7J91R7q1j66L40k05O2NM4K9q6l21K94K2j62K50k45j73J00K53j22n0RJ47
4512A18K42l39l4j99J00J24J22k66L21o48M84pm8R4k11K60k98J29j16L29j62J07
4534A02J88j22Q7l47J39k24K08qM3m1K65k48j38J97j70N6J79l9q6m1p9O6lJ64
4558A48j69J75n7j51J14j52j79O15j86j21n1K5j9N1m4m1M8l53L98l1j06M12k15
4581A11J19Q4l16kk9J12j63K32k25m7J36j04N1L77m24j50K66N2j37J31k33M4P1
4604d4R8q6J08k48J59kJ53j02l5L9Q9k44k66L97j69n1J22K23j54M9J5nJ20m35
$$ plain form
4628 -269 75 26 108 -135 -107 -20 -23 57 14 -183 12 -33 121 89 -49 69 -48 -14 96 104 59 -44 -221 153 -45
4653 -45 -138 259 81 -100 1 -58 -63 198 93 33 -21 23 17 -73 40 94 74 83 40 -33 -95 -34 -168 -70 -65 173 -30
4680 -30 88 87 82 -206 -92 72 198 73 -239 -91 15 69 210 117 -34 -81 111 159 -61 -186 -172 359 52
4703 52 113 -112 73 -27 -196 -192 -4 203 -75 -76 320 -150 -37 -80 25 -222 201 87 40 -58 168 -259 199
4726 199 107 65 -22 10 41 -140 185 -82 373 129 96 -293 20 -73 -197 269 10 245 89 105 31 -150 102
4749 102 28 -44 285 70 131 -5 15 46 59 180 257 -29 8 184 201 265 -162 -48 -21 -8 35 -180 157 26
4773 26 -261 -26 -11 -5 11 219 -23 -100 -108 -11 -21 26 -81 -100 -133 -26 375 -77 260 236 -8 -157 -92 -146 141
4798 141 -60 4 160 -94 278 56 172 196 -189 -206 -204 -141 -15 52 -31 174 -59 -180 106 151 7 -132 3
$$ packed form
4628b69L44m9Q2k43K8Q7lQ0m3j97J95m5J54l2j38J18j17L4J10Qm5j03j77L74j98
4653d5r3L97j78j81J01n9nK61j05o0n4M4or0J13N4k0Rm3p3o2O1j34R8NK38k03
4680c0J18jnk88J14J64J26j25l12J48J06N4J41r3j51m7J92M8k20j25J4N31l07
4703E2O1k25J85j00j69MJ88K07k78jL96m70J13m3J05k47M23j14m7r8K26m27M58
4726A99r2m2q7L2L1j81L25k67M55k44l3l89L13r3j24M66k59K35j56J6p4j81K52
4749A02p4p2L29k15O1j36K0L1J3J21P7k86L7J76J7O4m27J14K7J3M3k15L37j31
4773B6k87K35J5OJ6K08k42p7qR7j0M7j07j9l3J07M01m52L37k4k44j49O5n4K87
4798A41k01O4J56k54L72k22J16K4l85j7KO3J26O7q3K05k33j21K86M5j44j39J35
$$ plain form
4821 3 -34 88 -25 14 156 53 -178 -237 -110 -57 -136 -115 -1 -152 -85 -52 -170 -134 128 -41 172 -68 67 43
4845 43 110 -386 -281 16 63 -322 -7 -136 148 -261 -84 -82 318 291 -218 65 101 -193 85 192 49 147 -107
4868 -107 -240 -40 -177 156 55 -95 -139 161 88 164 -74 -141 90 -206 -134 -33 205 152 64 -177 -20 117
4890 117 62 -52 41 91 153 18 75 -60 133 283 -5 210 171 324 -314 -109 162 -6 156 -104 72 97
4912 97 84 310 82 151 58 -126 -75 -112 -85 -53 -84 97 -3 -118 48 130 144 -121 -250 -195 49 -30 -265 -51
4936 -51 112 -151 -22 66 15 175 -60 -245 -23 210 -102 -298 -168 73 70 133 229 -187 -326 196 -23 -67 -17
4959 -17 -103 247 69 -75 135 116 22 239 62 52 151 304 34 -211 120 -289 -49 42 -158 -42 223 -339
4981 -339 -89 85 71 -253 -220 7 210 -321 9 82 -36 97 102 -20 93 -110 -15 -264 -13 116 -98 147
$$ packed form
4821Cl7J22j13L9J42j03k31n9J27N3p9K1J14j51O7L3j18L6K62j69K13k40J35k4
4845D3O7m96J05K97M7l85L15j29K84m09J77KM00k7n09K83L6k94K78J07j43R8k54
4868a07j33K00j37L33j01j50m4L00p3P6k38o7K31k96P2J01K38n3q8k41J57J37
4890A17n5j14R3N0O2j35N7j35J93J50k88K15l9J53o38K05K71j68J62k60J76K5
4912I7j3K26k28O9r3j84N1l7K7L2l1J81j00j15J66Q2J4k65j29N5K44p9k35K14
4936e1J63k63J29Q8n1J60k35j85K22K33l12j96J30K41lO3R6m16j39N22k19m4N0
4959a7q6L50j78j44K10j9r4K17j77j0R9J53k70k45L31m09K40R1k00J16K65n62
4981c39K50J74j4l24L3K27K03n31L30P3j18J33Nj22J13k03R5k49K51J29k14K45
$$ plain form
5003 147 223 308 43 185 86 229 94 -151 85 32 149 -259 -261 -220 -116 67 -193 -133 -130 14 -166 64 163 -120
5027 -120 -25 -311 133 177 101 -5 311 215 -128 -90 -103 204 34 49 -292 221 341 -43 -181 -211 54 -34 -3
5050 -3 26 13 -186 171 127 -92 214 -11 14 54 97 -122 -32 -197 -6 3 129 122 -101 32 -102 47 104 -108 -314
5075 -314 -252 -54 189 -264 -81 71 30 8 29 -231 5 -17 -287 -463 13 -223 -162 -108 98 -121 -27 -114 -95
5098 -95 -77 -65 173 50 240 -82 206 8 -73 -273 -189 100 -79 -72 -228 -44 57 -94 21 38 -32 -100 -63 3
5122 3 -5 100 -4 105 225 -29 184 11 32 23 111 -209 -100 -144 139 -69 -69 278 -170 360 -260 16 102 142
5146 142 125 216 158 196 114 268 37 144 -34 -16 68 167 180 38 -17 -33 3 -148 18 64 168 -19 247 54
5170 54 278 -162 -226 -91 54 -135 34 224 -161 -95 264 140 -35 -64 -16 -87 -206 -119 -58 54 34 -245 -18
$$ packed form
5003A47P6Q5k65J42r9J43j35k45K36n3J17m08kM1J04J83k60O0LJ44j80K30R9k83
5027a20R5k86M44M4p6j06L16r6l43L8j3L07j70J5l41N13J20l84j38l0K65q8L1
5050cK9j3j99L57m4k19L06k25K5M0M3k19R0j65J91RJ26pk23J33j34J49N7k12k06
5075c14O2J98K43m53J83J52m1k2K1k60K36k2k70j76M76k36O1N4K06k19R4q7J9
5098i5J8J2K38j23J90l22K88j98q1k00Q4K89j79Pj56J84J01j51J15J7p0o8L7O6
5122CqJ05j04J09J20k54K13j73K1rQ8l20J09m4K83k08%L47m48N30o20K76Q6M0
5146A42j7R1n8L8q2J54k31J07j78J8Q4R9J3j42n5j6L6j51J66M6J04j87K66j93
5170E4K24m40o4J35J45j89J69J90l85O6L59j24j75k9M8p1j19Q7O1J12k0k79K27
$$ plain form
5193 -18 73 25 269 150 -204 -174 -136 -40 139 156 101 173 -76 -85 128 -325 -91 105 112 -1 172 -143 32 125 -99
5218 -99 113 110 -36 110 -169 -137 -218 357 -9 79 -214 -45 -209 -77 -81 -38 -141 265 39 -73 -64 -69 176 -121
5242 -121 -188 96 34 -38 -38 -77 -267 -55 305 82 40 39 83 -68 460 18 -73 231 -134 76 86 70 -155 48
5266 48 44 94 127 -88 92 13 -25 -205 97 107 157 -152 25 -70 117 73 -36 54 188 171 243 78 -71 120 162
5291 162 124 -17 -38 -258 -159 288 -73 -122 -193 -154 60 -16 -89 -224 182 -30 -49 -357 153 -72 82 57 -170
5314 -170 143 43 -163 129 291 -23 93 -101 21 -103 -8 -114 202 190 -179 -91 -52 -15 -114 -2 -96 -32 -19
5337 -19 -117 -37 -18 -56 112 -253 -243 213 143 -6 -98 67 270 342 1 -348 -338 -261 31 -153 -96 -225 -174 -23
5361 -23 -107 129 114 -5 383 -313 -280 56 206 -179 -97 406 -78 -240 -164 -31 -295 -56 -169 -12 -79 -54 161
$$ packed form
5193a8R1m8K44j19l54L0L8R6J79J7n5P2k49rK13m53K34J96Pj13J73l15J75R3k24
5218i9K12lj46J46k79L2q1N75l66Q8k93J69j64J32mM3j03M06k26j12RnK45k97
5242a21o7K84o2p2%l9j90K12L60k23m2jM4j51N28m42r1L04l65K10J0j6k25K03
5266D8mN0L3k15J80p9l8j80L02J0N0l09J77r5J87m4j09R0J34j7P2j65j49J91M2
5291A62l8j41k1k20R9M47l61m9p1L9K14p6p3j35M06k12j9l08N10k25J54k5k27
5314a70L13j00k06K92J62l14J16j94J22j24R5j06L16j2l69Q8L9L7r9J12r4O4J3
5337a9r8Q0J9l8J68l65J0M56p0j49r2J65K03P2l41l49J0P7K92j84N7j29N1J51
5361b3q4K36j5j19L88o96L3L36J50l85Q2N03m84j62P6J33k64K39j13J57o7K5K15
$$ plain form
5384 161 -98 87 -73 -249 4 19 -292 -43 54 171 136 249 -161 -77 -100 -95 -161 14 120 237 84 19 -160
5407 -160 -189 -69 -93 -140 -71 -158 136 151 65 170 -88 -89 -16 46 -143 338 -41 -58 224 149 -77 -30 156 -172 -14
5432 -14 177 -28 -275 242 62 -82 118 -195 2 102 5 -205 -164 231 -196 40 -47 54 224 114 90 194
5454 194 194 -21 -207 103 -12 182 -158 -26 -202 58 59 -60 -98 140 -32 14 -108 48 22 -171 -121 -3 270
5477 270 -28 175 45 -10 -87 17 -169 -38 -128 44 43 -85 -46 28 -8 -137 -82 -115 42 -50 105 16 -144 111
5501 111 101 152 -27 216 95 56 129 245 -176 -84 -99 -12 237 36 20 -17 61 -160 286 -409 -84 347 196
5524 196 7 29 30 -64 -65 62 2 -34 -172 -462 -163 125 63 -102 27 -20 -149 52 108 80 -68 219 162 165 -171
5549 -171 34 95 114 -192 -308 92 201 -195 220 106 6 -158 93 80 -144 -28 103 84 -42 -123 86 156
$$ packed form
5384A61k59J85j60j76K53J5l11K49R7J17l5J13m10Q4k3No6J75J06J17j53o5j79
5407a60k9J20k4m7O9q7K94J5q6J05k58jP3O2j89M81l79j7K82p5k26M7J86l28J58
5432a4J91k05k47N17j80j44K00l13J97J00r7k10M1L95m27K36q7J01J70j10k4J04
5454A94%k15j86L10j15J94l40J32j76K60Jj19l8K38j72M6j22J56k6j93N0J18K73
5477B70k98K03j30n5p7J04j86J31r0J72jj28L9P4l6j29N5l3J57r2J55q9j60K55
5501A11j0N1j79K43j21l9P3J16m21R2j5Q7K49k01j6l7P8k21M46o95L25M31j51
5524A96j89K2Jr4jJ27o0l6j38k90K99K88o2j65J29m7j29K01N6k8j48K87n7Ll36
5549a71K05O1J9l06j16M00J09l96M15j14j00j64K51j3k24J16J31j9j26q1K09P0
$$ plain form
5571 156 -244 65 90 66 168 -340 98 -139 -147 15 12 316 -281 -108 -1 -90 -173 104 67 212 61 179 51
5594 51 -36 -38 -74 -74 24 -91 16 213 -207 -142 92 -11 -145 328 135 -56 174 389 -110 134 -75 -85 28
5617 28 130 -8 -176 -104 3 -175 -345 -19 -67 -89 106 -83 -58 -59 346 173 -11 27 -2 150 -228 89 105
5640 105 -150 103 -4 -115 23 105 -48 10 142 -37 37 -115 -142 78 -170 68 -123 41 19 193 -84 -131
5662 -131 139 172 26 69 -42 -474 -80 -256 -4 -130 149 103 -46 -205 -131 69 60 8 -80 -79 -60 -32 101 -223
5686 -223 294 89 90 34 70 36 46 -114 -76 136 -179 20 149 -136 188 107 19 139 70 142 143 59 188 -21 -74
5711 -74 105 141 -181 -78 89 -35 -79 -86 -147 -145 -135 229 90 -327 -52 50 -143 -190 56 78 -185 -37 -18 -80
5735 -80 -210 -58 81 13 -120 -34 -378 -112 65 -111 -27 74 -91 -26 -220 -101 237 120 134 -289 -56 129
$$ packed form
5571A56m00L09K5k4J02n08M38k37qJ62lL04n97J73J07q9q3K77l7J45j51J18j28
5594E1q7kl6%R8j15J07J97m20O5K34j03j34M73j93j91K30K15m99K44k09j0J13
5617B8J02j38j68P2J07j78j70L26m8k2J95j89K5jM05j73j84L8k9J52l78L17J6
5640A05k55K53j07j11J38Q2j53N8J32j79P4j52k7K20k48K38j91J64k2J74k77m7
5662a31K70L3j46M3j11m32L94j76K52j26K79m6j49j59P4K00rn2q8JJ9K8J33l24
5686b23N17k05Jn6L6l4J0j60L8K12l15J99J29k85L24q1q8J20o9P2Jq4J29k09n3
5711g4J79L6l22J03J67j24m4po1KJ0L64j39m17K75J02j93m7K46K2k63J48J9o2
5735h0j30J52J39o8j33Q6l44K66J77j76Q4J01j65O5j94J19L38j17J4m23K33J85
$$ plain form
5757 129 70 -125 369 82 156 -149 -107 86 15 -57 113 -86 -97 71 19 46 192 110 -229 209 -76 181 138
5780 138 -213 37 -61 297 46 63 19 -202 75 21 -147 166 225 112 120 257 143 241 49 55 -42 -107 -64 244
5804 244 122 21 -59 -53 -145 -176 -262 -84 171 -385 111 200 -52 60 -147 224 136 -117 239 133 129 -34 -316
5827 -316 -261 -122 -184 18 179 202 21 -315 -91 22 195 -242 10 -55 190 -56 -112 -212 -295 145 -120 126
5849 126 -218 189 125 -201 -77 177 22 364 18 -271 -166 -43 36 -81 -95 -115 35 -179 -122 38 -153 100
5871 100 -12 110 -176 89 -179 -94 -19 -42 -100 3 58 70 -60 160 169 130 65 -76 23 -231 228 -154 -34 -67
5895 -67 104 87 33 -52 59 46 171 13 -13 32 -14 -175 151 -131 119 -73 77 2 -97 -260 -54 -3 414 -95
5919 -95 -38 37 -126 102 202 128 299 253 -117 -141 -21 215 44 103 -81 -86 89 -169 -161 -129 -94 103 -43 -43 -85
$$ packed form
5757A29n9j95M94k87P4l05M2J93p1p2J70j99j1J68n2K7J46q2l39M38k85K57m3
5780A38l51K50r8L58k51J7m4k21K77n4j68L13N9j13QJ37j14R8j92Or7o5M3L08
5804B44j22j01q0Or2l1q6J78K55n56M96Q9k52J12k07L71q8k53L56j06mj63k82
5827c16N5J39o2K02J61K3j81l36K24J13J73m37K52o5K45k46n6j00q3M40k65K46
5849A26l44M07o4l26J24K54j55L42l46k89J05J23P9j17j4k0J50k14N7J60j91K53
5871A00j12J22k86K65k68Q5P5k3n8J03N5J2j30K20Rl9o5j41R9k54M59l82J20l3
5895f7J71j7n4q5J11j3J25j58k6M5m6j61L26k82K50j92J50p5r9j63K06N1M17n09
5919i5N7P5j63K28J00p4J71m6l70k4J20K36j71N9j84nJ75k58QL2L5J97j46%m2
$$ plain form
5944 -85 37 137 221 21 81 2 -69 -44 -144 -163 -8 281 163 46 -30 -107 -79 165 22 -5 72 62 2 -92 213
5969 213 46 338 -188 -257 171 291 -142 -178 1 105 -141 89 -300 -152 -63 53 180 112 -110 53 106 -14
5991 -14 -145 -38 119 -4 146 -8 64 290 83 356 5 -61 -26 273 -100 99 78 -237 65 50 -209 84
6013 84 85 -116 128 80 -54 -99 248 -62 263 182 71 126 -84 -150 -137 -233 -208 292 248 24 -289 -107 -199 -134 170
6038 170 186 -28 -47 -41 -234 31 -89 -186 14 -327 -151 -128 59 43 18 87 202 85 4 35 -43 151 -56 -202
6062 -202 -43 114 -168 208 -165 -198 4 -269 -170 106 -73 -283 82 12 167 -159 14 95 70 64 44 -129 22
6085 22 -168 140 -164 16 126 7 -78 0 111 68 27 14 50 184 -142 59 39 -5 -11 -212 96 -77 -261 132
6109 132 -17 -85 28 21 67 -93 -152 196 -58 -202 137 43 -74 26 150 13 -54 24 80 -282 -243 37 -128
$$ packed form
5944h5J22J00Q4k00O0p9p1K5j00j9J55K89j18j17p6p7K8K44j43k7P7j0o0r4L05
5969B13j67K92n26o9M28J20m33l6J79J04k46K30l89J48Q9J16J27o8k22J63N3j20
5991a4j31J07J57j23J50j54P2K26k07K73l51o6L5K99l73J99k1l15L02j5k59K93
6013H4Jk01K44m8j34m5L47l10L25q1j11N5k10o6J3r6K5N00m4k24l13J82r2O5L04
6038A70J6k14j9Oj93K65j20r7K00l41J76K3J87j6k5O9J15j17q1L1p8J94k07j46
6062b02J59J57k82L76l73l3K02k73R9K76j79k10L65p0J55l26J73Q1k5ok0j73J51
6085B2j90L08l04J80J10j19q5P8J11m3m1j3L6J34l26K01k0m4ok01L08j73j84L93
6109A32j49o8J13pM6j60n9L48k54j44L39r4j17J00J24j37o7P8N6l62L9K80j65
$$ plain form
6132 -128 105 -95 -78 -80 85 156 -18 -76 -82 24 225 -19 87 -82 -62 82 14 267 86 -276 91 85 -113 93
6156 93 38 154 -145 101 256 166 -19 -260 -106 118 -48 -218 152 -78 218 -58 66 110 134 212 -72 230
6178 230 -201 -385 -83 -75 95 -76 51 58 32 -88 -52 1 316 158 56 11 -55 143 -96 300 132 -218 -21
6201 -21 140 -59 -119 112 -248 -172 135 75 -68 -36 -183 -94 -95 -28 322 178 455 5 46 195 132 9 72 -343
6225 -343 103 25 83 15 -73 -175 -83 85 282 140 -16 -33 175 60 20 -137 -88 48 -31 45 -89 38 66 -56
6249 -56 75 170 1 -142 -146 -101 4 -29 108 185 86 -118 19 -76 -6 25 100 124 -96 264 -315 -6 19 -62 -195
6274 -195 121 -46 33 -253 132 -37 196 118 150 -17 -146 277 -297 -143 -36 -116 213 -370 54 -97 102
6295 102 -120 235 27 294 -253 -201 85 -1 78 -6 -54 -200 -73 -7 -81 -133 42 190 -113 -102 113 -234 -34
$$ packed form
6132a28K33k00J7kJ65P1j74n8oJ06K01k44J06j69K0J44o8K53j81l62L67oj98K06
6156I3n5J16k99K46J55r0j85k41J54K24j66j70L70k30K96k76J24M4K4P8k84L02
6178B30m31j84L02QJ70j71J27Pk6j20L6N3L15j58j02m5o6J98k39L96j68l50J97
6201b1J61j99o0K31l60P6L07o0j43L2j47Q9jO7L50j44K77m50M1J49o3j23O3m15
6225c43M46p8N8o8q8j02R2J68J97j42j56j7K08j15m0j57M9J36p9P6j34J27K8j22
6249e6J31R5j69j43mM5J05l3J37P7r9k04J37r5P0L1P5K4k20L60n79L09K5q1j33
6274a95L16j67P9k86L85j69K33p8L2j67j29M23n74J54J07q0L29n83M24j51J99
6295A02k22L55k08K67n47N2K86q6P9q4m8j46J27O6p4n2J75J48l03J1K15l47K00
$$ plain form
6318 -34 104 -105 -502 127 167 -293 -230 38 -8 -8 -50 -106 318 -43 -43 83 -105 86 18 -39 -13 292 -135 -428
6342 -428 42 -16 42 75 -87 -47 62 39 -50 61 250 -70 -18 -44 -124 -79 53 -219 2 -125 -186 -54 -186 86
6366 86 -193 9 11 -26 98 68 -43 26 178 -291 6 -11 -317 261 -181 209 122 -61 -168 -102 125 -52 51
6389 51 -291 34 -37 83 251 97 142 -104 2 13 -365 -42 98 -127 136 -72 166 -44 81 -69 -211
6410 -211 -60 156 -62 241 95 -174 -1 259 41 23 -69 47 91 -58 96 114 -199 28 -129 270 -14
6431 -14 71 58 52 -60 42 97 193 -301 -99 -178 -130 252 21 77 -96 -248 -44 -130 239 86 -248 14 77 21
6455 21 54 -98 237 -93 299 223 215 74 -114 74 -17 -185 178 -94 -29 72 -204 -64 71 -226 -69 -180
6477 -180 -188 143 230 -31 -116 -42 95 -129 -111 -111 -358 70 -42 106 33 -167 -1 321 -29 -94 -32 -153 -169 -145
$$ packed form
6318c4J38k09l97O29M0m60O3K68m6%m2n6M24l61%J26j88J91o8n7K6L05m27k93
6342d28M70n8N8L3j62M0J09k3q9J11J89l20N2k6q0M5J32k72K21j27o1J32j32K72
6366H6k79K02Kl7J24l0j11O9J52m69K97j7l06N78m42L90q7j83j07O6K27j77J03
6389E1l42L25p1J20J68j54M5k46J06J1l78L23J40k25K63k08K38k10J25j50j42
6410b11J51K16k18L03j46k69J73K60k18j8r2J16M4j49J54J8l13K27j57L99k84
6431a4Q5j3oj12J02N5R6m94K02p9M8L82k31N6j73j52K04q6L69j53l34K62O3n6
6455B1L3j52L35l30L92p6qj41j88J88r1j68L63k72O5J01k76J40J35k97J57j11
6477a80qL31Q7k61q5P4J37k24J8%k47M28j12J48p3k00J66L22l50o5O2j21j6K4
$$ plain form
6501 -145 -186 46 86 -101 189 6 -1 94 111 56 57 -253 53 -242 -246 -30 -26 -57 2 249 16 -353 -4 23 -261
6526 -261 223 -173 -66 23 70 146 -66 -60 59 -14 45 34 103 29 -110 96 -305 -120 202 -184 49 -97 77
6549 77 24 -112 -62 13 -53 -186 -283 41 -96 61 45 -100 63 -386 50 -111 50 45 98 55 52 43 99 -152 -33
6574 -33 -220 36 -165 -181 30 4 -11 155 -35 -11 -47 165 -77 -28 68 -242 166 84 237 -262 39 219 241
6597 241 112 -25 35 264 -44 120 -40 281 -91 155 88 -193 97 -133 -273 40 245 -97 -3 23 75 -193
6619 -193 -33 103 80 -287 -61 74 -70 -21 -323 156 120 68 138 -60 -138 -126 -66 -148 112 77 -109 76 -18 -315
6643 -315 -143 95 159 -33 -279 -139 2 -151 -129 70 -295 39 -259 130 99 -33 -21 -148 -255 -161 -13 104
6665 104 198 -86 -80 -98 -49 118 146 -28 -17 0 -138 69 -19 63 -56 59 -150 105 167 -100 -399 -290 -155 7
$$ packed form
6501a45m1K32M0j87K90j83pR5J7n5Jl10L06k95mK16Ml1N9K47k33l69L49K7k84
6526b61M84l96J07Q9M7P6k12OJ19p3N9j1O9p4j39K06m01J85L22l86K33j46J74
6549G7n3j36N0P5o6j33r7L24j37J57j6j45J63m49M36j61J61nN3m3lrN6k51J19
6574c3j87K56k01j6K11k6j5J66j90K4l6K12k42M9R6l10M08q2J53m99L01J80K2
6597B41j29j37O0K29l08J64j60L21l72K46o7k81K90k30j40L13K05l42R4K6N2k68
6619a93J60J36k3l67K26J35j44M9l02M79l6n2P0j98p8J2O0q2K60l5j86J85r4k97
6643c15J72K38O4j92k46J40J41j53K2J99l65L34k98L89l1j32J2j27j07R4J48J17
6665A04R4k84Oj8M9J67K8j74J1J7j38K07q8Q2j19J15k09K55O2k67k99J09J35J62
$$ plain form
6689 7 81 -135 -319 -59 -244 42 115 1 18 113 -106 157 -56 28 -16 -51 31 -19 103 172 1 -59 -72 -144 -80
6714 -80 73 -57 181 -19 132 89 101 72 -120 149 207 -75 72 -158 -218 252 -160 167 35 30 167 -63 -158
6737 -158 84 159 -359 89 76 -41 -222 -304 100 164 98 -9 -98 113 188 1 -172 75 89 -194 148 -228 290
6760 290 215 -196 -181 137 -53 -270 18 -42 -208 178 23 53 -214 -10 -26 79 43 285 135 -148 145 -357
6782 -357 -62 26 246 -79 212 -73 76 -235 149 3 283 -60 -247 130 -115 8 61 277 -238 40 145
6803 145 53 184 230 -42 1 -208 112 255 -108 -85 19 -213 93 -46 -112 109 148 -184 -5 -59 -43 -48 -203
6826 -203 -206 -190 -197 118 53 -33 -134 25 121 -35 -2 -2 92 64 13 140 -153 125 110 139 -4 -107 395 20 -193
6851 -193 -58 174 -42 109 22 -18 -68 -35 -126 61 -10 -208 95 67 -87 136 -120 72 -17 1 170 -134 142
$$ packed form
6689GP4k16j84K60j85K86P3j14J7R5k19K63k13Q4m4l5Q2n0J22O9j71o0j3p2O4
6714h0J53j30K38k00J51m3J2k9j92K69N8k82J47k30o0M70m12L27j32nJ37k30r5
6737a58K42P5n18M48j3j17j81q2M04O4o6j07q9K11P5j87j73K47J4k83L42l76N18
6760B90p5m11J5L18j90k17K88o0j66L86j55L0k67K04j6J05l6K42j50k83K93n02
6782c57K95Q8K20l25K91k85J49l11L84j46K80l43j87L77k45J23N3K16n15K78J05
6803A45r2J31M6k72M3k09L20J43l63K3J04k32L06j39o6K21L9l32J79n4J6nj55
6826b03lJ6pL15o5q6j01J59R6j56L3%R4k8n1J27k93K78j5K9j43j03N02l75k13
6851a93J35K32k16J51q7m0n0L3r1J87p1j98L03k8j54K23k56J92q9J8J69l04K76
$$ plain form
6874 142 71 -1 -9 170 75 29 254 -106 -141 120 -219 -41 151 -126 441 -117 -330 -73 242 -82 -245 184
6896 184 22 -9 -78 -147 -138 -201 108 55 160 24 2 -30 -86 221 -185 78 7 -61 281 113 -92 17 76 9 151
6921 151 154 -48 33 267 -133 -15 56 -141 -38 233 107 42 1 -94 -123 -24 -162 -31 32 82 151 -6 -113 -262
6945 -262 -180 -67 -36 191 151 -165 -34 -9 -189 73 -52 22 -95 -215 83 20 249 30 -4 31 74 -96 78
6968 78 161 -70 -80 -157 44 -84 -10 259 -98 -191 -104 41 -240 -134 -162 110 -153 292 99 94 -412 -71 -88 75
6992 75 -17 16 -41 185 122 -108 -158 -129 -43 149 11 -98 95 315 -183 -268 -192 170 -244 -28 -330 -114 -91 299
7016 299 162 244 -233 183 256 -123 190 123 -248 -56 218 -79 -244 105 -129 -238 303 1 -29 117 -163
7037 -163 -129 -213 344 281 -121 9 28 93 19 267 163 63 33 -93 66 98 -70 174 -72 -59 53 -27 -60 -270
$$ packed form
6874A42p1p2qJ79r5m6K25l60l5K61l39J78J92k77N67n58k13K57L15l24j63M29
6896A84j62l1o9o9Ro3L09n3J05j36k2l2n6L07m06K63p1o8L42j68k05J09N9o7J42
6921A51Lk02Q1K34m00J18P1j97J03K71j26o5m1r5k9R9j38J31O3N0O9j57j07j49
6945b62Q2J13L1K27m0l16J31K5j80K62j25P4j17j20K98o3K29k19l4L5M3j70J74
6968G8Q3k31j0p7K01j28P4K69l57r3Q7J45k81J06k8K72k63M45j93nn06L41j7J63
6992G5r2L3n7K26o3k30n0K9Q6J92j38j09J93K20m98q5P6L62m14K16l02K16K3L90
7016B99j37Q2m77M16P3l79L13o7l71J92K74k97j65L49k34j09N41l02l0J46k80
7037a63L4q4N57o3m02J30J9O5p4K48j04j00l0j26J59L2j68K44k46J3J12q0l3k10
$$ plain form
7061 -270 -31 377 -132 -73 39 -163 153 0 -143 -197 137 62 -97 40 119 -221 -92 -20 118 -154 110 38
7083 38 -5 -63 90 99 -212 -218 -42 -14 -123 -150 286 -71 -75 65 -108 -55 -119 -5 107 -204 109 12 181 -169 38
7108 38 391 -71 -74 147 63 112 0 31 -116 -28 101 21 74 -229 -155 97 -93 182 -59 2 30 -72 -69 413 166
7133 166 28 63 -8 -298 102 76 172 -158 -187 60 144 -46 10 -121 19 -39 -12 -61 210 74 34 -29 -102 -43 -27
7158 -27 61 -180 -98 -116 106 -194 -48 -30 270 -16 84 122 -171 -172 -223 114 212 -287 -74 2 57 125 150 86 157
7183 157 -247 -1 -7 225 -42 -274 103 -18 249 79 -102 -125 -53 -44 161 65 -98 -76 -9 -91 -229 103 218
7206 218 -207 26 -101 66 92 19 -103 -51 -49 58 210 176 -45 -136 45 107 -145 287 196 330 -146 -14 -134
7229 -134 -168 125 31 34 -67 -273 -4 118 96 109 -89 -72 135 -99 123 -73 259 151 -58 -20 -77 -12 -29 139
$$ packed form
7061b70K39M08n09N9J12k02L16j53j43n4L34p5j59J37P9l40J29P2J38k72K64p2
7083C8m3n8J53Rl11oJ76K8j09k7M36l57mJ40j73N3o4J14J12l11L13r7J69l50K07
7108C8L53m62lK21q4M9j12L1j47Q8J29q0N3l03P4K52j90K75k41O1K8j02LM82k47
7133A66j38L5p1k90M00k6R6l30k9K47Q4j90N6j31J40n8K7m9K71j36m0o3p3N9J6
7158b7Q8k41Q2j8K22l00J46J8L00k86J00L8k93jn1L37R8m99K13P6N5O8K5o4P1
7183A57m04K46oK32k67k32L77j21K67j70j81k3P2RK05r6j63K2O7q2j38L32J15
7206B18m25K33j27J67K6p3j22N2KJ07J52l4k21r1J81O2k52M32r1J34m76J32j20
7229a34l4K93r4Lj01k06K69J22k2J3j98J7K07k34K22j96L32j08k09L8n7O5j7J68
$$ plain form
7253 139 90 198 189 108 32 -39 -203 -177 84 -53 84 -29 -127 76 130 -123 -158 -67 98 41 -92 -127 -27 -199
7277 -199 -10 23 18 161 -331 1 1 -88 83 198 60 -115 -349 -294 85 1 -123 -87 -228 -105 -390 -169 170
7300 170 -157 19 34 -258 -50 -119 221 -61 -43 -110 -4 201 -120 -154 -50 221 117 125 226 -257 -122 118
7322 118 12 -42 46 -185 225 -215 -170 -22 -50 234 71 -144 34 -180 -36 126 37 -20 37 354 -189 125
7344 125 124 17 -18 -259 76 -138 -489 79 -94 -9 144 142 86 232 417 -93 150 13 -220 -262 -330 4 -40
7367 -40 -9 -53 -171 170 -168 -10 97 249 -178 -72 284 249 0 120 -136 -159 58 -249 -129 88 -72 -94
7389 -94 117 132 99 -126 -112 22 45 -116 66 -253 27 136 49 -22 -88 -211 -27 -105 -116 54 -89 -149 -96 95
7413 95 -301 -96 -146 285 141 -36 101 117 -197 144 25 -47 -100 -116 49 -182 305 57 0 -87 -134 -217 417
$$ packed form
7253A39m9J08rq1p6p1j64K6K61j37J37j13r8K03N4k53l5R1J65n7j33l5J00j72
7277a99J89L3nJ43m92L32%q9J71J15j38j75k34N5L79q4j24L6j41J23k85K21L39
7300A70l27J76J5k92K08o9L40k82J8o7J06K05l21l4J04K71j04QJ01m83J35K40
7322A18j06n4Q8k31M10m40M5J48k8K84j63k15J78k14J44J62q9n7N7L17n43L14
7344A25jj07l5k41L35k14l51N68j73Q5J53kn6J46J85n10K43j37k33m2o8L34m4
7367d0L1m4j18L41l38J58J07J52m27J06L56l5k49J20k56k3K17l07J20K17j60k2
7389i4K11J5l3k25J4J34K3j61J82l19K80J09q7p1o6j23J84p8j1J70j43o0N3J91
7413I5l96K05n0M31j44j77J37J6l14L41j19p2n3j6J65k31M87k48n7q7m7q3O34
$$ plain form
7436 417 -99 217 239 60 28 177 -56 -143 32 54 209 -120 -151 -111 -135 37 -21 165 0 -82 -186 76 -16
7459 -16 -243 102 -34 313 -81 -144 318 -214 -37 174 10 -16 127 109 250 175 54 2 69 264 119 37 0
7482 0 -86 -94 103 -224 62 -51 52 -176 85 -186 19 -48 -48 -20 24 166 -13 152 -237 -93 -83 179 -16 180
7506 180 147 -18 80 41 -78 89 -130 74 232 104 92 -76 56 -144 36 29 39 -70 -203 55 54 -12 -256
7529 -256 -105 -256 24 127 189 -80 -53 -227 86 -71 45 -209 103 -184 -105 12 -88 160 -258 -105 419
7550 419 63 359 269 -36 86 -62 -54 -89 -154 -112 -4 -5 95 -15 89 -40 -99 -187 -173 -207 43 -174 -221 -50
7574 -50 55 -265 -93 80 59 -100 -73 82 134 164 -88 48 169 -81 -48 -16 2 98 -63 215 413 237 96
7597 96 -9 -45 -205 -60 -188 190 59 -106 -6 103 71 -45 86 191 -182 -269 112 -84 -89 4 2 -94 99
$$ packed form
7436D17n16L16K2j79l2J49k33q7J75K2J55l29l1M0k4J72n8J86j65q2j04K62r2
7459a6k27L45j36L47l94o3M62n32J77K11j64k6J43j8J41p5j21n2O7J95j45q2l7
7482@q6qJ97l27K86j13J03k28K61k71K05o7%K8M4J42j79J65l89J44J0K62j95J96
7506A80l3j65R8l9j19J67k19K04J58j28j2j68J32k00J80pJ0j09j33K58jo6k44
7529b56J51j51K80J03O2k69K7j74L13j57J16k54L12k87P9J17j00K48m18J53N24
7550D19l56K96r0l05J22j48Ql5o5M2J08jJ00j10J04j29n9q8J4l4K50k17m7J71
7574e0J05l20J72J73k1j59K7J55N2L0k52J36J21k50L3L2J8R6j61K78J98j76j41
7597I6j05l6j60J45j28L78j31j65J00J09l2j16J31J05l73q7L81j96nR3kr6J93
$$ plain form
7620 99 203 71 -33 96 -52 -112 -207 -212 -38 -245 -327 272 149 63 97 46 -148 -8 93 250 146 182 276 56
7644 56 -130 -130 46 -246 71 -202 52 135 -314 -144 -41 -166 88 -66 62 -127 -117 30 168 -42 -89 -13
7666 -13 151 52 49 -56 -55 -262 -70 83 -181 222 297 -25 -47 -13 50 -43 184 -16 -167 -157 -106 235 -75 80
7690 80 -51 82 53 -318 76 -177 -137 119 -205 13 49 -148 170 96 -185 -275 33 141 -127 121 -141 -151
7712 -151 165 -257 157 56 123 19 21 -176 68 -43 -164 -116 -38 -111 -213 -6 24 60 212 7 -18 -106 172
7735 172 57 22 -10 266 -72 3 -27 25 11 339 -71 59 254 -178 219 -41 308 -40 261 134 95 -154
7757 -154 162 134 33 -3 16 175 50 -19 78 73 -9 -225 114 -77 131 248 366 -70 -220 -122 77 -83 -106
7780 -106 226 -91 -213 235 -71 146 195 -3 -75 -55 140 248 35 72 162 -102 32 -76 -64 -121 47 -58
$$ packed form
7620I9J04j32j04J29j48o0r5nJ74k07q2N99j23q6L4n1j94J40J01J57j04L6R4k20
7644E6j86%J76k92L17k73K54Q3m49J70J03j25K54j54J28j89J0J47J38k10m7P6
7666a3J64r9lj05Jk07J92J53k64M03P5l22k2L4O3r3K27k00j51J0N1L41l10J55
7690H0j31J33k9l71L94k53M0K56l24K18L6j97L18p4k81r0L08J08k68K48k62j0
7712a51L16m22M14j01O7j04Kj97K44j11j21M8P8p3j02K07L0L6J52k05k5q8K78
7735A72j15l5l2K76l38P5l0N2j4L28m10J30J95m32L97k60L49l48L01j27l9k49
7757a54L16k8j01l6J9J59j25o9R7nq2k16L39j91K08J17J18m36j50R8J99j60k3
7780a06L32l17j22M48l06K17M9j98p2K0J95J08k13L7R0k64J34j08J2n7J68j05
$$ plain form
7802 -58 -160 26 -106 139 312 -58 -2 -265 -54 129 -169 -98 -258 340 -120 -111 185 96 192 -50 -116 105 -11
7825 -11 307 -81 -120 207 100 -80 -257 -33 -315 158 -128 -249 37 -90 7 131 -7 -318 175 -40 -42 83
7847 83 208 33 23 53 -41 -150 198 430 -117 -109 -200 -91 56 -100 -79 222 -34 15 -152 -147 35 192 -85 -20
7871 -20 -59 80 -57 -164 -40 -8 20 -46 -101 2 -41 45 -112 -244 -178 -39 -7 -32 -154 71 47 3 -131 158
7895 158 36 16 -101 14 -99 1 -177 164 -217 -103 -132 -48 57 -88 122 3 210 2 -124 -61 -66 70
7917 70 -170 30 -62 -21 -96 -10 -148 -98 55 78 -55 1 -158 32 -43 -21 10 -182 52 -116 21 110 -155 -7
7941 -7 -138 64 0 -24 -116 277 111 -153 -43 9 121 38 192 -136 68 -10 -145 -24 -123 127 369 7 -155
7964 -155 -67 -110 -150 30 205 166 -135 161 -99 46 263 208 -265 -42 135 182 280 -135 163 -7 10 -108 -45
$$ packed form
7802e8j02J86j32K45J73l70N6k63K11J83k98P1j60N98m60RK96q9R6k42o6K21j16
7825a1L18l88l9L27j07j80j77K24k82M73k86j21K86j27R7J24j38l11M93k15kJ25
7847H3J25j75j0L0r4j09L48K32n47Qr1J09J47j56K1L01k56M9j67NJ82J57k77O5
7871b0l9J39j37j07J24L2K8o6n5J03m3Q6j57j32O6J39L2k5j22K25k4m4j34K89
7895A58j22k0j17J15j13J00j78L41l81J14k9Q4J05j45K10j19K07k08j26O3nJ36
7917G0k40K00r2M1p5Q6j38N0J53K3j33N6j59J90p5K2L1j92K34j68J37Q9k65J48
7941gj31K02o4k4r2L93j66k64J10N2J12q3J54l28K04p8j35J21r9K50K42l62j62
7964a55Q8m3m0J80J75l9l01K96k60J45K17n5m73K23J77M7R8m15K98j70J7j18O3
$$ plain form
7987 -45 37 170 205 81 26 47 -82 -104 -186 262 27 -89 118 -198 54 -78 -38 -76 10 -82 64 -5 48 10 207
8012 207 -278 -240 58 282 -49 35 101 288 -74 232 231 -110 -292 -297 29 56 -31 9 -50 49 -181 282 -95 -260
8036 -260 -33 -13 -257 -308 26 -6 67 24 -21 -177 48 148 46 -149 71 28 133 119 -24 45 80 22 -65 33
8060 33 180 128 98 217 29 -93 -23 -31 -165 190 -19 -47 63 -141 19 -117 -117 -46 -121 -53 60 12 -94 -25 -77
8085 -77 92 3 -117 -233 34 -52 59 76 -8 -157 -177 81 86 243 -42 324 -195 -245 54 82 106 -34 -36 -225
8109 -225 -92 -197 177 -22 6 -65 -128 -77 36 -113 -31 9 -205 4 219 -177 -119 98 -195 -9 -105 19 -175
8132 -175 -33 -64 316 42 -26 -4 87 83 -17 29 -14 31 -55 -400 107 23 -222 -17 66 49 -260 186 5 138
8156 138 -41 175 -183 -86 192 -73 -150 -55 51 -240 -91 275 60 120 -114 -96 5 92 -293 230 190 -90
$$ packed form
7987d5Q2J33L5j24n5K1j29k2q2M48k35j16K07l16K52j32M0l8Q6r2J46o9N3l8J97
8012B07m85L8K98K24l31Q4O6J87l62L06jl41j82nL26K7q7M0n9R9k30M63l77j65
8036b60K27K0k44n1L34l2P3m3m5j56K25J00j02j95K20m3J05j4j43O9L5n8q7R8
8060C3J47n2l0J19j88j22P0qj34L55k09k8J10k04J60j36%P1p5O8J13m8j06O9n2
8085g7J69q9j20j16K67q6J11J7q4j49k0K58NJ57k85L66n19n0K99K8K4j40kj89
8109b25J33j05L74j99K8p1o3N1J13j49Q2M0k14K09K15l96N8K17k93J86r6J24j94
8132a75J42l1L80k74o8K2R1mj00M6m3M5q6l45N07q4k45K05Q3j7l09M46j81J33
8156A38j79K16l58R7K78k65p7R5J06k91J49L66k15O0k34J8J01Q7l85N23m0k80
$$ plain form
8178 -90 -13 -130 289 126 104 266 20 10 -331 -398 -92 -87 -158
$$ packed form
8178i0P7j17M19j63k2J62k46j0l41o7L06Np1
8191a58
$$ Imaginary data points
##PAGE= N=2
##DATA TABLE= (X++(I..I)), XYDATA
$$ plain form
0 0 0 0 0 0 0 0 0 0 0 0 0 0 8 -8 8 -8 8 -16 16 -24 24 -32 32 -40 48 -56 64 -73 88 -97 112 -128 145 -166
34 -166 187 -210 237 -264 296 -331 367 -409 453 -501 557 -613 679 -747 823 -909 999 -1101
52 -1101 1213 -1341 1481 -1640 1819 -2028 2270 -2555 2897 -3318 3849 -4545 5499 -6897 9152
67 9152 -13397 24300 -121017 -192501 -15230 33126 28471 -32773 -20791 32419 101650 101088 65824
80 65824 28172 39384 57262 55174 9812 -34662 -52958 -35051 -26160 -44672 -81234 -89528 -55081
93 -55081 5863 42084 35709 1636 -13015 10736 55955 81131 67952 28829 -2418 -9826 -3574
106 -3574 -6125 -21671 -36946 -33742 -17843 -5886 -11048 -27946 -34861 -20364 1611 11600 6596
119 6596 1787 14671 43444 64809 55589 20034 -14990 -25528 -13914 98 -2050 -19502 -33800
$$ packed form
0@%%%%%%%%%%%%Qj6J6j6J6k4L2m0M8n6O4p2Q8j04J20j37J61j85K09k40K73l11
34a66L53l97M47n01N60o27O98p76Q62r54J058j170J292j426J570j732J908k100
52a101K314k554K822l121L459l847M298m825N452o215P167q394J0044j2396J6049
67I152k2549L7697j45317p1484J77271M8356m655o1244J1982N3210O9231n62l5264
80F5824l7652J1212J7878k088m5362m4474j8296J7907Q891j8512l6562q294L4447
93e5081O0944L6221o375l4073j4651K3751M5219K5176j3179l9123l1247p408O252
106c574k551j5546j5275L204J5899J1957n162j6898o915J4497K1975R989n004
119F596m809J2884K8773K1365r220l5555l5024j0538J1614J4012k148j7452j4298
$$ plain form
132 -33800 -32226 -19886 -10037 -8636 -8718 -400 14570 25886 24385 12170 3340 5828 13164 14109 3592
147 3592 -9518 -12782 -3305 7852 6869 -7790 -22549 -24258 -11881 5030 12828 8464 419 -2874
161 -2874 -2557 -3171 -6468 -8554 -3561 7661 18580 20704 13259 5208 3126 4607 4106 -2031 -11590
176 -11590 -16007 -12601 -6163 -4571 -10357 -17217 -17434 -8249 5706 16162 19453 18532 16969 15181 11101
191 11101 4373 -2375 -5750 -4063 -1368 -2500 -9466 -15737 -18621 -16450 -10509 -6031 -3776 869 9038
206 9038 17859 21490 17568 9298 2224 -386 1007 2245 658 -2262 -4012 -6649 -8824 -12126 -14984
221 -14984 -13976 -7890 419 5924 7956 7356 7145 7653 9324 9187 6059 3369 2833 2913 1626 -2600 -9074
238 -9074 -14077 -15625 -11820 -7419 -3608 502 3520 6176 8304 7779 5675 4603 5385 7108 7806 4549
$$ packed form
132c3800J574J2340R849J401q2Q318J4970J1316j501j2215q830K488P336R45j0517
147C592j3110l264R477J1157r83j4659j4759j709J2377J6911P798m364q045l293
161b874L17o14l297k086M993J1222J0919K124p445q051k082J481n01o137r559
176a1590m417L406O438J592n786o860k17R185J3955J0456L291r21j563j788m080
191A1101o728o748l375J687K695j132o966o271k884K171N941M478K255M645Q169
206I038Q821L631l922q270p074k610J393J238j587k920j750k637k175l302k858
221a4984J008O086Q309N505K032o00k11N08J671j37l128k690n36Q0j287m226o474
238i074n003j548L805M401L811M110L018K656K128n25k104j072P82J723O98l257
$$ plain form
254 4549 125 -4851 -7726 -8921 -9701 -9419 -8375 -5382 -951 3077 5232 4958 3935 4253 5671 6261
270 6261 6337 5275 2895 320 -2460 -5036 -7852 -8788 -7344 -4084 -686 1060 1122 638 238 1472 2165
287 2165 3234 3912 4514 5166 5202 3141 -279 -3871 -5779 -5821 -4413 -2646 -1224 -570 356 499 -439 -1640
305 -1640 -1817 -475 2535 4354 5883 5230 3005 724 -1085 -2426 -2829 -2479 -1960 -284 1255 633 -955
322 -955 -3143 -4222 -3723 -2275 -72 2313 3274 4157 3985 2126 758 -910 -1638 -494 1100 2425 2638
339 2638 1519 -330 -2006 -3965 -4650 -4388 -3637 -1345 468 1653 1854 1232 536 447 766 2071 2949 3700
357 3700 4190 3744 2091 -189 -2417 -4194 -4767 -4339 -3489 -2620 -1818 -1776 -1194 -1462 -177 893 2156 4013
375 4013 5047 5825 5534 4013 2107 88 -1330 -2056 -3097 -3758 -3672 -3561 -4094 -3798 -3781 -3084 -1287 776
$$ packed form
254D549m424m976k875j195p80K82J044K993M431M028K155k74j023L18J418N90
270F261P6j062k380k575k780k576k816r36J444L260L398J746O2m84m00J234O93
287B165J069O78O02O52L6k061l420l592j908m2J408J767J422O54R26J43r38j201
305a640j77J342L010J819J529o53k225k281j809j341m03L50N19J676J539o22j588
322i55k188j079M99J448K203K385R61Q83j72j859j368j668p28J144J594J325K13
339B638j119j849j676j959o85K62P51K292J813J185K01o22o96q9L19J305Q78P51
357C700M90m46j653k280k228j777n73M28Q50Q69Q02M2N82k68J285J070J263J857
375D013J034P78k91j521j906k019j418p26j041o61Q6J11n33K96J7O97J797K063
$$ plain form
393 776 2776 4678 5383 5438 5030 4032 2784 1971 475 -92 -837 -2163 -3476 -4840 -5418 -5772 -4949 -3268
411 -3268 -1586 507 2415 3464 3818 4021 3689 3220 3097 3125 2943 2236 956 -847 -2655 -4252 -5256
428 -5256 -5325 -4868 -2858 -1731 -85 887 1094 890 1444 1820 2771 3372 4129 4213 3448 2452 972 -977 -2943
447 -2943 -3531 -3799 -3191 -2394 -1616 -1599 -1552 -1848 -1468 -1094 184 1622 2623 4128 4846 4257 2975 1374 65
466 65 -880 -1130 -1158 -1301 -1460 -1298 -1959 -2681 -3164 -3079 -2358 -1367 469 1607 2796 3407 3335 2711 2277 1426 939
487 939 883 756 521 -339 -1141 -2047 -2991 -3521 -3359 -2967 -1980 -926 12 1281 1493 1801 1997 2019 1878 2308
507 2308 2441 2118 1478 644 -264 -1712 -2283 -2786 -2874 -2688 -2258 -1736 -1434 -803 -336 565 1115 1916 2403 2981
527 2981 2793 2637 1836 858 14 -959 -873 -1400 -1634 -1639 -2062 -2005 -2146 -1931 -1028 -404 373 1600 2048 2340 2293
$$ packed form
393G76K000J902P05N5m08r98j248q13j496n67p45j326j313j364n78l54Q23J681
411c268J682K093J908J049L54K03l32m69j23K8j82p07j280j803j808j597j004
428e256o9M57K010J127J646R72K07k04N54L76R51O01P57Q4p65r96j480j949j966
447b943n88k68O08P97P78J7M7k96L80L74J278J438J001J505P18n89j282j601j309
466F5r45k50k8j43j59J62o61p22m83Q5P21R91J836J138J189O11p2o24m34q51m87
487I39n6j27k35q60q02r06r44n30J62L92R87J054R38J269K12L08J96K2j41M30
507B308J33l23o40q34r08j448n71n03q8J86M30N22L02O31M67R01N50Q01M87N78
527B981j88j56q01r78q44r73Q6n27k34nm23N7j41K15R03O24P77J227M48K92m7
$$ plain form
548 2293 1810 1122 636 482 229 257 139 -242 -849 -1645 -1754 -2158 -1873 -1496 -429 177 1039 1461 1352 967
568 967 409 56 142 86 792 700 619 603 -377 -897 -1340 -1604 -1370 -813 -183 860 776 488 454 -341 -291 -811 -537
591 -537 -289 238 776 696 274 368 -294 -460 -555 156 293 732 1029 701 357 -39 -816 -1314 -982 -872 -342
612 -342 -259 52 156 393 -135 259 268 419 929 1045 1260 1322 638 398 -181 -958 -1275 -1053 -815 -503 -863 -739
634 -739 -487 -285 -162 54 443 711 1072 1083 1193 908 1171 630 122 -34 -229 -698 -638 -1000 -1133 -943 -1099
655 -1099 -1087 -464 -320 83 473 430 489 722 748 846 787 801 982 917 485 201 -470 -787 -846 -972 -762 -431 -704
678 -704 -600 -338 -222 -300 -41 -88 208 830 1167 1514 1276 1062 816 56 -34 -259 -321 -162 -356 -831 -819 -862
700 -862 -1144 -1245 -1165 -797 27 466 1249 1569 1701 1328 1261 753 795 598 573 352 109 -342 -981 -1486 -1547 -1920
$$ packed form
548B293m83o88m86j54k53K8j18l81o07p96j09m04K85L77J067O06Q62M22j09l85
568I67n58l53Q6n6P06r2q1j6r80n20m43k64K34N57O30J043q4k88l4p95N0n20K74
591e37K48N27N38q0m22R4o62j66r5P11J37M39K97l28l44l96p77m98L32J10N30
612c42Q3L11J04K37n28L94RJ51N10J16K15O2o84k40n79p77l17K22K38L12l60J24
634g39K52K02J23K16L89K68L61J1J10k85K63n41n08j56j95m69O0l62j33J90j56
655a099J2O23J44M03L90m3N9K33K6R8n9J4J81o5m32k84o71l17n9j26K10L31k73
678g04J04K62J16p8K59m7K96O22L37L47k38k14k46p60r0k25o2J59j94m75J2m3
700h62k82j01Q0L68Q24M39P83L20J32l73o7n08M2j97k5k21k43m51o39n05o1l73
$$ plain form
722 -1920 -2062 -1217 -443 -117 377 1016 1032 831 1140 1237 996 1287 1227 1121 524 363 -310 -1027 -1659 -2067 -1804
743 -1804 -1589 -1069 -691 -430 365 424 734 603 1254 1015 1448 1714 1626 870 515 -190 -741 -1159 -1469 -1333 -1656
764 -1656 -1611 -1179 -871 -642 -290 -132 349 677 1123 1280 1564 1273 1160 827 673 385 -390 -380 -506 -1289 -884
785 -884 -1048 -1300 -1039 -842 -447 -376 -201 465 652 685 766 771 864 1287 889 740 285 197 -319 -555 -720 -767 -556
808 -556 -843 -426 -539 -108 -677 -104 -74 249 495 486 1030 856 1223 929 392 364 -223 -107 -148 32 -419 -233
830 -233 -277 -734 -858 -1148 -1229 -870 -262 -193 497 982 790 850 553 538 295 188 354 334 207 191 -8 -338 -814
853 -814 -912 -981 -1068 -405 -313 191 583 395 544 456 465 628 721 473 669 764 475 212 -227 -523 -753 -953 -1066
876 -1066 -486 -287 -394 -200 -80 67 150 50 -95 261 527 455 866 631 391 378 -3 59 -524 -539 -780 -334
$$ packed form
722a920j42Q45P74L26M94O39J6k01L09R7k41K91o0j06n97j61o73p17o32m08K63
743a804K15N20L78K61P95N9L10j31O51k39M33K66q8p56l55p05n51m18l10J36l23
764a656M5M32L08K29L52J58M81L28M46J57K84k91j13l33j54k88p75J0j26p83M05
785h84j64k52K61J97L95P1J75O66J87L3Q1NR3M23l98j49m55q8n16k36j65m7K11
808e56k87M17j13M31n69N73L0L23K46rN44j74L67k94n37k8n87J16m1J80m51J86
830b33m4m57j24k90q1L59O08O9O90M85j92O0k97j5k43j07J66k0j27j6j99l30m76
853h14r8o9q7O63R2N04L92j88J49q8RJ63R3k48J96R5k89k63m39k96k30k00j13
876a066N80J99j07J94J20J47Q3j00j45L56K66p2M11k35k40j3l81O2n83j5k41M46
$$ plain form
898 -334 -409 -533 -535 -484 -646 -508 -2 -204 181 387 702 772 870 721 794 416 162 340 88 -332 -482 -440 -408
921 -408 -522 -902 -375 -650 -756 -32 -457 -318 180 394 617 796 731 681 792 371 307 180 302 109 -296
942 -296 -249 -308 -694 -1003 -1042 -847 -723 -336 147 447 487 533 612 685 511 457 556 436 381 326 123 29 -667 -689 -1009
967 -1009 -1282 -1346 -730 -179 -57 -5 200 200 187 652 817 906 807 833 926 704 321 -91 -645 -783 -1041 -1161 -773
990 -773 -494 -704 -436 -351 -411 -53 197 16 807 654 844 1239 791 734 606 129 -642 -267 -685 -587 -725 -721
1012 -721 -649 -608 -776 -626 -327 -350 116 270 499 921 1127 788 1012 448 443 350 -140 -267 -402 -561 -800 -770
1034 -770 -1075 -850 -800 -876 -182 -172 99 536 591 789 731 881 856 914 749 551 -169 -225 -285 -658 -884 -646 -934
1057 -934 -1027 -889 -729 -306 -100 199 435 467 649 1168 1074 946 598 582 214 -15 -139 -247 -545 -554 -869 -783
$$ packed form
898c34p5j24kN1j62J38N06k02L85K06L15P0R8j49P3l78k54J78k52m20j50M2L2
921d08j14l80N27k75j06P24m25J39M98K14K23J79o5n0J11m21o4j27J22j93m05
942b96M7n9l86l09l9J95J24L87M83L00M0M6P9P3j74n4R9j20n5n5k03r4o96k2l20
967a009k73o4O16N51J22N2K05%j3M65J65Q9r9K6R3k22l83m12n54j38k58j20L88
990g73K79k10K68Q5o0L58K50j81P91j53J90L95m48n7j28m77p71L75m18R8j38M
1012g21P2M1j68J50K99k3M66J54K29M22K06l39K24n64nr3m90j27j35j59k39L0
1034g70l05K25N0p6O94J0K71M37N5J98n8J50k5N8j65j98p20n6o0l73k26K38k88
1057i34r3J38J60M23K06K99K36L2J82N19r4j28l48j6l68k29j24j08k98rl15Q6
$$ plain form
1079 -783 -924 -827 -844 -484 177 55 622 824 765 759 526 784 611 686 625 61 -21 -94 -496 -826 -902 -1037 -802
1102 -802 -762 -575 -164 -19 140 429 454 305 778 544 897 809 595 412 149 -339 -496 -718 -861 -738 -749
1123 -749 -528 -447 -355 -190 -183 83 -156 555 509 710 722 832 798 551 345 -128 -388 -73 -186 -331 -214 -464
1145 -464 -549 -576 -322 -163 -342 56 85 50 324 699 846 719 497 545 180 -15 190 -62 -230 -388 -480 -531
1167 -531 -478 -675 -295 -510 -287 -145 -179 97 315 669 377 318 812 697 512 -37 289 -71 -25 -280 -303 -397
1189 -397 -595 -632 -536 -492 -182 -116 80 250 67 139 353 847 664 472 336 189 301 114 145 99 -397 -656
1211 -656 -576 -680 -377 -463 -360 -373 37 111 161 456 588 413 325 257 436 509 627 375 92 -114 -371 -409 -115
1234 -115 -509 -289 -401 -537 32 -329 -203 -56 -88 189 318 537 752 668 308 650 119 29 303 -91 -47
$$ packed form
1079g83j41R7j7L60O61j22N67K02n9ok33K58j73P5o1n64q2p3m02l30p6j35K35
1102h02M0J87M11J45J59K89K5j49M73k34L53q8k14j83k63m88j57k22j43J23j1
1123g49K21Q1R2J65PK66k39P11m6K01J2J10l4k47k06m73k60L15j13j45J17k50
1145d64q5k7K54J59j79L98K9l5K74L75J47j27k22M8l65j95K05k52j68j58r2n1
1167e31N3j97L80k15K23J42l4K76K18L54k92n9M94j15j85n49L26l60M6k55k3r4
1189c97j98l7R6M4L10O6J96J70j83P2K14M94j83j92j36j47J12j87L1m6m96k59
1211f56Q0j04L03q6J03j3M10P4N0K95J32j75q8o8J79P3J18k52k83k06k57l8K94
1234a15l94K20j12j36N69l61J26J47l2K77J29K19K15q4l60L42n31r0K74l94M4
$$ plain form
1255 -47 -549 -259 -385 -425 -283 -615 -344 -87 -21 -42 287 366 644 595 657 102 432 234 286 216 319 40 -191
1278 -191 -368 -544 -477 -829 -521 -622 -229 -195 -3 58 348 114 392 153 394 437 225 184 214 496 31 -168
1300 -168 -71 -363 -373 -631 -576 -407 -58 -307 -91 343 226 213 386 275 803 476 288 171 294 305 15 -98
1322 -98 -371 -392 -524 -907 -385 -275 -370 -149 -267 201 141 245 121 398 418 470 471 410 576 -55 -60 -114 -417 -442
1346 -442 -879 -606 -571 -470 98 -84 -148 -186 -29 181 420 359 827 559 767 541 325 160 110 -118 -377 -425
1368 -425 -450 -247 -542 -288 -584 -313 -281 -84 107 319 465 761 574 631 407 394 470 273 108 -131 -167 -406
1390 -406 -472 -576 -603 -805 -469 -237 -274 -354 226 342 479 526 364 355 280 482 359 368 -4 -95 -119 -309 -715 -504
1414 -504 -518 -559 -379 -260 -487 -199 -58 -23 345 469 423 506 93 496 902 39 127 -155 22 -437 -77 -559
$$ packed form
1255d7n02K90j26m0J42l32K71K57O6k1L29P9K78m9O2n55L30j98N2p0J03k79k31
1278a91j77j76O7l52L08j01L93L4J92O1K90k34K78k39K41M3k12m1L0K82m65j99
1300a68R7k92j0k58N5J69L49k49K16M34j17j3J73j11N28l27j88j17J23J1k90j13
1322i8k73k1j32l83N22J10r5K21j18M68o0J04j24K77K0N2Jo1J66o31nn4l03k5
1346d42m37K73L5J01N68j82o4l8J57K10K39o1M68k68K08k26k16j65n0k28k59m8
1368d25k5K03k95K54k96K71L2J97J91K12J46K96j87N7k24j3P6j97j65k39l6k39
1390d06o6j04k7k02L36K32l7q0N80J16J37M7j62rp5K02j23Rl72r1k4j90m06K11
1414e04j4m1J80J19k27K88J41L5L68J24m6Q3m13M03M06q63Q8k82J77m59L60m82
$$ plain form
1436 -559 -512 -382 -414 -213 -296 -149 318 -120 62 510 397 602 514 401 372 307 -25 73 -442 -86 -263 -479
1458 -479 -720 -406 -274 -631 -343 87 -78 -139 47 465 216 288 571 415 453 201 409 236 -69 -105 -391
1479 -391 -343 -448 -409 -318 -220 -287 -322 -304 -86 122 -13 207 446 247 196 741 457 -50 -76 27 187 -157 -400
1502 -400 -293 -463 -370 -545 -342 -563 -194 -266 232 427 304 417 540 312 334 500 315 272 165 134 -23 -150
1524 -150 -255 -242 -468 -398 -274 -171 -174 -147 -75 119 237 94 267 562 403 256 435 455 227 163 -46 -322 -514
1547 -514 -461 -433 -319 -68 -283 -194 -158 21 -103 173 145 65 156 214 196 290 376 65 206 -32 -11 -86 -428 -79
1571 -79 -428 -316 -194 -137 -148 -258 -179 50 483 202 152 532 308 66 504 -110 9 -57 -185 -224 -271 -264 -378
1594 -378 -281 -386 -128 -575 -613 -9 43 101 350 188 349 276 436 759 422 -59 -272 -176 -84 4 -376 -74 -302
$$ packed form
1436e59M7J30l2K01q3J47M67m38J82M48j13K05q8j13k9o5l32R8n15L56j77k16
1458d79k41L14J32l57K88M30j65o1J86M18k49P2K83j56L8k52K08j73l05l6k86
1479c91M8j05L9R1R8o7l5J8K18K08j35K20K39j99n1N45k84n07k6J03J60l44k43
1502d00J07j70R3j75K03k21L69p2M98J95j23J13J23k28K2J66j85m3j07l1j57j27
1524a50j05J3k26P0J24J03lK7P2J94J18j43J73K95j59j47J79K0k28o4k09k76j92
1547e14N3K8J14K51k15Q9L6J79j24K76k8q0R1N8j8R4Q6l11J41k38K1p5l42L49
1571g9l49J12J22N7j1j10P9K29M33k81n0L80k24k42M38o14J19o6j28l9m7Pj14
1594c78R7j05K58m47l8O04N2N8K49j62J61p3J60L23l37m81k13R6R2Q8l80L02k28
$$ plain form
1617 -302 -181 -396 -70 -410 -35 -60 42 197 314 322 318 43 273 267 53 152 209 32 -165 -80 -139 -295 -543 -597
1641 -597 -372 -272 -254 -96 0 35 144 282 -82 277 429 474 320 273 -21 201 -328 -217 -449 -198 -542 -336
1663 -336 -572 -302 -283 214 53 66 30 460 420 384 415 417 576 6 -8 184 -164 -187 -219 -320 -201 -367 -294 -319
1687 -319 -423 -199 -180 -212 334 448 414 371 512 338 302 268 20 10 -107 -317 -328 56 -603 -555 -540 -253 -248 -208
1711 -208 96 -14 -154 273 508 398 347 178 301 194 311 -266 24 -184 -155 -330 -221 -553 -185 -628 -257
1732 -257 -204 -112 40 182 504 168 319 238 327 83 328 117 70 -15 181 -165 -167 -61 -356 -221 -113 -184 -187 -80
1756 -80 -271 143 101 408 -41 136 226 347 458 30 105 -51 -262 -317 -212 -234 -219 -208 -327 -80 -80 -193 -46
1779 -46 4 82 72 74 75 348 171 299 210 329 -120 209 -110 -287 -71 -295 -59 -317 -308 -237 -279 -262 -244 -224 116
$$ packed form
1617c02J21k15L26l40L75k5J02J55J17Qmk75K30ok14R9N7j77j97Q5n9j56k48n4
1641e97K25J00J8J58R6L5J09J38l64L59J52M5j54m7k94K22n29J11k32K51l44K06
1663c36k36K70J9M97j61J3l6M30m0l6L1KJ59n70j4J92l48k3l2j01J19j66P3k5
1687c19j04K24J9l2N46J14l4m3J41j74l6l4k48j0j17k10j1L84o59M8J5K87NM0
1711b08L04j10j40M27K35j10n1j69J23j07J17n77K90k08K9j75J09l32L68m43L71
1732b57N3R2J52J42L22l36J51q1Q9k44K45k11m7q5J96l46kJ06k95J35J08p1lJ07
1756h0j91M14m2L07m49J77R0J21J11m28P5j56k11n5J05k2J5J1j19K47%j13J47
1779d6N0P8j0KJK73j77J28q9J19m49L29l19j77K16k24K36k58RP1m2J7J8K0L40
$$ plain form
1804 116 326 157 295 212 156 290 0 368 239 -124 -195 -209 -380 -216 45 -155 -395 -188 -311 -116 -15
1825 -15 216 197 435 208 275 329 431 296 -37 36 -125 -91 -332 -557 -362 -264 -21 -174 -392 -55 -196 -281 159
1848 159 81 272 231 484 72 65 60 53 193 180 -85 -236 -310 -234 -403 -496 -226 -260 -286 122 -184 113 275 147 274
1873 274 458 288 201 30 227 24 113 8 75 -72 17 -469 -575 -289 -230 -111 -143 104 20 149 79 106 181
1896 181 284 321 473 493 380 162 221 -179 -277 -407 -352 -453 -251 -217 -153 -203 -29 -131 -90 -76 171 153 453 650
1920 650 80 250 224 197 -75 -50 -82 -60 120 -238 -75 -334 38 -241 -351 -26 95 -13 137 387 155 196
1942 196 352 360 202 220 -181 -204 -89 -84 -29 -231 -476 -249 103 -260 -252 -141 -139 52 213 195 369 223 299 145
1966 145 505 72 -60 138 -102 -246 -24 -229 -192 -434 -586 -97 -288 201 -19 50 -203 146 397 459 201
$$ packed form
1804A16K10j69J38q3n6J34k90L68j29l63p1j4j71J64K61k00k40K07j23J95J01
1825a5K31j9K38k27O7N4J02j35l33P3j61L4k41k25J95R8K43j53k18L37j41q5M40
1848A59p8J91m1K53m12pnpJ40j3k65j51p4P6j69r3K70l4k6M08l06K97J62j28J27
1873B74J84j70q7j71J97k03Q9j05O7j47Q9m86j06K86N9J19l2K47q4J29p0K7P5
1896A81J03L7J52K0j13k18N9m00r8j30N5j01K02L4O4n0J74j02M1J4K47j8L00J97
1920F50n70J70k6k7k72K5l2K2J80l58J63k59L72k79j10L25J21j08J50K50k32M1
1942A96J56Qj58J8m01k3J15NN5k02k45K27L52l63QJ11KJ91J61j8J74j46P6j54
1966A45L60m33j32J98k40j44K22k05L7k42j52M89j91M89k20O9k53L49K51O2k58
$$ plain form
1987 201 392 332 107 174 198 -126 298 152 -250 -75 -400 -401 -341 -162 -171 -58 7 -39 511 173 -52 577 237
2010 237 420 562 445 -90 113 434 -87 -156 -506 -406 -79 -231 -399 -288 -240 -215 -166 -52 342 252 81 51
2032 51 190 346 -39 42 51 -106 -87 -117 -219 -29 1 -68 -503 -208 176 152 -51 -56 303 287 337 369 209 388 227
2057 227 75 224 -357 6 -202 -213 -376 -16 -336 -186 -110 -282 -61 -67 89 105 154 147 243 93 266 -61 92
2080 92 79 128 70 -247 -241 -319 -34 -462 -318 73 56 95 -57 384 109 212 315 123 457 15 92 196 69
2103 69 -58 -178 74 -198 -46 -348 -257 -340 -148 -378 -441 -108 2 29 187 295 -64 385 108 244 250 334 204
2126 204 -198 -129 45 -437 -239 -221 -196 -100 -407 -87 -112 117 173 172 -47 27 96 31 417 546 -8 98 57 -52
2150 -52 17 -208 -347 -469 -75 -396 160 -33 -120 -120 72 98 -1 370 337 369 202 353 56 240 142 -112 -149 -138
$$ packed form
1987B01J91o0k25O7K4l24M24j46m02J75l25jO0J79rJ13O5m6N50l38k25O29l40
2010B37J83J42j17n35K03L21n21o9l50J00L27j52j68J11M8K5M9J14L94r0j71l0
2032E1J39J56l85Q1Rj57J9l0j02J90L0o9m35K95L84k4k03nL59j6N0L2j60J79j61
2057B27j52J49n81L63k08j1j63L60l20J50P6j72K21oJ56J6M9pR6j50J73l27J53
2080I2j3M9n8l17Op8K85m28J44L91j7L9j52M41k75J03J03j92L34m42P7J04j27
2103F9j27j20K52k72J52l02R1q3J92k30o3L33J10K7J58J08l59M49k77J36OQ4j30
2126B04m02O9J74m82J98J8K5R6l07L20k5K29N6jk19P4O9o5L86J29n54J06m1j09
2150e2O9k25j39j22L94l21N56j93q7%J92K6r9L71l3L2j67J51k97J84r8k54l7J1
$$ plain form
2174 -138 -178 -279 34 -180 -91 -244 -156 -43 -25 119 232 205 1 158 231 99 196 175 96 76 200 47 -91
2197 -91 -10 -269 -264 -91 -69 178 -58 -71 314 83 37 185 222 544 185 164 114 187 58 -22 -131 -173 11 -5 -146
2222 -146 -191 -186 20 -20 -159 213 107 207 93 249 84 -29 -39 76 304 118 -135 -105 -44 -137 -101 -228 -403
2245 -403 -340 -230 -151 -92 0 -48 135 110 144 2 105 427 31 -83 181 140 -21 -39 -138 -38 -224 -230 -284 -256 -420
2270 -420 -341 -62 233 133 84 128 313 -63 344 309 204 319 -74 -37 135 -5 -160 -222 -181 -156 114 -231 -274
2293 -274 -16 97 -176 247 419 214 224 275 109 276 69 35 346 388 24 -99 -236 -294 -169 -541 -422 -196
2315 -196 -413 -75 -105 -170 -29 -19 288 131 26 164 280 395 159 -55 -132 -56 -295 -334 -219 -184 -322 54
2337 54 -154 -247 -66 -84 -43 36 -67 186 412 198 25 109 -138 187 58 -36 7 -115 -58 -143 -148 -301 -11 92
$$ packed form
2174a38m0j01L13k14Q9j53Q8J13J8J44J13k7k04J57P3j32R7k1p9k0J24j53j38
2197i1Q1k59NJ73K2K47k36j3L85k31m6J48L7L22l59k1n0P3j29q0j09m2J84j6j41
2222a46m5NK06m0j39L72j06J00j14J56j65j13j0J15K28j86k53L0O1r3L6j27j75
2245d03O3J10P9N9R2m8J83k5L4j42J03L22l96j14K64m1j61j8r9J00j86on4K8j64
2270d20P9K79K95j00m9M4J85l76M07l5j05J15l93L7J72j40j55o2M1K5K70l45m3
2293b74K58J13k73M23J72k05J0N1j66J67k07l4L11M2l64j23j37n8J25l72J19K26
2315a96k17L38l0o5J41J0L07j57j05J38J16J15k36k14p7P6k39l9J15L5j38L76
2337E4k08r3J81j8M1P9j03K53K26k14j73Q4k47L25j29r4M3j22N7q5nj53K90J03
$$ plain form
2361 92 35 153 89 118 137 -175 17 -61 126 76 119 -100 319 -235 88 -36 -209 159 -49 -293 -186 -55 -132
2384 -132 19 -140 139 -38 234 261 117 92 180 299 -1 -16 -101 -155 -156 -388 120 -44 -510 -130 -10 -185 102
2407 102 157 119 238 40 375 161 130 -14 169 248 153 205 -93 -114 -236 24 -111 -53 -422 -467 -240 -15 1
2430 1 75 33 -6 -47 59 38 321 179 286 -75 293 87 249 -285 -209 -64 -397 -136 25 -250 -108 -180 -173 -193
2454 -193 209 168 38 102 -204 265 17 143 52 -180 -35 -36 -18 125 -34 -190 -222 -175 -160 -229 -65 -282 179
2477 179 125 210 105 288 387 168 264 163 -236 -81 26 -23 -270 -195 -236 -232 121 -8 -76 -75 -176 -24 64 163 153
2502 153 210 160 155 118 155 151 -214 35 -96 26 -373 -271 -52 61 -261 36 -67 106 -65 40 291 95 62
2525 62 443 233 45 133 -53 177 32 219 -181 -180 72 -55 -108 93 -101 -134 -322 80 468 186 48 37
$$ packed form
2361I2n7J18o4K9J9l12J92p8J87n0M3k19M19n54L23j24j73L68k08k44J07J31p7
2384a32J51j59K79j77K72K7j44k5Q8J19l00j5q5n4jk32N08j64m66L80J20j75K87
2407A02N5l8J19j98L35k14l1j44J83P9r5N2k98k1j22K60j35N8l69m5K27K25J6
2430AP4m2l9m1J06k1K83j42J07l61L68k06J62n34P6J45l33K61J61k75J42p2Pk0
2454a93M02m1j30O4l06M69k48J26r1k32J45jJ8J43j59j56l2M7J5o9J64k17M61
2477A79n4Q5j05J83R9k19R6j01l99J55J07m9k47P5m1ML53j29o8Jj01J52Q8R9j0
2502A53N7n0nl7L7ml65K49j31J22l99J02K19J13l22K97j03J73j71J05K51j96l3
2525F2L81k10j88Q8j86K30j45J87m00JK52j27n3K01j94l3j88M02L88k82j38j1
$$ plain form
2547 37 117 15 126 299 197 279 92 -168 -157 213 -223 -295 -234 -219 -78 -34 116 -108 233 -14 199 234 286
2570 286 404 239 -98 -113 171 67 20 123 -362 -255 2 -80 -157 -94 -57 54 -52 -108 -87 -240 285 85 123
2593 123 150 105 134 179 52 97 64 -122 -220 -509 -231 -210 -83 -17 84 166 124 -180 -141 115 17 59 232 282 260
2618 260 170 401 -193 -42 -102 -131 51 -166 -290 -309 15 12 104 -121 -20 145 195 89 138 175 108 -139 -63 9
2642 9 84 126 24 -363 -312 -72 22 -205 -191 -70 96 -146 60 -5 321 54 136 371 347 298 225 35 -26 -5 159
2667 159 -49 -130 -325 -283 -52 -1 -46 143 -268 -85 -172 93 320 -6 46 119 378 110 100 -55 163 -203 -216
2690 -216 -349 0 -108 -461 -208 -158 -81 -202 -280 76 200 175 122 34 97 173 25 -50 -124 -235 -10 -319 1
2713 1 159 85 -183 -241 -42 141 35 189 103 50 151 204 191 279 70 276 -18 37 -43 -61 136 -210 -37 -118
$$ packed form
2547C7Q0j02J11J73j02Q2j87k60J1L70m36p2O1J5J41M4J50k24L41k47K13L5N2
2570B86J18j65l37j5K84j04m7J03m85J07K57q2p7O3L7J11j06n6K1j53N25k00L8
2593A23K7m5K9M5j27M5l3j86r8k89K78K1J27O6J01Q2m2l04L9K56r8M2J73N0k2
2618B60r0K31n94J51o0k9J82k17j24j9L24lR2k25J01J65N0j06M9L7o7k47P6P2
2642IP5M2j02l87N1K40R4k27J4J21J66k42K06o5L26k67Q2K35k4m9p3j90o1K1J64
2667A59k08q1j95M2K31N1m5J89m11J83q7K65K27l26N2P3K59k68j0j55K18l66j3
2690b16j33L49j08l53K53N0P7j21p8L56J24k5n3q8O3P6j48p5p4j11K25l09L20
2713AJ58p4k68n8J99J83j06J54q6n3J01N3j3Q8k09K06k94N5q0j8J97l46J73q1
$$ plain form
2737 -118 305 -55 -62 -74 -22 -101 -98 42 49 43 422 341 -193 3 317 79 -30 -266 -207 -206 -110 -273 -176 -303 -99 144
2763 144 -112 -235 162 14 116 104 66 79 16 -17 292 142 25 55 78 -305 -200 -66 15 35 -203 -71 -280
2786 -280 0 -5 -226 -231 179 151 60 311 85 -201 406 -50 328 295 -219 -124 -173 -77 -372 -56 -171 -319 -115
2809 -115 -1 -53 15 -40 76 181 204 158 311 -19 129 8 128 -67 148 1 -12 -67 -72 -342 -64 -126 32
2832 32 -171 257 -119 478 79 92 25 -47 122 44 193 117 124 -90 -145 -145 -131 -5 -144 -261 -99 32 -174 -27
2856 -27 225 33 256 -8 570 164 -54 133 12 -154 205 -115 148 21 -333 -7 -72 -389 -321 -69 -29
2877 -29 37 -18 157 38 179 85 207 145 239 228 152 -4 -110 -45 -167 -94 -63 -25 -250 -173 -96 131 -29 -250 119
2902 119 50 209 83 29 215 -127 -59 268 78 -87 73 2 107 -126 -358 -378 -100 -107 14 128 23 30 360
$$ packed form
2737a18M23l60pj2N2p9LJ40PoL79q1n34J96L14k38j09k36N9JR6j63R7j27K04K43
2763A44k56j23L97j48J02j2l8J3o3l3L09j50j17L0K3l83J05J34Q1K0k38J32k09
2786b80K80nk21nM10k8r1K51k26k86O07m56L78l3n14R5m9R6k95L16j15j48K04
2809a15J14n2O8n5J16J05K3m6J53l30J48j21J20j95K15j47j3n5nk70K78o2J58
2832C2k03M28l76N97l99J3o7p2J69p8J49p6Pk14n5%J4J26j39j17J62J31k06J47
2856b7K52j92K23k64N78m06k18J87j21j66L59l20K63j27l54L26o5l17O8K52M0
2877b9O6n5J75j19J41r4J22o2R4j1p6j56j06O5j22P3L1L8k25P7P7K27j60k21L69
2902A19o9J59j26n4J86l42O8L27j90j65J60p1J05k33k32k0K78pJ21J14j05PL30
$$ plain form
2925 360 73 206 284 256 50 308 351 10 -106 7 -8 72 92 -149 -352 -300 -394 -195 -142 -292 30 34 141 -156
2949 -156 -24 22 276 116 419 -237 80 92 -258 -209 -287 -47 -57 -186 -206 83 -242 -70 -14 -153 298 152
2971 152 147 -142 -26 -219 38 314 -15 187 14 -8 2 87 -30 238 -425 -266 -131 -104 -140 193 -114 32
2993 32 20 250 180 252 101 424 57 -179 90 -204 -107 -182 -216 86 -220 -128 80 -70 58 -108 379 136 -200
3016 -200 315 162 162 -3 23 366 36 -155 -42 99 -168 -102 6 3 124 -210 2 -64 124 -36 369 -5
3038 -5 -158 155 371 119 -109 -134 94 0 -166 -180 -5 -24 -186 -14 -161 -269 -367 -24 184 -174 8 -54 38
3061 38 490 -103 145 -119 185 288 144 -116 -185 100 -24 -84 -283 -187 35 69 -126 -31 -128 168 77 87 -89
3084 -89 310 195 316 121 -78 -130 102 97 -326 -2 129 -388 -205 -105 -144 -31 -300 -12 -20 -12 -183 41 132
$$ packed form
2925C60k87J33P8k8k06K58M3l41j16J13j5Q0K0k41k03N2r4J99N3j50L22MJ07k97
2949a56J32M6K54j60L03o56L17J2l50M9p8K40j0j29k0K89l25J72N6j39M51j46
2971A52nk89J16j93K57K76l29K02j73k2J0Q5j17K68o63J59J35K7l6L33l07J46
2993C2j2K30p0P2j51L23l67k36K69k94R7p5l4L02l06R2K08j50J28j66M87k43l36
3016b00N15j53%j65K6L43l30j91J13J41k67O6J08lJ21l34K12o6J88j60M05l74
3038ej53L13K16k52k28k5K28r4j66j4J75j9j62J72j47j08r8L43K08l58J82o2R2
3061C8M52n93K48k64L04J03j44k60o9K85j24o0j99R6K22L4j95R5r7K96r1J0j76
3084h9L99j15J21j95j99n2K32nm23L24J31n17J83J00l9J13k69K88qQj71K24R1
$$ plain form
3107 132 38 211 114 106 95 184 -109 72 -72 -235 -243 -5 -119 -86 329 -257 113 352 199 129 197 240 73 -264
3131 -264 191 32 -204 -246 306 141 150 316 267 -173 -238 -413 -128 -148 225 12 -10 67 184 -8 -13 -125 0
3154 0 -112 187 99 41 12 -565 116 -50 -124 -245 280 -74 -205 -71 21 96 214 97 33 321 307 -129 242
3177 242 -171 154 -55 -103 -187 -21 -4 -174 -244 30 -368 -78 -58 -23 277 -51 99 170 -162 -123 377 9 277
3200 277 240 -191 -73 -17 -65 164 -154 -108 -25 66 12 -48 -145 -185 -126 -182 319 163 -30 65 -111 76 -43 -87 80
3225 80 -141 -360 -59 -186 -180 118 -211 -56 -302 -193 9 -173 -31 14 -96 31 20 116 47 -73 -9 -62 21
3248 21 70 294 -147 24 -130 -287 -264 108 163 -121 56 213 -75 117 229 208 104 43 101 281 -130 138
3270 138 -33 70 -339 -74 -238 -197 -309 -143 -213 -245 146 13 -127 -131 93 -98 205 52 30 198 198 -158 -94
$$ packed form
3107A32r4J73r7qj1Q9k93J81j44j63qK38j14L3M15n86L70K39j53p0O8M3j67l37
3131b64M55j59k36m2N52j65RJ66m9m40o5j75K85k0L73k13k2P7J17j92nj12J25
3154@j12K99q8n8k9n77O81j66p4j21N25l54j31J34R2P5J18j17o4K88j4m36L71
3177B42m13L25k09m8q4J66J7j70p0K74l98K90K0L5L00l28J50P1l32L9N00l68K68
3200B77l7m31J18N6m8K29l18M6Q3R1n4o0r7m0N9n6N01j56j93R5j76J87j19m4J67
3225H0k21k19L01j27OK98l29J55k46J09K02j82J42M5j10J27j1R6o9j20O4n3Q3
3248B1M9K24m41J71j54j57K3L72N5k84J77J57k88J92J12k1j04o1N8J80m11K68
3270A38j71J03m09K65j64M1j12J66p0l2L91j33j40mK24j91L03j53k2J68%l56O4
$$ plain form
3293 -94 145 -18 -144 -7 -122 -62 149 -343 -144 95 -180 -75 -85 62 106 137 0 206 211 69 70 -142 156
3316 156 -103 -137 -126 -4 97 -4 23 -29 -314 -414 87 54 -158 237 122 448 -2 -18 119 -18 -137 -48
3338 -48 -211 -325 -50 -101 -321 175 -170 -69 -165 -60 -179 -193 -93 -96 73 -105 207 160 3 -40 231 -233 -220
3361 -220 -109 -95 -140 -52 65 -31 -63 44 -183 242 -68 -192 51 56 182 40 123 180 -31 -171 -200 70 -249
3384 -249 -128 -37 -251 -164 48 -108 -104 -60 123 -210 177 14 -123 108 45 77 -84 200 335 -103 59 197
3406 197 28 -45 47 29 -152 -174 -265 134 186 186 166 376 167 -44 330 266 481 188 -5 -99 20 35 68 -30 -20
3431 -20 -101 -212 -257 48 -60 -33 -28 21 -66 307 -116 42 71 -173 90 5 -79 -32 202 263 343 97 -128 -58 94
3456 94 -121 135 -99 -330 -46 101 45 48 67 177 50 53 103 40 200 48 117 144 273 181 -283 -28 -126 6
$$ packed form
3293i4K39j63j26J37j15O0K11m92J99K39k75J05j0J47M4L1j37K06Nj42Jk12K98
3316A56k59l4J1J22J01j01K7n2k85j00N01l3k12L95j15L26m50j6J37j37j19Q9
3338d8j63j14K75n1k20M96l45J01r6J05j19j4J00lJ69j78L12m7j57m3K71m64J3
3361b20J11J4m5Q8J17r6l2J07k27M25l10j24K43NJ26j42Q3N7k11j40k9K70l19
3384b49J21R1k14Q7K12j56MM4J83l33L87j63j37K31o3L2j61K84J35m38J62J38
3406A97j69p3R2j8j81k2r1L99N2%k0K10k09k11L74o4K15k93j93r4J19J5L3r8J0
3431b0q1j11m5L05j08K7NM9q7L73m23J58K9k44K63q5q4M7K34O1Q0k46k25P0J52
3456I4k15K56k34k31K84J47n6LJ9J10j27LN0o3J60j52O9K7J29r2m64K55r8J32
$$ plain form
3480 6 62 -52 -122 -118 -44 -157 205 116 -61 253 178 -228 -74 -36 92 -90 1 108 -161 -50 -209 -195 -137 225
3504 225 -96 -147 69 36 -140 -129 21 263 -174 127 71 110 76 -51 -79 -92 -125 -138 -53 -28 -317 -69 -79 138
3528 138 258 -182 162 427 -234 -122 -110 -51 -46 82 -100 177 182 -13 162 -138 -221 139 -80 104 -59 -314
3550 -314 288 -163 -233 109 77 22 -187 239 33 -68 316 127 17 173 -22 72 -197 7 46 -35 -205 135
3572 135 -63 119 77 225 22 170 -111 -51 87 -172 317 90 -117 -325 -116 -2 -31 70 -75 -48 -38 -91
3594 -91 -28 -52 106 148 30 89 130 -72 54 -8 -170 -270 233 52 -163 -102 97 110 -215 -117 65 63 58 -103 33
3619 33 89 -98 175 239 140 55 -54 202 48 -45 -369 -117 -198 -12 -176 -90 -332 134 52 124 13 -39 -112 65
3643 65 297 212 -150 -9 -63 311 151 26 -70 241 122 -316 -196 -149 1 26 -251 -63 87 -310 -11 164
$$ packed form
3480FN6j14p0MP4j13L62q9j77L14p5m06J54L8J28j82R1J07k69J11j59J4N8L62
3504B25l21n1K16l3j76J1J50K42m37L01n6L9l4j27k8j3l3j3Q5K5k89K48j0K17
3528A38J20m40L44K65o61J12J2N9NJ28j82K77Nj95J75l00q3L60k19J84j63k55
3550c14O02m51p0L42l2n5k09M26k06j01L84j89j10J56j95R4k69K04L9q1j70L40
3572A35j98J82m2J48k03J48k81O0J38k59M89k27k07k08K09J14k9J01j45K7J0n3
3594i1O3k4J58M2j18N9M1k02J26o2j62j00N03j81k15O1J99J3l25R8J82knj61J36
3619C3N6j87K73O4r9q5j09K56j54r3l24K52q1J86j64Q6k42M66q2P2j11n2p3J77
3643F5K32q5l62J41n4L74j60j25r6L11j19m38J20M7J50K5k77J88J50l97K99J75
$$ plain form
3665 164 376 251 -60 437 49 74 -115 -218 170 -194 -148 -24 -170 -65 18 -121 109 -307 -232 -335 -8
3686 -8 185 164 68 24 -40 142 100 35 287 2 35 67 -164 -56 -198 -231 -304 167 93 -63 284 163 32 -174
3710 -174 10 181 -21 -129 7 56 190 -76 123 -136 85 -282 7 -247 -214 -21 -179 -60 -19 50 146 -36
3732 -36 39 171 148 -84 24 -20 -44 121 410 154 -4 273 -21 -96 -272 -283 220 -189 113 -95 -23 -73 174
3755 174 270 -149 161 228 -150 231 -79 -16 63 -104 235 127 117 118 -234 23 90 -80 -17 -56 198 -131 -73 -133
3779 -133 -42 132 74 38 197 83 -121 -83 151 -115 -18 -18 -116 3 92 -71 -225 270 225 88 236 90 -101
3802 -101 8 74 -70 -299 51 -17 59 -147 -38 28 -325 -203 131 -73 -145 -71 3 -265 81 -52 13 99 114
3825 114 -50 45 -9 -172 -151 -135 -107 -94 -213 -122 38 168 -74 -115 -108 -103 -33 -9 35 -67 -226 140 301 59 22
$$ packed form
3665A64K12j25l11M97l88K5j89j03L88l64M6J24j46J05Q3j39K30m16P5j03L27
3686hJ93k1r6m4o4J82m2o5K52k85L3L2k31J08j42l3p3M71p4j56L47j21j31k06
3710a74J84J71k02j08J36M9J34k66J99k59K21l67K89k54L3J93j58J19M1O9R6j82
3732c6P5J32k3k32J08m4k4J65K89k56j58K77k94p5j76j1N03m09L02k08P2n0K47
3755A74R6m19L10O7l78L81l10O3P9j67L39j08j0Jl52K57O7j70O3l9K54l29N8o0
3779a33R1J74n8l6J59j14k04L8K34k66R7%r8J19Q9j63j54M95m5j37J48j46j91
3802a01J09O6j44k29L50o8P6k06J09O6l53J22L34k04p2P4P4k68L46j33O5Q6J5
3825A14j64R5n4j63K1J6K8J3j19R1J60J30k42m1PNP0K4M4j02j59L66J61k42l7
$$ plain form
3850 22 42 103 -71 -122 -249 341 -314 -125 -156 83 4 -300 61 -260 11 20 43 53 -17 -99 90 -56 -27 271
3874 271 116 49 221 -176 -167 -72 59 -218 -48 25 86 153 -73 49 17 -257 2 -148 -98 192 -37 17 289
3897 289 -167 202 -26 -48 -94 -20 -183 50 -251 118 -279 -88 -19 179 196 107 29 -66 246 50 160 -99 311
3920 311 -2 100 204 -212 305 -9 -93 195 -47 -60 -173 86 219 275 41 43 -262 149 154 76 105 4 68
3943 68 -114 53 43 -86 232 -28 44 -48 -213 34 92 -240 362 -122 223 -69 104 -96 38 19 -183 -143
3965 -143 -290 -166 -25 -124 -179 28 -67 311 9 -159 -134 -11 22 -46 137 -16 261 304 -288 -125 119 -36
3987 -36 5 -33 -117 76 -258 -137 -33 73 141 56 -65 86 -41 -124 360 -8 -113 214 70 20 1 -22 34 52
4011 52 -7 -133 -34 -146 62 -32 82 5 -222 -28 -105 -167 -76 -35 -264 -82 247 -107 -87 154 151 -124 -15 111
$$ packed form
3850B2K0O1j74n1j27N90o55J89l1K39p9l04L61l21K71RK3J0p0q2J89j46K9K98
3874B71j55o7J72l97RR5J31k77J70P3O1O7k26J22l2k74K59j50N0K90k29N4K72
3897B89m56L69k28k2m6P4j63K33l01L69l97J91O9J98J7q9p8r5L12j96J10k59M10
3920C11l13J02J04m16N17l14q4K88k42j3j13K59J33N6k34Kl05M11Np8K9j01O4
3943F8j82J67j0j29L18k60P2r2j65K47N8l32O02m84L45k92J73k00J34j9k02M0
3965a43j47J24J41r9n5K07r5L78l02j68K5J23L3o8J83j53K77M3n92J63K44j55
3987c6M1l8q4J93l34J21J04J06O8q5j21J51j27q3M84l68j05L27j44n0j9k3N6J8
4011E2n9j26R9j12K08r4J14p7k27J94p7o2R1M1k29J82L29l54K0K41lk75J09J26
$$ plain form
4035 111 -122 39 -163 -296 64 -169 66 19 -345 174 -155 99 0 288 85 -196 51 185 211 24 -2
4056 -2 -207 117 -54 -79 52 -38 -23 5 37 366 -15 136 177 -26 129 -2 -43 153 83 325 1 -61 -31 -88
4080 -88 4 -46 -72 -13 -221 -116 206 160 207 16 96 -255 -144 89 186 55 -154 -84 143 -132 -93 63 -8 -152
4104 -152 -144 -138 -124 256 13 -116 133 37 127 -182 151 147 194 -196 189 119 48 -220 -29 23 -59 -178 -202 241 129
$$ packed form
4035A11k33J61k02j33L60k33K35m7l64N19l29K54r9K88k03k81K47J34K6j87k6
4056bk05L24j71k5J31r0J5K8L2L29l81J51M1k03J55j31m1J96p0K42l24o2L0n7
4080h8R2n0k6N9k08J05L22m6M7j91Q0l51J11K33R7j31k09P0K27k75L9J56p1j44
4104a52QOJ4L80k43j29K49r6R0l09L33mM7l90L85p0p1k68J91N2q2j19k4M43j12
$$ [...]
8191b24
##END NTUPLES=NMR FID
##END=
