##TITLE=1H_Pr Q-17-3
 CDCl3
 8 sc, 
 17.02.2022
##JCAMPDX= 6.0         $$ Bruker NMR JCAMP-DX V2.0
##DATA TYPE= NMR FID
##DATA CLASS= NTUPLES
##ORIGIN= UXNMR, Bruker Analytische Messtechnik GmbH
##OWNER= root
$$ XWIN-NMR		Version 3.5
$$ Thu Feb 17 13:24:32 2022 Russian Standard Time (UT+4h)  she@DPX200
##.OBSERVE FREQUENCY= 200.131346
##.OBSERVE NUCLEUS= ^1H
##.DELAY= (6, 6)
##.ACQUISITION MODE= SIMULTANEOUS
##.ACQUISITION SCHEME= undefined
##.AVERAGES= 8
##.DIGITISER RES= 18
##SPECTROMETER/DATA SYSTEM= spect
##.PULSE SEQUENCE= zg30
##.SOLVENT NAME= CDCl3
##.SHIFT REFERENCE= (INTERNAL, CDCl3, 0, 15.7039)
##AUDIT TRAIL= $$ (NUMBER, WHEN, WHO, WHERE, WHAT)
$$ ##TITLE= Audit trail, XWIN-NMR		Version 3.5
$$ ##JCAMPDX= 5.01
$$ ##ORIGIN= Bruker BioSpin GmbH
$$ ##OWNER= she
$$ F:/spectra/data/she/nmr/H-F/1/audita.txt
$$ ##AUDIT TRAIL=  $$ (NUMBER, WHEN, WHO, WHERE, WHAT)
(   1,<2022-02-17 13:23:03.46 +0400>,<she>,<DPX200>,
      <created by zg, POWCHK disabled, PULCHK disabled
       configuration hash MD5:
       00 E9 B6 7A A2 85 ED C7 34 08 36 98 17 FE 4E 26
       data hash MD5: 16K
       56 66 36 9C 53 5D 1E 5E 7C 0F 08 74 B8 89 A1 A2>)
$$ ##END=
$$ 
$$ hash MD5
$$ 2C 2C DE 45 01 4A C2 ED B1 CA 41 FF A6 7F D7 E1
##$RELAX= 
##$RELAX= 
##$RELAX= 
##$RELAX= 
##$RELAX= 
##$RELAX= 
$$ Bruker specific parameters
$$ --------------------------
##$DU= <F:/spectra>
##$EXPNO= 1
##$NAME= <H-F>
##$PROCNO= 1
##$TYPE= <nmr>
##$USER= <she>
##$AMP= (0..31)
100 100 100 100 100 100 100 100 100 100 100 100 100 100 100 100 100 100 
100 100 100 100 100 100 100 100 100 100 100 100 100 100 
##$AQSEQ= 0
##$AQ_mod= 1
##$AUNM= <au_zg>
##$AUTOPOS= <>
##$BF1= 200.13
##$BF2= 200.13
##$BF3= 200.13
##$BF4= 200.13
##$BF5= 200.13
##$BF6= 200.13
##$BF7= 200.13
##$BF8= 200.13
##$BYTORDA= 1
##$CFDGTYP= 0
##$CFRGTYP= 5
##$CHEMSTR= <none>
##$CNST= (0..31)
1 1 145 1 1 1 1 1 1 1 1 1 1 1 1 1 1 1 1 1 1 1 1 1 1 1 1 1 1 1 1 1 
##$CPDPRG= <>
##$CPDPRG1= <>
##$CPDPRG2= <>
##$CPDPRG3= <>
##$CPDPRG4= <mlev>
##$CPDPRG5= <mlev>
##$CPDPRG6= <mlev>
##$CPDPRG7= <mlev>
##$CPDPRG8= <mlev>
##$CPDPRGB= <>
##$CPDPRGT= <>
##$D= (0..31)
0 1.2 0 0 0 0 0 0 0 0.06 0 0.03 0 0 0 0 0.0002 0 0 0 0 0 0 0 0 0 0 0 0 
0 0 0 
##$DATE= 1645089782
##$DBL= (0..7)
120 120 120 120 120 120 120 120 
##$DBP= (0..7)
150 150 150 150 150 150 150 150 
##$DBP07= 0
##$DBPNAM0= <>
##$DBPNAM1= <>
##$DBPNAM2= <>
##$DBPNAM3= <>
##$DBPNAM4= <>
##$DBPNAM5= <>
##$DBPNAM6= <>
##$DBPNAM7= <>
##$DBPOAL= (0..7)
0.5 0.5 0.5 0.5 0.5 0.5 0.5 0.5 
##$DBPOFFS= (0..7)
0 0 0 0 0 0 0 0 
##$DE= 6
##$DECBNUC= <off>
##$DECIM= 32
##$DECNUC= <off>
##$DECSTAT= 4
##$DIGMOD= 1
##$DIGTYP= 9
##$DL= (0..7)
0 120 120 120 120 120 120 120 
##$DP= (0..7)
150 150 150 150 150 150 150 150 
##$DP07= 0
##$DPNAME0= <>
##$DPNAME1= <>
##$DPNAME2= <>
##$DPNAME3= <>
##$DPNAME4= <>
##$DPNAME5= <>
##$DPNAME6= <>
##$DPNAME7= <>
##$DPOAL= (0..7)
0.5 0.5 0.5 0.5 0.5 0.5 0.5 0.5 
##$DPOFFS= (0..7)
0 0 0 0 0 0 0 0 
##$DQDMODE= 0
##$DR= 18
##$DS= 0
##$DSLIST= <SSSSSSSSSSSSSSS>
$$ [...]
##$SUBNAM2= <"">
##$SUBNAM3= <"">
##$SUBNAM4= <"">
##$SUBNAM5= <"">
##$SUBNAM6= <"">
##$SUBNAM7= <"">
##$SUBNAM8= <"">
##$SUBNAM9= <"">
##$SW= 18.0517287032376
##$SWIBOX= (0..15)
0 0 2 0 0 0 0 0 0 0 0 0 0 0 0 0 
##$SW_h= 3612.71676300578
##$TD= 16384
##$TD0= 1
##$TE= 0
##$TE2= 300
##$TE3= 300
##$TEG= 300
##$TL= (0..7)
0 120 120 120 120 120 120 120 
##$TP= (0..7)
150 150 150 150 150 150 150 150 
##$TP07= 0
##$TPNAME0= <>
##$TPNAME1= <>
##$TPNAME2= <>
##$TPNAME3= <>
##$TPNAME4= <>
##$TPNAME5= <>
##$TPNAME6= <>
##$TPNAME7= <>
##$TPOAL= (0..7)
0.5 0.5 0.5 0.5 0.5 0.5 0.5 0.5 
##$TPOFFS= (0..7)
0 0 0 0 0 0 0 0 
##$TUNHIN= 0
##$TUNHOUT= 0
##$TUNXOUT= 0
##$USERA1= <user>
##$USERA2= <user>
##$USERA3= <user>
##$USERA4= <user>
##$USERA5= <user>
##$V9= 5
##$VALIST= <valist>
##$VCLIST= <CCCCCCCCCCCCCCC>
##$VD= 0
##$VDLIST= <DDDDDDDDDDDDDDD>
##$VPLIST= <PPPPPPPPPPPPPPP>
##$VTLIST= <TTTTTTTTTTTTTTT>
##$WBST= 1024
##$WBSW= 4
##$XGAIN= (0..3)
0 0 0 0 
##$XL= 0
##$YL= 0
##$YMAX_a= 270768
##$YMIN_a= -318841
##$ZGOPTNS= <>
##$ZL1= 120
##$ZL2= 120
##$ZL3= 120
##$ZL4= 120
##$ABSF1= 10
##$ABSF2= 0
##$ABSG= 5
##$ABSL= 3
##$ALPHA= 0
##$AQORDER= 0
##$ASSFAC= 0
##$ASSFACI= 0
##$ASSFACX= 0
##$ASSWID= 0
##$AUNMP= <proc_1d>
##$AZFE= 0.1
##$AZFW= 0.1
##$BCFW= 1
##$BC_mod= 2
##$BYTORDP= 1
##$COROFFS= 0
##$CY= 11.3945322036743
##$DATMOD= 1
##$DC= 2
##$DFILT= <>
##$DTYPP= 0
##$F1P= 2.36226072786647
##$F2P= -0.459571619588291
##$FCOR= 0.5
##$FTSIZE= 0
##$FT_mod= 4
##$GAMMA= 1
##$GB= 0.15
##$INTBC= 1
##$INTSCL= 1
##$ISEN= 128
##$LB= 0.24
##$LEV0= 0
##$LPBIN= 0
##$MAXI= 10000
##$MC2= 0
##$MEAN= 0
##$ME_mod= 0
##$MI= 1.114404
##$NCOEF= 0
##$NC_proc= 0
##$NLEV= 6
##$NOISF1= 3.799351
##$NOISF2= 2.8
##$NSP= 1
##$NTH_PI= 0
##$NZP= 0
##$OFFSET= 15.70392
##$PC= 1
##$PHC0= -16231.46
##$PHC1= 13.40078
##$PH_mod= 1
##$PKNL= yes
##$PPARMOD= 0
##$PSCAL= 0
##$PSIGN= 0
##$REVERSE= no
##$SF= 200.130013532006
##$SI= 16384
##$SIGF1= 3
##$SIGF2= 2
##$SINO= 400
##$SIOLD= 16384
##$SREGLST= <1H.CDCl3>
##$SSB= 0
##$STSI= 0
##$STSR= 0
##$SW_p= 3612.71676300578
##$SYMM= 0
##$S_DEV= 0
##$TDeff= 0
##$TDoff= 0
##$TI= <>
##$TILT= no
##$TM1= 0
##$TM2= 0
##$TOPLEV= 0
##$USERP1= <user>
##$USERP2= <user>
##$USERP3= <user>
##$USERP4= <user>
##$USERP5= <user>
##$WDW= 1
##$XDIM= 8192
##$YMAX_p= 0
##$YMIN_p= 0
$$ End of Bruker specific parameters
$$ ---------------------------------
##NTUPLES= NMR FID
##VAR_NAME=  TIME,          FID/REAL,        FID/IMAG
##SYMBOL=    X,             R,               I
##VAR_TYPE=  INDEPENDENT,   DEPENDENT,       DEPENDENT
##VAR_FORM=  AFFN,          ASDF,            ASDF
##VAR_DIM=   8192,          8192,            8192
##UNITS=     SECONDS,       ARBITRARY UNITS, ARBITRARY UNITS
##FACTOR=    0.0002768,     1,               1
##FIRST=     0,             0,               0
##LAST=      2.2672688,     0,               0
##MIN=       0,             -318841,         0
##MAX=       2.2672688,     270768,          0
$$ Real data points
##PAGE= N=1
##DATA TABLE= (X++(R..R)), XYDATA
0 0 0 0 0 0 0 0 0 0 0 0 -1 8 -8 8 -8 9 -16 16 -24 25 -32 40 -48 56 -65 73 -89 104 -119 136 -153 177 -201
33 -201 227 -257 289 -324 365 -407 453 -507 563 -621 692 -766 844 -932 1028 -1133 1247 -1374
51 -1374 1514 -1669 1840 -2035 2251 -2498 2783 -3110 3498 -3964 4534 -5248 6176 -7445 9271
66 9271 -12159 17428 -30123 129764 -1209 -316907 -50906 223401 148259 -119711 -135905
77 -135905 -7997 87985 89291 24678 -126323 -139095 79325 229218 -2652 -268400 -110887
88 -110887 235696 183952 -157496 -225139 51023 192641 39849 -113625 -85210 7048 80418
99 80418 95751 -11399 -150307 -75633 160510 174711 -105311 -226700 25582 236657 64275
110 64275 -187721 -124312 101941 132822 -10844 -96758 -66654 11645 88527 73382 -70351
121 -70351 -152736 1021 181965 76533 -166532 -146560 108179 181708 -27239 -163576 -39511
132 -39511 112504 85999 -27598 -77434 -43142 37913 96854 35258 -103293 -103755 71680 150212
144 150212 -14142 -163733 -54545 131142 96884 -79382 -116005 8296 88158 39739 -39461
155 -39461 -65247 -26124 52084 81142 -10149 -107129 -41729 105565 95565 -65611 -117555 19327
167 19327 118064 34656 -81071 -62110 32897 65823 18924 -39586 -55924 -7316 62913 51307
179 51307 -49540 -90872 7879 97117 29844 -85661 -66150 47324 76410 -5811 -64945
190 -64945 -28680 34702 48934 8470 -40502 -39139 20706 63135 17843 -58519 -45641 42408
202 42408 66657 -10177 -66085 -20645 47939 39057 -21500 -46416 -12853 30131 30224 -11007 -42160
215 -42160 -19767 30637 38323 -13410 -48061 -10788 42770 32144 -23233 -38903 4230 38880
227 38880 20100 -19774 -27444 3773 30821 17988 -17188 -27403 1235 28885 14628 -20971
239 -20971 -27901 3635 27162 7716 -24499 -22269 7934 22302 2754 -20707 -15564 8998 18660
252 18660 3052 -15271 -11270 9703 18355 4475 -13179 -9539 11194 18260 711 -14509 -6503
265 -6503 11825 11913 -4225 -12517 -4267 7005 6591 -4720 -11206 -5027 4884 5920 -4453 -10714 -3347
280 -3347 7144 5386 -4527 -7309 1806 7442 3179 -2241 -2073 2272 5516 4125 -369 -2159 1420
295 1420 5061 2156 -2841 -2513 1037 1891 -1561 -3802 -1943 -439 -1200 -1891 -2320 -2261 -1114 -360 40
312 40 -1565 -1255 1709 1368 -80 490 2024 1989 1069 1427 2527 1859 798 1417 1384 427 -105 -102 373 -768
332 -768 -1593 -812 -1018 -2005 -1709 -1531 -1950 -2399 -723 145 -1618 -2592 371 1997 399 -950 -94 2548
350 2548 3082 1708 328 219 2333 4241 1656 -1664 -1402 2622 3999 -825 -5543 -2221 2881 2279
366 2279 -3543 -6502 -2853 2648 2715 -3325 -7626 -2325 5918 4474 -4134 -7305 809 9215 5308 -4486
382 -4486 -6129 2372 10749 6379 -5403 -8423 2524 12500 5845 -9923 -11259 4563 13245 1637
396 1637 -13861 -11007 5461 11906 523 -13823 -11958 5127 15341 2438 -16762 -12978 11142
409 11142 20195 -602 -19797 -7877 17175 18937 -4452 -17891 -4326 15292 16795 -2463 -19118
422 -19118 -9801 15871 21645 -5850 -28759 -9733 24195 19945 -16752 -29993 -935 26072 12206
435 12206 -18124 -23225 763 22329 15262 -12314 -25955 -3161 30636 23626 -20052 -34214 6730
448 6730 41814 15130 -32240 -27769 17827 34606 3289 -28146 -20967 10441 27832 9943 -25432
461 -25432 -32955 7342 41783 12352 -42475 -36360 26624 48053 -6026 -48254 -15931 35366
473 35366 32283 -10922 -31986 -11643 21932 32407 4407 -35885 -28242 28431 51335 -5781
485 -5781 -59294 -19712 52714 40431 -33527 -51989 4719 43653 16753 -25348 -32410 -6456
497 -6456 26901 32419 -9762 -51185 -19618 52765 48550 -36723 -66564 12177 71615 18699 -54307
510 -54307 -36295 29417 42956 4300 -27465 -27975 873 38080 32117 -29756 -61123 4471 72172
523 72172 24250 -69167 -54075 44481 65402 -15877 -62490 -14790 38313 31250 -5374 -29886
535 -29886 -27215 11746 51218 21768 -53808 -52138 41941 78293 -11515 -82738 -17983 71152
547 71152 43401 -42054 -51089 6987 38339 20545 -12048 -36107 -26217 28075 56174 -7271
559 -7271 -76197 -27515 72598 57019 -52933 -75153 21300 74141 11432 -51548 -30336 20529
571 20529 34892 16846 -15104 -39992 -13417 49811 49062 -36899 -74205 10620 83597 20249
583 20249 -73828 -47427 45722 55706 -15067 -48777 -16068 20802 29600 11784 -27360 -44602
595 -44602 5777 63570 25505 -63703 -53863 48408 75038 -17492 -73888 -10564 59650 33680
607 33680 -28011 -36821 -4061 24071 30326 3416 -41239 -36740 31461 61544 -10866 -75671 -20399
620 -20399 66758 43599 -47257 -57595 16220 51411 10352 -30866 -26420 1532 27458 28463
632 28463 -9510 -45773 -14265 51306 43046 -36860 -59230 15167 64797 11149 -52321 -29937
644 -29937 28564 35125 -2510 -27842 -21320 4679 29188 18974 -26962 -43380 8204 53549
656 53549 13990 -51520 -35635 36292 47649 -11999 -44452 -8587 31965 25228 -7089 -24796
668 -24796 -14236 15803 32700 5073 -36316 -25916 28533 41715 -11977 -48168 -9363 39407
680 39407 23781 -25062 -32617 2700 25896 13222 -13125 -23597 -6759 21747 23357 -10249
692 -10249 -32751 -5391 33836 22653 -22673 -30526 9267 33240 8468 -23234 -17265 9780
704 9780 20773 6063 -14976 -18259 1770 20900 10690 -18901 -24069 7058 26504 4176 -25633
717 -25633 -17012 14600 21457 -2601 -19421 -8727 11893 16135 666 -14100 -9848 9974 18700
730 18700 1697 -17735 -9838 14421 17703 -4668 -18991 -4653 14404 10903 -7644 -14585 -2815
743 -2815 10000 8267 -5560 -12850 -4365 10443 9109 -5826 -13076 -1236 12271 7750 -7317
756 -7317 -9834 2812 11451 5218 -6110 -6578 2664 8932 4066 -5308 -6851 1634 8005 2945 -6744
771 -6744 -6946 2371 6767 -35 -7423 -5302 2531 5140 -535 -5816 -3734 2701 4816 247 -4395
786 -4395 -2126 3494 5008 294 -3674 -727 3773 4008 -215 -2797 -550 3148 2530 -1061 -2746 -964
802 -964 1994 1216 -2153 -3005 -910 1106 608 -2014 -2264 -497 1090 760 -1163 -1323 558 1859 1297
819 1297 -241 -252 1486 2107 778 49 421 1217 1356 478 -257 -457 -4 570 -575 -1225 -1074 -679 -304
838 -304 -1114 -1492 -1403 -645 -163 -402 -934 -553 161 596 984 -76 -23 1294 1664 1083 111 -55 1337 1832
858 1832 872 -361 -673 752 1517 -349 -1827 -1904 259 977 -869 -2721 -2023 688 1327 -615 -2815
875 -2815 -1595 1556 2456 -231 -2720 -961 3051 3683 -212 -2898 -219 4083 3765 -759 -3633 -403
891 -403 4305 3417 -2012 -4857 -1011 4237 2865 -3731 -6170 -840 5155 3207 -5043 -7062 501 6211
907 6211 2488 -5221 -5775 2046 7333 2988 -4917 -5476 2620 8911 3916 -6127 -6680 3964 10648
922 10648 1914 -9236 -6683 5764 9688 -928 -10373 -5621 5231 8302 -1112 -10602 -6715 5829
936 5829 10661 -507 -12829 -7272 10142 12938 -3453 -14583 -3088 13485 10739 -5666 -12041
949 -12041 -877 11739 9702 -4347 -13014 -4193 12691 12801 -6720 -18727 -2534 17991 10671
962 10671 -14124 -18134 3685 17436 4362 -13508 -12353 3221 13484 6967 -9220 -15464 485
975 485 19577 11614 -15280 -19848 8331 25656 4228 -22019 -12645 14850 18826 -2388 -16991
988 -16991 -8771 7972 15453 3606 -16504 -17719 8290 25149 2486 -28359 -16402 21588 25113
1001 25113 -10766 -27863 -2903 22515 14005 -9833 -16418 -3989 13185 17940 -614 -22278
1013 -22278 -13134 21331 27291 -10742 -34334 -3153 32850 16056 -23854 -24444 8685 22635 4889
1026 4889 -14510 -15919 -1456 16183 16284 -9731 -29135 -4467 32362 19691 -26974 -31344 14870
1039 14870 36799 1381 -30188 -12804 18784 19973 -542 -14908 -13909 3256 22690 13769 -21889
1052 -21889 -30076 11361 38871 3344 -40636 -19966 29934 28400 -15394 -30413 -2108 20406
1064 20406 13226 -4674 -16632 -12809 10159 27715 4910 -32148 -20511 29150 35855 -15409
1076 -15409 -40757 412 37431 14271 -24234 -21218 6953 18493 8359 -7786 -19437 -10298
1088 -10298 18714 25988 -11269 -38381 -4704 39520 19694 -32668 -30980 17788 33381 -1237
1100 -1237 -25561 -10780 11802 16523 7279 -10186 -20777 -1245 28868 18429 -25868 -32569 15417
1113 15417 39863 -324 -38185 -14424 26519 21611 -11444 -21650 -5014 10895 14486 3415
1125 3415 -17099 -19923 9382 31090 3599 -33629 -17416 28997 29446 -15543 -31493 2267 27517
1138 27517 10758 -14015 -14989 -372 12630 14428 -1884 -21680 -12192 20702 24619 -13238 -33142
1151 -33142 -552 32021 11852 -25415 -21156 11647 21247 1195 -14628 -11493 2742 14630
1163 14630 11368 -9522 -20952 404 26305 12890 -22029 -21726 13510 26646 -1559 -23450
1175 -23450 -8759 14712 14026 -3066 -13302 -8502 4998 14217 4633 -16004 -16124 9168 21905
1188 21905 -446 -23649 -9774 18154 16526 -8601 -17432 -1049 14272 9335 -4366 -11126 -4370
1201 -4370 9620 13475 -1616 -16251 -6623 15221 14292 -9211 -18506 335 16607 6428 -12328
1214 -12328 -12283 2933 11029 4210 -7369 -10199 -249 10613 7679 -7503 -12782 1902 15076 5615
1228 5615 -11304 -9883 6564 12893 1229 -9562 -5612 5395 8756 857 -7487 -6409 3169 8774
1242 8774 1918 -9281 -7637 5069 9180 -1041 -10257 -4544 6553 6923 -2449 -7737 -2365 5481
1256 5481 5747 -1042 -6158 -2363 5458 6723 -924 -6650 -1903 6276 5419 -3115 -6264 -5 5760
1271 5760 3045 -3824 -5650 -124 4289 2379 -3305 -5110 -246 4281 2131 -3477 -4529 511 4838
1286 4838 1571 -3030 -2910 1786 4183 1291 -2571 -1817 1914 3610 659 -2652 -1602 1875 2782 306
1302 306 -2693 -1901 1350 1849 -727 -2908 -1762 909 1344 -950 -2208 -983 1265 1658 -609 -1723
1318 -1723 -415 1675 1775 -229 -851 257 1737 1491 -396 -1067 368 1096 835 -484 -1235 -156 797
1335 797 85 -1102 -1630 -190 708 -62 -1484 -1302 -259 525 282 -970 -723 -60 1159 528 -641 -244
1353 -244 525 1447 696 -363 -351 563 1081 683 -648 -937 297 759 107 -1265 -1162 -3 744 -491
1371 -491 -1260 -1265 224 955 -214 -1660 -981 802 1721 583 -1372 -552 1476 2034 332 -1224 -533 1637
1389 1637 2133 132 -1562 -685 1684 1970 -466 -2602 -1370 1526 1853 -988 -3156 -1258 1715 1918
1405 1918 -1535 -2986 -1020 2256 2271 -1272 -3474 -451 3495 2794 -1434 -3341 437 4333 2837 -2317
1421 -2317 -3295 1038 4508 1979 -2628 -3818 549 4137 1797 -3763 -4913 654 5026 1547 -5575
1436 -5575 -4869 2181 6010 284 -5758 -3773 3140 5605 664 -5064 -3534 3249 6720 1244 -5776
1451 -5776 -4308 4764 7947 -488 -7906 -3415 6514 6346 -2665 -7901 -2217 5260 4930 -2132 -7242
1466 -7242 -3768 4989 7114 -2039 -9845 -3530 8652 7663 -5162 -10195 579 10243 5092 -6082
1480 -6082 -7411 1523 7895 4826 -4061 -8341 -921 9579 7263 -7110 -12078 1512 13263 4268
1494 4268 -11714 -9817 5605 11023 -199 -9859 -6172 3875 8547 2846 -7337 -9066 2690
1507 2690 13431 4629 -12522 -10779 9191 15877 -1731 -15101 -4361 11637 9663 -3956 -9672
1520 -9672 -3398 6240 9036 544 -11478 -9035 7793 14972 -2461 -18458 -6031 15822 12101
1533 12101 -10272 -15570 2212 13736 5048 -7520 -8920 -818 8872 9876 -2968 -14347 -4431
1546 -4431 16000 13738 -11175 -19179 3635 20640 4810 -16629 -10884 8148 12148 284 -9316
1559 -9316 -8632 670 10862 7886 -9073 -16546 2141 20250 6451 -18703 -14287 12975 18638
1572 18638 -4128 -16866 -3899 11790 9662 -1836 -8700 -6895 4010 13744 4858 -15334 -13919
1585 -13919 11467 20149 -4462 -22982 -5074 18877 11577 -12192 -14658 1731 11251 5876 -4143
1598 -4143 -10121 -5921 8958 15098 -2315 -19486 -6054 19849 15235 -13858 -19721 5464 20008
1611 20008 3739 -14292 -9065 5621 10049 3795 -5960 -11840 -2679 13380 11269 -10991 -19267
1624 -19267 3349 21360 4926 -19537 -12128 12100 15146 -3324 -12818 -4345 6968 9295 2550
1637 2550 -8123 -10474 3449 16623 5157 -16415 -12879 12310 17953 -4952 -19121 -3550 14273
1650 14273 8866 -7542 -10840 -1964 6814 7866 -705 -11109 -7964 8952 14420 -3499 -17881
1663 -17881 -3798 16986 11172 -10688 -14021 3931 13603 4276 -7940 -7931 1158 8538 6893 -4146
1677 -4146 -11923 -2458 12996 9018 -10103 -14494 3440 15069 2525 -13243 -8478 6618 9690
1690 9690 -497 -7865 -5640 2774 8296 3827 -7218 -9094 3904 12834 2727 -11876 -7297 8954
1704 8954 11146 -2919 -10857 -2645 7866 6344 -2432 -7206 -3496 4590 7252 -663 -8851 -5390
1718 -5390 6619 8768 -3314 -11032 -1841 9268 6025 -5096 -7686 925 7273 3820 -3217 -5829
1732 -5829 -442 6072 5482 -2927 -7139 -643 7982 4673 -5805 -7613 1649 7522 1453 -6260 -5161
1747 -5161 2000 5518 1021 -4858 -4614 1216 5426 1903 -4968 -4889 2618 6628 783 -5585 -3007 4242
1763 4242 5404 -582 -4596 -1703 3656 3825 -418 -4039 -1957 2765 3861 -767 -4704 -2085 3076
1778 3076 2944 -1624 -4509 -1196 3252 2378 -1866 -3462 -590 2976 2117 -1417 -2893 -343 2933 2249
1794 2249 -1136 -2799 521 3257 1637 -1865 -2332 532 2918 814 -2301 -2096 469 2098 328
1809 328 -2092 -2106 418 1953 258 -1890 -1522 791 2065 5 -1742 -1055 1244 1754 215 -1517
1825 -1517 -436 1518 1848 56 -1316 -401 1233 1396 -121 -1661 -431 868 701 -529 -1763 -648
1841 -648 791 774 -772 -1208 -308 831 827 -637 -1075 177 838 789 -569 -690 339 1147 747 -188 -391
1860 -391 239 1260 660 -684 -809 -46 758 163 -789 -1192 -159 780 -26 -1035 -1162 -287 953 -20
1878 -20 -1097 -939 305 1180 114 -917 -519 637 1471 567 -655 -664 791 1691 232 -1324 -1115 759
1896 759 1265 14 -1503 -969 632 1149 -11 -1457 -1002 744 1188 -222 -1898 -841 1229 1766 -350
1913 -350 -1789 -614 1732 2062 -311 -1731 -229 2114 2022 -485 -2033 -228 2152 2017 -850 -2858
1929 -2858 -670 2351 1717 -1989 -3025 -95 2344 868 -2016 -3077 63 2485 1342 -1949 -2653
1944 -2653 226 3378 1917 -2647 -2883 1217 4052 1390 -3145 -2366 1959 3609 949 -3032 -2494 1417
1960 1417 3415 873 -3497 -3353 1712 4201 339 -4955 -3302 2735 4568 -1185 -4937 -1930 3398
1975 3398 3756 -647 -4071 -1733 3105 4589 -229 -5098 -2298 4290 5286 -1675 -6319 -877 5856
1990 5856 3572 -3276 -5280 198 4609 2756 -2532 -5042 -1216 4533 4030 -2927 -6874 -748 7127
2005 7127 3786 -5352 -6444 2152 7192 1765 -5469 -3786 2436 5471 2003 -3722 -5029 880 6913
2020 6913 3554 -5670 -7117 2909 8875 622 -8750 -4680 5306 6237 -2208 -6451 -2436 3288 5139
2035 5139 574 -5446 -5031 3436 8440 597 -9189 -4619 7859 8347 -3527 -8926 -385 7879 4307
2050 4307 -4133 -6005 -584 4583 4575 -1337 -7469 -3756 6449 7788 -4218 -10937 -768 10514 4720
2065 4720 -8135 -7794 3375 7558 1300 -5250 -4655 955 5905 4801 -3329 -8287 -79 10394 5566
2080 5566 -8587 -9226 5001 11183 -81 -10054 -4168 5943 5857 -1150 -5736 -3996 1944 6493 2627
2095 2627 -7186 -7821 4213 10926 134 -11640 -5143 9429 8637 -4643 -8826 181 6935 4324
2109 4324 -2268 -5278 -2778 4030 7363 113 -9170 -4776 8295 9132 -5171 -11682 128 10219
2123 10219 3706 -7541 -6654 2256 5698 2428 -3412 -5868 -1646 6191 6655 -3768 -9775 46 11026
2138 11026 5307 -8784 -7843 5307 9464 -108 -7732 -3601 3726 5078 931 -4415 -5370 758 7570
2153 7570 3390 -7649 -7828 4365 10125 -731 -10010 -3787 7303 6283 -3065 -6229 -1089 4313
2167 4313 4493 91 -4955 -4040 3837 7580 115 -8461 -3712 7773 7281 -4269 -8140 341 7108
2182 7108 2675 -4575 -5072 144 4017 3112 -1802 -5903 -2139 5570 5476 -3939 -7721 570 8013 2881
2198 2881 -6268 -5033 3138 6160 668 -4329 -3051 1580 4649 2279 -3181 -5014 850 6131 2228
2213 2228 -5568 -5354 3339 6026 -671 -6273 -2850 3888 4071 -1208 -4078 -1863 2448 3896 234
2228 234 -4334 -3143 2977 5393 -510 -5395 -1663 4816 4208 -2030 -4587 -59 3756 2584 -1998
2243 -1998 -3506 -563 2740 2347 -1680 -4243 -1310 3788 2761 -2666 -4336 438 3906 1643 -2923
2258 -2923 -2898 1146 3271 1139 -2337 -2309 816 3341 1575 -1852 -2884 983 3681 1046 -2989 -2493
2274 -2493 1478 3002 -313 -3248 -1895 1463 1941 -409 -2670 -1647 1268 2205 -52 -2370 -1342
2289 -1342 1766 2551 -318 -2456 -586 2279 2136 -774 -2194 -53 2158 1605 -746 -1758 -308 1819
2305 1819 1384 -1054 -2100 -148 1662 1079 -1289 -2039 42 1204 782 -1122 -1339 11 1475 587
2321 587 -1166 -1088 460 1571 669 -1023 -763 809 1321 328 -1151 -592 749 1141 11 -1029 -749
2338 -749 580 966 -221 -995 -607 620 672 -314 -1491 -676 793 931 -404 -982 -36 663 701 -40 -910
2357 -910 -142 878 852 15 -655 0 991 622 -365 -800 55 628 602 -407 -1103 -211 741 263 -796 -997
2377 -997 7 668 203 -541 -775 -59 958 469 -209 -689 365 1269 474 -571 -501 271 952 274 -560
2396 -560 -648 522 804 199 -827 -911 125 612 60 -918 -682 393 795 20 -1149 -853 537 1025 -168
2415 -168 -1149 -672 470 1397 206 -775 -571 937 1162 -80 -1262 -349 990 1154 -463 -1350 -565 941
2433 941 933 -439 -1343 -400 942 1118 -684 -1686 -312 1227 1172 -845 -1914 43 1756 1246 -684
2450 -684 -1258 172 1355 986 -694 -1724 -15 2209 1308 -1273 -1857 512 2325 876 -1980 -1992 516
2467 516 1800 386 -2034 -1564 494 1985 316 -1750 -1616 863 2260 661 -2279 -1831 1329 2735
2483 2735 100 -2411 -998 1909 2068 -260 -2113 -1211 1430 2279 -55 -2784 -1731 1840 2639 -680
2499 -680 -3562 -1322 2716 2155 -1754 -3041 -472 2511 1906 -1309 -2383 -185 2216 2454 -731 -3067
2515 -3067 -861 3650 2818 -2165 -3443 757 4190 1257 -2730 -2816 1325 2664 778 -2043 -2617 433
2531 433 3069 1730 -2688 -3845 989 4513 1120 -4163 -3012 2716 3855 -432 -3498 -1326 2205
2546 2205 2718 316 -2585 -2379 1558 4002 876 -4106 -3052 3084 4634 -1304 -5247 -1339 3892
2561 3892 2825 -2190 -3598 -492 2416 2291 -492 -3538 -1718 3008 4071 -1108 -5225 -1089 5097
2576 5097 3269 -3450 -4353 1375 4480 1102 -2924 -2519 778 2861 1946 -1741 -3837 -570 4294 2993
2592 2993 -4011 -5421 1597 5453 547 -5129 -2974 2936 3841 -530 -3526 -1779 1320 3204 1621
2607 1621 -2966 -3714 1485 5498 1360 -5450 -3234 4444 4934 -1508 -5240 -823 4028 2360 -1401
2622 -1401 -3290 -1622 2158 3203 -82 -4353 -2792 3422 4959 -1890 -6021 -621 5414 3107 -3385
2637 -3385 -4040 1516 3757 1561 -1937 -2502 -214 2958 3131 -1497 -4859 -669 5211 3190 -4040 -4706
2653 -4706 2051 5235 247 -4664 -2434 1883 2812 278 -2506 -2533 256 3702 2052 -3146 -3930 1725
2669 1725 5247 661 -4954 -2414 3633 3899 -1395 -3718 -765 2450 2416 -513 -2647 -2167 1691 3583
2685 3583 -9 -4223 -2354 3493 3722 -1937 -4904 -382 3959 2095 -2613 -2991 485 2617 1834 -1249
2701 -1249 -2879 -771 2813 2748 -1494 -3800 -72 4344 2236 -2864 -3349 1363 3562 320 -2667 -2098
2717 -2098 569 1953 787 -1966 -2580 411 2968 1478 -2898 -2710 1625 3572 102 -3409 -1382
2732 -1382 2200 2533 -572 -2241 -750 1544 1984 215 -2029 -1641 1457 2786 17 -2996 -1194 2437
2748 2437 2379 -1382 -2944 -388 1998 1585 -1571 -1773 -170 1913 1570 -986 -2050 -476 2304 1900
2764 1900 -1149 -2432 204 2470 1293 -1642 -1766 807 2054 693 -1321 -1285 485 1663 707 -1198
2780 -1198 -1684 271 1852 486 -2105 -1639 897 1921 21 -1380 -1101 963 1579 -89 -1348 -555
2796 -555 1144 1542 116 -1265 -574 1210 1422 -89 -1487 -510 1222 874 -547 -1700 -246 781
2812 781 748 -536 -1267 -258 1113 604 -631 -1149 -136 953 648 -627 -978 247 1239 562 -555
2829 -555 -701 303 1160 422 -729 -924 392 968 102 -701 -795 158 849 -89 -770 -775 113 786 11 -678
2849 -678 -610 427 875 -64 -799 -442 578 769 -91 -828 -83 708 846 -242 -437 -110 376 688 -140
2868 -140 -627 -333 459 631 -433 -878 -275 618 104 -485 -761 -138 591 357 -481 -557 -113 577 536 -440
2888 -440 -466 274 743 361 -83 -548 28 881 370 -502 -774 249 491 112 -352 -671 26 624 69 -677
2908 -677 -604 127 358 -142 -919 -480 261 807 -135 -873 -228 481 613 38 -714 -540 666 807 101 -534
2928 -534 -287 588 590 -208 -890 -414 670 586 -171 -942 -118 359 652 -508 -1046 -321 479 636 -471 -691
2948 -691 -160 825 774 -315 -896 -220 1071 889 -382 -1009 40 1092 380 -550 -747 404 842 318
2966 318 -557 -877 52 1013 341 -786 -1073 -35 1234 295 -1333 -978 598 1399 216 -941 -660 758
2984 758 1174 162 -501 -734 510 1517 458 -1017 -1082 731 1416 155 -1712 -678 1064 999 -469
3001 -469 -1284 -374 813 830 -57 -1195 -1001 913 1550 -604 -1684 -580 1892 1537 -754 -1559 98
3018 98 1802 1183 -899 -1221 -311 1462 1069 -757 -1607 -323 1650 1087 -1317 -1995 -157 1928 797
3035 797 -1738 -1350 914 1271 -94 -1007 -1162 330 1498 750 -1258 -1602 582 2630 811 -1907 -1533
3052 -1533 1585 2392 -232 -1831 -850 1597 1368 -253 -1348 -1000 700 1938 267 -2054 -1695 1557
3068 1557 2161 -725 -2760 -822 2273 1656 -1185 -1926 204 1788 1235 -456 -1706 -659 1411 2291
3084 2291 -754 -2487 -759 2437 1779 -1526 -2623 695 2539 317 -1860 -1621 362 1650 537
3099 537 -1157 -1893 -209 1784 1149 -1729 -2782 721 3270 1078 -2540 -1510 1814 2277 -350 -1736
3115 -1736 -590 1086 1654 609 -1356 -1672 697 2502 402 -2734 -2052 2069 2678 -1009 -2796 -814
3131 -814 1964 1190 -1231 -1993 -419 1121 1440 -89 -2012 -1025 1790 2379 -750 -3100 -481 2877
3147 2877 1587 -1854 -2485 853 2469 633 -1392 -1564 -22 1445 1139 -930 -2303 -245 2352 1501
3163 1501 -1794 -2567 969 3069 248 -2285 -1326 1305 1690 -155 -1316 -923 555 1660 707 -1328
3179 -1328 -1864 1018 2482 387 -2466 -1505 1849 1892 -1044 -2126 -605 1245 1110 -709 -1429 -602 959
3196 959 1605 -41 -1774 -947 1771 1990 -876 -2571 -267 2270 912 -1319 -1654 430 1760 724
3212 724 -736 -1435 -185 1217 963 -670 -2187 -91 2248 1092 -1991 -1713 805 1981 -7 -1841
3228 -1841 -1033 960 1131 194 -1200 -1299 322 1533 640 -1603 -1331 1019 2055 151 -1876 -1036 1445
3245 1445 1406 -404 -1471 -497 671 906 -63 -1220 -896 541 1275 -227 -1446 -721 1128 1169 -855
3262 -855 -1393 -52 1432 698 -949 -1039 24 809 681 -500 -1151 -8 1267 1152 -725 -1347 66
3279 66 1460 627 -1050 -1120 456 1216 -12 -1033 -1033 190 1146 364 -772 -936 567 1239 441 -672
3297 -672 -965 515 1257 -48 -1353 -477 609 1077 11 -876 -243 486 786 -77 -908 -458 810 713
3315 713 -380 -1246 -257 899 442 -533 -1158 110 799 431 -460 -535 154 733 714 -238 -626 161 690 347
3335 347 -561 -568 172 836 426 -336 -579 165 610 207 -780 -613 43 458 -187 -793 -672 67 577 -15 -693
3356 -693 -284 458 499 142 -697 -218 368 624 -26 -465 -111 358 518 -219 -639 -267 570 466 -244 -502
3376 -502 -261 402 114 -259 -465 -121 358 389 -386 -510 -133 418 212 -286 -264 -146 537 408 -404 -331 97
3397 97 446 283 -340 -280 -107 543 321 -375 -337 103 657 33 -384 -432 133 254 -17 -290 -331 194 631 78
3419 78 -482 -432 314 523 95 -588 -251 290 472 144 -541 -239 404 420 78 -811 -26 216 394 -218 -382
3440 -382 66 404 466 -189 -515 -257 441 541 -478 -658 -133 548 351 -467 -787 216 698 364 -235 -461
3460 -461 138 542 556 -337 -563 -73 604 200 -457 -809 47 551 53 -429 -651 158 661 179 -372 -543
3480 -543 143 586 323 -278 -716 173 731 491 -499 -315 591 905 -69 -696 -444 557 383 22 -375 -499
3500 -499 264 700 160 -924 -348 448 862 -323 -1151 -146 628 762 -388 -676 211 760 624 -170 -691
3519 -691 -32 842 865 -56 -1026 -448 1010 676 -650 -1072 150 1186 290 -704 -1064 126 493 283 -785
3538 -785 -1047 -210 1017 505 -754 -1166 272 1311 181 -1183 -852 890 1174 92 -656 -308 349
3555 349 674 211 -684 -1032 311 1240 497 -1331 -799 918 1247 -565 -1299 -211 1031 750 -536 -869
3573 -869 -300 359 642 30 -909 -700 762 1438 -60 -1287 -8 1657 1105 -1039 -1203 422 934 271
3591 271 -677 -908 -117 898 911 -439 -1386 29 1414 829 -1273 -1485 591 1628 -32 -1426 -642
3608 -642 567 680 -28 -712 -593 205 1097 645 -876 -1275 330 1650 206 -1490 -1081 1331 1316 -374
3626 -374 -1499 -239 997 667 -23 -927 -560 605 969 34 -1408 -756 1360 1463 -721 -1752 -37
3643 -37 1632 907 -1087 -1011 247 1079 297 -374 -1003 -185 1099 1238 -730 -1491 -192 1541 536 -1443
3661 -1443 -1179 605 1638 112 -1187 -672 219 1072 220 -693 -865 67 1270 830 -1051 -1258 605
3678 605 1787 274 -1419 -620 1234 814 -185 -897 -282 652 822 -87 -1036 -946 476 1281 -509 -1535
3696 -1535 -781 1421 1130 -886 -1137 176 960 505 -562 -732 -24 816 730 -398 -931 -223 1193 1224
3714 1224 -684 -1438 137 1331 444 -957 -978 183 758 237 -680 -580 -189 787 708 -801 -1105 89
3732 89 1301 423 -1111 -1193 910 1261 -196 -912 -274 705 648 -144 -582 -477 374 863 143 -746 -949 512
3752 512 1116 -274 -1161 -381 919 582 -458 -1189 -60 766 593 -435 -764 -422 577 609 -534 -1183
3770 -1183 -325 1010 645 -724 -729 373 1057 461 -675 -797 226 599 174 -384 -737 4 535 449 -658
3789 -658 -711 150 959 -18 -916 -497 711 748 -384 -757 -249 449 468 -191 -204 -331 553 841 201 -580 -32
3810 -32 492 546 -293 -975 -84 717 472 -439 -630 -130 397 644 -506 -685 -53 584 505 -333 -531 83 915
3831 915 424 -498 -570 345 675 104 -370 -111 200 682 78 -400 -332 256 594 347 -648 -465 62 435 -99
3852 -99 -454 -233 230 351 51 -582 -416 122 736 -50 -223 -196 395 633 24 -392 -174 558 581 12 -274
3873 -274 -15 302 277 -31 -520 -318 358 276 -372 -706 -63 245 389 -399 -410 -36 469 205 -420 -648 28
3894 28 451 337 -393 -356 -4 441 241 -270 -116 152 284 80 -262 -219 25 422 59 -142 -305 -64 240
3915 240 -215 -375 -129 177 200 19 -524 -256 375 510 112 -431 -111 166 329 224 -438 218 155 158 -51
3936 -51 -288 24 187 175 26 -168 17 352 194 -414 -506 -271 306 78 -297 -576 -124 426 96 -230 -336
3957 -336 -84 346 347 -260 -516 76 466 194 -76 -575 238 373 -61 -413 -253 99 130 -117 -351 -386 -175
3978 -175 397 107 -304 -286 287 358 163 -623 -295 451 563 55 -789 -20 273 251 161 -398 -329 277 702 -12
4000 -12 -649 -154 452 415 -131 -589 54 262 505 -13 -544 -222 270 374 37 -322 -228 540 482 -461 -495 11
4022 11 621 211 -475 -387 238 683 30 -321 -401 190 708 445 -268 -468 -19 679 278 -827 -675 241 742
4043 742 -26 -565 -418 328 504 -56 -482 -553 131 560 331 -470 -460 512 803 -63 -929 -189 674 221 -531
4064 -531 -562 -156 612 260 -181 -363 -440 437 909 -60 -938 -487 870 824 -483 -759 148 891 67 -435
4084 -435 -355 122 233 570 -100 -477 -363 575 890 -372 -901 3 743 440 -904 -743 487 859 294
4103 294 -594 -332 302 555 214 -397 -966 50 1057 876 -873 -825 459 865 -248 -731 -168 850
4121 850 600 -318 -401 -251 450 369 137 -784 -447 435 778 -122 -1128 -375 750 810 -660 -785 325 788
4141 788 331 -327 -453 98 458 457 -207 -604 -215 888 772 -645 -1120 -202 1199 576 -625 -554 73 493
4161 493 59 -372 -684 -22 360 651 -438 -953 206 997 230 -962 -950 580 945 -99 -1167 -236
4179 -236 479 597 54 -412 -379 341 939 429 -623 -840 637 979 -168 -1181 -39 854 676 -443
4197 -443 -792 -113 528 478 -227 -492 -506 136 865 -21 -895 -261 957 554 -466 -775 159 1052 194 -490
4217 -490 -464 75 476 366 -419 -711 -87 911 516 -522 -1137 412 929 -60 -977 -457 566 806 -186
4236 -186 -521 -206 297 515 144 -257 -481 293 860 231 -704 -449 500 1059 -346 -1007 -152 631 378 -251
4256 -251 -376 -123 463 378 -270 -905 -470 556 477 -171 -975 -89 963 403 -539 -554 213 770 374 -137
4276 -137 -431 239 489 208 -61 -788 127 736 295 -464 -536 35 896 -20 -729 -37 122 112 -76 -537 -586
4297 -586 234 372 163 -561 -539 334 724 33 -273 -58 490 616 -251 -578 -191 428 476 -242 -315 -45 458
4318 458 536 -205 -467 -196 678 378 -235 -443 -66 395 238 -207 -257 27 412 357 -243 -523 50 599 454
4339 454 -251 -536 -61 372 268 -328 -103 42 505 -5 -234 -296 5 433 125 -205 -491 75 433 81
4359 81 -234 -280 360 377 -278 -427 -400 246 586 -207 -299 -97 423 439 -56 -431 -10 141 190 -259 -499 106
4381 106 269 307 -165 -590 -184 88 148 -125 -538 17 385 165 -250 -292 -36 393 133 40 4 -92 332 170
4403 170 -272 -539 112 586 -118 -280 -260 201 375 240 -333 -305 12 229 -67 -337 -247 316 449 177 -163
4424 -163 7 489 303 115 -257 -292 468 317 -41 -22 -128 225 149 163 -414 -69 365 303 74 -333 -82 298
4446 298 343 -389 -546 163 111 343 -277 -200 -28 210 283 -126 34 -17 553 293 -141 -164 167 472 148 -339
4468 -339 -156 217 309 68 -325 -162 -144 166 -69 -584 -279 89 441 51 -347 -339 -152 359 19 -205 -245 351
4490 351 528 236 -351 -235 272 516 221 -684 -252 560 260 -53 -428 -204 307 202 52 -550 -250 164
4510 164 424 -131 -476 -437 250 216 -366 -198 14 457 94 -413 -494 -116 291 346 9 -585 -127 499 514 -227
4532 -227 -413 -97 388 195 -437 -529 96 354 373 -371 -415 -132 277 5 -222 -365 -256 541 195 -757 -669
4553 -669 317 852 -190 -624 -91 309 169 -146 -303 -77 107 257 217 -584 -477 275 918 -66 -686 -239
4573 -239 734 418 -551 -341 -107 203 277 -398 -55 -253 17 434 -50 -514 -352 631 576 -401 -402 303 499
4594 499 442 -489 -292 -84 485 286 -135 -135 -189 214 77 -287 -891 -122 756 218 -759 -520 450 535 -211 -253
4616 -253 -206 362 429 150 -299 -271 42 673 89 -561 -534 453 868 -302 -607 -231 622 130 -346 -334 -27
4637 -27 -30 143 62 -321 -362 261 734 -137 -1014 -306 711 622 -288 -609 356 817 381 -285 -375 -138 543 175
4659 175 -258 -728 -420 434 649 -363 -798 280 767 199 -671 -591 399 451 -103 -409 -320 77 488 223
4679 223 -212 -500 110 989 340 -804 -494 603 601 -191 -798 -153 526 415 -148 -185 -34 241 474 -158
4699 -158 -657 -329 566 599 -114 -659 -183 754 426 -361 -542 -24 511 141 -245 -297 69 519 375 -74 -510
4720 -510 -41 666 627 -273 -750 -24 885 67 -679 -283 63 190 63 -437 -381 76 333 439 -599 -622 212
4741 212 779 132 -447 -141 454 653 -39 -118 26 433 289 79 -348 -524 167 619 246 -591 -383 215
4761 215 610 -443 -374 94 296 161 -337 -217 -154 257 389 11 -598 -74 260 378 -332 -682 -139 454
4781 454 638 -435 -416 444 510 256 -137 -347 -90 403 383 -362 -452 -180 579 229 -251 -581 282 332 -209
4802 -209 -520 -423 304 507 -85 -112 -53 -9 663 158 -383 -153 426 458 22 -636 -116 385 478 -445 -439 -110 329
4825 329 107 -215 -324 -137 203 573 -123 -354 -6 458 253 -466 -205 237 371 324 15 -17 -119 360 23
4846 23 -320 -254 -133 689 239 -221 -49 -24 382 294 -585 -431 101 268 269 -246 -226 83 217 249 -401 -238 -40
4869 -40 562 42 -388 -22 7 424 39 -423 -239 366 210 45 -522 -17 345 35 -255 -479 120 109 166
4890 166 -170 -401 85 407 371 -311 -581 -10 187 90 -178 -349 50 451 311 -193 -109 228 299 182 -324
4911 -324 -163 -26 176 84 -287 -40 -46 125 -215 -95 -322 225 514 61 -265 -82 212 407 84 23 -238
4932 -238 175 479 -74 -160 -136 74 351 -44 -337 -173 264 408 -334 -561 -290 323 128 -124 -329 -312 326
4953 326 148 -215 -247 -248 329 241 -341 -461 -32 341 335 -158 -96 -84 429 119 -374 -301 35 474 135 -226 -312
4976 -312 -233 251 -87 -248 -357 67 271 152 -185 -572 35 338 251 -374 -26 167 283 133 -138 -303 11
4997 11 119 -101 -273 -71 -94 201 -52 77 -172 355 503 114 -285 17 137 230 -295 -249 -168 128 -134 -133
5019 -133 -317 -279 135 137 46 -491 -169 331 146 89 -178 35 400 253 59 -200 101 407 239 -6 -370 -203
5041 -203 319 112 -93 -392 -131 358 292 -440 -229 250 391 -5 -408 -122 261 176 72 -63 -85 37 349
5062 349 272 -361 -293 174 550 -114 -548 -66 235 231 -2 -286 -181 133 419 202 -182 -166 333 198 -67 -423
5084 -423 -84 326 388 -327 -301 100 168 123 -161 22 121 426 449 32 30 -204 369 508 -247 -617 134 567 78
5107 78 -93 -365 249 198 -150 -156 -29 -198 220 296 -342 -300 -126 462 462 -606 -322 247 691 6 -560 4
5129 4 74 391 -72 -348 -46 -202 525 356 -313 -446 126 528 -1 -589 -124 618 294 -174 -259 111 346
5150 346 157 35 -423 143 238 403 118 -466 89 461 509 -354 -511 -19 364 -118 -423 -198 35 83 157
5171 157 89 -375 -263 153 425 -63 -253 -133 503 212 -308 -362 523 621 -193 -60 -66 -34 281 -2 -258 -99
5193 -99 70 364 294 -433 -455 289 413 213 -722 -199 353 282 -218 -403 -87 196 199 -151 -179 -291 129 464
5215 464 -145 -489 -162 626 453 -295 -428 298 633 257 -202 -268 -5 315 206 -230 -420 122 520 284
5235 284 -196 -565 -147 618 176 -484 -333 265 413 346 25 -188 -37 335 277 -238 -142 276 392 266 -130
5256 -130 -119 655 673 -137 -172 -291 292 366 -199 -209 -172 135 400 -145 -550 -337 522 296 -79 -276 5 365
5278 365 392 -6 -372 -9 566 351 -253 -484 -339 126 458 -452 -536 -133 310 353 -485 -389 16 336 135
5299 135 -332 -87 -8 181 35 -258 -380 7 580 223 -151 -371 204 401 144 -443 -27 187 372 -62
5319 -62 -334 -378 159 379 -254 -424 -366 208 436 -26 -444 -309 511 165 -419 -109 -138 159 314 -179 -242 -230
5341 -230 84 273 -223 -470 77 486 229 -224 -704 2 243 135 -27 -383 155 206 163 -174 -381 -189 303
5362 303 131 -95 -346 145 191 237 -71 -112 261 395 92 -234 -277 53 208 14 -103 -138 208 245 96 -294
5384 -294 -119 141 70 -199 -382 -257 48 75 -268 -244 -177 333 166 -285 -457 79 199 -51 14 -299 46 247
5406 247 178 19 -291 124 273 173 -270 -142 -68 164 202 -179 -307 49 265 -187 -36 -276 243 222 -163
5427 -163 -367 -39 32 230 158 -404 -45 113 405 116 -334 -111 139 101 56 -130 -69 26 235 -88 -135 -96 109
5450 109 260 -134 -172 -275 263 310 93 -103 -326 -103 448 -44 -225 9 302 179 -10 -333 -119 334 359
5471 359 -45 50 288 146 -163 -273 -203 0 103 101 -128 -109 -109 272 100 -160 -90 75 251 -79 -183 -87 83
5494 83 181 -111 -318 103 -141 168 162 -270 -146 142 183 -11 -194 -58 314 266 108 -227 13 45 44 6 -373
5517 -373 -114 -72 156 -23 11 -12 180 180 10 -16 -51 381 87 -103 -245 165 207 288 -204 -334 78 150 251
5540 251 -260 -274 51 453 89 -114 -278 113 150 -268 -59 -98 -122 11 194 137 -187 -132 247 15 -201 -176
5562 -176 164 563 0 -169 -192 -26 220 -76 -14 -307 44 269 87 -473 -70 53 319 188 -432 28 135
5583 135 162 -37 -360 -391 184 390 28 -201 -107 30 342 -187 -199 -189 181 247 -135 -92 59 459 26 133
5605 133 -221 59 101 200 58 -116 -84 89 155 -177 -427 -101 162 -253 -328 -67 216 188 30 -105 -78 -189
5627 -189 107 291 -192 -156 -93 379 268 -522 -276 -76 326 -119 -300 -216 82 44 -292 -100 -142 20 -46 -70
5649 -70 -108 -303 111 562 148 -278 38 470 246 -197 -72 -124 207 182 90 -215 -263 293 176 178 -225 -169 192
5672 192 93 -238 -172 61 524 1 -251 -330 8 350 123 187 -206 161 367 249 -207 -410 -231 204 258 -255
5694 -255 -175 195 197 -95 -366 -5 -32 0 99 -257 -282 165 122 0 -102 -225 391 254 221 -355 -154 304 338
5717 338 -219 -191 -80 32 84 -113 -191 -187 133 271 -26 -348 -249 373 240 -216 -343 185 57 32 -116 -357
5739 -357 -29 123 -16 -101 -182 -133 321 282 -40 -101 33 368 -65 -213 -308 181 105 -191 -355 -123 196 -22
5761 -22 -159 -141 -204 -194 291 22 -209 -141 162 214 -143 -315 -12 326 41 183 -274 -242 237 202 62 -325 -402
5784 -402 288 194 106 -114 81 224 277 -92 -154 -35 -38 300 -241 -208 -78 137 244 -90 -340 -3 358 35
5806 35 -231 -181 -56 181 -7 -47 -156 47 187 58 -95 96 46 417 245 -258 -237 111 352 137 -290 -161
5828 -161 42 -128 -80 -375 14 21 23 195 -182 62 136 312 -16 -230 -43 156 302 -63 -253 159 122 -28
5850 -28 -110 -117 -155 193 243 -34 -230 -221 198 96 -115 -216 64 116 127 -156 -189 -73 158 199 -6 -279 75 105
5874 105 167 147 -265 79 355 112 -85 34 136 209 38 -14 -231 287 8 -131 -59 -502 220 282 -39 -188
5896 -188 -139 189 173 -109 -276 -45 305 -36 24 -246 -104 22 158 86 -204 -6 96 -69 -148 -323 -17 263
5918 263 140 -35 -199 6 10 346 -218 -84 33 133 -13 -142 -183 -17 251 -21 39 -349 105 178 315 6
5940 6 -14 -176 24 169 -142 -204 139 315 201 -150 -234 61 175 162 80 -84 224 85 -4 -104 -367 252 -1
5963 -1 88 -136 249 -73 104 84 -186 -27 110 4 -160 50 -37 -9 229 -140 -259 -175 168 321 2 -239
5985 -239 46 54 162 -195 -192 -105 129 79 29 132 210 -53 194 -223 -146 3 -9 -71 -153 2 226 97 77 35 27
6010 27 -81 290 221 1 -26 183 -77 155 -38 -255 193 182 -57 -122 -55 20 235 101 238 84 241 227 44
6033 44 -383 -37 78 -103 -73 -228 74 81 182 -6 -31 129 -51 153 -166 -197 11 65 3 3 39 236 189 -22
6057 -22 -147 -20 189 -76 103 0 36 2 82 91 -197 -230 -105 -85 225 -359 -237 11 264 -38 -223 -135 -29
6080 -29 112 9 -341 29 68 212 -233 -150 -297 -76 45 -19 -103 -232 365 -16 5 -17 162 -143 -166 151 -91
6103 -91 -261 -28 274 133 -439 127 -35 175 62 -21 161 217 -159 -207 -164 -33 179 203 28 -342 90 285
6125 285 174 -129 -111 26 122 71 -326 -29 263 142 41 -89 -385 15 4 -108 -114 -78 -120 0 155 -100 -96
6148 -96 -33 176 121 121 -41 155 -78 -44 -96 -66 96 183 96 -63 -21 -10 64 -50 -84 -51 184 -47 -98 -379 -69
6173 -69 368 56 -76 -48 -22 -65 61 167 -304 7 269 166 -182 -114 -167 121 179 -53 -54 222 213 262 -206 61
6197 61 -148 26 179 -446 45 -85 22 4 -319 -290 26 75 -155 -348 -23 -7 20 33 -92 205 54 23 -103
6220 -103 38 -15 65 187 -89 1 -107 97 28 -60 42 187 75 -187 -146 -172 -122 131 95 -37 140 -114 204
6243 204 73 -285 -619 -20 417 81 32 -112 157 236 120 91 13 124 79 -67 -154 -194 -130 168 82 -157 -220
6266 -220 158 128 -61 -176 60 -1 25 -166 13 10 -132 89 -55 -363 -67 207 -154 -260 -89 122 55 135
6288 135 23 -238 32 122 172 268 -127 127 134 234 25 -347 -162 106 89 -138 -210 -38 -125 2 119 125 232
6311 232 94 203 -139 -298 199 362 79 -109 -61 176 -28 12 -178 -49 -59 102 77 128 -184 95 -207 -115
6333 -115 -293 75 119 80 -52 0 -10 142 147 -48 -158 -101 138 -54 96 -125 174 -21 80 48 -166 50 83
6356 83 147 -323 -285 34 11 -174 -31 -51 -416 -90 -63 -234 -24 -73 -125 227 -132 -132 178 75 15 -65 -352 142
6380 142 238 6 49 -199 -222 -218 -4 63 -4 176 229 57 -370 -187 102 81 47 -197 -7 -73 241 -214 -85 -144
6404 -144 344 72 -73 126 -264 142 406 -322 -71 -90 240 240 237 -203 134 496 81 -170 -162 16 34 105 71
6427 71 52 5 138 -344 -179 3 74 225 -102 -163 -224 35 77 118 -151 -53 168 93 -42 39 -11 103 271 -7
6451 -7 28 -240 145 237 -39 -62 -307 2 172 15 -251 -180 -134 90 127 -233 -14 188 -125 -175 -98 -110 180 -49
6475 -49 84 123 184 225 86 -155 -64 183 113 -49 -65 -25 35 85 98 -186 -68 -96 -108 -7 -39 -112 -67 111 100 -171
6501 -171 -82 44 138 97 -122 -162 -41 259 16 -83 -359 -118 25 178 -98 488 127 183 54 -152 -275 180
6523 180 137 -164 -19 -28 15 143 -152 -171 66 143 134 195 -76 4 36 130 -22 -23 17 114 -8 -131 -32 -136 131 63
6549 63 -175 -286 31 -189 -51 -62 -106 -42 303 -58 -49 199 -6 76 -103 -157 -105 -91 227 98 26 -172 106 -86
6573 -86 217 -10 -64 -7 262 -13 -83 43 135 -148 -158 82 -223 280 144 45 -155 -27 -55 156 287 -199 80
6596 80 57 247 223 24 -195 28 213 -32 -237 -193 72 81 -14 -19 23 150 -50 -157 -30 -48 38 151 -139 109
6620 109 -23 85 6 -121 -298 164 126 -80 143 -187 69 -68 169 63 78 322 21 -20 58 -273 17 445
6642 445 137 -89 -266 82 -42 156 -18 -50 137 49 -23 110 69 162 303 21 27 -99 176 -49 -34 -46 118
6665 118 134 53 -75 97 -136 220 271 -191 29 34 220 119 -185 -60 -29 -150 16 62 -328 106 218 119 -116
6688 -116 -5 91 17 191 49 -5 107 53 -106 -74 -72 75 187 77 -169 -128 105 395 59 3 -180 2 169
6711 169 83 77 14 165 206 173 189 145 128 74 -73 -382 -19 -3 129 75 -14 11 74 -98 -57 -8 -99 -49 111 79 -291
6738 -291 50 328 -27 -145 5 226 -60 -158 125 83 -127 53 -136 -112 -51 -353 158 323 -76 163 71 67
6760 67 -31 -99 -85 25 247 104 5 -133 13 29 1 -47 -40 212 175 109 -159 79 125 32 -43 -95 -7 12 164 112
6786 112 -67 61 274 89 -24 10 269 3 114 -25 -135 13 218 -47 -34 99 41 160 -61 24 -25 327
6808 327 247 204 -74 -229 148 45 -128 49 -53 -44 227 135 -115 -38 103 53 21 -37 -55 -222 149 15 -189
6831 -189 29 -52 -38 -166 -249 97 154 160 83 -303 105 161 -146 -100 -22 -87 149 128 104 48 32 182 115 -35 -168
6856 -168 -92 47 181 -88 -3 -104 258 -21 -143 -85 32 96 9 113 -195 -88 450 -18 27 -45 -16 185 38
6879 38 -56 114 167 -140 18 -51 -51 124 118 2 -61 -246 -23 45 87 -142 -340 -89 283 -42 85 -133 230 156
6903 156 -137 -47 -143 52 145 15 -287 104 170 173 -91 65 -175 213 37 -7 -68 -205 140 -207 -14 -174 -91
6926 -91 6 163 176 14 -223 55 113 3 -132 -216 53 -66 -66 58 31 -2 53 -181 5 -151 -69 226 -215 -49
6950 -49 -260 58 -4 86 -173 261 4 106 -176 -61 113 -18 -159 -104 -175 -52 65 -77 -234 -53 117 111
6972 111 145 20 -35 129 -45 -100 -151 22 144 53 247 -113 -126 -205 -49 236 -190 -81 65 -3 -6 28 92 11
6996 11 -105 -169 -60 -10 141 68 -22 176 109 351 -3 -175 -53 -182 9 -17 12 -106 -118 141 232 -153 -48
7019 -48 134 -162 -95 -151 3 -239 161 -11 -125 -106 81 319 -56 22 -142 -80 153 326 73 93 140 173 -75
7042 -75 -224 -82 316 -111 -81 -373 -149 -138 125 213 -246 74 186 80 171 -144 272 122 324 -185 -141 -164
7064 -164 89 105 32 -26 55 69 92 -94 -69 15 61 -35 -251 36 -348 126 -19 -134 -122 135 -210 -67 -172 -56
7088 -56 107 113 -10 -148 -37 -84 23 198 26 -140 -117 125 48 -246 -119 211 166 2 -323 -156 24 273
7110 273 14 -126 -12 188 81 -7 -262 9 140 -122 175 18 286 -80 -228 -98 -102 155 137 -110 -41 81
7132 81 -105 211 -178 -174 123 -170 -11 312 23 155 59 -207 77 -18 151 22 -1 170 -6 176 234 204 223
7155 223 25 72 -112 67 101 190 44 -92 242 -172 -146 -174 107 177 72 -50 46 -61 128 79 -186 -89 137
7178 137 -79 -85 -18 87 -39 108 267 116 -54 114 157 -138 -120 34 324 80 -258 -4 271 30 4 152
7200 152 252 156 -192 7 179 -42 82 -182 -24 27 10 55 185 86 249 -195 278 47 -161 -138 25 -62
7222 -62 37 315 134 40 87 -57 -152 -153 -25 406 113 -178 -40 100 198 164 169 -106 23 -24 -133 91 -57 24
7246 24 -219 105 76 -241 -180 62 45 -166 169 108 135 25 -98 69 26 185 1 40 -48 9 62 6 -160 47
7270 47 -11 27 16 109 -29 -120 347 -78 -7 -437 91 91 -115 -59 -326 201 9 299 -115 248 90 269 245 -116
7294 -116 -31 79 3 138 -105 -67 -27 -193 124 -95 54 -102 310 -31 29 58 39 143 -108 -34 -8 150 140
7317 140 72 146 -74 53 28 -30 61 -71 -5 146 -111 -112 51 141 21 -67 -2 90 14 -136 -71 -41 -36 -124 105 -53
7343 -53 165 104 79 269 -36 -192 -100 -11 68 144 -37 -100 208 138 -130 118 -23 285 -111 5 -91 -81 -136 270
7367 270 -244 42 -15 185 43 4 -23 58 164 -38 -122 26 173 -31 56 -119 -29 293 -47 41 -82 32 32
7390 32 113 -95 -223 330 -111 158 -169 -199 -116 -46 -6 -77 -86 -152 275 -10 40 97 104 -108 112 -141 -29 -100 -26
7415 -26 -86 -92 -22 -88 -104 118 -251 -15 -164 291 115 -63 -176 -40 320 27 -146 -205 3 -69 -164 -82 -11 162
7439 162 -63 61 240 -56 137 47 14 85 63 157 -134 66 -136 94 47 -147 162 -230 74 176 -120 41
7461 41 171 249 187 122 345 -15 -62 -128 -110 -185 -14 388 194 89 -170 -68 -126 181 -99 -161 41 92 -43 -28
7485 -28 60 157 -86 73 -44 -202 -83 147 96 -154 -150 104 193 -270 -99 -205 -104 66 206 -32 -81 -175 -52
7508 -52 278 -61 -109 -45 185 -36 -22 -155 -119 437 2 -202 -34 -203 -37 200 -6 352 40 2 -129 -95
7530 -95 -93 -36 -148 212 -103 6 -57 56 6 -12 -128 -248 130 -58 19 -17 -307 18 -94 -255 42 114 -172
7553 -172 -285 113 -172 25 88 23 85 -39 103 -123 -164 169 23 59 -72 268 14 107 -120 -230 -52 -114
7575 -114 61 211 -45 -122 199 99 119 57 73 -113 24 -307 -30 16 27 -57 -89 164 27 44 -314 61 7
7598 7 -120 93 -25 108 222 -19 -49 35 -50 29 -9 133 75 204 -56 -130 169 -14 105 -32 -141 -133 204 -192
7622 -192 -142 -388 -369 144 -98 -114 -29 -109 89 -57 -195 139 -219 -154 162 101 27 -47 265 94 -158 -302 -84
7645 -84 306 216 14 -47 -53 3 24 -175 163 -139 50 -79 46 -141 97 70 -80 78 -61 8 -32 158 226 -214
7669 -214 48 100 138 119 -14 48 -15 -110 -314 -65 -55 129 -47 393 115 15 24 128 -127 -130 -2 184 67 -22
7693 -22 117 46 279 -319 10 -8 159 330 -17 -226 -119 116 166 -62 119 -121 21 -54 -41 81 -68 -14
7715 -14 16 -61 -107 -158 141 -25 -100 74 402 327 57 147 -117 -83 -229 219 -269 -3 -208 49 -42 75 11 13
7739 13 15 -289 254 64 49 -53 -79 -50 -189 53 -135 -201 -88 -125 33 -45 -59 -138 -10 -327 134 92 -160 173
7763 173 51 -56 -65 9 101 138 -139 -30 39 -105 -100 144 -219 -112 -37 81 -50 18 -34 151 -176 -37 80 42
7787 42 158 -111 80 -229 185 1 -137 158 -125 -182 155 78 -53 -10 -320 -36 28 -109 -130 28 3 -76 -277
7810 -277 144 169 8 -163 -223 -189 18 76 226 -19 -17 -103 -106 -223 -27 298 6 -194 65 5 -131 -49 168 -22
7834 -22 41 -61 25 40 87 40 92 -85 -118 -9 -155 -235 75 244 -94 -40 11 15 62 57 97 62 -1 -72 191 -78 -200
7861 -200 49 -108 127 -3 313 69 155 -33 10 -36 -137 -160 -130 85 -104 -97 197 19 171 -32 46 -116 31
7884 31 -44 -38 279 -17 98 -50 -54 32 -44 33 49 -57 98 104 -254 -223 61 170 -12 -139 -325 47 -129 -246
7908 -246 -239 191 239 89 147 -65 79 197 96 288 -1 32 145 22 256 -6 -117 60 123 -120 68 -256
7930 -256 263 -28 -71 77 -46 22 139 146 -103 208 73 62 -48 -136 -114 50 -77 109 -86 -12 191 82 33
7953 33 -45 41 -187 -69 25 92 10 -32 190 199 19 -82 -95 99 -17 -129 6 54 121 50 -103 -22 -45 100 -334
7978 -334 78 31 198 18 126 180 170 -185 274 0 -85 50 -33 326 6 159 -11 -171 53 -124 -15 -20
8000 -20 -151 -250 57 146 -30 51 128 -100 329 -41 95 86 48 -68 128 188 -326 -135 -37 62 165 -142 -212 -15
8024 -15 -47 -37 286 -92 28 -36 330 57 4 140 27 278 -62 -97 182 -66 -131 123 61 82 0 34 -188 -58
8048 -58 -42 27 64 -52 71 7 -108 256 -156 -87 157 56 126 -10 127 -31 -146 36 -126 49 99 12 -109
8071 -109 -146 -93 -240 -84 108 -242 -14 -138 -37 25 -234 -28 -94 275 -302 88 -105 13 -229 212 -6
8092 -6 -98 -59 -204 -56 22 -15 48 -63 -146 295 113 77 193 -80 -64 39 -153 -253 -156 185 128 120 -30 -273 -87
8117 -87 -35 -16 -58 -291 -88 -23 -2 175 24 -232 -22 6 -170 -186 30 -42 -117 -118 3 123 -99 4 186 -237
8141 -237 232 -65 57 55 -44 196 216 -251 65 203 75 -72 -36 -202 84 167 114 10 -222 12 -20 -58 132
8164 132 -67 142 -193 70 186 -107 -47 19 132 121 103 -8 83 -190 -155 152 -72 80 -42 82 357 223
8186 223 -292 -34 -1 -8 -29
8191b9
$$ Imaginary data points
##PAGE= N=2
##DATA TABLE= (X++(I..I)), XYDATA
0 0 0 0 0 0 0 0 0 0 0 0 0 0 0 0 1 -8 8 -8 8 -9 16 -16 16 -24 24 -31 33 -40 45 -53 60 -66 77 -85 95 -109 121
37 121 -134 150 -167 188 -206 229 -254 280 -308 339 -376 412 -454 502 -550 608 -675 746 -826
56 -826 920 -1028 1156 -1308 1496 -1730 2032 -2441 3020 -3905 5420 -8490 17134 -91661 -318841
71 -318841 -12819 270768 113387 -175653 -144764 55429 125682 57554 -29322 -113394 -77965
82 -77965 113164 193478 -44206 -254910 -54395 259930 150515 -203161 -215441 101612 212618
93 212618 -5772 -163050 -73022 57437 87091 44162 -53851 -131376 -30926 162494 128420
104 128420 -137367 -204285 71002 241955 24074 -214069 -95651 151484 138887 -52599
114 -52599 -118121 -29943 59008 84713 30920 -86541 -118762 37468 170938 34460 -183642
125 -183642 -118334 137838 166108 -71444 -181435 -10965 140750 66781 -71416 -86947 -8705
136 -8705 63804 76652 -252 -102759 -67393 95325 134346 -41992 -159426 -18688 153599
147 153599 80711 -107029 -111122 42613 105412 17179 -68781 -59587 3936 59621 52875 -37160
159 -37160 -100861 -17629 108152 68727 -89416 -110552 43595 122407 10537 -100775 -49572
170 -49572 60746 70638 -3158 -52635 -37510 19775 65481 31698 -58013 -72716 30493 96834
182 96834 10568 -96112 -51937 66093 71530 -29065 -76213 -16041 49088 38921 -15449 -48703
194 -48703 -26061 31873 53346 -1459 -62407 -31368 54509 60627 -24476 -65824 -2890 61362
206 61362 33799 -33340 -43132 5440 40905 23493 -21952 -39116 -5868 36742 28284 -25308
218 -25308 -47440 -1400 44463 20149 -36296 -39120 12130 39288 7932 -30669 -24580 13053
230 13053 31919 8908 -23126 -21401 12196 32102 9506 -23584 -20106 14362 30040 3399
242 3399 -26045 -15816 16176 22486 -3803 -24093 -11471 13020 15435 -5281 -20671 -10060 11054
255 11054 13853 -3893 -17317 -7731 13073 15055 -4419 -15372 -1904 15888 11980 -5791 -10560
268 -10560 1954 12166 7737 -4697 -8331 79 8244 5592 -5122 -10029 -988 7217 1978 -7884
282 -7884 -9039 467 5513 -1076 -6474 -4286 1372 3409 824 -2602 -2448 1968 5297 2432 -2073
297 -2073 -295 4218 4158 933 -1492 907 2885 1065 -514 -971 -763 -388 -520 -1187 -2802 -2650 -555
314 -555 -685 -3186 -2311 -173 -455 -1519 -1063 741 594 -61 1023 2079 1147 1203 1904 2246 1669 1089 1813
333 1813 1567 385 612 998 -187 -1021 -407 110 -2127 -3438 -887 83 -2033 -3375 -2272 240 294
350 294 -1485 -2132 -743 1663 2927 233 -1735 -118 3899 4917 -52 -3047 1056 5976 3938 -1878
366 -1878 -3948 956 4871 2349 -4020 -6386 -933 5725 2012 -7243 -8241 946 6900 734 -8669
381 -8669 -7381 2675 8642 2125 -8039 -6732 5342 12405 3338 -10009 -6962 9503 14772 -2
395 -2 -12427 -5395 10966 12186 -2468 -13278 -7097 8837 12989 -3046 -18314 -9828 12430 15358
409 15358 -8066 -22268 -5499 18314 13298 -11887 -19390 363 18325 11776 -8353 -17155 -1642
422 -1642 20244 17980 -9598 -24255 -370 28760 16034 -20858 -25673 8220 28744 6197 -24330
435 -24330 -19863 8344 22246 5958 -20047 -23365 3587 27979 12272 -27424 -30421 13993 39830
448 39830 4703 -37681 -21109 27368 34053 -5582 -30987 -11301 22131 27425 866 -27024
460 -27024 -21566 17567 38804 2017 -44343 -26236 34971 42185 -18614 -51500 -7114 41854
472 41854 23998 -24972 -34925 -1370 27891 22966 -9418 -35519 -15464 34945 42324 -16557 -55798
485 -55798 -5040 59637 32815 -42690 -46930 20187 50600 7467 -35740 -26466 9443 30937
497 30937 19312 -21502 -45242 -5388 52729 33088 -48186 -60707 24218 70411 3148 -65298
509 -65298 -29164 43061 42512 -11485 -36294 -16276 16796 37000 17328 -34516 -46456 19660
521 19660 69806 10697 -72400 -40032 58451 61382 -31425 -67249 -1278 50687 23276 -23988
533 -23988 -34472 -12866 21530 39517 3007 -55621 -37835 50229 67329 -27444 -82011 -2437
545 -2437 80393 33551 -56523 -48149 26279 48909 9415 -25954 -29794 -6300 34865 42332 -20019
558 -20019 -69005 -10233 75598 41940 -65864 -69831 36322 75690 -5454 -66213 -24043 36510
570 36510 34688 -1651 -26833 -29765 2554 48441 32601 -44056 -62026 26583 82764 6532
582 6532 -79804 -34220 62350 54396 -30164 -54584 -2152 35968 24253 -5861 -32148 -30276 17208
595 17208 54528 7680 -67399 -41806 56887 65514 -34221 -77180 2848 69338 24416 -43975
607 -43975 -36680 12943 33547 19971 -10334 -36527 -18631 39521 51396 -21565 -69976 -4586
619 -4586 73412 32784 -59321 -53580 31021 55452 -3333 -44171 -21610 15484 27934 13137
631 13137 -21037 -39183 -1879 50598 29381 -45481 -51573 27761 65047 -391 -58841 -20516
643 -20516 42793 35666 -14155 -32253 -9743 18139 27068 6992 -30200 -32726 18041 48926 1394
656 1394 -55247 -26867 43865 41825 -25771 -49124 268 38898 17890 -20302 -26341 -3560 22101
669 22101 25513 -4872 -34851 -14510 35160 36392 -19771 -45428 2320 46146 18182 -32950
681 -32950 -29540 13718 30444 5128 -21462 -20669 2250 22621 14322 -18146 -30383 1589 33480
694 33480 13729 -29826 -27966 16386 33245 127 -28352 -12880 18132 21260 -394 -17690
706 -17690 -11931 9976 21910 5323 -20657 -17661 13668 26261 -1519 -27540 -12006 19636
718 19636 19022 -9880 -22728 -4641 15388 12010 -6819 -16899 -6087 12469 14998 -4044 -18686
731 -18686 -5664 17638 15417 -8611 -17847 965 18290 9375 -10501 -12267 2781 13551 6078
744 6078 -8111 -11191 115 11508 6127 -9378 -12831 1199 12083 3454 -11354 -9910 4399
757 4399 10403 982 -9501 -6097 4951 8589 1469 -6598 -4624 4879 8982 1671 -6764 -3870 5524
772 5524 8077 -928 -7097 -2714 4667 5047 -2130 -6367 -2807 3506 3264 -2360 -5750 -2381 3164 3153
788 3153 -2157 -4837 -885 3723 2719 -1526 -2901 529 3942 2911 -1009 -1730 981 3605 2152
803 2152 -1422 -1578 1062 2317 692 -1800 -1708 155 709 -237 -2257 -2234 -104 245 -436 -2012 -1446 394
821 394 912 -228 -645 -122 978 1425 344 263 777 1246 1653 1097 28 138 833 721 249 -803 -338
840 -338 -95 85 -430 -1169 -1218 -629 -210 -716 -1344 -1259 23 269 -375 -971 -731 894 1511 218 -448 107
860 107 1649 2092 623 -644 152 1903 2179 -387 -1844 -369 1385 1440 -980 -3029 -1088 1494 795
877 795 -2186 -3696 -1461 1945 1889 -2300 -3834 -164 3622 2339 -2448 -3429 920 5067 2772 -2257
893 -2257 -2988 1813 5690 2670 -3468 -4374 1682 5858 1926 -5344 -5336 2593 5956 55 -7340 -5467
909 -5467 2896 6151 -291 -7144 -4864 3439 7368 324 -7605 -4922 5840 9567 -330 -9353 -3672
924 -3672 8818 9459 -2682 -9753 -1590 9211 7729 -3488 -9834 -3033 8139 8875 -4084 -12965
938 -12965 -4218 11379 9455 -8046 -15340 -545 14066 6786 -10407 -12039 2538 12729 6112
951 6112 -7891 -11144 1115 14303 9485 -9256 -15594 3047 19637 7468 -16070 -14664 9164
964 9164 18498 13 -16414 -9634 8126 13052 1017 -13198 -12357 4525 17667 4837 -18859
977 -18859 -16394 12091 23540 -1883 -24358 -8304 19755 17338 -8039 -17859 -2518 13831 13504
990 13504 -1781 -16217 -10451 13660 22026 -3401 -27648 -10039 25321 20814 -17619 -28189 2903
1003 2903 25256 8125 -17552 -16927 2301 15341 11214 -7797 -21106 -5830 23613 21122 -16172
1016 -16172 -30928 4920 35780 10894 -28424 -20611 17098 25481 -1208 -19569 -11109 6749
1028 6749 16841 8828 -14346 -24069 2265 31088 11498 -31518 -26995 20866 34408 -7137 -34940
1041 -34940 -8006 25194 17589 -9197 -18187 -6770 10582 19986 5831 -22491 -21299 18425 36333
1054 36333 -3790 -40535 -11614 36376 25069 -23456 -30879 6080 25865 7893 -14090 -17168
1066 -17168 -5251 13710 20556 -3944 -31860 -13100 31885 28929 -23025 -39275 8663 40888
1078 40888 8369 -30937 -18492 16430 22115 2029 -13034 -14497 -692 20537 18473 -16134
1090 -16134 -33364 3444 39779 11952 -38019 -26682 25281 32425 -9913 -31457 -5918 18661
1102 18661 14405 -2324 -14696 -14302 5372 26131 10384 -27864 -25200 22187 38058 -7325 -39517
1115 -39517 -6935 33735 19415 -19227 -22964 3114 17167 10317 -4497 -17798 -12542 13742
1127 13742 25381 -4588 -34487 -11235 31806 23590 -23049 -31850 8609 30731 5067 -20903
1139 -20903 -13541 7200 15726 8670 -7338 -18200 -4340 23054 19768 -17386 -29607 6874 33811
1152 33811 6342 -29713 -17824 18470 21643 -5848 -19529 -7776 8291 13209 3711 -13494
1164 -13494 -17339 5436 24231 5924 -24940 -17298 18448 25502 -6905 -25124 -3431 20429
1176 20429 12842 -8331 -14078 -2554 10192 12511 -188 -15954 -10864 12808 19288 -5516 -23973
1189 -23973 -5493 20800 12570 -14450 -18413 3351 15732 4896 -9622 -11020 396 11007
1201 11007 9869 -5502 -14910 -1645 16911 11312 -12188 -16409 5480 18662 4013 -14391 -9797
1214 -9797 7870 12110 614 -10264 -7994 3532 10509 3701 -10233 -11355 4228 13693 1439
1227 1439 -13974 -8333 9060 12043 -2555 -11152 -3264 8240 8216 -1566 -7705 -3283 6126 8571
1241 8571 -274 -8935 -4345 7574 8755 -3258 -10127 -2416 8207 5426 -5055 -8248 -639 6331
1255 6331 3991 -4024 -7058 -858 5826 4642 -3750 -6905 205 7443 4090 -4228 -5592 2057 6965
1270 6965 2361 -4205 -3917 2285 5525 1755 -3914 -4021 1553 4652 825 -4493 -4211 1758 4076 -196
1286 -196 -4832 -2983 1922 3479 -656 -3818 -1840 2192 2816 -151 -2725 -1032 2721 3207 -297 -2410
1302 -2410 -306 2721 2375 -580 -2409 -539 2212 1399 -1387 -2353 -553 1389 1074 -1633 -2063 -405
1318 -405 1071 456 -1558 -1941 326 1260 528 -954 -1071 484 1911 989 -340 -459 818 1656 549
1335 549 -128 -553 749 1167 359 -876 -679 172 410 -283 -1536 -1127 -3 451 -519 -1218 -977 139
1353 139 631 7 -759 -305 658 1021 174 -479 -182 1083 1103 454 -611 -81 1147 1158 -37 -893 -528
1372 -528 772 825 -664 -1998 -926 466 695 -686 -2094 -876 908 970 -672 -1903 -455 1734
1388 1734 1627 -589 -1629 21 2340 2032 -438 -1746 81 2780 2090 -1494 -2350 18 2546 1407
1404 1407 -1930 -2649 -85 2367 1255 -2354 -3182 297 2885 1536 -2971 -3569 729 4042 1229 -3206
1420 -3206 -3097 1852 4530 1235 -3374 -2448 2500 4487 1155 -3843 -2959 2703 5233 272 -5409 -3209
1436 -3209 3624 5444 -1369 -6596 -2769 4043 4204 -2052 -5806 -2403 3999 4849 -1353 -6424 -2873
1451 -2873 5973 6610 -2266 -7661 -993 8040 5678 -4251 -6915 734 7171 4185 -4002 -6363 -602
1466 -602 6347 5436 -4036 -9075 -1029 9263 5359 -7866 -10027 2749 10216 2116 -8681 -6683
1480 -6683 4055 8337 1890 -6454 -6563 2183 9844 4571 -8197 -9624 4877 13559 1922 -12472
1494 -12472 -7156 9372 10837 -3044 -11146 -3748 6935 7495 -1161 -9249 -6779 5093 11557 388
1508 388 -13780 -8069 11137 13559 -5628 -15622 -1509 14125 8054 -7622 -9997 766 9006
1521 9006 6673 -2742 -10213 -4457 10631 12426 -5524 -17221 -2096 17391 8903 -13793 -14728 5872
1535 5872 14830 1214 -11481 -7771 2978 9624 5414 -6365 -12384 -794 15972 9982 -13717
1548 -13717 -16502 8136 20947 1214 -18499 -8045 13003 12662 -3775 -11273 -4664 5369 9944
1561 9944 3236 -11088 -12899 5804 18642 1813 -20733 -11224 16207 16665 -8967 -18829 -183
1574 -183 14797 7392 -6681 -9638 -2544 7354 11235 499 -14586 -8902 14398 18020 -7774 -22098
1588 -22098 -350 21733 8620 -15882 -13825 6586 13235 2143 -8298 -9313 -1403 9623 10105
1601 10105 -6459 -18178 -1879 20076 11028 -17333 -17859 10040 20811 -294 -17264 -6555
1613 -6555 10578 11071 -68 -8230 -7890 2178 13509 7036 -12637 -15625 7411 20875 335
1626 335 -21458 -9323 15679 13909 -8402 -15300 -1220 9576 6976 -2199 -9440 -6812 6275
1639 6275 14067 959 -16701 -9043 15380 16357 -8511 -18787 1200 17634 6676 -11133 -10048
1652 -10048 2922 9238 5410 -4427 -10228 -3866 10199 10989 -7005 -17483 -732 17370 7565
1665 7565 -14382 -13311 7026 14289 396 -11234 -6194 4800 8930 3460 -6475 -9191 1621
1678 1621 13098 6066 -11491 -12009 7076 15610 -585 -14523 -5862 9864 9100 -3628 -9904 -3220
1692 -3220 5196 6925 -5 -8844 -6756 5894 11189 -612 -12876 -5128 10760 10131 -5795 -11131
1706 -11131 215 9887 5376 -5203 -6809 -45 6476 5904 -2621 -8263 -2298 8289 7045 -5335
1720 -5335 -10670 216 10090 3702 -8066 -7770 2513 7544 1642 -5750 -5435 1398 6568 3245 -4577
1735 -4577 -6500 1523 8366 3044 -6591 -5923 4375 8209 177 -7051 -3560 4217 5469 -623 -5299
1750 -5299 -3149 2912 4893 -48 -5777 -3582 3359 5312 -1419 -6465 -2386 4735 4322 -2396 -5264
1765 -5264 -833 4662 3429 -1712 -3758 -443 3889 3448 -1814 -3986 -410 3955 3106 -2720 -4310
1780 -4310 204 3568 1609 -3086 -3535 327 3203 957 -2585 -2912 324 2971 714 -2343 -2566 744
1796 744 3002 1174 -2538 -1735 1566 2856 612 -2209 -1405 1663 2388 334 -2041 -1027 1391 1882
1812 1882 -307 -2367 -1199 1396 1650 -818 -2356 -1095 1079 1245 -882 -2083 -555 1419 1223 -724
1828 -724 -1388 66 1547 1338 -630 -1080 209 1732 946 -622 -1042 66 1384 487 -979 -1136 92
1845 92 974 131 -1253 -1319 -170 752 64 -1269 -927 92 961 -25 -807 -358 666 1232 359 -804 -431
1864 -431 679 1378 354 -488 -348 773 880 309 -1010 -620 573 786 -237 -1284 -723 320 801
1881 801 -272 -1412 -866 665 781 -205 -1604 -183 933 1296 -32 -1062 -355 1375 1615 104 -1161
1898 -1161 -459 1498 1333 -336 -1394 -378 1141 1198 -747 -1929 -657 1467 1112 -1486 -2163 -382
1914 -382 1724 1232 -1600 -2112 310 2027 1271 -1384 -1687 132 2274 1651 -1067 -2052 421 2721 1546
1931 1546 -1902 -2094 1322 2617 729 -2451 -2175 1090 2715 447 -2530 -2443 981 2877 640 -3376
1947 -3376 -2644 1615 3598 179 -3689 -2067 2882 3403 -292 -3177 -1353 2801 3735 109 -3389 -1839
1963 -1839 3089 4459 -765 -4597 -1983 3779 3770 -2171 -4960 -697 3855 2533 -2578 -4295 -832 3480
1979 3480 3182 -2007 -5153 -1063 4881 4035 -3328 -5732 694 6428 2765 -4427 -4483 2052 5060 1341
1995 1341 -3430 -4000 866 4948 2843 -4296 -5947 1022 6873 2003 -6994 -5602 3687 6817 -495
2010 -495 -6691 -3307 4192 4838 -125 -4697 -3789 2701 6378 1536 -6417 -4908 4870 8657 -843 -8989
2026 -8989 -2262 7424 5594 -3707 -6623 -615 5225 3988 -2126 -6008 -2881 4583 6503 -1875 -9340
2041 -9340 -2716 8639 6777 -5799 -9283 1722 9181 2703 -5933 -4917 2134 5879 2908 -3208
2055 -3208 -6206 -1117 7550 6119 -5806 -9635 1646 10743 2799 -9772 -7028 5366 8004 -1148
2069 -1148 -7124 -3591 2733 5323 1904 -5076 -6931 1846 9635 2933 -9588 -7323 7371 10927
2083 10927 -2415 -10810 -1576 8288 5833 -3271 -6166 -1414 4265 5569 297 -7412 -5577 5504
2097 5504 9595 -2395 -11974 -2793 10600 6651 -7409 -9062 2233 8161 2453 -4685 -4980 10
2111 10 5189 5988 -2081 -8284 -2207 9406 7214 -6642 -10335 2858 11600 1891 -9150 -5500 4725
2126 4725 6400 -38 -5151 -4511 565 5892 3699 -5635 -8678 1939 10711 2519 -10342 -6596 7084
2141 7084 9158 -2607 -8572 -1564 6158 5024 -1229 -5060 -3266 3120 6963 1340 -7629 -5982 6147
2156 6147 9152 -2815 -10692 -2100 8837 4874 -5786 -7073 772 5317 2645 -2641 -5321 -1976
2170 -1976 4771 5993 -1992 -8301 -1696 8493 5837 -5821 -7697 2687 8509 1801 -5721 -4147
2184 -4147 2381 4680 1825 -3249 -4813 -6 5814 3504 -5319 -6944 1808 7864 1228 -7556 -4441
2199 -4441 4637 5964 -1177 -5376 -1699 3318 4157 538 -3819 -3636 2441 6228 761 -6001 -3855
2214 -3855 4892 5909 -1812 -6436 -1262 5000 3373 -2894 -4559 -626 3166 2964 -1352 -4502 -2158
2229 -2158 3539 4043 -1979 -5855 -587 5170 3036 -3298 -4686 1361 4690 1618 -2593 -2679 1051 3733
2245 3733 1873 -2140 -3229 363 4216 1887 -3377 -3802 1463 4171 553 -4233 -2605 2097 2808
2260 2808 -132 -3025 -1931 1659 3069 251 -2656 -1862 1583 3403 114 -3171 -1645 2580 2940
2275 2940 -583 -3064 -934 2850 2177 -832 -2572 -816 1687 1803 -924 -2633 -812 2230 1758 -1293
2291 -1293 -2839 -272 2250 1381 -1644 -1949 456 2234 914 -1231 -1577 641 2050 1050 -997 -1647
2307 -1647 689 1654 640 -1352 -1441 604 1631 -214 -1627 -1043 528 1229 -202 -1442 -1304 516
2323 516 1120 -61 -1358 -972 853 1395 -8 -1148 -119 1254 1190 116 -1126 -201 1091 1398 -90
2340 -90 -1259 -189 944 833 -658 -1317 -320 851 455 -838 -982 -260 621 487 -700 -1092 -23 639
2358 639 431 -806 -686 268 1203 699 -728 -452 711 963 633 -450 -576 487 1015 509 -734 -931
2376 -931 268 685 30 -832 -696 298 699 -346 -1083 -1023 379 709 146 -910 -444 370 833 28 -821
2395 -821 -201 1056 1078 -216 -880 -424 718 967 -135 -552 -391 704 757 -479 -1098 -711 881 640
2413 640 -476 -1351 -417 573 767 -595 -1094 -36 1044 810 -390 -1061 -9 1238 889 -466 -983
2430 -983 30 1637 1015 -658 -1091 -153 1353 809 -860 -1463 5 1444 743 -1361 -1851 -45 1613
2447 1613 314 -1434 -1437 588 1569 607 -1387 -1437 342 1617 734 -1239 -1032 778 2255 604 -1518
2464 -1518 -1317 1514 2076 -276 -1951 -753 1109 1556 -357 -2061 -1215 1094 2162 57 -2538 -1368
2480 -1368 1778 2328 -806 -2700 -495 2286 1759 -1018 -2309 -61 1812 1780 -707 -2294 -588 2442
2496 2442 2429 -1080 -3194 -131 3156 1972 -2282 -3050 515 2809 1008 -2062 -2375 198 2515 1323
2512 1323 -1900 -2964 247 3404 1661 -2683 -3010 1564 4069 292 -3488 -1896 2479 2915 -28
2527 -28 -2407 -1466 1360 3121 735 -3115 -2776 1881 3999 -250 -4683 -2276 3654 3399 -1724 -3980
2543 -3980 -581 3018 2180 -1031 -2798 -1288 2481 3212 -198 -4086 -1803 3921 4328 -2027 -4908 234
2559 234 4741 2269 -3158 -3236 904 3034 1499 -1966 -3080 -760 3133 3030 -2336 -4842 -172 5173
2575 5173 2084 -4628 -3949 2357 4649 -119 -3740 -1948 1935 3186 740 -2304 -2874 772 4570
2590 4570 1626 -4235 -3966 2783 5559 -435 -5492 -1888 4356 3406 -1710 -3813 -797 2365 2543 -158
2606 -158 -3483 -2905 2313 4773 -289 -5464 -2162 5083 4367 -2951 -4843 411 4901 1670 -2631 -2771
2622 -2771 257 2716 2643 -1146 -4098 -1391 4018 3755 -2926 -5930 303 5689 1734 -4733 -3543 2472
2638 2472 3926 117 -2839 -2173 904 3104 1993 -2161 -3665 837 5237 1810 -4786 -3856 3342
2653 3342 5417 -806 -5275 -1456 3411 2867 -948 -3066 -1727 1406 3116 583 -3598 -3307 2539
2668 2539 4780 -758 -5289 -1651 4652 3322 -2530 -4071 426 3668 1754 -1324 -2341 -489 2414
2683 2414 2994 -829 -3932 -1035 4341 3225 -2785 -4540 842 4451 1074 -3453 -2831 1151 2658
2698 2658 329 -2224 -2479 284 2801 1976 -2153 -3458 972 4525 1280 -3767 -2359 2731 3524 -238
2714 -238 -3215 -1290 1908 2169 -14 -2232 -1654 1176 2668 261 -3107 -2520 2158 3146 -741 -3507
2730 -3507 -862 2842 1986 -1395 -2655 -36 2169 1638 -977 -2160 -681 1868 2390 -645 -2693 -425
2746 -425 2674 2069 -1915 -2739 684 2511 1032 -1787 -2004 546 1655 737 -1270 -1996 131 2224
2762 2224 1262 -1939 -2198 590 2602 450 -2209 -1597 1583 1828 90 -1688 -859 1326 1506 308
2778 308 -1472 -952 1053 1818 211 -1947 -1183 1157 1557 -707 -1990 -706 1192 942 -848 -1442 -556
2795 -556 1297 1006 -374 -1309 -374 1197 1253 -521 -1410 -103 1629 973 -829 -1173 463 1542 577
2812 577 -702 -1233 210 1170 468 -1040 -1317 83 1117 436 -1304 -1027 537 1191 71 -1220 -801
2829 -801 751 1037 72 -537 -547 784 1167 94 -964 -451 613 948 -179 -1105 -339 744 686 -427
2847 -427 -856 -197 574 575 -163 -806 -140 646 383 -497 -714 -284 593 496 -269 -675 273 1040 624 -397 -544
2868 -544 64 874 694 -344 -425 175 945 380 -356 -699 -3 471 224 -876 -689 184 510 -39 -751 -673
2888 -673 187 560 201 -729 -452 371 664 41 -618 -375 357 660 35 -543 -400 601 788 -44 -710 -256
2908 -256 334 677 -289 -656 -422 318 199 -523 -801 -315 382 545 -103 -491 -136 563 570 -171 -770 -229 541
2929 541 533 -224 -868 -246 763 809 -315 -954 -288 920 486 -655 -1012 63 836 180 -643 -1015 21
2948 21 626 446 -604 -887 -67 748 310 -765 -858 317 1241 507 -773 -495 766 1043 512 -654 -838
2967 -838 460 934 335 -861 -812 455 984 309 -1047 -1031 725 1092 -369 -1480 -674 650 701 -63
2985 -63 -1043 -522 618 1043 172 -1120 -680 1080 1542 -278 -1437 -208 1358 1000 -951 -1278 35
3002 35 1152 664 -439 -1489 -207 1047 1060 -627 -1796 -462 1795 930 -1353 -1692 430 1528 446
3019 446 -1039 -1044 398 1470 866 -818 -1174 78 1880 978 -1432 -1841 793 2317 79 -1862 -1257
3036 -1257 1101 1525 -489 -1690 -1039 600 1118 227 -1428 -1766 667 2175 193 -2662 -1294 1796
3052 1796 2096 -719 -2024 -109 1889 1139 -717 -1241 -353 1324 1447 -64 -1873 -957 1649 1987 -1095
3069 -1095 -2904 -267 2592 1205 -1978 -1926 594 1730 521 -1313 -1306 -41 1587 1119 -960 -2337
3085 -2337 -47 2723 1355 -2171 -2302 1598 2783 -4 -2152 -982 1238 1641 101 -1444 -1364 259
3101 259 1900 567 -2130 -2370 1137 2852 10 -3141 -1235 2398 2079 -918 -2236 -311 1372 1275
3117 1275 -524 -1730 -883 1212 2292 178 -2740 -1009 2511 2446 -1585 -2830 302 2580 1074 -1842
3133 -1842 -1789 516 1666 833 -755 -1981 -769 1751 1808 -1264 -2737 51 3034 1107 -2365 -2028
3149 -2028 1704 2463 171 -1593 -881 785 1762 433 -1078 -2045 164 2512 950 -2284 -2204 1542
3165 1542 2868 -140 -2837 -960 1687 1295 -895 -1608 -641 964 1301 274 -1834 -1203 1275 2482
3181 2482 -268 -2676 -861 2596 1926 -1437 -2114 405 2065 764 -1316 -1271 50 1350 1027 -848
3197 -848 -2015 -683 1746 1584 -1673 -2387 296 2467 609 -2053 -1286 1005 1654 211 -1262 -1114
3213 -1114 246 1627 755 -1031 -2022 261 2249 694 -2134 -1742 1513 1978 -221 -1878 -621 999
3229 999 1164 -499 -1346 -780 690 1269 187 -1599 -797 1115 1799 -497 -2013 -421 1646 1097 -873
3246 -873 -1099 -45 1207 821 -677 -846 -138 1292 1291 -337 -1776 -240 1492 944 -1040 -1274 361
3263 361 1397 274 -1127 -722 248 1099 288 -727 -956 107 1406 659 -1146 -1039 568 1400 449
3280 449 -1277 -689 938 1112 -64 -947 -789 687 873 -150 -1000 -752 438 1037 -95 -1440 -803
3297 -803 859 1243 -264 -926 -85 922 613 -379 -903 76 925 681 -175 -854 -148 1058 720 -694
3315 -694 -847 276 826 547 -754 -949 249 865 -87 -1138 -758 172 549 387 -582 -893 319 810
3333 810 170 -371 -579 358 844 166 -696 -377 319 628 109 -534 -17 377 572 26 -229 -528 565 545
3353 545 -464 -850 -502 309 723 -493 -570 -150 141 515 -51 -569 -227 782 250 -143 -445 101 842
3372 842 477 -479 -290 110 645 282 -296 -454 240 420 291 -620 -667 -44 693 282 -611 -506 -89 466
3392 466 0 -504 -334 247 360 83 -302 -70 426 673 49 -638 -297 167 509 -94 -537 -270 181 489
3412 489 -273 -718 -559 202 326 -73 -666 -274 448 247 -228 -503 -115 383 85 -35 -503 -277 443 455
3432 455 -191 -387 7 468 373 -418 -579 -12 372 241 -428 -598 -54 518 420 -89 -287 91 545 163 -580
3453 -580 -490 193 663 36 -663 -155 117 736 354 -444 -442 131 883 299 -474 -308 495 732 254 -830 -164
3474 -164 318 637 239 -818 -272 68 688 36 -645 -475 315 783 47 -675 -437 756 754 -383 -909 165
3494 165 556 785 -31 -628 -391 512 557 -99 -769 -478 759 583 -328 -865 100 1084 353 -843 -684 -6
3514 -6 587 225 -439 -699 -320 769 552 -547 -1088 -103 1068 428 -844 -1065 457 1080 131 -992 -658
3533 -658 455 801 184 -677 -607 167 697 421 -855 -1282 303 962 -404 -1509 -605 948 715 -555
3551 -555 -871 -89 549 749 0 -594 -557 747 1291 -173 -1346 -485 1351 1129 -753 -1139 98 1168
3569 1168 251 -691 -921 285 800 389 -408 -1169 -319 959 988 -982 -1572 -111 1582 523 -1387 -943
3587 -943 716 920 181 -892 -568 276 903 395 -598 -970 165 1435 357 -1392 -1170 821 1383 -323
3605 -323 -1590 -427 916 896 -431 -1086 -439 535 814 94 -990 -1215 757 1470 -105 -1394 -452 1475
3623 1475 1304 -848 -1161 225 986 607 -492 -873 -157 754 936 -196 -1359 -277 1309 1063 -1170
3640 -1170 -1906 258 1561 323 -1345 -883 692 938 354 -427 -808 18 1216 1067 -728 -1459 435
3657 435 1723 401 -1591 -721 1247 1586 -251 -1389 -401 498 750 11 -875 -736 141 1338 174
3674 174 -1723 -748 1241 1701 -333 -1819 -495 1419 738 -633 -990 201 1020 770 -291 -788 -510
3691 -510 917 1058 -654 -1623 -148 1550 614 -1279 -1497 416 1466 17 -859 -855 236 875 473 -419
3709 -419 -977 174 1232 909 -937 -1497 289 1462 137 -1437 -696 771 1048 -166 -985 -355 321
3726 321 914 278 -542 -734 307 1004 121 -1273 -826 1011 1206 -927 -1402 68 553 644 -260 -740 -58
3745 -58 526 832 -306 -755 -343 872 882 -460 -1028 -99 1306 527 -569 -1045 331 842 106 -485 -755
3764 -755 41 423 242 -757 -840 54 1039 540 -866 -862 819 956 336 -842 -403 616 889 263 -523 -416
3784 -416 363 907 322 -915 -705 696 1090 -48 -748 -433 647 455 -95 -788 -300 862 317 -136
3802 -136 -457 -174 664 620 -280 -590 17 775 863 -358 -880 112 902 298 -362 -294 -38 735 299 -336 -604
3823 -604 26 613 203 -657 -854 124 943 41 -784 -667 361 479 262 -569 -310 215 483 173 -505 -359
3843 -359 434 510 -96 -385 -117 584 405 -146 -544 -239 627 490 13 -568 -218 372 300 -154 -572 -17 219
3864 219 226 -187 -569 -78 599 151 -233 -670 125 417 3 -288 -525 -78 397 -19 -249 -442 36 294 -64
3885 -64 -529 -215 -40 245 70 -256 -257 88 414 -96 -363 -371 284 211 77 -403 -324 223 373 -24 -407 -116
3907 -116 314 343 -49 -254 -97 270 352 -105 -509 22 199 207 -32 -261 -77 470 231 -110 -327 -76 276
3928 276 390 -211 -482 -81 323 454 -166 -363 -103 501 140 -93 -288 20 304 202 -312 -416 178 493
3948 493 -30 -299 -361 7 271 59 -511 -176 76 463 17 -325 -523 206 455 -2 -317 -452 182 442
3968 442 136 -408 -60 819 188 -248 -407 -402 -37 387 202 -696 -197 338 549 -174 -558 -381 234 172 -251
3989 -251 -676 -6 352 178 185 -401 -342 293 346 137 -585 -62 585 499 -430 -527 40 447 308 -309 -252 -99
4011 -99 284 101 -255 -560 -205 325 167 -633 -781 62 823 -63 -491 -536 183 821 -108 -244 -597 163 540
4032 540 459 -494 -522 143 611 244 -575 -436 377 890 -151 -900 -400 191 180 -208 -501 -90 -170 480 229
4053 229 -704 -477 551 731 -138 -869 -375 707 702 -469 -513 146 721 353 -196 -183 -9 610 481 -89
4073 -89 -901 -418 839 382 -775 -806 407 736 215 -643 -574 323 377 -67 -286 -655 -49 558 516 -446 -738
4094 -738 362 1202 76 -760 -434 507 876 143 -752 -160 515 482 -118 -611 -535 235 613 252 -833 -713
4114 -713 558 853 -489 -1076 -159 1030 602 -428 -444 -229 633 420 -48 -624 -187 598 924 -226 -964
4133 -964 -115 1276 437 -887 -960 261 820 36 -577 -550 148 485 458 -263 -678 -55 1032 512 -583
4152 -583 -817 624 1243 65 -882 -371 632 930 109 -698 -524 339 531 388 -533 -723 260 984 113
4171 113 -973 -496 903 1069 -486 -1076 -146 721 322 -395 -788 -561 -58 739 75 -796 -255 1066 1198
4190 1198 -273 -1132 207 1039 507 -677 -680 304 698 488 -273 -356 90 714 638 -430 -1163 -267 1233
4209 1233 367 -901 -971 347 1017 -6 -812 -165 616 661 -25 -403 -512 37 636 377 -693 -522 542
4228 542 754 -2 -1315 -297 511 417 -404 -857 -35 373 253 -167 -706 -521 336 773 -34 -823 -339 959
4248 959 391 -511 -775 193 981 386 -93 -562 118 562 639 -406 -653 -331 697 647 -531 -757 169 747
4268 747 309 -629 -663 297 581 21 -378 -421 241 710 80 -241 -421 -31 817 248 -731 -556 230 797 -87
4289 -87 -521 -282 532 342 -518 -621 -228 261 642 77 -644 -191 306 679 -173 -810 -19 660 535 -326
4309 -326 -819 134 523 367 -180 -340 -57 617 331 -321 -618 117 654 306 -246 -676 62 527 -59 -504
4329 -504 -344 289 457 -27 -449 -327 265 332 218 -468 -346 98 649 185 -205 -89 176 384 136 -342
4349 -342 -238 496 248 115 -405 -134 452 455 4 -425 26 373 282 -82 -483 -108 263 539 -487 -473 -52
4370 -52 362 179 -269 -276 -36 428 220 -165 -99 44 385 -130 -293 -595 317 408 96 -211 -575 23 407 -184
4392 -184 -654 -362 239 600 241 -368 -155 260 385 71 -254 -250 36 201 -75 -85 -56 334 159 151 -193 -274
4414 -274 309 486 64 -407 -119 16 382 61 -471 -86 101 429 -155 -596 -366 305 256 -115 -292 53
4434 53 286 395 -246 -52 -51 382 197 -127 -151 8 424 148 -168 -192 120 325 190 -29 -403 28 402 45
4456 45 -107 -470 -50 261 8 -259 -338 111 257 100 -307 70 -35 667 -27 -191 -275 187 573 -44 -373
4477 -373 -223 307 306 -49 -194 -165 225 345 100 -119 -13 315 296 -297 -621 -105 234 189 -92 -477 -150 715
4499 715 103 -54 -385 82 322 355 -124 -347 -139 379 513 -222 -404 -251 379 124 -404 -318 58 549 113
4520 113 -442 -190 115 195 136 -228 -317 -210 423 266 -313 -295 177 613 304 -432 -180 375 402 -46 -133 -223
4542 -223 104 292 -27 -240 -609 124 469 80 -317 -290 385 564 -279 -490 -52 258 210 -243 -204 -15 12
4563 12 509 110 -516 -172 531 518 -11 -570 2 726 336 -218 -627 -104 386 59 -393 -260 -93 184 478
4584 478 -188 -628 -387 444 502 -593 -481 123 741 257 -481 -160 321 380 195 -247 -390 156 585 452
4604 452 -310 -751 -209 665 8 -930 -743 570 303 -491 -498 -334 393 130 217 -405 -325 114 634 149 -524
4625 -524 -650 468 552 -367 -570 142 699 184 -578 -508 90 306 325 2 -246 -499 297 571 -219 -602 -343
4646 -343 649 579 -725 -836 266 793 -3 -394 -384 182 287 358 -80 -680 29 438 446 -608 -417 446 819
4667 819 82 -690 -765 240 382 -274 -694 135 189 506 -30 -471 -491 188 585 -38 -521 -545 410 719 -393
4688 -393 -799 65 553 176 -386 -319 267 355 446 -26 -604 -157 505 645 -310 -550 -256 677 231 -742 -496
4709 -496 179 706 -25 -564 -543 46 323 185 -436 -649 172 653 229 -688 -476 427 684 -107 -451 -48
4729 -48 440 451 -275 -286 -394 386 346 45 -541 -419 221 444 -156 -811 -174 452 544 49 -431 170 306 401
4751 401 -61 -161 -309 336 516 -27 -665 -357 497 456 -255 -730 -165 603 165 -481 -503 83 379 -87 -286
4772 -286 -579 -213 237 202 -241 -587 87 681 228 -663 -341 407 231 -121 -725 -228 162 190 93 -79 -523
4793 -523 199 547 123 -540 -195 319 283 -79 -751 -294 504 651 141 -284 41 476 369 -167 -246 -92 481
4814 481 526 67 -700 -41 717 557 -287 -384 101 355 154 -337 -347 109 312 197 -175 -479 244 438 374
4835 374 -399 -394 107 390 165 -200 -94 218 234 -25 -110 -134 -72 448 170 -356 -337 117 216 139 -538 -137 431
4858 431 348 -115 -241 -123 107 178 -3 -273 -117 236 257 174 -251 -160 413 260 -322 -291 -73 342 305 -52
4880 -52 -418 1 234 183 35 -103 -76 395 152 -440 -347 -78 440 218 -137 -422 77 467 -62 -416 -241
4901 -241 -86 424 164 -196 -202 -16 514 -216 -383 -188 251 329 -180 -227 -164 363 282 195 -254 -132 4 147
4923 147 -101 -406 -334 127 362 -345 -360 -471 294 62 -45 -301 -255 239 389 69 -407 157 199 331 29
4944 29 -192 94 163 133 -91 -259 12 152 102 -392 -408 28 156 14 -258 -389 15 29 6 -235 -438 195
4966 195 598 -11 -237 -213 348 294 160 81 -48 137 692 132 -397 -114 86 292 250 -133 -133 332 211 -43
4988 -43 -132 -433 42 33 -61 -331 -159 222 132 -200 -194 -114 246 60 -38 -150 -59 171 59 71 -258 -103 263 456
5012 456 -12 -217 69 135 -5 -296 -148 -153 281 190 -90 -518 -222 225 117 -397 -278 191 316 -15 -252
5033 -252 46 215 363 120 -69 -244 144 298 202 -1 -278 220 414 321 -432 -123 414 103 -190 -375 -206
5054 -206 128 -51 -21 -154 -284 105 180 -34 -224 -21 463 350 73 -334 264 354 458 -204 -477 -1 147
5075 147 175 40 -327 -103 50 48 -191 -571 5 478 206 -421 -428 152 309 -84 -301 -157 20 121 145 140 -168
5098 -168 -235 679 380 -165 -369 201 330 -24 -481 -187 276 417 -59 -492 -162 35 225 -8 -106 -414 -132
5119 -132 348 42 -349 -55 449 344 -263 -366 206 301 203 39 -38 -144 285 94 -128 -329 -205 270 431
5140 431 -362 -547 8 488 287 -635 -299 42 340 -137 -188 -325 -78 35 113 -1 -326 230 606 269 -421
5161 -421 -371 216 574 122 -527 -128 159 182 -61 -350 -325 233 106 130 -295 -317 185 561 86 -435 -493 462
5183 462 280 -160 -338 -193 441 358 195 -71 -45 140 628 34 -446 -291 637 501 -250 -846 -296 280 112
5204 112 -265 -332 -39 322 -95 -66 -155 -212 423 494 -311 -515 -307 631 194 -517 -340 227 377 -71 -466 88
5226 88 263 257 240 -144 -445 -72 542 287 -234 -446 78 574 -60 -420 -257 236 206 50 -278 -105 88 259
5248 259 155 -257 -345 111 638 -33 -663 -101 219 196 -102 -146 -63 643 337 -246 -296 -146 153 380 75 -354
5270 -354 -467 529 393 -295 -427 -242 432 166 -407 -242 183 355 221 127 -244 -91 573 401 -7 -328
5290 -328 120 331 -15 -390 -248 350 572 -18 -227 26 133 281 -64 -379 -252 267 308 95 -120 -480
5310 -480 369 435 -270 -389 105 226 303 8 -198 -32 315 445 -20 -76 -156 224 240 -180 -460 -274 207 180
5332 180 -279 -629 183 275 -142 -141 -240 167 408 283 -198 -372 -24 620 379 -141 -487 154 209 288 -61 -355
5354 -355 255 460 160 -247 -166 154 282 211 -316 -195 98 312 -180 -277 -80 175 399 47 -297 -169 -50
5375 -50 13 94 -229 -170 123 403 256 -353 -155 195 157 -190 -189 -29 687 149 53 -247 -87 289 43 -176 -232
5398 -232 -172 88 -4 -386 -176 -19 168 331 -56 -359 84 257 205 -53 -235 -294 228 -45 -233 -126 25
5419 25 537 -164 -302 -300 162 419 -27 -160 -451 -251 179 -235 -106 -336 135 209 30 -150 12 303 56
5440 56 -23 -21 -145 126 331 -36 -155 -221 154 89 50 -592 -86 269 84 -82 -103 -51 252 -176 -84 -98 6 194
5464 194 17 -113 -299 -49 218 57 -67 -251 28 199 112 -404 -158 160 293 233 -232 -143 -61 345 38
5485 38 -197 12 49 86 -144 -175 -123 174 26 -442 -178 -106 386 195 55 -174 6 84 293 111 -198 96
5507 96 288 152 41 -247 -251 58 200 -64 -100 139 453 139 -201 -374 90 97 161 -319 -284 -6 276 -50 -233
5530 -233 -311 -17 -28 285 -101 -255 14 124 244 -270 -55 240 268 96 52 -366 72 109 85 69 -500 -53
5552 -53 257 50 -80 -135 37 175 33 -221 -45 183 190 18 -264 -30 206 272 -38 15 109 294 175 -23
5574 -23 -398 -108 119 321 -74 -101 -157 356 57 -210 -273 149 273 -39 -256 -243 -208 52 129 -148 -33 75
5596 75 509 184 -208 -415 139 223 195 -109 -10 -2 120 138 -209 -520 43 52 95 -248 -149 -44 405 296 -297 -98
5620 -98 258 76 -164 -102 -205 396 -150 249 7 -172 156 182 16 -170 -162 32 212 148 -192 -115 181 205 -150
5643 -150 -177 -15 -20 -108 167 -213 -345 245 66 -303 -333 101 218 112 -105 -94 -58 220 138 -265 -154 80 268
5666 268 201 -72 -325 24 151 274 -444 -218 109 180 -142 -287 -148 136 315 -146 -231 -92 211 37 18
5687 18 -45 -196 100 304 54 -280 -86 283 403 -36 -164 -83 362 257 158 -81 -88 -94 120 136 -431 -396 141
5710 141 143 49 -321 -240 250 316 -67 -294 -256 106 -259 -126 -287 -191 180 144 -80 -331 -180 252 233 -176 -530
5733 -530 361 372 199 -12 -169 -230 96 -110 -168 -341 7 325 149 -114 -384 261 378 -52 -301 -179 316
5754 316 253 -171 -93 -180 224 253 107 -103 -78 -83 8 -3 -356 -228 190 63 38 -145 97 229 -35 -234 -338
5777 -338 106 40 -129 -69 -13 -266 206 233 -275 -269 82 269 21 -48 -314 239 184 205 254 -295 69 254 44
5800 44 -124 -335 70 152 55 -263 -176 207 356 -3 -191 -88 160 -74 213 -140 106 368 115 -92 -183 -65
5822 -65 4 195 127 -75 -90 311 333 -5 -51 -108 12 218 -124 -12 -186 171 420 43 -212 -197 215 44 -94
5845 -94 -299 -109 142 58 -4 37 86 22 236 71 -61 -23 277 273 -8 -59 118 158 -186 -46 -548 203 85 39
5869 39 -105 -60 -39 260 -180 -161 -1 218 -31 -34 -146 -215 -109 225 -79 -75 7 235 -49 -169 1 -195 340
5892 340 -35 -44 -164 56 149 57 27 -331 65 178 0 -233 -311 10 230 194 -69 -45 116 132 2 -130 -160
5915 -160 105 51 433 -43 -218 73 -16 153 -113 -114 -68 -14 32 -221 -28 26 203 -177 -283 -332 -124 285 171
5938 171 -204 -190 -26 238 115 -191 26 207 235 14 11 116 165 155 -8 -36 107 58 19 -44 -41 -120 164 84 -165
5963 -165 -296 -254 157 39 -309 -215 -142 194 -105 -83 -478 196 93 -35 -1 -290 121 116 -57 -149 -41 328 165
5986 165 39 -255 -102 84 62 -83 43 -94 78 47 17 24 27 6 189 292 -434 -161 281 255 6 -153 32
6009 32 -26 165 39 -189 -233 -139 72 82 -225 189 -26 -58 -38 -399 -159 187 100 -300 78 100 145 -32 -151
6032 -151 -107 -27 148 162 -330 -71 221 51 167 -259 -69 143 -29 85 -95 -432 140 144 -52 -158 -190 174
6054 174 70 -59 -175 -169 288 259 146 -3 179 134 -53 -121 -23 -179 19 178 96 -179 -93 223 221 -42 -346
6077 -346 244 108 -243 -46 -31 -239 -110 309 -169 -140 -269 54 165 -215 -242 84 302 143 61 -180 84
6098 84 23 127 53 -129 -188 18 162 1 -185 77 8 198 -266 -181 0 -5 -68 -336 36 88 203 -28 -140
6121 -140 -101 103 16 118 -102 -279 30 77 -86 -137 -123 201 309 -104 -30 152 99 -57 100 -169 33 8 -9
6144 -9 91 -157 -331 132 128 -183 -177 68 121 209 -152 -233 -4 136 143 -105 -132 -225 251 141 -302 -82 -5 122 98
6169 98 -351 -219 -44 4 127 -148 -282 138 159 115 -19 -16 -69 187 234 -131 -216 54 -19 -28 -160 -91 186 112 -16
6194 -16 -309 -62 235 -20 -2 -26 -140 105 247 55 8 -298 35 236 -49 -294 91 212 -16 -204 -280 95
6216 95 221 343 67 140 -110 -66 -28 -43 -37 120 286 13 -23 -173 143 190 -50 -199 87 160 14 34 30 -21 -9
6241 -9 137 15 -169 -445 193 182 78 -109 54 217 39 110 61 -104 59 276 191 -68 -166 226 109 33 -234
6264 -234 -112 273 77 -87 -356 -58 256 4 -89 -190 16 -23 213 -45 -250 -275 -111 51 -113 -9 -9 228
6286 228 205 -46 -107 -11 -17 198 273 28 -193 177 241 -22 -243 -228 98 17 -40 -309 140 153 39 -270 -64 123
6310 123 95 113 -69 -214 67 117 -10 -209 -326 254 -58 -192 -126 -173 70 37 206 106 -185 107 274 190
6332 190 -154 -20 282 94 -213 -238 -258 5 63 95 -339 -62 129 -116 43 -177 -238 29 100 -109 -244 -164
6354 -164 137 59 -17 -218 137 470 75 -127 -201 186 161 2 -82 -320 131 126 -57 44 -23 -129 200 -119 98
6377 98 -167 96 128 -183 110 -180 147 -71 -63 -189 26 168 439 -166 -180 -272 329 209 -263 -69 -122 101
6399 101 2 106 -92 -227 236 -2 -85 -248 6 157 89 -7 -323 -1 175 44 -63 -93 -163 172 133 1
6421 1 -269 45 192 65 2 -56 -217 -78 -63 159 -18 -190 68 -54 1 -173 290 236 -113 -381 -101 3
6443 3 -1 -188 -252 -78 129 155 -156 -25 171 378 -37 -38 -122 -145 113 292 45 -63 0 -128 -46 -85 -165 -24 104
6468 104 302 -51 -351 -295 95 296 50 -62 -59 206 297 29 -136 35 199 114 23 18 224 364 71 -63 0
6491 0 215 80 -28 -97 -143 -162 133 57 -139 -32 24 40 -43 111 -116 266 135 -167 -170 -217 172 99 42 -234 18
6516 18 210 185 122 -145 -194 245 103 -115 -105 -203 80 190 -24 -128 129 208 140 -125 64 -51 213 403 -254
6539 -254 43 126 -173 14 -16 214 -28 132 24 -111 66 -76 217 0 -65 -58 51 115 -148 150 -273 -61
6561 -61 22 216 80 -137 171 92 163 -155 -15 251 96 -64 -133 223 85 29 182 -95 -129 121 226 -149
6583 -149 -5 -79 71 69 202 -121 217 252 183 -7 -213 143 202 -157 -112 -87 -206 131 29 51 40 -123 203
6606 203 218 -47 -156 115 192 185 83 -322 -23 221 16 -69 -200 -116 -105 161 20 -73 60 177 212 -174 28
6629 28 48 64 118 34 33 13 19 -113 -20 -18 28 170 -36 -57 -20 44 68 5 -238 -6 126 -44 -255 -109 -117 -30 243
6656 243 149 -30 -188 -84 59 -26 -281 50 111 -14 83 -123 161 70 318 -44 -26 -152 3 252 149 -88
6678 -88 -7 238 -240 -89 -215 -1 141 -36 -195 2 90 83 -9 -136 -95 -130 94 -53 0 -116 276 171 67
6701 67 -35 -44 171 54 12 60 -13 156 -2 -215 -65 -11 -86 -72 -243 -42 -77 73 34 -104 -102 1 28 -229 -116
6726 -116 57 126 8 133 -85 125 11 -62 123 123 -30 49 -76 -84 91 53 46 233 155 -51 -75 -34 -103 -263 -172
6751 -172 -100 -58 154 -80 -20 154 -38 192 5 -145 52 59 -4 -118 -33 -72 -167 -135 -84 -202 -197 -22 3 97 -201
6776 -201 -116 51 92 -259 -158 19 -181 -129 -290 -202 -139 174 -86 -153 -96 103 233 278 156 -220 26 -26 30
6799 30 81 20 -45 204 -28 -33 -149 92 83 -15 -206 -141 13 82 185 -21 -42 32 -126 141 -102 36 -115 -51 23
6824 23 -92 50 5 61 30 -64 -193 -52 -57 -66 31 108 54 145 -194 -343 265 -118 156 28 -101 24 6 50 -62
6849 -62 -75 -39 5 240 -52 -39 -29 -47 77 -143 55 143 -4 -273 -136 -39 -183 18 55 -33 -70 134 24 84
6873 84 -170 2 168 102 -136 -136 -230 46 296 -7 -279 -217 -83 162 -281 149 -123 -91 -23 -75 -76 45 87 72
6897 72 31 18 56 161 50 -57 -217 -112 91 178 26 -159 122 -171 59 148 -120 -92 146 -138 -142 -56 18 12
6921 12 176 92 -55 147 -76 -107 -215 -269 131 196 84 -232 -197 -65 21 40 -187 -385 194 77 -119 -234 -104
6944 -104 24 -50 -75 -130 -190 86 240 66 -268 -60 286 90 -41 -33 -152 213 328 65 -177 -252 22 -38 -183
6967 -183 -140 -84 129 134 -144 -279 -180 125 125 45 -57 59 83 -152 231 -66 24 151 304 245 -143 -115 56 -171
6991 -171 -228 189 -20 138 180 55 62 -77 146 -65 -62 -432 64 34 127 -236 18 65 41 98 -10 -111 63 229
7015 229 -116 25 -60 3 77 -134 -153 -125 95 -1 -142 76 -201 79 66 78 94 -150 181 0 94 237 -67
7038 -67 -32 13 18 -171 2 -61 -62 86 -83 -34 165 51 12 -355 67 -246 -56 -110 -122 -7 243 -272 -243 -57
7062 -57 -58 1 4 -107 -209 125 89 -151 40 -17 81 -39 125 232 -95 -22 -9 -139 161 27 71 309 169 -1
7086 -1 107 89 67 27 12 38 -125 -283 -11 -104 -157 81 164 -9 -147 -296 60 69 85 57 -110 -78 114 -168 -30
7111 -30 -127 94 -53 -242 39 -16 182 69 -134 141 70 258 -266 -237 -124 29 302 156 5 -90 40 50
7133 50 72 -173 80 3 -21 -67 -99 -127 131 -66 -95 -150 -44 173 10 33 52 -83 -61 70 3 60 -183 -28 117
7158 117 -40 -111 114 -246 -75 325 -80 3 165 -216 42 70 -84 11 68 58 -1 10 62 -119 -277 -286 -65 184
7182 184 -81 -130 66 65 105 156 -180 -17 -59 116 162 -18 -89 -239 -18 -117 52 153 67 91 68 -143 -111 -24 341
7207 341 123 -152 -77 144 -27 -5 -83 -22 158 194 175 57 229 -80 44 228 -58 124 183 221 168 -48 -39 -27
7231 -27 -100 137 -15 -279 149 161 -125 24 -135 85 190 -23 -132 59 282 4 76 -121 -56 149 28 110
7253 110 -34 -182 245 -106 56 170 184 42 113 -256 254 53 86 33 -97 -181 7 171 25 69 -202 -110
7275 -110 -44 49 82 45 -115 95 -136 -55 -39 -107 44 16 -70 -232 172 95 127 -106 18 -143 -200 52 -158 -212
7299 -212 -12 -219 -107 -136 -63 -21 0 -40 -16 -287 -66 19 -84 -52 -112 139 -157 -17 -75 -99 165 -165 106 -190
7323 -190 374 148 127 96 -50 -90 10 -201 -24 16 72 162 -121 -129 -110 106 20 37 -235 -83 2 -40 -48 183 -39
7348 -39 -186 142 38 -246 154 -162 -12 107 -100 104 -37 240 -132 -73 -65 74 -84 -25 46 -122 -161 -28
7370 -28 73 54 74 -61 -87 -11 30 -93 -4 32 62 -400 243 -35 -97 107 -216 -24 62 212 188 -9 62 29 313
7395 313 88 -81 52 59 -118 -111 -51 224 202 30 40 -138 -260 73 60 -204 -73 120 32 -82 -14 -196 -2
7418 -2 205 -138 -41 -31 -16 -116 -96 -28 -18 71 40 -117 -108 166 120 48 308 -185 113 -125 -71 65 -166 39 23
7443 23 151 -37 47 120 110 -121 -250 141 24 129 -90 170 31 -4 151 33 -64 116 -94 54 30 -149
7465 -149 -67 -237 -12 22 -109 -9 186 -112 -89 -144 86 72 -237 296 -16 235 -126 -43 377 103 50 -141
7487 -141 385 77 -72 -402 8 141 -199 92 -20 -42 -78 -152 -105 177 -30 -164 113 -56 -218 -110 -214
7508 -214 -92 -374 -147 -203 -43 -135 -9 48 141 84 -38 -124 50 -7 97 -389 -329 116 -89 -282 60 156 195
7531 195 -14 -78 125 -19 -178 -103 223 -18 -7 113 196 125 -81 -150 180 0 181 -93 -231 35 -81 -11
7553 -11 245 82 234 192 64 -54 -6 26 -142 -155 -19 -105 245 -48 -3 -37 25 -185 141 225 -308 -22 8 -179
7577 -179 146 -91 2 98 -41 223 -73 136 228 46 13 26 215 71 116 -75 34 -201 61 91 -43 0 162
7600 162 -181 -68 -174 150 203 -45 -84 -119 -114 112 333 14 220 -133 28 -35 -127 4 118 19 -29 -19 53 40
7624 40 216 181 238 -65 -307 160 337 71 96 -15 -17 38 -58 -163 -157 244 228 301 -190 -45 -8 44 -138 -131 54
7649 54 -24 20 -168 -41 -7 -26 -176 -37 -46 64 -146 -186 -38 -97 161 180 -152 -85 29 -84 -42 80 -129 94
7673 94 -106 -116 7 -85 18 -24 -13 -81 -12 -102 -118 148 -52 -60 30 12 201 5 54 102 -8 39 -179 -31 30 -48
7699 -48 26 -107 81 169 -50 -28 50 -28 300 -39 57 14 98 54 -9 -132 -3 125 70 -52 -215 -30 -68 -53 40
7724 40 -122 -128 -106 -9 94 51 79 45 -140 -26 -24 -56 -9 53 187 -139 -127 17 12 16 29 -52 141 39 -176 69 -238
7751 -238 -82 115 147 25 -382 -24 -12 81 -174 -167 43 -403 -83 -57 -45 47 76 -19 -91 -233 54 -29 42 38 -126
7776 -126 38 227 158 120 -171 -13 88 -9 -146 -47 -135 -3 22 10 -107 69 114 21 -88 -357 66 -155 69
7799 69 -160 54 39 165 -115 -1 -58 -113 172 -279 177 -44 -54 271 92 -52 -202 -31 -55 -51 -131 91 238
7822 238 -93 177 -4 -85 172 222 27 -90 -37 65 -181 78 70 -16 130 103 -104 -110 -95 265 52 -93 -148 140
7846 140 6 36 -127 -28 -133 -277 -201 -5 271 300 -63 -11 83 94 87 298 199 -202 -154 38 -279 209 -83 -65
7870 -65 -61 34 167 -61 -104 205 114 -88 105 142 196 -169 59 221 192 150 212 -39 -4 -32 -220 -26 -35 145 -332
7895 -332 5 108 -27 87 -231 -123 -7 -351 -29 86 113 -23 -58 -181 -108 92 -13 185 106 2 -35 -263
7917 -263 -197 -33 9 -2 -36 180 -92 89 -22 -21 177 60 56 215 81 14 -46 -26 -9 -153 -188 200 -96 -176 -213
7942 -213 58 45 26 18 29 -82 45 36 -127 -114 -135 151 -173 -102 -72 -133 66 -130 -29 109 127 -167 -48 178
7966 178 24 -283 146 308 -99 -63 228 38 -239 -41 2 93 163 204 89 250 -55 6 209 -23 20 -146
7988 -146 -28 -6 360 57 97 -104 74 47 -134 -8 -111 145 -166 32 -56 162 -110 -119 -52 -14 39 -48 -43 170
8012 170 6 92 82 105 46 -123 134 -111 -175 58 175 50 89 295 47 39 -78 4 73 -233 150 179 150 87
8036 87 -210 62 -39 51 -48 149 -31 244 164 -141 -105 -8 -170 -422 93 -31 57 -32 65 110 67 -96 60 99
8060 99 -216 -156 119 224 -74 -164 89 -81 -14 -141 -120 43 -57 -156 169 64 223 1 23 -63 -200 288 18
8083 18 21 200 182 174 117 141 -185 65 128 -102 -68 -311 106 53 -86 118 39 112 -199 -54 -35 9 32 -125 -68 89
8109 89 -106 -20 176 148 296 110 88 -29 6 -37 85 -5 -45 -53 -50 -214 180 75 8 -248 40 -91 -182 -60 169
8134 169 138 -136 -115 -6 138 -95 58 -180 -49 242 -23 126 -191 -17 0 -88 -9 110 202 -102 13 214
8156 214 -44 2 -253 70 21 202 273 -106 101 153 156 -157 -115 69 9 53 75 48 108 95 -76 -231 -306 -58 -149
8181 -149 24 -211 78 137 -134 71 -14 -306 -288 -106
8191a06
##END NTUPLES=NMR FID
##END=
