##TITLE=1H_Pr Q-17-2
 CDCl3
 8 sc, 
 17.02.2022
##JCAMPDX= 6.0         $$ Bruker NMR JCAMP-DX V2.0
##DATA TYPE= NMR FID
##DATA CLASS= NTUPLES
##ORIGIN= UXNMR, Bruker Analytische Messtechnik GmbH
##OWNER= root
$$ XWIN-NMR		Version 3.5
$$ Thu Feb 17 12:52:09 2022 Russian Standard Time (UT+4h)  she@DPX200
##.OBSERVE FREQUENCY= 200.131346
##.OBSERVE NUCLEUS= ^1H
##.DELAY= (6, 6)
##.ACQUISITION MODE= SIMULTANEOUS
##.ACQUISITION SCHEME= undefined
##.AVERAGES= 8
##.DIGITISER RES= 18
##SPECTROMETER/DATA SYSTEM= spect
##.PULSE SEQUENCE= zg30
##.SOLVENT NAME= D2O
##.SHIFT REFERENCE= (INTERNAL, D2O, 0, 15.7039)
##AUDIT TRAIL= $$ (NUMBER, WHEN, WHO, WHERE, WHAT)
$$ ##TITLE= Audit trail, XWIN-NMR		Version 3.5
$$ ##JCAMPDX= 5.01
$$ ##ORIGIN= Bruker BioSpin GmbH
$$ ##OWNER= she
$$ F:/spectra/data/she/nmr/H-F/1/audita.txt
$$ ##AUDIT TRAIL=  $$ (NUMBER, WHEN, WHO, WHERE, WHAT)
(   1,<2022-02-17 12:50:59.64 +0400>,<she>,<DPX200>,
      <created by zg, POWCHK disabled, PULCHK disabled
       configuration hash MD5:
       00 E9 B6 7A A2 85 ED C7 34 08 36 98 17 FE 4E 26
       data hash MD5: 16K
       16 D0 7E 88 97 44 A4 79 9D 4D 19 C7 BC 0B CD BE>)
$$ ##END=
$$ 
$$ hash MD5
$$ CD CE 8A 1A 7A 03 37 AB 9B 26 0F 8E 57 43 E5 68
##$RELAX= 
##$RELAX= 
##$RELAX= 
##$RELAX= 
##$RELAX= 
##$RELAX= 
$$ Bruker specific parameters
$$ --------------------------
##$DU= <F:/spectra>
##$EXPNO= 1
##$NAME= <H-F>
##$PROCNO= 1
##$TYPE= <nmr>
##$USER= <she>
##$AMP= (0..31)
100 100 100 100 100 100 100 100 100 100 100 100 100 100 100 100 100 100 
100 100 100 100 100 100 100 100 100 100 100 100 100 100 
##$AQSEQ= 0
##$AQ_mod= 1
##$AUNM= <au_zg>
##$AUTOPOS= <>
##$BF1= 200.13
##$BF2= 200.13
##$BF3= 200.13
##$BF4= 200.13
##$BF5= 200.13
##$BF6= 200.13
##$BF7= 200.13
##$BF8= 200.13
##$BYTORDA= 1
##$CFDGTYP= 0
##$CFRGTYP= 5
##$CHEMSTR= <none>
##$CNST= (0..31)
1 1 145 1 1 1 1 1 1 1 1 1 1 1 1 1 1 1 1 1 1 1 1 1 1 1 1 1 1 1 1 1 
##$CPDPRG= <>
##$CPDPRG1= <>
##$CPDPRG2= <>
##$CPDPRG3= <>
##$CPDPRG4= <mlev>
##$CPDPRG5= <mlev>
##$CPDPRG6= <mlev>
##$CPDPRG7= <mlev>
##$CPDPRG8= <mlev>
##$CPDPRGB= <>
##$CPDPRGT= <>
##$D= (0..31)
0 1.2 0 0 0 0 0 0 0 0.06 0 0.03 0 0 0 0 0.0002 0 0 0 0 0 0 0 0 0 0 0 0 
0 0 0 
##$DATE= 1645087859
##$DBL= (0..7)
120 120 120 120 120 120 120 120 
##$DBP= (0..7)
150 150 150 150 150 150 150 150 
##$DBP07= 0
##$DBPNAM0= <>
##$DBPNAM1= <>
##$DBPNAM2= <>
##$DBPNAM3= <>
##$DBPNAM4= <>
##$DBPNAM5= <>
##$DBPNAM6= <>
##$DBPNAM7= <>
##$DBPOAL= (0..7)
0.5 0.5 0.5 0.5 0.5 0.5 0.5 0.5 
##$DBPOFFS= (0..7)
0 0 0 0 0 0 0 0 
##$DE= 6
##$DECBNUC= <off>
##$DECIM= 32
##$DECNUC= <off>
##$DECSTAT= 4
##$DIGMOD= 1
##$DIGTYP= 9
##$DL= (0..7)
0 120 120 120 120 120 120 120 
##$DP= (0..7)
150 150 150 150 150 150 150 150 
##$DP07= 0
##$DPNAME0= <>
##$DPNAME1= <>
##$DPNAME2= <>
##$DPNAME3= <>
##$DPNAME4= <>
##$DPNAME5= <>
##$DPNAME6= <>
##$DPNAME7= <>
##$DPOAL= (0..7)
0.5 0.5 0.5 0.5 0.5 0.5 0.5 0.5 
##$DPOFFS= (0..7)
0 0 0 0 0 0 0 0 
##$DQDMODE= 0
##$DR= 18
##$DS= 0
##$DSLIST= <SSSSSSSSSSSSSSS>
$$ [...]
##$SUBNAM2= <"">
##$SUBNAM3= <"">
##$SUBNAM4= <"">
##$SUBNAM5= <"">
##$SUBNAM6= <"">
##$SUBNAM7= <"">
##$SUBNAM8= <"">
##$SUBNAM9= <"">
##$SW= 18.0517287032376
##$SWIBOX= (0..15)
0 0 2 0 0 0 0 0 0 0 0 0 0 0 0 0 
##$SW_h= 3612.71676300578
##$TD= 16384
##$TD0= 1
##$TE= 0
##$TE2= 300
##$TE3= 300
##$TEG= 300
##$TL= (0..7)
0 120 120 120 120 120 120 120 
##$TP= (0..7)
150 150 150 150 150 150 150 150 
##$TP07= 0
##$TPNAME0= <>
##$TPNAME1= <>
##$TPNAME2= <>
##$TPNAME3= <>
##$TPNAME4= <>
##$TPNAME5= <>
##$TPNAME6= <>
##$TPNAME7= <>
##$TPOAL= (0..7)
0.5 0.5 0.5 0.5 0.5 0.5 0.5 0.5 
##$TPOFFS= (0..7)
0 0 0 0 0 0 0 0 
##$TUNHIN= 0
##$TUNHOUT= 0
##$TUNXOUT= 0
##$USERA1= <user>
##$USERA2= <user>
##$USERA3= <user>
##$USERA4= <user>
##$USERA5= <user>
##$V9= 5
##$VALIST= <valist>
##$VCLIST= <CCCCCCCCCCCCCCC>
##$VD= 0
##$VDLIST= <DDDDDDDDDDDDDDD>
##$VPLIST= <PPPPPPPPPPPPPPP>
##$VTLIST= <TTTTTTTTTTTTTTT>
##$WBST= 1024
##$WBSW= 4
##$XGAIN= (0..3)
0 0 0 0 
##$XL= 0
##$YL= 0
##$YMAX_a= 170120
##$YMIN_a= -184041
##$ZGOPTNS= <>
##$ZL1= 120
##$ZL2= 120
##$ZL3= 120
##$ZL4= 120
##$ABSF1= 10
##$ABSF2= 0
##$ABSG= 5
##$ABSL= 3
##$ALPHA= 0
##$AQORDER= 0
##$ASSFAC= 0
##$ASSFACI= 0
##$ASSFACX= 0
##$ASSWID= 0
##$AUNMP= <proc_1d>
##$AZFE= 0.1
##$AZFW= 0.1
##$BCFW= 1
##$BC_mod= 2
##$BYTORDP= 1
##$COROFFS= 0
##$CY= 11.3945322036743
##$DATMOD= 1
##$DC= 2
##$DFILT= <>
##$DTYPP= 0
##$F1P= 2.36226072786647
##$F2P= -0.459571619588291
##$FCOR= 0.5
##$FTSIZE= 0
##$FT_mod= 4
##$GAMMA= 1
##$GB= 0.15
##$INTBC= 1
##$INTSCL= 1
##$ISEN= 128
##$LB= 0.24
##$LEV0= 0
##$LPBIN= 0
##$MAXI= 10000
##$MC2= 0
##$MEAN= 0
##$ME_mod= 0
##$MI= 1.114404
##$NCOEF= 0
##$NC_proc= 0
##$NLEV= 6
##$NOISF1= 3.799351
##$NOISF2= 2.8
##$NSP= 1
##$NTH_PI= 0
##$NZP= 0
##$OFFSET= 15.70392
##$PC= 1
##$PHC0= -16231.33
##$PHC1= 14.20078
##$PH_mod= 1
##$PKNL= yes
##$PPARMOD= 0
##$PSCAL= 0
##$PSIGN= 0
##$REVERSE= no
##$SF= 200.130013532006
##$SI= 16384
##$SIGF1= 3
##$SIGF2= 2
##$SINO= 400
##$SIOLD= 16384
##$SREGLST= <1H.CDCl3>
##$SSB= 0
##$STSI= 0
##$STSR= 0
##$SW_p= 3612.71676300578
##$SYMM= 0
##$S_DEV= 0
##$TDeff= 0
##$TDoff= 0
##$TI= <>
##$TILT= no
##$TM1= 0
##$TM2= 0
##$TOPLEV= 0
##$USERP1= <user>
##$USERP2= <user>
##$USERP3= <user>
##$USERP4= <user>
##$USERP5= <user>
##$WDW= 1
##$XDIM= 8192
##$YMAX_p= 0
##$YMIN_p= 0
$$ End of Bruker specific parameters
$$ ---------------------------------
##NTUPLES= NMR FID
##VAR_NAME=  TIME,          FID/REAL,        FID/IMAG
##SYMBOL=    X,             R,               I
##VAR_TYPE=  INDEPENDENT,   DEPENDENT,       DEPENDENT
##VAR_FORM=  AFFN,          ASDF,            ASDF
##VAR_DIM=   8192,          8192,            8192
##UNITS=     SECONDS,       ARBITRARY UNITS, ARBITRARY UNITS
##FACTOR=    0.0002768,     1,               1
##FIRST=     0,             0,               0
##LAST=      2.2672688,     0,               0
##MIN=       0,             -184041,         0
##MAX=       2.2672688,     170120,          0
$$ Real data points
##PAGE= N=1
##DATA TABLE= (X++(R..R)), XYDATA
0 0 0 0 0 0 0 0 0 0 0 0 0 0 0 8 -8 8 -8 8 -16 16 -16 24 -25 32 -36 41 -49 57 -65 73 -88 97 -113 129 -145
35 -145 161 -181 204 -228 254 -284 313 -349 386 -427 472 -520 574 -631 697 -768 845 -933 1029
54 1029 -1136 1258 -1397 1556 -1740 1957 -2220 2538 -2942 3468 -4186 5231 -6897 9985 -17669
69 -17669 82028 55432 -146439 -133858 8406 159919 123881 -31428 -149200 -89376 57821
80 57821 140698 63113 -71995 -131530 -50870 72949 114562 30414 -81086 -111460 -26957 80187
92 80187 101318 11610 -90045 -96873 3774 100731 91732 -16264 -104814 -74406 43387 114885
104 114885 62833 -55358 -107850 -37417 75466 103903 17657 -84617 -90587 -618 83295
115 83295 71789 -19433 -87125 -59629 26077 75048 39867 -37886 -73864 -31638 40585 66896
127 66896 22610 -41820 -57851 -12482 46223 57081 9424 -42962 -43791 4004 48058 41891 -7575
140 -7575 -46152 -33719 14201 44970 25935 -20821 -45343 -23961 19631 37468 11889 -27255
152 -27255 -38370 -10668 25157 31417 3009 -28225 -27683 2685 28225 23961 -3247 -23379 -14281
165 -14281 11918 24603 12418 -8230 -16173 -5266 10019 13210 3396 -7419 -9389 -4208 1061
178 1061 3466 2011 -2516 -6853 -8257 -3835 3969 7172 694 -8868 -9359 468 10695 10338 -197
193 -197 -8971 -5480 6041 12218 7235 -2408 -6474 -1809 5131 7570 3839 -2638 -6357 -5826 -901
208 -901 4904 5031 -2254 -10893 -11320 -1057 9826 8051 -5845 -15944 -9183 8348 17044 6902
222 6902 -11124 -15511 -290 17197 16975 -310 -14497 -9965 7841 17800 9604 -7801 -15037 -5220
236 -5220 9465 12768 2572 -11333 -14489 -3560 8009 9534 -860 -12377 -12773 -1638 10322
249 10322 10534 -2162 -12760 -9557 4574 15515 10999 -4626 -13334 -4979 10790 17049 6376
262 6376 -9243 -12997 -760 13199 12673 -1790 -14001 -11295 2517 12286 6715 -8103 -15136 -8175
276 -8175 5299 11015 2754 -9174 -12528 -2574 9410 10891 1179 -8879 -8615 2801 12734 10432
290 10432 -880 -9127 -5630 6137 12200 6496 -5159 -10592 -3742 6723 9598 1327 -9856 -11481
304 -11481 -2013 7484 6734 -3246 -11285 -8487 2349 9772 5524 -5553 -10512 -3891 7225 11638
318 11638 4447 -6058 -8043 513 10168 10581 1083 -8342 -7087 2864 10742 7319 -3861 -11178 -6781
333 -6781 3342 8746 3183 -7746 -11263 -4499 5447 7745 170 -8713 -9138 238 9079 8046 -1152
348 -1152 -7946 -5073 4556 10995 6498 -3027 -7600 -2023 7333 10025 2560 -7084 -8105 -887 7624
363 7624 6602 -1938 -9754 -8606 690 7328 4047 -5260 -10013 -6132 3578 8234 3629 -5426 -8188
378 -8188 -1635 6874 9204 2976 -4846 -5866 1482 8695 8180 175 -6600 -4963 2925 8103 4431
393 4431 -4314 -8289 -3826 3642 5345 -638 -7408 -7158 -657 4966 3562 -3031 -6836 -3734 3434
408 3434 6330 2959 -2964 -3937 -166 5455 6561 2587 -2363 -3417 721 4954 5581 818 -4466 -5095
424 -5095 274 4535 3497 -2389 -7073 -5153 1102 4524 1419 -4711 -6773 -2324 3499 4686 -109
439 -109 -4631 -3195 2298 5720 3668 -1403 -3245 67 4740 5680 1805 -2511 -2687 984 3944 3682
455 3682 -998 -4735 -3478 -20 3022 1829 -3130 -6058 -4377 1026 3759 1375 -3271 -5016 -2110
470 -2110 2931 5517 2155 -2650 -3874 -115 5300 6409 2109 -3438 -3874 1227 6257 5667 -543 -6297
486 -6297 -4968 2341 6457 2628 -5409 -9107 -3619 4699 6170 -1047 -8259 -7438 610 6459 4362
501 4362 -2710 -6721 -2763 4141 7118 3719 -1619 -4017 -1642 4023 7420 4613 -1533 -6293 -4177
516 -4177 3944 9079 4267 -6290 -11450 -3916 8337 10534 -900 -13875 -11993 2779 13786 7954
530 7954 -8349 -15921 -5151 11369 14696 1510 -12246 -10862 3117 14067 10263 -2943 -10727
543 -10727 -5770 5679 11130 6115 -3814 -9846 -6290 3564 9860 6359 -5339 -13684 -9019 5706
557 5706 14021 5510 -11450 -17903 -4843 13933 16999 41 -17873 -14905 6378 21005 12488
570 12488 -9456 -19065 -5333 15560 19682 2262 -15493 -14786 2792 16429 11676 -5462 -16209
583 -16209 -9758 5374 12891 6052 -8037 -14942 -7345 6361 12841 4808 -8933 -14676 -4835 10679
597 10679 15996 3866 -12551 -14560 713 17224 15991 -2123 -17132 -11684 8187 19557 9860
610 9860 -10891 -19238 -5923 13796 17166 380 -17325 -17232 696 16638 12668 -6489 -19196
623 -19196 -11733 7885 17688 7909 -10529 -16883 -4163 13405 16847 2746 -12999 -13270 1955
636 1955 16224 13551 -2656 -14578 -10362 5233 14915 8511 -7146 -15676 -7642 7321 13603 4166
650 4166 -11141 -16405 -4650 11779 14596 747 -15203 -15168 2060 17474 13611 -5312 -17824
663 -17824 -8707 11184 19874 6542 -12668 -16264 -214 16588 14733 -2959 -16297 -10610 6144
676 6144 14926 6100 -9231 -14515 -5353 7555 10561 1634 -9597 -10869 -2120 8059 9762 1228
690 1228 -8895 -10072 214 11723 11815 -440 -11948 -9497 4975 15320 9665 -6506 -14650 -5187
704 -5187 10475 14429 1371 -13582 -13613 1339 13250 9046 -5556 -14524 -7768 5664 10963 3112
718 3112 -7486 -9888 -1823 7032 8232 1584 -5735 -5900 418 6966 7392 1358 -4905 -5627 656 7206
734 7206 6431 -1166 -7551 -5414 2346 7299 3303 -5385 -8725 -3297 4610 5925 -574 -7003 -6275 818
750 818 6440 4176 -2434 -5508 -2160 3641 5113 2250 -1988 -2380 868 3694 2918 0 -1848 -1177
766 -1177 891 1714 546 -1136 -1558 -1140 -224 -459 -1288 -1320 -286 -1 -719 -1350 -1726 -78 1029 1126 -660
785 -660 -1387 155 2304 2852 1150 -1317 -1635 1135 3802 3477 -338 -3365 -2262 1355 3995 1706
801 1706 -3303 -5512 -2584 2755 4783 395 -5970 -6521 -939 5393 5231 -1732 -7370 -5235 2927 8693
817 8693 5148 -3749 -8205 -2645 6993 10241 2887 -6685 -8094 268 9327 8397 -1104 -9965 -7863
832 -7863 2681 9971 5866 -5533 -11777 -6502 5338 10567 3125 -8674 -11651 -2527 9248 10835
846 10835 398 -10664 -9987 2263 12903 9972 -2867 -11799 -6870 6872 14031 6746 -7284
859 -7284 -12933 -3935 9498 12797 1863 -11922 -12716 -750 11722 10414 -3108 -14293 -10377 4082
873 4082 13244 7376 -7048 -14142 -5935 8726 14096 4217 -9540 -12251 -766 12326 12855 271
887 271 -11590 -9928 3313 13891 9186 -4747 -13410 -7415 6456 12831 4456 -9397 -13673 -4017
901 -4017 8806 11183 43 -11529 -11077 988 11381 9411 -3196 -11892 -7259 5421 12895 6682
915 6682 -5746 -10956 -3377 8442 11707 2973 -8544 -9931 -132 9575 9024 -1702 -10684 -8537
929 -8537 2267 9664 5627 -5586 -10915 -5265 5199 9115 2638 -6947 -9066 -1367 7813 8247 338
944 338 -7325 -6281 2212 8945 6588 -2023 -7523 -3766 4096 8182 3406 -4902 -7538 -1938 4939
959 4939 5965 56 -6396 -6394 -292 4965 3655 -2127 -6076 -3833 1925 5232 2694 -2497 -4642 -1666
975 -1666 3183 5041 2093 -2042 -3387 -222 3868 4516 731 -3341 -3620 482 3744 2709 -1498 -4589
991 -4589 -3200 1136 2908 347 -3044 -3932 -662 2192 1992 -1046 -2726 -1473 1190 2117 866 -515
1007 -515 -158 714 1274 895 571 710 593 46 -207 337 1339 936 -958 -1866 -1041 565 857 -765 -2137
1026 -2137 -1619 362 781 -381 -1760 -1010 484 1012 29 -702 -30 1370 1309 -421 -845 778 2497
1043 2497 1964 -553 -1734 -110 2320 2397 -820 -2810 -1751 1354 2494 -435 -3229 -2888 -204 1920
1059 1920 692 -1998 -2671 -659 1256 1379 235 -724 -700 117 938 1309 1287 628 -174 -437 796 2071
1077 2071 1879 -270 -1989 -1020 1395 2416 310 -2697 -3170 -847 2069 1930 -1196 -3823 -2475 897
1093 897 2845 1105 -1585 -2688 -844 2223 3026 861 -1876 -1670 675 2976 2514 3 -1921 -781
1109 -781 1290 1834 922 -1190 -1953 -693 697 313 -482 -1143 -1034 -684 -328 -320 -234 -449 -700 -1062 -125 939
1129 939 1459 368 -934 -843 1135 2657 1555 -779 -1516 542 2765 1951 -525 -2381 -1067 1343
1145 1343 1845 -280 -1897 -1495 34 290 -762 -1707 -491 254 -174 -1664 -1258 1043 2252 276 -2174
1162 -2174 -1916 1749 4561 2401 -2009 -3535 157 4678 4279 -712 -4298 -2127 2722 4350 940
1177 940 -3347 -3611 -390 2209 2006 -954 -2836 -2447 -298 1607 1459 290 -1360 -2368 -929 1920
1193 1920 3734 1915 -2433 -3820 -37 4764 5515 13 -5302 -4201 2646 7196 3705 -4066 -7022
1208 -7022 -2182 4976 6038 -538 -6526 -5928 733 5411 3557 -2671 -6345 -3217 2641 5460 2477
1223 2477 -2838 -5227 -1533 3828 5905 2368 -3245 -4897 -482 5367 6243 547 -5417 -5338 1016 6693
1239 6693 4762 -2451 -7734 -4574 3032 7192 2260 -5585 -8127 -2220 5677 6976 135 -6931 -6231
1254 -6231 1026 7603 6051 -1825 -7113 -3950 4004 8080 4003 -3779 -6728 -1763 5171 6782 755
1269 755 -5775 -5973 -225 5330 4600 -1537 -6435 -4687 1301 5202 3162 -2988 -5746 -2984 2763 5306
1285 5306 1929 -3233 -4860 -816 4242 5183 1017 -3705 -3611 672 4701 3975 -750 -4438 -2672 2089
1301 2089 4511 1550 -3000 -4453 -1213 2539 2619 -459 -3568 -2991 309 2485 1515 -1029 -2326 -997
1317 -997 1056 1794 820 -372 -610 13 798 1316 1117 555 -402 -326 -45 918 413 -135 -850 -1262 -297 19
1337 19 28 -383 -745 -1129 -862 -405 291 623 8 -1253 -1088 69 1670 1544 -211 -1514 -1113 1510 2961
1356 2961 1845 -1330 -2677 -814 2507 3445 500 -2997 -3515 -241 3028 2483 -1150 -4282 -3458 1050
1372 1050 3763 2095 -2539 -4840 -2485 2667 4997 1530 -3266 -4455 -168 4553 5185 321 -4139
1387 -4139 -3915 1057 5698 4186 -1304 -5295 -3053 2403 5668 2114 -3907 -6054 -1972 3757 5162
1402 5162 460 -5537 -5774 -370 5104 4424 -1253 -5699 -4098 2685 6376 3578 -2648 -5912 -2100
1417 -2100 4355 6555 2039 -4289 -5396 -212 5337 5300 -445 -5517 -4837 1060 5224 3399 -2611 -6348
1433 -6348 -3761 2612 5333 1874 -3692 -5591 -1501 4079 5321 368 -4234 -4377 881 5419 3991
1448 3991 -771 -4274 -2451 2453 5250 2694 -2368 -4570 -1206 3115 4048 426 -3918 -4055 -361
1463 -361 3313 2729 -1172 -4151 -2897 1434 3710 1791 -2016 -3708 -1163 2363 3624 1296 -2189
1478 -2189 -2779 -149 2994 3312 473 -2238 -2283 568 2757 2094 -1162 -3217 -1955 1528 2759 445
1494 445 -2505 -3203 -934 1918 2017 -584 -2767 -2044 662 2687 1709 -838 -2264 -800 1638 2449 1258
1511 1258 -966 -1504 -94 1730 2260 777 -1394 -1796 -308 1698 1512 -121 -2103 -2110 -426 1583 1362
1528 1362 -1068 -2668 -1664 1062 2160 598 -1898 -2053 -137 2304 2133 -56 -1525 -899 1353 2475
1544 2475 1331 -621 -1321 -589 1365 1676 686 -1267 -1824 -668 650 1338 -323 -1820 -2026 -524 1077
1561 1077 1264 -454 -1994 -1722 455 1916 1117 -335 -1699 -730 1539 2254 1225 -1014 -1449 -96
1577 -96 1901 1991 550 -1351 -1801 23 1675 1052 -508 -2226 -1655 358 1483 385 -1561 -2168 -749
1594 -749 1040 1533 -90 -1611 -1387 291 1509 1269 179 -700 -564 442 1141 1336 409 -391 -819 -155
1612 -155 1000 1150 109 -994 -1656 -529 975 914 -500 -1928 -1554 234 1218 557 -1067 -1445 -15
1629 -15 1224 723 30 -627 78 833 625 -164 94 830 722 45 -719 68 1229 679 -964 -1959 -607
1648 -607 1502 1501 -576 -2660 -2225 733 2268 215 -2297 -2592 226 1909 1698 -296 -1759 -1238 965
1665 965 1898 1295 4 -790 -377 580 1443 1551 334 -1286 -1633 -75 2265 1989 -607 -3206 -2508 770
1683 770 3169 1582 -2459 -4070 -1377 2975 3598 -86 -3809 -3236 1043 4105 2781 -1343 -3332 -1553
1699 -1553 2373 3738 1483 -2179 -2818 -473 2499 3009 581 -2533 -3053 -671 2196 2346 -198 -2993
1715 -2993 -2846 229 2707 2116 -920 -3418 -2286 1271 3537 1945 -1646 -3048 -928 2694 3518 942
1731 942 -2169 -2351 327 2788 2681 -414 -3028 -2395 673 2574 1432 -1311 -2841 -1239 1109 1910
1747 1910 227 -1915 -2279 -396 1305 1409 -173 -1435 -1287 447 1201 887 17 -559 -428 609 1074
1764 1074 1007 99 -923 -584 60 949 869 -238 -1114 -1197 83 786 219 -989 -1370 -667 840 1003 -277
1783 -277 -774 -776 29 490 281 64 324 686 151 -104 528 855 1093 -283 -980 -679 911 1924 674
1802 674 -1540 -2006 -540 1638 1630 -689 -2736 -1974 728 1883 792 -1628 -2363 -897 1472 2025 654
1819 654 -1221 -1749 -208 1699 2232 794 -1468 -1770 192 2059 2419 -75 -2286 -2137 469 2646
1835 2646 1918 -1283 -3479 -2097 1531 3025 1020 -2575 -3710 -950 2662 3047 182 -3052 -2688 614
1851 614 3360 2495 -687 -3061 -1509 2039 3546 1567 -1625 -2999 -1030 2227 3033 309 -2572 -3007
1867 -3007 -314 2607 2226 -852 -3344 -2678 631 2847 1720 -1464 -3614 -1415 2127 3275 1091
1882 1091 -2074 -2810 -6 2894 3082 295 -2596 -2115 939 3109 2410 -1070 -2759 -1644 1382 2587
1898 2587 757 -2246 -3223 -960 1809 2250 -65 -2803 -2473 -7 2233 1915 -488 -2513 -1636 1145
1914 1145 2591 1736 -697 -1919 -598 1665 2503 950 -1470 -1681 -13 1845 1565 -320 -1939 -1795
1930 -1795 170 1624 873 -1014 -2092 -1289 410 1530 811 -1367 -1687 -169 1219 1270 252 -1185
1946 -1185 -965 683 1614 858 -27 -1121 -648 777 1465 596 -291 -1133 -638 451 343 -48 -921 -858 -269
1965 -269 323 259 -416 -707 -537 -20 388 157 -128 -389 -264 409 583 394 315 163 302 415 451 68 126
1986 126 182 185 92 9 -9 102 -36 -447 -494 -90 -75 -22 -283 -837 -756 42 524 344 -280 -424 -352 414 900 492
2010 492 -85 -366 23 738 1289 514 -490 -911 -266 776 1151 -103 -1081 -1195 -121 932 962 -365
2028 -365 -1537 -1100 320 914 376 -762 -1551 -642 1030 1566 485 -1175 -1279 227 1781 1552 137
2045 137 -1286 -883 378 1700 1049 -664 -1524 -1012 992 1574 234 -1797 -2059 -460 980 1319 -209
2062 -209 -2071 -1541 44 1639 1206 -566 -1538 -1091 934 1827 1263 -803 -1586 -182 1331 1826 850
2079 850 -1262 -1640 -256 1554 1846 159 -1835 -1704 179 1522 995 -1011 -1970 -1285 933 1617 231
2096 231 -1505 -1723 25 1551 1213 -269 -1265 -755 336 1314 1278 -272 -750 -467 293 1258 865 -430
2114 -430 -981 -703 471 1042 549 -786 -1718 -865 835 966 -32 -1325 -1363 -62 1198 1099 -488 -1048
2132 -1048 -253 1014 1109 191 -722 -356 551 838 290 -226 -261 158 160 0 79 -189 -136 -38 -378 -377 -310 205 -290
2155 -290 -586 -572 191 208 216 -403 -408 94 588 137 -114 -377 321 449 356 55 -40 645 446 -133 -488 129 141
2178 141 268 -418 -926 -317 254 599 -136 -1173 -902 -150 909 383 -470 -978 -351 460 723 312 -250
2197 -250 -719 339 806 782 240 -278 -193 234 868 622 126 -731 -488 23 332 221 -383 -825 -643 29
2217 29 429 95 -383 -884 -738 129 456 491 -226 -399 15 561 921 504 -218 -690 -66 969 870 -126 -735
2238 -735 -620 387 1052 346 -682 -1086 -736 227 312 -243 -848 -522 -333 402 -196 -457 -173 -147 177 233
2258 233 266 302 113 -69 -127 242 743 561 -121 -432 -6 644 689 81 -767 -828 106 546 345 -669 -828
2279 -828 -391 343 150 -103 -702 -250 -103 66 325 50 61 72 33 131 405 653 466 -372 -220 151 862
2300 862 677 -336 -942 -344 583 930 -60 -1153 -1036 51 735 458 -727 -976 -487 410 618 161 -480
2319 -480 -614 112 349 536 439 36 -255 68 569 835 336 -203 -541 -111 682 821 -258 -866 -922 -88
2339 -88 847 524 -534 -1167 -766 401 680 2 -851 -914 -38 660 1060 55 -813 -561 508 908 670
2358 670 -340 -733 -73 664 924 568 -678 -644 -206 600 712 -332 -1202 -1013 106 795 567 -610 -978
2377 -978 -820 342 887 579 -815 -1229 -420 1073 1244 175 -629 -857 416 997 1122 33 -1128 -722
2395 -722 571 1317 818 -865 -1688 -564 697 1138 117 -1332 -1572 -244 1137 1000 -511 -1387 -1185
2412 -1185 554 1410 1037 -615 -1558 -338 966 1603 765 -883 -1507 -424 1189 1588 -65 -1547 -1295
2429 -1295 -37 1383 996 -640 -1731 -1428 681 1682 639 -1386 -1830 -656 1324 1742 226 -1658
2445 -1658 -1607 123 2066 1939 -359 -1781 -1080 1061 2071 1331 -907 -2090 -697 1349 1951 261
2461 261 -1833 -1936 -158 1500 1321 -361 -1976 -1540 384 1569 1128 -1127 -2252 -1217 1141 1985
2477 1985 683 -1635 -1883 -135 1705 1970 81 -1721 -1392 585 2071 1470 -614 -2182 -1188 878
2493 878 1860 712 -1247 -1955 -522 1127 1541 -18 -1710 -1928 -33 1801 1192 -480 -1518 -965 1068
2510 1068 2086 782 -827 -1333 -145 1134 1489 202 -1249 -1356 -113 1318 1210 -298 -1161 -1029
2526 -1029 110 1044 338 -958 -1259 -1067 450 1083 352 -750 -1408 -235 987 593 185 -744 -660 419
2544 419 1221 1063 -264 -871 -56 678 678 191 -601 -770 -40 383 780 46 -589 -565 -162 47 307 -122 -652
2565 -652 -301 58 285 272 -178 -283 -41 233 468 178 -1 -67 121 168 399 212 -84 -132 -54 -49 -82 -177 182
2588 182 160 -14 -316 -379 29 10 -67 -386 -257 129 314 226 -359 -598 56 368 463 266 -61 -396 -13 554
2610 554 534 59 -139 -249 7 404 247 -339 -197 -480 -227 545 139 -451 -860 -434 49 678 228 -653
2630 -653 -904 -287 451 930 73 -690 -338 258 1012 696 -250 -601 -281 790 761 60 -552 -666 -239 339
2650 339 536 -220 -829 -626 -103 366 228 -596 -915 -781 178 850 183 -540 -860 -524 701 897 288 -561
2670 -561 -595 302 846 848 17 -740 -578 459 1252 701 -665 -967 -412 705 903 -158 -877 -1410 -376
2689 -376 691 1014 -73 -1166 -1141 404 1149 716 -229 -1063 -479 865 1374 832 -722 -1147 -280 726
2707 726 1531 368 -1117 -1081 -266 1200 895 -247 -1315 -1182 473 1281 727 -837 -1846 -1026 739
2724 739 1649 607 -1228 -1771 2 1654 1531 -148 -1649 -1145 674 2063 1143 -490 -1658 -648
2740 -648 972 1640 731 -1007 -1604 -527 969 1195 278 -1500 -1458 -170 1418 1403 -218 -1769 -1439 184
2758 184 1945 1479 -456 -2128 -896 1206 2271 905 -1338 -1921 -300 2006 2084 -47 -1993 -1810
2774 -1810 731 1841 959 -1220 -2038 -1017 865 1796 470 -1417 -2032 -663 1290 1564 89 -1434
2790 -1434 -1845 171 1872 1759 -83 -1803 -1121 692 2115 1441 -949 -2236 -750 1189 2243 520
2806 520 -1701 -2044 -232 1664 1682 -492 -1838 -1580 429 1659 1080 -716 -1924 -1062 985 1533 557
2823 557 -957 -1622 -94 1453 1745 168 -1153 -1256 213 1398 1062 -52 -1153 -1065 588 1098 437
2840 437 -494 -1437 -757 725 1285 173 -1095 -1364 86 929 789 -192 -1136 -895 549 1191 784 -291
2858 -291 -785 -248 636 819 392 -671 -782 -138 729 681 -165 -686 -450 -52 231 167 -272 -920 -445 27
2878 27 169 154 -134 -204 -62 175 75 -18 -108 132 84 408 284 491 145 93 -189 41 211 90 -48 112
2900 112 -95 -88 -157 14 29 -237 -176 -300 58 185 347 -162 -297 -297 73 187 366 54 -176 76 548 458 222
2923 222 -6 -315 46 320 241 -242 -444 -578 379 241 -305 -499 -294 44 85 363 -96 -483 -127 -34 -73
2944 -73 160 17 -102 -118 43 255 424 -29 -4 -144 492 512 353 -198 -141 -53 269 351 -35 -65 -216 21 -152
2967 -152 -52 1 -284 -185 -215 182 -56 -46 -40 118 -243 -13 78 208 352 212 -223 -46 -32 244 334 -129 -94
2990 -94 -340 302 143 342 -51 -568 -265 476 347 -67 -416 -565 -69 473 205 -306 -548 -395 362 647
3010 647 438 -410 -595 -272 572 802 352 -293 -469 317 872 565 -98 -801 -667 121 791 471 -689 -1106
3030 -1106 -502 390 661 464 -781 -1140 -46 919 786 -29 -1061 -659 151 1321 819 147 -886 -604
3048 -604 619 1249 544 -464 -666 -205 1073 992 68 -967 -866 74 692 440 -100 -1031 -741 420 642
3067 642 213 -685 -844 -545 633 964 164 -372 -713 147 941 769 -19 -473 -220 311 717 544 -240 -754
3087 -754 -239 466 579 136 -541 -605 -148 396 418 -162 -524 -579 128 659 300 -205 -519 -189 122 387 616
3108 616 -173 -246 -68 280 657 199 -264 -227 219 224 20 -194 -359 -161 97 86 -316 -42 -360 -210 145 11
3130 11 -1 -54 85 -12 -8 32 121 294 -36 -118 88 -43 215 348 137 -138 -171 -11 263 280 79 -313 -264 -118
3154 -118 74 163 -173 -503 -603 -6 328 -31 -329 -493 -266 273 429 290 -654 -478 204 479 560 279 -354
3175 -354 -494 138 640 475 -83 -689 -382 302 672 369 -620 -995 -637 438 550 186 -838 -838 -36 683
3195 683 710 -276 -950 -675 662 1028 321 -234 -763 53 586 852 325 -588 -783 47 742 670 25 -866
3215 -866 -893 241 1048 422 -436 -1180 -814 489 1211 372 -581 -1189 -215 879 899 51 -1021 -1019 408 1156
3235 1156 970 -245 -971 -648 763 1201 511 -629 -1164 -204 752 817 39 -1063 -1264 -66 772 651
3253 651 -292 -1273 -1091 391 1299 727 -436 -1222 -568 766 1500 373 -786 -1323 17 1333 1336 79
3271 79 -1176 -922 576 1416 1009 -800 -1217 -765 585 1224 187 -1166 -1417 -249 900 1058 -174
3288 -174 -1053 -1010 122 1228 1072 -187 -1122 -1033 448 1497 1023 -707 -1166 -373 1137 1664 239 -1191
3306 -1191 -1347 -167 1157 1202 -108 -1402 -1200 503 1267 744 -685 -1507 -778 655 1425 474 -856
3323 -856 -1268 -311 1270 1187 27 -1147 -972 287 1552 1354 -310 -1442 -717 792 1361 487 -1103
3340 -1103 -1588 -439 1080 1165 -212 -1420 -1310 106 1397 1111 -192 -1303 -946 209 1614 596
3356 596 -533 -1365 -682 1082 1197 443 -1163 -1408 -19 1261 1252 4 -1463 -792 431 952 630 -748
3374 -748 -1279 -580 719 1235 294 -962 -1211 -136 827 895 -91 -752 -843 130 956 849 -303 -1118 -562
3393 -562 545 1057 771 -730 -1160 -576 605 982 355 -978 -988 -102 671 810 -342 -970 -758 275
3411 275 834 362 -601 -924 -88 606 755 244 -586 -680 210 758 698 -226 -329 -407 224 513 599 -528 -724
3432 -724 -200 143 724 161 -797 -736 -292 81 440 -73 -325 -648 -305 577 615 -292 -389 -342 252 609 210
3453 210 -196 -414 1 414 273 91 -93 3 -59 266 218 179 -194 15 218 197 -439 -82 -248 -50 -99 158
3475 158 236 -353 -234 72 110 261 162 191 259 171 253 157 308 136 16 53 304 -81 219 -9 -331 57 -340
3498 -340 -242 107 75 -346 -258 -134 -165 179 108 -233 -248 -352 162 316 93 -66 -219 159 342 468 -74 -352
3520 -352 -7 177 580 280 -274 -480 -104 287 483 46 -455 -623 -112 374 291 -297 -497 -626 32 471
3540 471 429 -166 -573 -271 374 587 153 -276 -296 11 633 474 308 -512 -665 28 764 468 -22 -783 -483
3561 -483 54 641 455 -275 -797 -450 334 491 90 -923 -808 -320 495 529 115 -688 -659 293 596 625 -88
3582 -88 -598 -173 397 688 402 -584 -859 -433 534 424 -79 -614 -754 -141 533 465 -165 -474 -707 171 656
3603 656 583 -244 -778 -303 728 739 236 -472 -701 -148 804 643 -73 -647 -351 226 478 390 -272 -626 -695
3624 -695 372 743 321 -514 -674 -39 483 547 -122 -684 -474 238 510 461 -184 -443 -190 344 671 498
3644 498 -320 -671 -176 216 641 104 -299 -361 -42 549 494 25 -722 -367 67 249 -17 -352 -565 -261 237
3665 237 332 -92 -265 -409 -218 387 201 209 -141 -104 162 164 348 -105 -360 -141 -31 441 419 94 -368 103
3687 103 24 353 -348 -361 -187 -76 -31 295 -273 -436 67 60 368 167 0 9 80 -96 191 -61 -197 -47 15
3710 15 -5 184 -12 131 -37 -48 58 -23 -178 -229 -106 -141 -88 -89 151 -215 -63 195 62 63 -17 -81 -7 -7 180
3735 180 -271 168 10 199 96 70 -118 63 -15 205 173 80 -17 107 -43 -111 193 -116 63 43 130 -45 -135
3758 -135 -53 -228 -1 51 216 134 -350 -18 62 52 79 -53 -105 113 256 185 127 -186 -336 17 222 164 -221
3781 -221 -185 -470 -323 302 135 -19 -425 -195 -254 -21 92 -246 -193 -160 115 550 337 -244 -336 102 576 283
3803 283 333 -137 -180 42 531 294 -314 -463 -563 5 501 96 -218 -528 -276 428 494 110 -231 -161 131
3824 131 584 514 -150 -496 -423 428 811 350 -121 -537 -328 420 722 164 -412 -692 -268 497 428 -12 -477
3845 -477 -605 138 439 324 3 -638 -413 154 645 196 -483 -658 -201 296 758 395 -451 -424 56 646
3865 646 693 -78 -615 -700 298 615 464 -523 -594 -215 412 504 8 -535 -941 106 340 272 -115 -697 -357
3886 -357 179 564 572 -284 -613 -240 427 831 112 -110 -450 -284 575 592 -96 -553 -550 171 503 509 -263 -944
3908 -944 -555 -35 579 35 -247 -749 -363 414 537 340 -475 -468 37 525 622 20 -859 -303 539 719 318
3929 318 -216 -589 -328 421 682 392 -365 -918 -84 525 538 106 -435 -445 139 522 548 -319 -687 -514 255
3950 255 833 92 -280 -584 -277 476 623 150 -376 -363 -9 605 719 22 -563 -618 -4 628 362 -305 -816
3971 -816 -90 504 413 135 -517 -500 -233 273 343 -104 -532 -364 334 829 421 -128 -590 -194 415 549 285
3992 285 -342 -423 -229 293 509 48 -340 -587 83 352 364 -130 -374 -244 113 251 564 -191 -258 -25 183
4013 183 365 128 -172 -83 284 258 220 -108 19 -58 138 316 281 119 33 -274 -54 57 55 -116 -187 -86 142
4036 142 -212 -143 -184 167 -217 8 -138 -44 69 106 8 -94 140 36 167 248 7 -72 272 161 118 -136 -121
4059 -121 -252 -113 354 301 -177 -377 -256 -16 282 241 -494 -462 101 390 467 -143 -358 -328 196 455 572 -84
4081 -84 -523 -426 294 707 382 -256 -704 -182 576 659 79 -683 -633 270 681 336 -155 -1040 -355 340 746
4102 746 458 -422 -817 -392 434 792 191 -462 -1025 67 877 956 -126 -817 -565 225 999 628 -489
4121 -489 -884 -567 564 878 504 -787 -1133 -390 658 925 -30 -808 -832 25 883 572 -258 -784 -630
4140 -630 428 813 536 -221 -852 -386 769 1022 -44 -505 -1142 91 863 775 -272 -800 -600 85 749
4159 749 446 -671 -724 -546 411 726 206 -739 -895 -82 791 888 -355 -528 -481 195 881 708 -205 -752
4179 -752 -238 638 937 331 -527 -781 -212 438 637 19 -742 -519 -80 693 271 -517 -818 -276 359 504
4199 504 243 -215 -468 -322 466 641 266 -399 -456 7 572 436 -91 -296 -380 4 484 263 -84 -314 -373
4220 -373 257 275 39 -198 -551 18 345 -13 -22 98 -37 67 103 34 -17 -180 7 61 203 114 -201 -98 2
4243 2 266 85 4 -216 -240 194 42 80 82 24 8 -52 -217 -140 -109 2 -7 220 146 37 233 -135 309 422 141
4268 141 -130 159 4 40 -55 108 -271 96 229 -163 -238 -86 192 -201 14 -4 -55 51 -106 -26 132 53
4290 53 48 -10 14 -40 -178 -59 -81 39 -75 186 24 45 211 115 159 178 137 -20 70 252 397 93 -101 -89 -9
4315 -9 -29 -39 -147 -154 -36 83 279 -33 -109 -166 -212 34 49 64 40 -151 -125 -152 -37 115 -103 228 40 334 142
4340 142 -122 99 -130 -211 -207 -185 59 -92 -191 47 -117 158 -145 -9 108 -42 -236 -71 -61 -152 -84 245 109
4363 109 -3 -158 -118 120 -54 68 207 -131 95 -93 -52 -13 -138 39 107 -52 -29 37 -42 -31 -5 324 106
4386 106 -113 86 60 31 -77 -55 -193 -25 150 208 -24 -135 127 -35 236 213 77 -195 -87 -140 47 -163
4408 -163 -21 70 -174 57 124 104 -130 -261 -135 247 -130 -157 -54 -301 -157 -31 179 284 51 -18 -109 36
4430 36 -61 99 194 -60 -113 -23 -110 97 -227 160 -34 226 160 -123 -215 -149 116 -150 -111 -164 148 91 97 -168 69
4455 69 18 6 237 85 26 74 79 151 414 153 -143 -164 -277 241 223 -100 -158 70 -203 -96 -79 126 -207 -41
4479 -41 -197 71 130 197 -11 34 -13 195 -165 216 82 -42 -56 150 -37 52 149 123 -36 70 101 -198 298
4502 298 -136 -142 -196 92 393 -111 -224 -164 160 262 48 -8 -446 -120 73 95 66 -246 -454 -150 146 254
4524 254 23 -392 76 155 382 117 -131 -239 -310 139 190 80 -81 -400 -86 36 75 83 -137 -202 -307 137
4546 137 486 107 -34 -184 -77 441 471 142 -250 -174 -25 319 80 -74 -298 -85 307 437 222 -352 -313
4567 -313 -46 368 423 -83 -380 -432 -41 -18 315 -206 -365 -105 221 282 303 -262 -309 -183 307 436 104 -301
4589 -301 -295 -69 348 61 -62 -319 -242 139 408 161 -39 -323 -13 326 241 191 -236 -247 -18 299 250 -296
4611 -296 -259 -295 113 275 243 35 -109 -82 88 26 185 -318 57 63 -176 300 85 -278 -23 -67 -258 93 -168
4634 -168 -204 -70 199 209 -72 -93 74 73 4 158 78 141 125 -90 -223 -206 151 -38 13 -85 64 -216 58 -154
4658 -154 -176 -302 -170 26 71 71 -90 44 -423 171 434 280 -174 -261 -423 73 169 272 -437 -384 91 454
4680 454 174 453 -468 -245 106 46 519 -95 -169 -176 144 384 462 -176 -644 -321 400 357 279 -385 -343 -82 270
4703 270 593 135 -392 -256 327 506 330 -79 -584 -165 201 512 363 -433 -558 -176 301 544 189 -374
4723 -374 -417 -105 515 388 -108 -640 -513 306 427 439 40 -540 -448 127 544 165 -493 -414 -22 514 435 154
4745 154 -484 -562 49 452 240 -331 -323 -249 212 290 334 -404 -836 -254 221 400 153 -540 -453 201 206 497 -57
4768 -57 -436 -65 185 492 170 -231 -483 -354 452 253 0 -169 -570 -337 368 133 -155 -481 -437 -7 421
4789 421 211 -78 -395 -456 235 628 309 -274 -516 -51 264 488 206 -582 -227 99 166 469 -186 -329 -209
4810 -209 200 296 64 -124 -315 -271 91 153 -123 -78 -211 -197 -89 229 251 201 -210 -77 111 51 240 -254 2
4833 2 45 170 8 132 133 -358 115 69 148 -54 101 -129 257 -29 -150 -33 -99 -158 30 -118 -8 285 244
4856 244 -171 -295 -34 56 -149 -219 -271 -228 189 134 -145 -167 -8 -207 272 -30 -221 -199 -89 79 246 450
4878 450 -247 -432 -264 46 123 49 -471 -373 10 327 138 -10 -115 -169 -92 -252 214 272 -295 -317 -145 113
4900 113 360 166 -458 -212 231 236 235 -100 -611 -93 -88 361 75 -289 -417 36 77 495 -270 -335 -426 86 417
4923 417 521 -268 -683 -262 503 387 239 -199 -747 200 287 677 76 -371 -259 137 254 222 -82 -239 -333
4944 -333 202 386 5 -209 -424 -206 207 543 320 -519 -441 50 335 491 -122 -402 -450 271 180 303 -56
4965 -56 -483 180 2 81 107 -351 -413 72 264 133 21 -159 -430 90 244 115 -151 -280 -374 156 393 172
4987 172 160 -348 -7 35 236 2 40 -202 -11 324 141 64 -304 -278 132 170 166 22 -160 -137 -37 206 17
5010 17 -233 18 -27 -192 45 38 38 -163 233 273 141 21 -147 -197 -36 -19 -25 249 110 -52 278 266 73 -189
5034 -189 136 9 -56 -298 -48 90 127 61 -40 52 20 14 63 -196 -70 85 183 249 85 -219 -204 67 81 2
5058 2 -147 -107 -140 331 94 -178 -58 -258 6 -37 332 -200 -69 -269 -42 209 50 -174 -212 -458 228 95
5080 95 196 -12 -343 -251 50 281 86 -148 -178 -184 251 134 54 -229 -215 1 186 100 -158 -343 -258 34 386
5103 386 46 -336 -490 18 319 228 55 -272 -374 -209 1 -63 -65 -395 112 203 656 329 -187 -354 50 247
5125 247 116 -263 -216 -264 -79 141 507 149 -215 -375 296 366 202 -119 -403 -156 77 109 137 -241 -236 42
5147 42 180 395 233 -287 -427 83 138 194 -238 -670 -132 -43 192 154 -272 -29 -26 252 399 29 -302 -303 -3
5170 -3 329 -15 -25 -78 -258 110 226 188 -215 -390 -117 274 548 290 -161 -108 10 275 117 97 -651 -232
5192 -232 92 171 140 -347 -533 -303 -63 -32 -29 -235 -447 -140 332 167 -15 -92 -253 252 139 -86 -89 -102 -61
5215 -61 108 200 474 -190 -143 -83 182 277 12 -65 -200 -92 119 334 -197 -126 -244 -64 122 291 -57 -278
5237 -278 -153 163 259 175 -158 -151 -90 31 383 -61 -197 -2 140 12 -140 -16 117 147 360 -106 -171 89
5259 89 -94 -85 -72 93 -141 -16 15 40 3 17 146 89 65 131 64 21 60 123 -90 135 66 297 140 61 46 -252
5285 -252 -309 32 -7 103 -239 -30 95 73 176 305 -59 -213 -3 -60 61 39 -244 -53 272 167 134 -124
5307 -124 -209 -202 279 377 -48 162 -117 72 93 79 313 -129 -299 -170 77 213 -46 -172 -274 100 144 294
5329 294 -96 -102 -136 216 543 403 -265 -394 -91 86 -10 39 56 -229 275 476 280 -141 -399 -98 153 214
5351 214 127 -106 -448 -118 388 415 -114 -189 -383 34 282 414 -167 -461 -164 200 366 156 -243 -256 -108
5372 -108 353 162 -55 -253 -337 -495 277 220 -77 -158 -63 110 75 194 -32 -211 -239 30 130 91 -50 -139 30
5395 30 489 299 69 -342 -316 82 202 29 -36 -142 176 270 175 36 29 -243 43 37 150 -75 -304 -90 -35
5418 -35 103 2 -22 -236 -177 -108 167 -21 -112 -35 -18 -140 -53 -13 22 136 -25 -5 12 -47 -135 26 110 44 -259
5443 -259 -242 -261 108 80 29 -205 1 89 207 122 -13 -115 134 -3 -153 82 -27 29 128 167 -78 -141 -11
5466 -11 17 326 73 -61 -59 42 35 117 -70 -65 -314 -11 -43 -145 45 -180 11 61 174 214 -99 -160 -63 -43 64
5491 64 195 122 -33 -76 194 346 -50 -133 98 215 242 191 -83 -526 151 48 -59 123 -37 -190 -131 -6
5513 -6 73 -48 -189 -351 137 69 119 -109 -132 -21 -27 361 -65 170 -274 152 167 220 -37 -213 -31 58 67 206
5537 206 196 -243 -133 147 178 -105 -56 79 -40 35 206 8 -278 -111 -26 291 6 86 -194 60 -47 202
5559 202 49 67 130 164 -49 -107 -60 -193 204 8 -72 146 30 -83 -200 -59 118 -84 38 -105 -73 170
5581 170 24 120 -59 -3 -174 136 110 117 -120 -242 -59 -41 207 23 -184 -157 199 -13 -31 161 -170 -124 43
5604 43 -78 -29 -204 -124 -80 103 170 134 -34 -204 214 70 -81 32 149 172 235 -266 188 93 128 -37 99
5627 99 -7 104 26 -233 -74 -126 -50 58 167 0 84 -29 -14 -310 -47 81 301 158 -35 -121 71 134 283
5650 283 13 96 -170 -163 -185 -170 -105 -114 -145 6 41 -183 -46 163 162 -229 -189 -154 190 51 86 -82 -193 -126 77
5675 77 260 -16 7 -180 61 -53 125 -10 -164 -127 57 145 131 -24 -302 -191 123 156 -61 -238 -303 -67
5697 -67 16 254 16 2 -351 93 92 167 -7 -331 -248 -129 118 222 -169 -184 -55 224 328 36 -201 -283 -131
5720 -131 255 228 -13 -246 -61 51 -144 176 -33 -252 -249 161 409 49 -181 -419 -310 189 215 -56 -143 -375
5742 -375 86 378 245 13 -233 -113 86 292 181 -116 -457 -39 13 462 302 -157 -382 -151 271 464
5762 464 359 -380 -496 55 130 499 -122 -321 -343 110 545 26 -214 -240 -105 370 493 45 -236 -105 -18
5783 -18 318 328 -68 -401 -169 27 249 22 -213 -220 -185 141 -33 -192 -98 -316 84 307 173 5 -178 -61
5805 -61 173 219 144 -336 -359 -38 277 120 -29 -339 -292 47 -19 329 126 -219 -170 -27 48 -7 -35 -39 -383 203
5829 203 191 141 -122 -337 126 3 226 152 -178 -225 -103 60 50 2 200 167 37 -65 -218 -40 63 13 -126
5852 -126 -20 81 289 -48 -40 53 -42 88 121 -5 92 -28 -116 -80 272 308 -24 18 -82 158 185 100 -139 -80
5876 -80 13 115 157 -173 -117 -318 -42 94 -90 -224 -120 65 65 401 -95 -210 -334 233 342 285 -164 -239 -127
5899 -127 -65 108 224 -117 -271 92 297 152 -45 -316 -568 -43 273 212 125 -175 -284 30 -101 326 -59
5920 -59 -291 30 357 315 184 -50 -308 -86 83 396 232 8 32 82 385 37 127 -140 -251 336 406 99
5942 99 -128 -422 -197 103 124 134 -391 -337 -115 141 335 203 -65 -275 29 189 218 -96 -387 -59 90 210
5964 210 373 -213 -318 -87 -10 368 13 -284 -279 167 313 398 -201 -503 -324 101 185 180 -58 -102 -2 157 283
5987 283 38 -166 -118 -55 -128 241 -152 -198 -90 41 401 114 -220 -136 -16 -64 290 58 21 -50 -173 274 -50
6010 -50 184 -200 -230 -162 -21 347 0 183 -59 82 129 -23 -11 -211 199 169 69 21 -89 -61 141 141 295
6033 295 204 81 -53 33 -60 111 -109 -196 -27 107 -2 117 -253 -122 20 -94 36 76 2 89 -48 79
6055 79 132 70 194 48 -62 -231 158 30 -40 -98 119 49 -149 79 119 -48 54 84 80 -22 -350 30 -147
6078 -147 -33 -289 63 13 113 -142 98 140 -102 5 28 121 -75 -107 178 6 -32 -403 -23 164 96 80 170
6101 170 108 19 96 -158 45 -222 -39 -119 -225 -30 -103 -110 113 142 56 -77 -198 -22 20 80 197 2 -36 -102
6125 -102 83 33 263 -279 132 -45 266 66 -81 -101 175 50 101 147 57 -161 51 102 -193 10 -23 129
6147 129 -116 -157 172 -110 -173 8 93 145 47 114 -178 180 89 -5 160 -189 -311 -335 -43 96 97 53 -86 204
6171 204 -12 -121 -42 13 -278 23 37 53 110 -21 -25 172 -9 -105 -117 128 -34 238 106 -111 -30 79 174 -75
6195 -75 151 -96 -49 -32 -24 10 105 -166 -48 -43 32 -263 247 18 13 -50 163 -70 149 346 -85 38 -96 -60 5
6220 5 128 54 -36 -132 -82 11 -27 1 -149 -23 -174 164 -26 -81 -64 -120 197 -119 -3 92 -211 -205 16 -146 -135
6245 -135 -3 91 -3 25 -112 -109 45 106 45 -24 49 -19 7 -67 89 123 74 -120 -187 57 -121 141 13 -246 -49
6270 -49 68 92 44 26 0 -209 -140 -103 163 0 -73 91 109 187 -116 -67 66 -88 -257 50 -38 -296 -226 147
6294 147 124 -79 259 -80 102 -77 34 -16 -223 -56 -80 108 308 -93 -181 -62 219 87 144 -308 -8 83
6316 83 -26 293 346 17 -217 21 154 107 -203 -291 34 -105 94 169 -26 -187 -276 119 168 208 -322 -345 -75
6339 -75 -85 -147 148 -156 -100 2 62 -30 -56 -73 -188 49 -1 -5 -90 -58 38 277 -49 -298 30 -318 91 -17 -71
6364 -71 -155 150 -109 77 28 -147 -207 -114 87 209 84 -117 -39 -22 55 1 146 123 170 -61 -105 -171 -105 38 64
6389 64 -101 42 -95 11 -11 180 -135 285 -72 0 -215 43 81 -21 44 -81 209 -137 16 49 16 74 91
6412 91 41 56 -47 -335 179 -40 116 81 -165 7 3 168 50 -55 161 -148 15 55 206 105 71 -130 -135
6435 -135 -30 -14 164 -93 181 -117 56 -215 -187 175 371 187 131 -235 -219 69 28 -107 -4 15 -10 86 168
6458 168 -352 85 -10 106 -56 -97 60 -36 51 93 241 100 -2 42 85 31 -158 63 9 -82 -139 -20 38 -132
6482 -132 -86 72 34 331 27 -198 -48 18 49 -213 -63 119 -144 122 67 -5 -23 92 -133 187 17 54 181
6505 181 -50 79 42 215 -3 -100 -236 -177 91 -21 -284 -218 -92 445 -38 126 -31 -270 9 47 163 109
6527 109 -148 -83 23 175 93 42 -154 -97 3 138 283 -54 -227 162 171 105 -128 -56 -57 -26 272 158 72 -52
6551 -52 -274 -59 20 133 -172 97 70 50 192 99 -66 -327 -80 -73 215 30 -44 -274 203 90 -26 -71 -166
6574 -166 -99 39 190 2 -36 -343 -111 190 22 -451 -149 -97 170 52 -33 140 7 -152 -118 355 245 47
6596 47 -125 -102 64 105 -143 -190 -73 -293 58 212 -178 -164 -122 -20 32 62 -296 -96 -253 -15 69 -47 -155
6619 -155 5 -29 73 92 -15 163 3 47 30 -26 -165 4 -142 -200 -17 29 89 -69 -204 65 -17 269 -138
6642 -138 135 205 -124 -141 109 -194 -192 167 9 71 -4 -109 41 -92 65 -56 90 3 105 44 -299 -218 98
6665 98 113 -197 124 -243 48 -92 58 132 -137 126 -101 45 -12 -51 -57 51 26 72 -183 303 36 -61 71
6688 71 10 -14 21 -59 122 67 79 -82 -233 309 62 106 -59 6 -183 148 -188 139 -136 -24 -12 23 23 56 -153
6713 -153 54 -153 -83 196 108 57 101 -190 153 -14 -286 212 -126 -31 -53 -19 147 22 -182 -117 137 72 0
6736 0 -118 -81 90 150 12 -47 8 249 277 -106 -93 -210 -138 87 21 103 149 259 -102 2 143 20 -64 133
6760 133 -48 -17 128 -258 -31 -275 120 -52 -145 189 -105 66 -22 35 26 242 -176 -243 170 -48 -121 -277 47
6783 47 -86 -67 196 154 -13 58 135 -64 298 -205 80 158 -106 -93 -56 40 146 117 -42 -97 -294 -22 -11 231
6807 231 304 -35 -126 75 -111 66 -53 -206 -28 -241 91 21 -161 -50 129 -202 -142 -68 -106 70 156 -112
6829 -112 22 91 40 -67 -428 135 177 -90 -104 77 26 94 117 -148 83 -101 -110 238 97 185 -133 -62 156 -141
6853 -141 -181 -33 47 15 -55 35 132 -154 -26 -90 -24 -96 70 -138 31 18 260 -38 -82 -119 -22 -9 -8 -70 25 95
6879 95 45 109 163 157 63 -106 153 -70 112 -32 -41 -2 169 -1 -122 202 -158 74 -1 34 179 -256 156 -153
6903 -153 -94 29 25 36 -122 -158 -80 -350 102 146 100 -159 -56 117 -7 204 98 36 -53 224 -42 89 11 112
6927 112 -182 -295 -152 233 -50 13 -33 -134 -127 -57 -115 21 -44 -78 106 -96 7 2 -169 37 -66 -83 -145 15
6951 15 5 -136 -117 113 103 54 120 60 53 25 -84 -213 -187 -82 104 -292 -36 54 414 -115 -36 198 -76 100
6975 100 -9 188 -167 -96 -98 41 72 82 -21 36 105 -74 -61 -75 -61 228 37 -6 -5 -127 -163 -27 -5 72 175
7000 175 -27 34 44 -26 32 314 17 -94 65 22 43 43 20 -116 -37 167 57 -77 -2 163 96 282 -48 173
7024 173 -35 2 116 -56 1 92 -116 -128 49 82 85 -2 133 105 -150 97 -50 -16 -21 -116 68 -32 -55 -151 -56
7049 -56 -144 212 139 144 43 187 132 -35 105 -116 -46 13 -64 -144 -3 -135 -182 -196 -22 76 70 -54 -69 -284 -356 -55
7075 -55 -20 168 -81 -42 174 80 123 62 -27 -80 51 -15 74 88 20 55 108 18 72 175 -140 81 72 13 -27 -50 152
7102 152 45 136 257 -146 -144 -56 111 14 133 -165 -152 -179 93 -17 -158 -332 -74 97 87 -22 -74 -87 -74 158
7126 158 -83 2 -140 21 65 96 368 68 -158 -122 -337 55 -90 -14 -8 -260 179 41 -7 -60 -202 290 62
7149 62 88 -130 96 -99 -170 87 43 -164 73 -235 -288 67 -4 -148 80 -193 13 98 110 102 -66 -81 189 132
7173 132 -243 19 -296 -175 281 56 123 -195 -153 -207 156 246 188 -18 41 84 -164 -58 -36 -16 70 99 74 -153
7197 -153 -119 -86 -245 85 73 -9 -88 0 -100 231 130 -56 -3 27 -227 -100 -48 -70 -33 186 220 -71 89 -147
7221 -147 -169 5 93 41 30 90 -148 55 54 -67 105 46 63 -31 67 82 -77 -24 140 272 -63 193 -200 -109 -32
7246 -32 -163 137 -368 167 -70 -43 -11 14 38 -116 -9 5 -251 97 36 196 36 -20 4 -105 241 -71 -34
7269 -34 151 -72 103 18 -33 131 -13 -161 139 -86 -46 14 -239 -137 -62 -36 122 -82 86 -50 190 209 -64
7292 -64 -3 -183 137 -49 48 122 168 -19 -140 -173 101 -188 -161 -25 -125 -139 -97 -202 -136 184 135 -192 -34 71
7316 71 117 96 109 202 -108 -57 22 49 -62 -170 -58 126 -93 -152 121 -184 -33 -35 -47 -108 -23 -160 160 216 58
7341 58 -80 20 70 -142 -205 -35 -120 -167 -31 70 153 -175 33 -59 -215 198 -150 36 47 -56 -36 64 -204
7364 -204 93 -174 33 -65 123 22 -172 23 89 -98 258 -94 -75 80 95 94 69 -3 -72 -23 -30 -12 14 122 -148
7389 -148 -48 200 165 -209 -25 -272 -75 170 23 -134 -7 -74 126 197 24 -160 -99 66 12 31 -161 -60
7411 -60 -117 -21 -13 -56 -204 -118 124 -30 -40 -46 79 142 -182 101 85 52 -297 28 -44 21 111 -93 58 -264 147
7436 147 -75 250 15 -228 -197 38 75 10 43 186 -1 36 -10 -115 21 95 -29 33 -95 -182 -124 -57 54 -88
7460 -88 119 16 -287 -53 68 -72 -240 -49 91 -87 -233 82 87 -34 -50 -73 63 29 -248 66 186 4
7482 4 -124 191 46 -70 -193 222 -85 -51 -15 100 -33 -14 58 -38 113 -138 3 -7 168 -33 -98 -56 -48 -57 80
7507 80 183 17 16 234 -19 32 83 -82 350 -254 -151 111 -65 9 91 17 186 -61 -17 29 62 -13 170 -192
7531 -192 59 -57 -28 -200 -4 40 -319 91 -9 -93 165 19 21 72 157 -84 134 -29 170 42 -117 -1
7553 -1 263 -189 -87 81 20 27 -88 24 -52 -160 -54 -193 73 -13 -191 109 77 146 -75 -181 -339 82 26
7576 26 65 -18 -36 -161 -176 19 -215 -100 156 -90 176 -4 139 -6 27 198 136 281 -142 -114 -49 60 119
7599 119 108 120 -3 -141 111 81 203 110 86 -10 28 -164 -160 214 -161 21 160 1 -120 -348 27 56 -143
7622 -143 31 -23 82 -61 -89 101 -81 34 -128 -1 -82 51 49 -47 -63 23 -44 -87 141 -192 -68 -44 54 56 59
7647 59 -166 -37 22 -56 -8 197 54 -57 -216 -4 -12 -8 80 46 51 -150 -199 201 -7 57 40 42 -220 -192 245 12
7673 12 133 -124 -53 -59 -46 -19 -20 24 -13 -94 -248 89 149 -122 3 229 135 -14 61 53 62 85 25 -49 -46 98 -217 -16
7701 -16 -180 -7 -15 83 188 100 -122 -73 -6 -83 -65 67 -137 -96 145 -25 62 -122 -170 96 -236 203 -72 -11
7725 -11 -81 -205 99 -106 22 -288 -171 -49 148 29 43 -143 52 11 3 136 149 -44 -182 90 28 -196 136
7748 136 68 -201 71 111 438 -148 31 -54 144 -158 171 -59 24 98 46 165 -31 -29 32 125 -2 79 71 37 -97
7773 -97 -43 184 -145 -328 80 -111 -123 66 -95 83 185 74 81 -167 -125 -291 -166 129 -270 35 257 172
7795 172 -47 118 -25 -174 95 -64 -137 -148 -314 88 29 219 43 3 -32 36 -274 -71 322 -72 -46 -54 32
7818 32 14 -37 48 -10 -95 -27 -354 -98 27 -42 -74 164 73 30 81 103 -6 -59 71 -47 148 -90 220 243 61
7843 61 172 -104 48 106 -29 98 3 10 27 -64 -14 44 -153 35 -25 -21 -32 -66 14 17 -30 -224 -364 214 122 -202
7869 -202 -175 -105 8 50 -50 115 -48 225 94 -92 -30 156 65 178 33 194 62 96 -108 -240 71 224
7891 224 -128 0 173 -224 -64 -31 -79 48 -92 -66 100 -17 -32 -124 15 -88 -5 46 8 134 53 203 35
7914 35 -127 98 -79 -20 197 -350 -14 100 19 265 112 -37 -64 -170 21 68 107 -51 -179 -119 -200 222 14
7937 14 2 -306 -207 71 24 122 -142 24 -48 265 33 -49 -26 -82 201 -65 136 -138 -138 99 -305 244 60 -78
7961 -78 -58 155 57 -30 -254 179 55 86 3 80 37 -146 0 -216 14 46 -152 77 135 136 -48 -186 -21 -228
7985 -228 4 77 -117 -140 -56 -38 -64 79 -199 -44 -102 8 216 -40 33 29 41 -48 -119 240 51 -132 -63 8 41
8010 41 40 -98 -126 -154 64 25 89 -61 73 -77 -118 -101 -5 45 -116 41 -11 44 84 -21 -37 -45 -70 50 59 177 -3
8037 -3 10 -230 5 -153 -1 128 372 149 -274 155 -182 -136 -44 186 -17 92 -300 -23 75 106 48 63 -216
8060 -216 -112 -73 153 103 -149 -61 17 -127 38 -41 -68 -62 94 33 -51 -103 -158 -30 72 36 -90 61 104 73 -120
8085 -120 -9 24 -97 21 -64 -212 -72 125 33 -144 -60 -88 49 10 71 -187 -50 145 158 -69 67 -103 -16
8108 -16 -67 -126 -142 -171 196 -1 -77 78 31 -236 -19 -92 63 87 -1 -142 187 193 -86 177 -68 101 37 -191
8132 -191 -137 32 -76 99 97 60 260 -49 -84 54 -25 6 92 -78 94 -241 134 46 -126 -115 -59 29 -83 20
8156 20 20 131 -57 99 73 214 -207 -231 133 -152 276 153 -22 -17 96 -95 414 -175 -131 229 63 223 -56
8179 -56 -179 -71 74 178 -69 18 -89 112 -104 90 -193 -48
8191d8
$$ Imaginary data points
##PAGE= N=2
##DATA TABLE= (X++(I..I)), XYDATA
0 0 0 0 0 0 0 0 0 0 0 0 0 0 0 0 0 0 0 0 8 -8 8 -8 8 -8 16 -16 16 -24 24 -28 32 -37 40 -47 53 -60 68 -76 84
39 84 -93 101 -114 125 -139 153 -169 189 -207 228 -252 276 -304 335 -370 410 -454 506 -565 636
59 636 -716 817 -943 1103 -1319 1622 -2081 2861 -4426 8830 -46758 -184041 -97220 81564
73 81564 170120 67712 -99367 -149703 -28616 117594 134488 7885 -114611 -108181 13531
84 13531 116304 96372 -23169 -111078 -82936 27711 105521 69946 -42333 -111489 -65254
95 -65254 48980 106935 45976 -68790 -112453 -34290 81910 105635 11767 -93606 -93456 12143
107 12143 105414 82726 -27899 -101389 -57880 49317 100263 44118 -54398 -87997 -23412 61915
119 61915 74517 7273 -65249 -67278 -272 60699 52935 -12800 -64282 -49499 13017 56815
131 56815 38280 -21009 -56043 -29927 26393 53152 23918 -28174 -46202 -11999 36775 47650
143 47650 9826 -33740 -38106 -802 37548 35534 -4013 -36760 -29775 6847 33255 21366 -15299
156 -15299 -36280 -20448 14045 28760 9817 -19258 -28403 -7693 18808 22031 2124 -16403
168 -16403 -14776 3422 17737 14124 -26 -8483 -4932 3722 8327 7024 2140 -2804 -5085 -3608
182 -3608 1193 5818 3932 -4572 -11585 -8244 2658 8371 2886 -8531 -12722 -4785 7072 9449
196 9449 881 -7535 -6770 1465 8410 8240 2015 -3186 -3056 938 5843 8600 5145 -3057 -8132 -4208
212 -4208 5583 11082 3494 -10577 -15388 -3858 11106 11949 -3657 -17917 -14506 4063 16690 8246
226 8246 -10534 -17609 -4978 13022 17042 2826 -11923 -11340 3954 16196 12767 -1432 -11582
239 -11582 -7702 5738 13848 8094 -4893 -12901 -7773 4769 11324 4412 -9574 -15376 -6442 7474
253 7474 11577 1629 -13028 -14697 -959 13191 12534 -2032 -13606 -9333 6863 16485 9737 -5647
267 -5647 -12553 -3078 11072 15189 3805 -10461 -11530 -110 11073 9802 -2683 -12967 -10439
280 -10439 1289 9923 5451 -6778 -13291 -7453 4891 10681 3575 -7953 -10771 -2124 9288 11417
294 11417 2347 -7973 -7704 2912 12050 9313 -1409 -8894 -5935 5192 11130 4808 -6138 -10632
308 -10632 -4023 6242 8218 -276 -10668 -11000 -1101 7935 6754 -3102 -11411 -7945 3235 10194
322 10194 5983 -4259 -9096 -3067 7933 11962 4491 -6270 -8172 98 9747 10389 1097 -8357
336 -8357 -7953 1511 8681 5846 -4369 -10911 -7115 3054 7908 2139 -7591 -10945 -3915 5627 7999
351 7999 215 -7981 -7868 1493 9328 7836 -792 -7567 -4269 5414 11055 5832 -3573 -7935 -2281
366 -2281 6764 9112 1937 -7124 -8815 -1260 6509 6449 -2133 -9646 -8617 -84 6737 4683 -3442 -8798
382 -8798 -5504 3323 8339 4082 -4061 -7031 -1311 7012 9320 2698 -4966 -5361 1790 7876 6279
397 6279 -1448 -6943 -3712 3699 6462 1486 -5935 -7409 -2318 3664 3894 -1943 -7116 -5517 273
412 273 4424 2973 -2016 -5182 -2975 2855 5990 4233 -798 -4174 -1617 4359 6725 3284 -2379
427 -2379 -4716 -747 5041 5562 204 -5916 -5196 249 4364 2293 -3885 -6759 -3308 2234 3369 -359
443 -359 -5062 -4474 575 4190 3182 -956 -3549 -1531 3284 5500 3224 -1335 -3010 129 4153 5060
459 5060 1697 -2863 -4129 -493 3832 3567 -603 -5153 -5160 -923 2970 2517 -2316 -6130 -4882 475
475 475 4388 3296 -2078 -5353 -2695 3380 6931 3879 -2385 -4978 -588 6207 8112 1473 -5233
490 -5233 -5275 1932 7793 5211 -3276 -8411 -4430 3803 6347 686 -6907 -7781 -1748 4403 4599 -1149
506 -1149 -5721 -5241 -190 5008 5365 1215 -4125 -4916 495 7711 8962 1497 -7389 -7130 2735 11893
522 11893 8636 -4629 -13467 -6485 8525 13430 1899 -13768 -14460 116 13497 9238 -6920
535 -6920 -16055 -8260 7231 13248 3778 -9527 -11713 -1410 9981 11124 1812 -7532 -7787 38
549 38 9073 11203 2866 -7972 -10294 -1078 11163 12673 -482 -14626 -13988 3024 16483 10475
563 10475 -9425 -20914 -9555 12129 18605 2342 -17727 -18174 1993 19453 14278 -6611 -18373
576 -18373 -8253 11152 18876 6877 -10368 -14276 -1743 12977 13972 1220 -11287 -11682 -165
589 -165 11570 10773 -1920 -13626 -12245 1251 12937 9872 -5605 -17375 -11172 6872 17177
602 17177 8098 -10759 -18093 -4506 14876 18588 2145 -15813 -14849 4213 19492 14288 -6374
615 -6374 -18361 -9204 10731 19055 6359 -13195 -18398 -3987 14004 15217 -967 -17217 -15403
628 -15403 2118 15735 10708 -7040 -17232 -9060 8495 16906 6836 -9917 -14806 -3427 12430
641 12430 15305 3078 -10916 -12209 697 13706 12787 -1285 -13916 -11468 3468 15032 9952
654 9952 -6911 -17758 -9876 8399 16534 5154 -13721 -18333 -2689 15439 15472 -2588 -17658
667 -17658 -12485 7626 19181 9409 -9449 -15817 -2859 13788 15480 1483 -12641 -11083 2472
680 2472 12621 8938 -3265 -11381 -7945 2801 9813 5562 -5414 -11854 -7625 4073 11072 5247
694 5247 -7847 -13902 -5122 9610 14503 3145 -11361 -12693 1873 15120 12281 -3673 -14351
707 -14351 -7267 8988 15750 5276 -10002 -13066 -1635 10405 9947 -1702 -11187 -8385 1832
720 1832 8146 4656 -4148 -8994 -5649 2695 7315 3844 -2937 -6942 -3415 4073 8185 4310 -3702
735 -3702 -6320 -1258 6633 8392 1553 -6089 -6168 1232 7263 4941 -3011 -7586 -3862 3645 5974 492
751 492 -6004 -6829 -1231 3811 3343 -1529 -4527 -2864 1281 3702 1516 -1553 -1526 35 2542 2847 945
768 945 -271 -445 883 1401 653 -246 -136 687 567 -503 -1609 -1412 -391 226 -513 -2289 -2266 -660
786 -660 1337 732 -1604 -2810 -1928 1350 3374 1779 -1614 -2838 67 3848 4321 1153 -3474 -2883
802 -2883 1216 5239 4590 -1237 -5840 -3893 2441 5847 2484 -4857 -8037 -3088 4500 6759 39
817 39 -7877 -8122 -25 7818 7068 -2507 -9268 -5646 4405 10549 5683 -4551 -9266 -2438 8034
832 8034 11079 2553 -8006 -9623 -72 9903 9197 -1476 -11028 -9111 2830 10934 6375 -6120
846 -6120 -13287 -6549 6563 11870 3652 -9289 -12438 -2521 10550 12113 650 -11179 -10039 3061
860 3061 13754 10118 -3652 -12868 -7464 6975 14363 6316 -8228 -13859 -4371 9601 12562 1087
874 1087 -12328 -12856 -492 12090 10135 -3581 -14154 -9823 4533 13410 7373 -6619 -13581 -5036
888 -5036 9167 14136 4038 -9463 -11781 -605 12406 12195 -449 -11834 -9709 3229 12952
901 12952 8253 -5278 -13525 -7177 6058 11756 3663 -9225 -12797 -3051 8894 10525 99 -10910
915 -10910 -10103 1410 11305 8853 -2526 -10631 -6372 5667 11881 6447 -5197 -10128 -2935 8141
929 8141 10382 2153 -8430 -9312 -282 8570 7606 -2296 -10161 -7927 1868 8432 4484 -4975 -9498
944 -9498 -4461 4689 8394 2385 -5884 -7519 -585 7428 7611 315 -6369 -5123 2175 7756 5612
959 5612 -1842 -6559 -3249 3429 6352 2142 -4548 -6039 -1834 3673 4157 -669 -5302 -4974 -207 3750
975 3750 3258 -1158 -4328 -3397 1021 4231 3153 -1430 -3407 -1697 2976 4688 2191 -1980 -3518 -257
991 -257 3557 3510 -126 -3436 -2721 825 3000 855 -2496 -3456 -1471 1357 1069 -734 -2072 -1359 -99
1008 -99 620 119 -386 168 362 319 237 1318 1622 1131 -177 -477 807 2032 1314 -360 -1553 -258 1170
1027 1170 1174 -944 -2003 -1263 407 354 -1230 -1621 -898 186 42 -1375 -1570 604 1705 961 -1440 -1387
1045 -1387 1211 2562 1866 -894 -2360 420 3234 2919 -337 -2265 -1495 2019 2513 162 -2421 -2375
1061 -2375 -198 1584 413 -1225 -2368 -1473 4 483 148 -169 -553 -1112 -586 667 1819 887 -682
1078 -682 -1353 523 2541 2986 215 -2201 -1580 1531 3383 1594 -1808 -2958 -1002 2060 2414 -552
1094 -552 -3594 -3005 -309 2166 1439 -1463 -3314 -2086 1105 2459 1080 -1207 -1967 -61 2167 2446
1110 2446 603 -836 -627 1124 2064 1254 267 -446 -217 347 458 -30 -317 -403 -955 -1227 -276 413 372
1129 372 -1284 -2232 -1108 1041 1473 -306 -1913 -1526 1163 2653 1384 -1099 -1890 425 2740 2203
1145 2203 125 -1303 -58 1439 1274 -408 -1029 12 590 -541 -1469 -1138 806 1003 -1410 -3035
1161 -3035 -1653 1954 2736 -210 -4078 -3106 1475 4803 2718 -2426 -4026 -179 4378 4232 -236 -3672
1177 -3672 -2019 2114 3981 2017 -1767 -2566 -1043 1234 1926 722 -1259 -2721 -2209 -330 2030 2343
1193 2343 -763 -4134 -3411 929 4762 2989 -2559 -5670 -1797 4710 6704 966 -5484 -5167 1611
1208 1611 7149 5218 -2238 -6363 -2861 4153 6103 1701 -4870 -5989 -1018 4550 4438 -657 -5562
1223 -5562 -4841 163 4541 3856 -1250 -5474 -3768 1869 5839 4202 -2573 -5710 -2973 4489 7503
1238 7503 2829 -4506 -6476 -844 6464 6664 -281 -7080 -6069 1526 7239 4747 -3525 -8501 -4660
1253 -4660 3534 7207 2223 -5897 -7656 -1368 6043 6715 88 -6436 -5516 1596 7339 5724 -1715
1268 -1715 -6244 -3261 3428 7007 3320 -3410 -5879 -1580 4046 5384 583 -4860 -5637 -401 4218
1283 4218 3927 -1374 -5430 -4592 711 4470 3212 -2010 -5174 -2694 2574 5410 1936 -2868 -4085
1298 -4085 -361 4402 4713 425 -3616 -2966 1321 4240 2521 -1641 -3619 -1878 1773 2677 268 -2247
1314 -2247 -2787 -764 1145 771 -589 -1602 -1566 -336 714 895 181 -235 -628 24 899 1099 935 306
1332 306 -13 -16 683 883 484 33 -436 -526 -327 244 443 -40 -732 -1687 -1251 165 1088 157 -1723 -2332
1352 -2332 -689 1670 2422 380 -2298 -2351 809 3461 2954 -298 -2886 -1754 2087 4166 2170 -2295
1368 -2295 -3617 -1073 2966 4127 390 -4074 -4347 -419 3875 3513 -1496 -5242 -3987 1307 4717
1383 4717 2840 -2274 -5331 -2578 3572 5362 1992 -3233 -4765 -316 4908 5384 235 -4596 -4237
1398 -4237 1207 5708 3917 -1765 -5898 -3555 2434 5406 2172 -4245 -6320 -1909 4072 5165 212
1413 212 -5718 -5453 110 5458 4762 -1474 -5718 -3488 2675 6612 3729 -2813 -5377 -1692 4372 6297
1429 6297 1388 -4288 -5366 -273 4597 4788 -745 -5360 -4423 779 4649 3282 -2541 -5414 -3439
1444 -3439 2144 4891 1527 -3397 -4736 -979 3769 4502 417 -3887 -3310 1122 4924 3455 -842
1459 -842 -4066 -2083 2420 4354 1801 -2257 -4175 -1280 2678 3345 46 -3750 -3788 -69 2792 2336
1475 2336 -1134 -3862 -2407 883 3009 1875 -1433 -3123 -1085 2193 3499 1374 -1727 -2444 40
1490 40 3238 2933 70 -2783 -2022 841 2730 1257 -1752 -2997 -1341 1275 2128 71 -2475 -2561 -645
1507 -645 1717 1959 -498 -1987 -1623 554 2002 1634 -238 -1748 -807 1108 2664 1634 -416 -1532
1523 -1532 -770 1212 2431 766 -1832 -2305 -576 1891 1873 -580 -2390 -2243 586 1762 553 -1301
1539 -1301 -2552 -956 1514 1713 326 -1557 -1420 381 1883 1887 42 -1132 -861 828 1947 1460 -184
1556 -184 -1350 -985 694 1853 601 -1123 -2284 -1099 721 1475 61 -2014 -2178 -627 1296 1542
1572 1542 -263 -1916 -1653 716 1981 1517 -573 -1625 -485 1676 2193 1089 -784 -1743 -284 1638
1588 1638 1931 -43 -1553 -1841 -87 1699 1051 -961 -1914 -1383 281 1622 365 -1100 -1429 -644 520
1605 520 833 512 -89 -685 -270 620 1301 1188 -119 -842 -424 655 1511 1159 -511 -1744 -617 1137
1623 1137 1425 -375 -1656 -1336 -23 1017 192 -896 -1304 -111 253 34 -567 -293 208 341 -187 -85
1641 -85 616 1255 864 -623 -969 617 2146 1493 -1161 -2179 -635 1835 1953 -425 -2693 -2109 802
1658 802 1994 388 -1830 -2680 -835 1077 1431 -64 -1333 -1323 19 877 1262 776 -441 -1156 -588
1675 -588 1202 2663 1438 -919 -2668 -962 2504 3296 594 -3158 -3367 273 3666 2176 -2015 -4526
1691 -4526 -2278 2228 3591 686 -3165 -3682 -187 3043 2978 -264 -2975 -2132 1287 3387 2202 -608
1707 -608 -2667 -1640 1350 3323 1969 -1067 -2940 -1245 1500 2868 1002 -2340 -3321 -1218 2345
1722 2345 2852 -101 -3243 -3322 78 2844 2233 -1039 -3194 -1780 1810 3488 1791 -1608 -2654 -546
1738 -546 2139 3240 807 -1981 -2114 219 2528 1911 -365 -2312 -1649 735 1701 648 -1392 -2302
1754 -2302 -941 574 995 -48 -1117 -1058 -135 617 555 495 -577 -630 174 591 1192 645 -181 -639 -228
1773 -228 900 1343 339 -722 -1034 227 988 447 -674 -1121 -878 142 179 -260 -673 -759 -259 -476 -458
1792 -458 -156 578 444 -345 -849 -16 1545 1752 39 -1374 -1150 1179 2519 1266 -1041 -2228 -600
1809 -600 1742 2142 72 -2542 -2030 17 1924 1478 -867 -2629 -1652 138 1845 1423 -430 -2141
1825 -2141 -1328 1113 2743 1425 -783 -2408 -744 2076 2973 1240 -2053 -2567 -525 3142 3066 -312
1841 -312 -2906 -3045 668 3101 1732 -1912 -3960 -1796 1727 3208 780 -2877 -3398 -620 2649 2996
1857 2996 -11 -2836 -2755 786 3322 2529 -791 -2856 -1788 1580 3265 1852 -1898 -2989 -1168 2156
1873 2156 3023 95 -3016 -3294 -456 2440 2403 -841 -3350 -2583 1047 3075 1566 -1565 -3363 -1123
1889 -1123 2026 3303 1079 -2320 -2826 30 2864 2858 139 -2729 -2261 679 2969 1768 -1165 -2801
1905 -2801 -1612 1133 2177 760 -1926 -2637 -1027 1713 2056 112 -2172 -2102 101 2228 1848 -324
1921 -324 -1694 -1399 1183 2197 1379 -623 -1997 -559 1554 2017 834 -1230 -1781 82 1447 1452 -95
1938 -95 -1813 -1824 212 1261 756 -913 -1630 -1049 621 1323 474 -959 -1268 -70 1165 1351 490 -714
1956 -714 -595 614 1190 1028 -185 -324 -37 695 584 216 -495 -471 -195 233 284 -157 -666 -908 -222 109
1976 109 140 -184 -209 -266 -64 68 398 -67 152 336 237 165 286 364 253 246 -139 36 1 303 281 -61 -649
1999 -649 -564 61 507 -185 -707 -900 -545 244 213 -252 -809 -690 41 654 748 92 -827 -295 542 1232 1165
2020 1165 -156 -933 -223 723 1399 786 -530 -1021 -396 823 1069 -111 -1355 -1386 -251 1216 363 -436
2038 -436 -1910 -1235 398 1470 505 -768 -1613 -508 1277 1701 355 -999 -1266 76 1884 1679 65
2055 65 -1398 -884 514 2112 1078 -672 -1853 -1125 893 1732 290 -1539 -1861 -521 1271 1331 -112
2072 -112 -1871 -1681 -3 1488 1377 -198 -1606 -1212 514 1782 1233 -623 -1433 -579 1416 2083 961
2089 961 -1487 -1584 -331 1610 1380 -615 -1945 -1510 313 1465 676 -1378 -1583 -573 715 1132 390
2106 390 -779 -1067 -185 1093 1096 403 -380 -694 189 1292 1320 253 -868 -1106 90 1302 1041 -311
2124 -311 -1419 -1089 437 1165 57 -1200 -1472 -216 873 573 -701 -1226 -412 645 631 481 -261 -262
2142 -262 542 661 462 -88 287 447 404 -140 33 386 357 32 -266 -340 86 37 -412 -672 -538 -93 28
2163 28 -182 -599 -501 135 364 6 -123 11 436 386 -139 33 307 675 607 151 -180 270 806 582 -94
2184 -94 -1034 -441 326 773 83 -733 -1001 -160 539 260 -526 -988 -712 138 616 371 -320 -480 -382 385 786
2205 786 434 -154 -510 -80 732 622 376 -419 -537 159 377 431 -20 -496 -438 -123 496 247 -274 -647 -638
2226 -638 -60 388 97 -112 -697 -692 460 1029 591 -201 -749 -77 794 789 323 -412 -472 510 783 369 -236
2247 -236 -566 -159 359 221 -108 -673 -145 -333 -27 -126 -248 -107 -386 -453 -345 122 477 201 -289 -556 322
2268 322 936 696 -112 -604 137 689 916 482 -585 -539 256 767 53 -302 -650 -216 27 177 -321 -493
2288 -493 -246 -188 -285 -124 26 119 -314 -475 -445 339 828 486 -260 -644 446 1134 850 93 -710 -379 483
2309 483 1175 253 -981 -944 -190 432 252 -353 -976 -565 -63 414 282 -207 -792 -535 217 510 323 -13
2329 -13 -298 -286 502 823 991 -103 -754 -198 893 1079 235 -755 -1144 180 898 971 -316 -1373 -688
2348 -688 212 565 196 -873 -943 -474 368 712 177 -729 -787 118 1137 821 -71 -789 -368 525 1066 617
2368 617 -185 -820 -89 784 1070 280 -560 -918 -166 657 662 -449 -1238 -1103 45 949 602 -498 -1185 -1003
2388 -1003 552 1360 488 -648 -1025 -145 1166 1540 319 -1126 -1061 -23 1435 1299 -195 -1500 -961
2405 -961 495 1290 659 -994 -1609 -673 589 1088 124 -1356 -1618 -11 1269 1331 -164 -1572 -947 609
2423 609 1783 1138 -548 -1350 -445 1095 1918 613 -1094 -1409 -120 1458 1428 -154 -1656 -1438 246
2440 246 1748 871 -1000 -2407 -1272 884 1868 347 -1232 -2144 -472 1638 1555 194 -1614 -1748 394
2457 394 2233 1531 -250 -1919 -1017 1131 1954 1017 -1098 -2038 -586 1252 1567 261 -1725 -2043 -277
2474 -277 1433 1772 -458 -2228 -1356 432 2067 1245 -825 -1884 -898 1614 1877 590 -1025 -1816 -302
2491 -302 1851 1793 257 -1523 -1403 317 1956 1312 -716 -1962 -917 882 1688 442 -1052 -1836 -478
2508 -478 1085 1257 -83 -1432 -1187 117 1534 1222 -203 -1439 -911 674 1579 882 -688 -993 -334
2525 -334 1119 1253 214 -1022 -932 33 835 783 -345 -1323 -1180 65 739 620 -655 -1064 -557 447
2543 447 821 115 -744 -733 21 634 837 84 -502 -341 311 1024 585 -608 -334 -209 289 682 60 -581
2563 -581 -528 -308 328 167 10 -776 -494 -33 125 64 -273 -363 -39 98 158 498 63 54 -50 300 -86 462
2585 462 77 142 211 182 -13 270 378 116 -252 -373 -137 -127 242 40 -436 -252 -86 278 122 -226 -574
2606 -574 -384 24 -25 537 -81 -140 -211 255 736 257 -147 -250 -122 632 711 403 -471 -408 -60 419 625 -46
2628 -46 -745 -751 115 661 349 -750 -1066 -509 357 857 -53 -838 -523 119 592 749 -84 -775 -197 506 739
2649 739 619 -395 -407 -91 325 563 270 -531 -825 -53 753 585 -153 -1095 -1160 76 910 521 -187 -886
2669 -886 -725 482 1046 423 -782 -693 197 1076 857 350 -692 -560 403 1154 809 -320 -1058 -663 332
2688 332 869 378 -772 -1299 -666 709 966 421 -1169 -1164 -291 1060 894 -242 -1093 -1025 168 1304 963
2707 963 -504 -1033 -664 756 1479 713 -609 -1312 -410 844 1393 200 -975 -1418 -90 1148 1178 -517
2725 -517 -1586 -1388 165 1643 617 -983 -1793 -746 1280 1777 406 -1341 -1428 -20 1735 1597 -130
2742 -130 -1286 -1134 619 1690 1014 -622 -1794 -974 803 1726 904 -958 -2078 -807 869 1876
2758 1876 382 -1840 -2229 -265 1784 2002 -210 -2030 -1638 695 2399 1515 -1136 -2186 -607 1649
2774 1649 2298 492 -1728 -1929 -20 1676 1527 -137 -1698 -1523 356 1520 930 -959 -2390 -1325
2790 -1325 481 1843 1045 -1057 -2115 -651 1358 2360 330 -1563 -1963 -162 2143 1894 -291 -1967
2806 -1967 -1354 939 2114 1283 -1102 -1929 -908 1313 2039 100 -1681 -1833 -291 1568 1312 -422
2822 -422 -1658 -1474 311 1314 961 -737 -1414 -816 834 1720 625 -979 -1091 -82 1151 1638 126
2839 126 -1054 -1337 79 1139 1133 -267 -1246 -733 456 979 484 -970 -1365 -792 340 945 -137 -754
2857 -754 -695 -27 968 802 -148 -595 -485 151 736 709 -232 -365 -126 308 675 179 -316 -491 154 289 119
2878 119 -196 -407 -308 -10 160 -163 -97 -189 -214 -155 265 25 177 -55 -27 -279 80 -24 46 -11 -227 209 67
2901 67 -62 152 228 25 102 -169 131 -98 36 -269 -253 -333 -99 221 -30 -327 -525 13 355 333 -44 -413
2923 -413 -119 321 631 325 -119 -354 139 571 257 -109 -99 -133 -50 300 145 -134 -289 -343 1 327 190
2944 190 -441 -541 -193 68 198 30 -198 -185 -143 74 307 0 -91 -113 167 339 519 193 -327 292 19
2965 19 202 -76 90 -131 -65 123 -89 -143 -15 145 -173 -428 -420 -257 -221 37 -324 -52 -360 106 109 46 -79
2988 -79 -308 166 396 407 29 -182 -213 310 695 12 -342 -414 -374 162 260 274 -318 -431 -84 362 457 -259 -704
3011 -704 -497 48 632 499 -269 -631 -403 320 748 493 -226 -526 2 691 881 17 -556 -739 -130 836
3031 836 692 -196 -1139 -513 307 920 492 -639 -1051 -434 519 691 189 -890 -1043 171 591 876 -90
3050 -90 -834 -489 343 1031 780 -296 -824 -300 726 921 548 -531 -590 -45 498 742 -297 -909 -809
3069 -809 -88 512 682 -336 -1035 -820 268 729 460 -525 -965 -129 666 757 221 -516 -808 22 778 694
3089 694 152 -750 -472 322 624 262 -239 -583 -386 416 396 -95 -422 -687 -206 171 335 -56 -471 -484 72
3110 72 335 151 -131 -101 306 142 533 190 -90 -384 37 297 188 33 23 -218 -154 -51 -55 60 62 -304 -183
3133 -183 -335 -28 -259 -13 -253 -353 -322 -36 260 106 -226 -115 -32 262 316 181 96 -314 -124 351 291 251
3155 251 -130 -208 -257 175 298 -178 -355 -616 -42 332 135 -247 -606 -486 467 593 329 -200 -463 -450 337
3176 337 574 206 -241 -762 7 901 929 116 -442 -505 179 631 791 -188 -963 -310 324 675 327 -1058
3196 -1058 -1249 -596 726 557 -164 -745 -886 100 763 697 -506 -826 -241 634 1131 815 -312 -758 -327
3215 -327 778 1192 308 -719 -1105 -305 688 937 -191 -1222 -1022 242 1040 603 -640 -1213 -722 852
3233 852 1208 431 -872 -1101 24 1245 1006 -331 -878 -962 424 1235 1023 -279 -987 -678 443 1037
3251 1037 907 -460 -1288 -374 611 1136 279 -1190 -1222 -277 1136 821 -83 -1142 -996 521 1321 824
3269 824 -794 -1446 -709 938 1548 425 -1098 -839 -77 1219 1275 -150 -1230 -844 538 1079 931 -439
3287 -439 -1403 -719 485 1259 266 -956 -1257 -493 804 1218 326 -1107 -1258 -20 1379 1306 -296 -1307
3305 -1307 -838 671 1319 951 -544 -1287 -349 1008 1387 148 -1543 -1419 -77 1208 900 -103 -1560
3322 -1560 -1027 162 1327 844 -632 -1450 -786 1065 1471 502 -1157 -1400 67 1248 1202 12 -1468
3339 -1468 -921 482 1493 1087 -430 -1314 -702 714 1129 535 -1115 -1584 -522 876 1167 -20 -1250
3356 -1250 -1545 -171 1033 1099 -358 -1308 -1249 473 1610 1089 -704 -1213 -172 1111 1424 172 -897
3373 -897 -1014 330 1303 1008 -187 -1249 -823 118 993 560 -598 -1337 -303 353 929 293 -491 -1157
3391 -1157 -160 1146 859 249 -820 -652 273 996 911 -119 -1197 -789 545 1269 699 -363 -1013 -186
3409 -186 728 784 -46 -846 -966 -80 569 377 -366 -1183 -479 33 711 459 -516 -690 38 393 708 500
3429 500 -496 -152 -63 700 731 8 -460 -350 141 635 437 -296 -938 -421 5 500 73 -527 -657 -384 296
3450 296 447 -204 -603 -267 -74 280 492 65 -227 -6 355 373 230 -109 -165 12 173 338 -69 163 -211
3471 -211 35 193 186 -88 -21 -150 -111 35 115 -20 33 -62 -133 -72 37 10 32 55 217 -7 135 273 85 107
3495 107 138 84 117 247 308 16 -100 -19 94 197 -43 -304 -177 -134 67 -13 -138 -271 -228 -51 326 20 -356
3518 -356 -360 -197 637 755 387 -145 -240 54 491 189 -56 -310 -182 232 337 411 -234 -687 -240 214 370
3539 370 -26 -440 -723 -231 348 57 111 -645 -274 -58 779 534 -72 -394 -403 146 839 546 -325 -634 -5
3560 -5 528 651 155 -526 -735 -57 639 557 -94 -704 -622 92 717 365 -194 -1075 -116 263 892 469 -486
3581 -486 -545 -314 498 738 83 -595 -325 349 812 577 -75 -700 -259 440 906 461 -487 -748 -253 397
3601 397 595 166 -719 -656 -71 657 509 -148 -882 -509 84 690 349 -330 -606 -187 650 768 469 -378
3621 -378 -403 -20 916 698 102 -718 -361 255 489 200 -289 -639 -279 355 525 375 -580 -483 -380 108 392
3642 392 70 -455 -394 24 456 526 -109 -434 -251 157 543 551 -158 -473 -199 537 440 -379 -299 -339 105 293
3664 293 168 -213 -574 -466 116 291 219 -198 -198 -287 248 461 -188 -347 -314 -161 176 425 -33 -398 60 36
3686 36 175 209 -29 -180 -18 291 253 -117 -370 -374 -74 92 81 -89 -182 -24 -67 87 76 -28 -396 104 69
3709 69 12 86 -36 -72 105 76 427 131 107 21 -149 -72 65 -131 14 -58 -150 72 210 44 38 34 -165 127 -25
3734 -25 54 -187 89 32 251 -444 66 263 98 271 -4 -195 -78 -4 -35 -165 -140 -81 84 63 -34 0 107
3757 107 -74 59 -180 14 114 -131 -117 -305 66 70 165 -126 -306 21 325 473 -6 -241 -58 7 241 317
3779 317 -12 -7 -40 66 286 180 -84 -570 -132 -107 164 -31 -135 -21 6 177 181 -162 -265 63 -67 283
3801 283 336 -179 -445 -94 194 578 327 -94 -288 -9 691 515 -56 -359 -278 -82 181 511 -297 -660 -439
3822 -439 85 513 306 -106 -717 -357 258 682 -95 -589 -557 226 726 779 95 -404 -325 380 555 209 -268
3843 -268 -552 -88 156 407 296 -206 -386 -46 350 677 -211 -675 -548 98 506 515 -311 -659 -518 21 920
3864 920 499 -263 -743 -475 778 642 -83 -531 -437 58 627 395 -51 -570 -496 181 698 369 -310 -665
3884 -665 -425 437 346 256 -230 -515 -232 337 659 -97 -646 -218 278 514 431 -165 -721 -165 345 729 367
3905 367 -499 -582 -115 527 546 113 -476 -667 -167 713 447 -262 -755 -418 209 669 326 -311 -571 -49 293
3926 293 502 275 -351 -475 -103 515 686 -16 -666 -202 220 886 66 -305 -541 -457 480 420 167 -615 -741
3947 -741 -270 239 427 -35 -547 -435 227 493 423 -220 -330 -498 369 666 458 -419 -568 0 370 438 -108
3968 -108 -566 -556 35 481 488 -7 -605 -415 152 498 70 -171 -692 -511 541 97 202 -360 -554 -131 755
3989 755 306 123 -218 -305 94 509 491 -319 -589 -226 416 571 150 -34 -20 -177 259 296 0 -275 -239 -31
4011 -31 390 110 -256 -363 6 -100 424 287 -358 -75 138 222 437 -45 43 -196 132 434 110 89 -94
4032 -94 -267 115 27 126 -76 -40 94 35 18 -284 -98 -269 -273 -165 18 135 -57 -55 -220 -86 -280 106 287
4055 287 288 -6 -235 68 235 298 188 98 -369 -236 381 238 -112 -468 -420 73 301 460 -183 -652 -383 348
4077 348 311 -53 -663 -517 -306 299 501 -177 -241 -678 314 717 790 118 -687 -260 533 624 116 -258 -647
4098 -647 -18 363 773 -70 -608 -678 -59 755 653 -68 -1047 -720 437 780 482 -522 -1054 -366 617 857
4118 857 267 -832 -807 174 969 975 133 -627 -637 275 729 758 -321 -908 -347 514 1021 263 -653 -1058 -381
4139 -381 814 694 -154 -623 -862 246 856 873 -498 -780 -598 381 942 683 -690 -988 -377 678 992
4158 992 17 -850 -756 180 879 726 -412 -966 -523 555 767 457 -708 -683 -373 442 633 35 -668 -576
4178 -576 155 741 488 144 -533 -546 242 947 366 -252 -712 -273 290 583 313 -401 -399 -54 804 553 82
4199 82 -489 -471 -74 711 208 -26 -765 -486 232 517 202 -303 -364 -2 421 688 68 -191 -163 247 434
4220 434 427 -248 -324 -117 74 323 279 -297 -277 -93 132 182 -59 -207 -302 -239 115 287 27 -248 256 -109 168
4243 168 162 49 -109 206 -69 76 -101 103 15 185 189 -85 -160 -67 -12 25 -75 -164 -413 -343 -100 99 -44 -342
4267 -342 -116 -238 176 -83 -45 -233 128 51 -103 104 -83 144 10 183 6 36 264 -103 22 14 122 -363
4289 -363 -165 -253 -25 135 -43 125 81 -77 76 101 52 177 117 -484 -15 86 -56 -264 140 208 157 14
4311 14 26 -81 -67 -35 -48 -181 -91 -116 122 251 -320 22 -31 -15 -20 59 -205 -122 110 286 -195 -160 -306 196 36
4336 36 -198 216 133 -157 32 72 -42 7 7 -28 9 71 -148 177 32 -278 -139 -164 2 -295 -134 -67 -146 211
4360 211 15 -150 0 30 12 167 91 -27 -203 31 162 211 -87 -100 118 -57 -62 324 79 -146 56 82 -134
4383 -134 -52 28 -104 -31 -78 -52 -89 -96 -283 -71 -85 75 88 141 -213 88 59 128 -425 -106 -96 223 139 -224 167
4408 167 -185 -103 437 184 -16 -194 -10 -18 90 139 -133 -156 -13 192 -170 42 -250 -8 141 -312 174 25
4430 25 -57 -354 -46 95 19 151 -82 -37 62 320 14 -14 53 62 214 -80 -337 -86 -194 -156 92 44 -105 -163
4454 -163 -36 -63 -291 -53 -180 -38 -77 117 320 -105 13 140 154 194 33 -78 277 -30 228 93 97 160
4476 160 116 70 -181 201 -58 -147 56 -70 -45 229 71 -3 -25 -97 -445 -8 75 79 -171 89 -102 118 503
4499 503 126 21 20 -221 170 -11 42 201 98 66 -130 266 119 -25 -512 3 100 146 70 -164 -133 -265 230
4522 230 200 140 -96 -315 -11 220 77 -49 -21 -58 -99 106 398 -115 -232 -37 177 235 -89 -220 -254 47
4544 47 196 390 -351 -447 -374 169 433 254 -165 -290 -146 26 560 143 -374 -164 -12 298 383 191 -388
4565 -388 -157 93 423 238 -386 -506 -132 312 549 246 -310 -334 -21 287 255 90 -354 -273 -131 142 261
4586 261 -48 -233 -273 187 389 207 59 -252 -192 428 416 18 -122 -198 180 400 -45 -82 -217 -213 33 226
4608 226 182 -323 -325 -303 267 300 288 -309 -278 178 224 167 -26 -147 -98 86 95 178 -175 26 -36 -7 -31 34 14 -148
4634 -148 89 -99 -68 -70 -305 -133 -111 101 113 10 -74 -272 36 84 -102 53 158 19 1 -410 33 228 299
4657 299 243 67 47 -48 -32 148 -150 -226 -111 274 73 -25 -193 -457 -84 239 427 -123 -333 -275 100 351
4679 351 358 -123 -285 -158 300 363 332 -274 -381 58 114 233 155 -384 -247 25 324 254 -272 -511 -314 204
4701 204 299 88 -97 -612 -6 468 474 177 -201 -384 -150 489 462 101 -172 -323 160 688 416 -142 -849
4722 -849 -354 196 758 300 -337 -336 -94 507 368 74 -437 -405 28 467 128 -163 -737 -351 -62 538 177
4743 177 -386 -507 -117 573 516 287 -284 -361 -91 721 440 189 -343 -612 -89 592 428 -197 -769 -343 261
4764 261 562 252 -382 -467 -3 380 358 129 -579 -550 0 486 367 -119 -510 -412 313 119 443 -109 -411
4785 -411 -281 252 478 57 -368 -514 -54 256 498 -130 -494 -82 54 362 176 -202 -394 -421 379 356 367
4806 367 -303 -222 104 155 369 120 -298 -244 25 190 215 100 -263 -255 74 397 112 106 -269 26 187 -45 -131
4829 -131 -131 -265 -32 9 232 36 -370 -228 -86 316 107 89 -201 -57 110 120 167 -190 217 -76 221 -192
4851 -192 268 -260 -29 -24 85 128 -121 247 -382 -7 -174 -73 299 76 -148 -161 82 159 192 159 -33 -148
4873 -148 -152 107 239 177 -80 -153 -350 200 -11 125 -233 -159 112 69 186 -61 -332 -69 31 114 188 -179 -311
4896 -311 -182 98 385 218 -397 -298 -14 466 280 108 -154 16 130 564 350 -232 -270 -133 446 318 91
4917 91 -129 -588 -300 200 174 -166 -303 -622 212 496 278 -78 -264 -307 207 350 504 -146 -255 -204 289
4938 289 521 67 -116 -432 307 186 548 -159 -385 -223 -129 415 571 -513 -196 -203 58 190 205 -490 -460
4959 -460 60 135 565 -36 -310 -275 180 231 200 78 -339 -288 105 319 357 -47 -470 -473 128 230 -14 -234 -439
4982 -439 -32 241 306 -120 -258 -166 -44 339 341 -234 -354 -45 178 256 63 -130 -395 -455 175 215 -20 -53 -95
5005 -95 66 246 82 62 -302 178 -49 -72 -100 -238 -174 -119 50 34 -58 -279 68 43 -101 -312 72 -144 71
5028 71 -125 -66 -193 156 -202 -36 -13 158 160 167 -94 -30 -147 -207 -162 -109 2 6 -137 -13 -211 -103 60 -74
5052 -74 -130 -85 12 234 165 -110 -109 -72 284 218 250 -23 -220 16 299 282 7 -164 89 95 100 102 -217 -194 -158 149
5078 149 123 33 -383 -235 -21 314 67 -134 -60 -307 216 430 200 -235 -80 50 117 492 59 -139 -169 -70
5100 -70 153 330 -165 -288 -350 140 184 -47 -51 -292 -296 123 126 299 -237 -152 -274 417 169 373 -118 -188 198 438
5124 438 527 -300 -242 161 131 173 412 -448 -354 49 -75 406 109 -378 -572 -126 365 172 126 -139 -514 109
5146 109 562 220 -287 -202 -203 353 673 -2 -514 -452 114 320 533 -190 -190 64 105 89 285 -114 -226 -180 77
5169 77 286 -108 -252 -133 -69 201 133 -59 -300 -83 139 366 149 -92 -416 -41 80 515 227 -294 -296 -160
5191 -160 95 245 135 -437 -269 87 -57 232 -43 -308 -135 -10 114 144 70 -219 -95 358 382 -37 -216
5212 -216 -220 -10 39 315 -189 -79 5 102 132 149 32 -70 -316 161 131 -154 -30 -239 -144 -34 143 -13 -28
5235 -28 -300 -97 -219 3 -229 -267 -3 -169 -31 68 107 -110 -24 47 184 -131 -295 -145 -118 158 -81 8 -144
5258 -144 72 -155 -8 -73 36 41 -81 -192 -104 265 64 183 114 -241 31 -87 -40 97 100 -26 -203 67 222
5281 222 129 58 -63 -13 148 15 -88 -74 3 57 157 157 -165 -268 20 -99 112 -94 -122 -243 -346 -48 340
5304 340 15 -58 147 -330 282 292 -121 -357 -117 254 22 20 -197 -233 -137 418 236 14 -174 -322 -102 344
5326 344 128 34 -58 -397 -20 214 278 -83 -344 -164 368 289 221 130 -370 161 300 316 62 -238 -282 204 241
5349 241 147 -160 -414 -185 131 329 195 -156 -473 -380 -158 411 -130 -405 -424 170 109 152 119 -16 -180 154
5371 154 326 191 151 -261 -207 218 514 189 152 -184 17 251 202 -37 -48 -413 -119 289 182 85 -47 -387
5393 -387 -291 119 -287 -159 -518 11 166 25 218 -214 -296 -131 353 317 -272 -55 -70 43 126 280 94 0
5415 0 -41 201 -48 60 87 -309 -25 -52 -52 -40 -118 -327 -313 -34 131 -64 -148 -61 -13 202 62 145 -90 -220 97
5440 97 49 113 -77 -142 -37 -330 -34 29 -39 26 55 -52 -82 23 -142 144 9 -177 -337 -6 159 -48 -45 -19
5464 -19 -122 157 -188 29 -136 290 15 226 -196 -222 -78 162 103 87 286 -16 -97 -180 -64 334 185 89
5486 89 -160 -83 -21 61 291 -506 -150 -10 171 109 -163 42 17 175 203 36 -27 -56 -17 246 -7 -60 -138 -203
5510 -203 255 189 91 -230 -244 -53 -268 82 265 -311 -113 109 -21 -213 234 -222 -168 -280 172 58 -108
5531 -108 58 -125 48 210 -103 194 -259 -70 -7 115 -187 -278 -116 -345 152 193 133 -215 -63 224 213 -101
5553 -101 34 -220 -37 64 -121 -239 -52 -13 166 73 -136 22 9 -75 -2 64 148 -185 10 -204 187 -50
5575 -50 -19 -137 33 -15 22 1 193 -131 -306 -46 -35 30 85 -74 -140 -198 138 169 -121 14 44 -82 130 72
5599 72 57 159 -126 135 88 -138 -103 22 102 -237 -168 96 119 14 -31 95 -27 -7 84 -15 -57 -89 -175 38 -20
5624 -20 -126 151 90 -113 -294 85 151 15 6 39 -254 -83 243 -11 -88 164 -59 220 -48 69 -94 -97 193
5647 193 17 11 41 13 353 -121 -36 216 -51 148 -198 -212 -44 -27 44 202 233 111 216 -313 145 147 199 -125
5671 -125 -173 -93 40 184 -272 -38 -306 -97 11 -63 72 -243 34 -132 141 135 205 69 35 160 92 6 -139
5694 -139 123 88 68 44 50 -431 -72 -55 199 24 -21 -267 -215 74 529 69 -345 -160 96 316 50 -186 -270
5717 -270 -374 39 286 331 6 -183 -212 35 498 140 -146 -368 194 229 253 -54 -106 -97 31 70 147 -153 -218
5740 -218 -292 257 282 198 -70 -405 114 161 337 19 -471 -525 116 289 422 -50 -381 -529 118 272 19 -162
5762 -162 -109 -405 57 221 249 -218 -153 -137 366 293 -143 -59 -162 140 603 313 -65 -233 -283 262 185 128 -240
5785 -240 -239 -105 300 383 190 9 -193 105 227 392 -410 -268 -246 75 389 -66 -140 -121 50 33 238 232 -93
5808 -93 -129 104 274 185 7 -15 -54 -196 318 128 93 -252 -227 145 262 -51 123 -212 -39 135 7 119
5830 119 -153 -103 52 21 -37 6 34 -196 -40 173 205 -26 97 89 29 -116 243 -132 194 173 57 214 -117
5853 -117 -253 -25 -347 -221 -446 52 187 -150 170 -149 82 234 -241 -28 114 -223 -29 35 138 -148
5873 -148 -214 76 178 -1 155 -84 -418 -32 241 44 29 21 -267 -2 317 -82 44 -308 -205 194 135 194
5895 194 -249 -342 43 212 8 67 -250 -277 -109 317 573 -11 -182 -226 193 302 292 -50 -150 -171 153 253
5917 253 109 -278 -219 -113 131 586 -109 -308 -294 101 427 284 -61 -610 -106 36 193 155 -273 -216 -157 364
5939 364 341 4 -186 -301 39 291 200 17 -422 -432 108 298 333 -229 -422 -265 225 345 219 -162 -444
5960 -444 -154 247 353 -36 24 46 112 393 -137 29 -117 -299 -116 290 368 -196 -242 -252 239 173 76 -354 -331
5983 -331 122 432 60 -69 -244 -61 80 118 219 -206 -186 -37 126 33 50 -9 -363 -11 130 53 2 -223
6005 -223 95 74 193 8 -173 -150 -220 62 11 93 -166 -24 0 24 -81 -88 -29 -173 -111 27 66 -90 -53 -19 108
6030 108 -43 3 27 -117 251 -107 211 101 48 -75 -3 191 176 161 -93 174 28 -10 18 130 -45 -189 -69
6053 -69 -45 -157 -366 -233 -171 -15 -207 -89 227 10 121 -91 -90 73 147 -153 -84 -170 19 -90 -79 188 170
6076 170 -76 232 25 -77 -249 113 121 282 -58 -202 -217 -200 -169 209 -89 182 -80 0 -88 -4 -41 22 -331
6099 -331 -238 117 311 -169 95 111 -11 -111 145 122 -77 -1 -54 -5 23 51 -119 -189 -32 189 -87 -164 -105 -84
6123 -84 182 52 -45 26 -32 41 -237 106 -267 205 -142 -61 75 75 129 -79 -175 -80 -59 17 -53 -41 -1 81 -6 146
6149 146 -66 11 -79 -138 116 161 -26 84 187 -25 6 -231 -42 59 50 11 263 3 57 308 78 103 -27
6172 -27 91 59 294 156 206 -166 120 -22 -82 -180 -148 207 69 77 344 62 100 221 -147 -43 -55 132 -335
6195 -335 9 155 301 63 70 33 -56 -52 -17 1 21 -84 42 116 -82 -114 60 40 21 -118 36 -9 -77 -146 43
6220 43 -116 -210 -195 75 -12 326 -37 -152 81 122 -68 143 27 -76 43 -111 140 -276 -55 -97 42 -161
6242 -161 103 -35 180 -89 186 211 -33 -170 -231 108 -76 -100 -148 129 65 213 137 108 -135 73 -84 153
6264 153 5 256 -162 -289 48 66 143 -56 -48 -149 -70 -22 200 31 -147 -96 202 161 42 48 76 70 273 224 274
6289 274 -114 114 243 -196 90 35 62 65 193 135 74 107 -46 -22 -139 80 -83 -43 -99 -138 -40 79 48 29 -106
6314 -106 126 301 -160 58 -171 -35 30 279 131 201 -135 136 188 228 6 -139 24 122 93 18 64 -120 39
6337 39 173 -124 -43 -112 -132 41 -220 114 -25 60 -12 61 21 161 45 -170 8 9 -116 176 -183 29 -291
6360 -291 88 -11 -182 -83 256 78 124 290 -128 -251 41 82 5 1 46 119 -14 51 108 -146 -229 -179 -45 -126 88
6385 88 -5 -79 128 -22 257 11 52 124 -180 -145 -197 -88 214 -134 -103 -79 96 65 -31 300 -66 -199 -68 199
6409 199 126 51 223 -79 -101 -50 104 -35 252 83 -11 26 6 -228 32 -177 -133 13 135 176 134 -80 309
6432 309 -431 156 14 102 37 -210 -75 -138 -87 -232 72 19 321 21 34 -25 42 11 -44 120 -33 102 46 56
6456 56 47 -127 -154 -150 300 -96 -17 -112 -234 3 5 -188 249 -57 -232 -22 116 65 184 -81 -182 70 40 -357
6480 -357 3 -195 -34 366 -182 -191 39 5 -161 143 113 36 -274 -40 177 128 92 -205 -154 -50 99 52 19
6503 19 -304 -35 54 361 -89 9 -283 -50 312 -37 46 -30 -302 -172 -122 46 -98 -91 -45 29 380 255 -61
6526 -61 -293 -103 47 80 10 -126 -63 168 231 233 44 -226 -67 -18 -147 86 -97 -285 76 144 386 503 -159
6549 -159 33 103 6 101 -100 96 -223 156 133 114 -216 -88 -233 42 130 105 18 39 212 72 215 -55 106
6572 106 -299 -53 -34 102 58 -186 -335 291 363 -15 -154 -203 -239 28 240 52 -294 -302 -60 201 111 -105 -26
6595 -26 -214 -225 219 124 -41 -18 -84 119 84 133 -298 -128 33 93 216 131 214 -215 90 -50 -111 9 -68 147
6619 147 -99 134 -18 103 -65 -10 75 86 288 -93 -135 -34 97 123 -213 -144 35 54 -41 202 -81 -12 3
6642 3 52 -7 162 -126 -242 141 -40 3 -194 -258 -221 124 -14 1 -26 -7 9 -9 187 -122 -141 -27 -37 20 151
6667 151 -31 114 244 -103 -373 225 8 -92 52 6 143 -6 15 -42 128 72 54 -139 -13 -45 -262 -8
6689 -8 -81 46 11 -63 143 -54 129 23 256 73 -74 -67 -24 60 78 33 64 226 -38 97 -16 -50 102 -110
6713 -110 123 38 -196 -174 -170 -64 -419 -153 -18 79 -40 -35 20 -36 46 -167 2 -45 154 51 -60 -115 -86 118
6737 118 53 -5 -3 -92 -154 159 40 -81 122 -65 290 382 2 23 -23 53 159 86 238 101 -163 107 -44 40
6761 40 -72 -61 -101 213 -116 -157 -41 -78 -113 -104 -193 -18 51 -261 150 172 -263 -79 -255 -71 156 -32 75 -55
6785 -55 -6 -118 205 170 -106 363 194 -4 275 -14 -7 22 -245 -73 9 205 -110 -90 257 -202 9 4 52 276
6809 276 -130 -53 21 218 -113 -144 -26 -228 -63 54 -116 -211 128 443 265 -11 -96 50 -93 -161 -47 248
6831 248 -144 -239 30 155 63 -132 -221 -245 13 163 28 14 44 -82 96 72 107 33 -99 -59 163 41 202
6854 202 -33 -167 -1 198 66 97 -160 104 -251 180 -232 -89 118 124 154 -14 -158 152 -7 112 136 -15
6876 -15 76 66 9 50 172 129 141 120 -28 30 141 -41 -97 -43 -85 157 -2 -47 20 -152 14 -105 56 60 -42
6901 -42 22 -51 -20 -16 2 3 149 157 -109 136 0 -213 4 22 18 -30 -117 30 -24 218 -9 -55 -54 45 -82 -112 -107 51
6929 51 155 -99 -1 72 58 -134 -76 -101 -15 2 129 -88 -163 378 88 143 168 214 14 -92 -145 206 221 164 92
6954 92 -35 -27 68 -118 62 48 -68 248 -102 -116 126 -316 -44 110 -75 -83 128 -26 -137 -103 -37 112 -37
6977 -37 43 -64 190 -139 68 -95 -61 94 79 160 -112 262 -75 -89 3 133 108 -96 -37 88 -205 209 -23
7000 -23 -21 121 236 134 -57 -154 137 59 -4 -12 -149 275 -19 -291 44 -177 238 -115 -48 -45 48 35 17 -62 -242
7025 -242 124 116 -62 -12 -17 129 5 -315 -10 -169 11 -79 117 290 -63 -85 -40 12 78 136 -30 78 -5 80
7049 80 -90 -25 51 89 52 -48 55 -68 20 147 -68 402 141 85 -46 134 110 -83 253 263 -132 53 -61
7072 -61 193 132 30 88 -148 -1 327 156 -267 -14 -91 -214 293 62 188 -10 -178 36 220 108 -72
7093 -72 -190 59 24 255 175 249 -114 -106 -106 172 43 -139 -150 170 195 277 134 52 -97 -28 -80 42 28 -211 -13
7118 -13 -168 156 47 -92 -195 -389 268 41 -21 -15 26 -78 87 146 82 -115 4 106 -61 89 -150 49
7140 49 -68 -68 35 165 -99 80 -20 110 209 147 -3 -57 -109 108 76 -16 -38 82 -184 -140 -85 -52 -42 88 29
7165 29 -152 157 99 15 47 -97 -60 -30 -140 -182 76 260 -117 -180 61 -90 166 -20 210 27 -276 28 -12
7188 -12 -136 43 -235 -179 86 -70 149 32 -19 -133 15 60 -147 -287 -1 -38 -147 310 -90 174 -205 22
7210 22 63 78 126 -100 -50 38 177 -55 -216 174 48 211 98 227 -75 -71 11 -140 234 -27 -66 -6 75 -85
7234 -85 150 -101 23 117 29 67 60 -109 182 -178 -79 166 272 -75 65 -164 -303 40 141 -44 -216 212
7256 212 -111 -103 -116 -222 -28 -153 -173 -29 61 -133 -25 -39 178 -29 -173 22 -64 151 85 27 115 -10 -30 3
7280 3 -270 -49 -1 25 153 55 69 -154 -27 18 -75 -90 358 -17 9 -85 -242 174 -10 -35 -55 79 150 15 81
7305 81 164 -168 -217 -78 31 -269 -27 -15 -58 -41 -350 25 56 -40 -145 -243 -129 108 130 58 -93 17 -177 124
7329 124 -143 -137 -7 330 -74 223 48 2 -268 60 350 -57 -135 -118 -188 123 62 6 60 -4 -87 171 -106 -49
7353 -49 -189 77 237 -59 73 -85 -39 34 19 -48 198 0 -59 78 27 -13 103 -25 65 -95 109 53 170
7376 170 77 205 -59 -145 -239 -271 -239 185 217 49 -220 -4 -49 -51 -74 -65 -157 117 195 241 273 -287 25 -166 86
7401 86 216 -66 20 -32 87 -3 57 -80 -189 57 313 -97 -155 -38 70 -39 76 79 -111 -143 -33 98 -95
7424 -95 14 -180 129 -11 -157 75 2 -163 -48 108 -108 -71 -45 -215 -102 -53 -44 203 38 -94 -38 -116 247
7447 247 -9 -173 -6 -186 -185 229 120 -18 24 79 101 -115 96 -19 -106 -240 11 95 46 -142 -117 138 53
7470 53 -6 192 -11 -48 9 -23 93 -126 -169 -88 -237 2 106 19 -132 -23 -71 -99 52 -46 -54 104 -82 35
7494 35 2 -14 23 15 207 -134 -152 -33 -256 -65 151 175 32 -24 -125 129 124 -39 -70 -85 -98 64 -69 -27 -52
7519 -52 -80 -120 -175 -35 159 -122 -120 -14 -338 -7 -7 117 149 -12 -101 213 74 47 181 51 17 -214 -5 196
7543 196 122 1 -184 64 -58 167 57 48 94 -151 142 -290 -76 -108 24 57 -40 -105 336 -196 161 83 -153
7566 -153 157 -37 -90 160 -103 116 -61 177 96 -114 -8 -9 163 113 -36 -165 -49 -134 25 20 29 -94 115
7589 115 160 95 -53 -145 -21 5 138 30 -102 152 12 59 18 -208 366 25 192 68 205 -219 126 -81
7611 -81 -2 13 68 17 -92 -207 -3 304 76 115 2 209 -125 171 144 -203 93 -124 27 58 194 66 168
7634 168 208 88 109 87 -44 -102 -152 13 229 147 135 13 -28 -274 -92 -39 11 -255 12 -308 18 28 25 206
7658 206 60 108 -420 7 -4 -77 127 173 -195 -109 67 -110 79 364 146 8 -100 120 -168 -193 -140 72
7680 72 124 107 -54 -94 -32 142 219 -96 -166 55 195 -44 -155 12 288 -18 10 -101 -79 -135 -42 36 -120 -20
7704 -20 97 -142 -2 -115 -144 260 -19 -216 154 72 167 -149 177 -40 -41 -154 -31 16 176 105 67 -120 236
7727 236 -81 78 -209 -50 20 21 34 113 32 28 22 -286 -14 -40 -9 5 5 38 92 -43 -40 302 62 -101 -79 94 -6
7754 -6 -31 67 119 -133 54 52 -9 -23 -231 225 -102 -36 -29 4 -163 141 209 147 239 31 -117 67 123 61 96 3 40
7781 40 141 11 214 5 124 -160 -106 260 -115 -319 115 -42 99 -102 363 -370 -54 66 -29 153 -28
7802 -28 -95 -86 -12 62 -14 -134 -149 -90 51 27 -83 67 270 -235 1 47 -137 91 107 91 129 -31 -5 210 116
7827 116 -174 -156 -71 260 -110 103 24 278 -213 -53 130 -350 -207 -42 10 -69 180 -32 -133 -39 -92 -25 -41
7850 -41 103 134 -186 -42 -151 76 -34 178 13 -126 200 12 91 20 55 -85 94 63 -115 -44 39 -120 48
7873 48 224 -245 -134 143 -65 303 -136 -221 66 -80 145 281 -240 -25 70 198 203 -207 -82 367 -80 18
7895 18 -105 -16 -114 12 86 -34 -157 -81 -233 163 -127 -105 42 -156 -118 -7 6 -125 -138 204 -148 -86 -109 25
7919 25 69 9 -52 261 282 -33 145 2 168 170 -4 67 133 -164 234 4 200 -42 134 -21 -48 144 -133
7942 -133 -249 66 -11 -9 123 42 -294 -55 41 66 -84 -166 -366 215 35 58 108 162 122 69 -57 -317 -161 -110
7966 -110 -20 -131 -17 -208 -35 -17 108 -173 -72 32 -101 34 33 54 221 -116 -153 162 47 -215 214 99
7988 99 -132 -55 371 -80 -162 201 -57 -23 34 -97 344 9 46 171 -127 -178 -160 -20 -142 -200 -252 75 -8 34
8012 34 -66 -207 -275 -78 -89 -6 -92 4 65 -101 170 -185 -69 -44 -76 152 -72 37 60 0 178 19 125 -5
8036 -5 10 -128 -31 58 18 5 7 44 77 -209 -135 43 50 270 -33 7 -16 132 -157 53 -117 96 104 -392 -54 30
8062 30 -189 -51 -248 -79 39 -355 -41 38 -176 103 61 -1 -275 -159 -85 -38 18 -2 30 -61 20 46 139 186 1
8087 1 -13 -65 22 -12 -126 -56 30 -127 58 -200 -167 -134 -152 92 -8 -137 218 -31 49 -55 136 18 -46 21 -66
8112 -66 -66 -36 -32 105 -61 108 83 208 34 -8 -33 33 -145 207 -5 0 44 -166 -68 -74 70 148 1 -56 -10 13 221
8139 221 216 -156 -11 -105 99 -123 33 257 -54 -105 -146 -36 -79 -118 132 218 -22 76 83 225 -67 -31 -56 -49 -64
8164 -64 114 208 -143 -67 -158 109 -116 -5 -82 -1 -45 269 185 46 -53 -103 -286 193 398 -24 22 -124 -223 -121
8188 -121 96 -25 -124
8191a24
##END NTUPLES=NMR FID
##END=
