##TITLE=1H_Pr Q-14
 CDCl3
 8 sc, 
 14.2.2023
##JCAMPDX= 6.0         $$ Bruker NMR JCAMP-DX V2.0
##DATA TYPE= NMR FID
##DATA CLASS= NTUPLES
##ORIGIN= UXNMR, Bruker Analytische Messtechnik GmbH
##OWNER= root
$$ XWIN-NMR		Version 3.5
$$ Tue Feb 14 13:54:40 2023 Russian Standard Time (UT+4h)  she@DPX200
##.OBSERVE FREQUENCY= 200.13135
##.OBSERVE NUCLEUS= ^1H
##.DELAY= (6, 6)
##.ACQUISITION MODE= SIMULTANEOUS
##.ACQUISITION SCHEME= undefined
##.AVERAGES= 8
##.DIGITISER RES= 18
##SPECTROMETER/DATA SYSTEM= spect
##.PULSE SEQUENCE= zg30
##.SOLVENT NAME= D2O
##.SHIFT REFERENCE= (INTERNAL, D2O, 0, 15.7039)
##AUDIT TRAIL= $$ (NUMBER, WHEN, WHO, WHERE, WHAT)
$$ ##TITLE= Audit trail, XWIN-NMR		Version 3.5
$$ ##JCAMPDX= 5.01
$$ ##ORIGIN= Bruker BioSpin GmbH
$$ ##OWNER= she
$$ F:/spectra/data/she/nmr/H-F/1/audita.txt
$$ ##AUDIT TRAIL=  $$ (NUMBER, WHEN, WHO, WHERE, WHAT)
(   1,<2023-02-14 13:53:44.39 +0400>,<she>,<DPX200>,
      <created by zg, POWCHK disabled, PULCHK disabled
       configuration hash MD5:
       00 E9 B6 7A A2 85 ED C7 34 08 36 98 17 FE 4E 26
       data hash MD5: 16K
       D4 9C B3 9C 71 33 BD E3 43 65 8D 14 8B 98 30 D4>)
$$ ##END=
$$ 
$$ hash MD5
$$ 84 C5 6B CD E6 11 F3 16 EB 8B 2D 72 C8 52 B7 6B
##$RELAX= 
##$RELAX= 
##$RELAX= 
##$RELAX= 
##$RELAX= 
##$RELAX= 
$$ Bruker specific parameters
$$ --------------------------
##$DU= <F:/spectra>
##$EXPNO= 1
##$NAME= <H-F>
##$PROCNO= 1
##$TYPE= <nmr>
##$USER= <she>
##$AMP= (0..31)
100 100 100 100 100 100 100 100 100 100 100 100 100 100 100 100 100 100 
100 100 100 100 100 100 100 100 100 100 100 100 100 100 
##$AQSEQ= 0
##$AQ_mod= 1
##$AUNM= <au_zg>
##$AUTOPOS= <>
##$BF1= 200.13
##$BF2= 200.13
##$BF3= 200.13
##$BF4= 200.13
##$BF5= 200.13
##$BF6= 200.13
##$BF7= 200.13
##$BF8= 200.13
##$BYTORDA= 1
##$CFDGTYP= 0
##$CFRGTYP= 5
##$CHEMSTR= <none>
##$CNST= (0..31)
1 1 145 1 1 1 1 1 1 1 1 1 1 1 1 1 1 1 1 1 1 1 1 1 1 1 1 1 1 1 1 1 
##$CPDPRG= <>
##$CPDPRG1= <>
##$CPDPRG2= <>
##$CPDPRG3= <>
##$CPDPRG4= <mlev>
##$CPDPRG5= <mlev>
##$CPDPRG6= <mlev>
##$CPDPRG7= <mlev>
##$CPDPRG8= <mlev>
##$CPDPRGB= <>
##$CPDPRGT= <>
##$D= (0..31)
0 1.2 0 0 0 0 0 0 0 0.06 0 0.03 0 0 0 0 0.0002 0 0 0 0 0 0 0 0 0 0 0 0 
0 0 0 
##$DATE= 1676368423
##$DBL= (0..7)
120 120 120 120 120 120 120 120 
##$DBP= (0..7)
150 150 150 150 150 150 150 150 
##$DBP07= 0
##$DBPNAM0= <>
##$DBPNAM1= <>
##$DBPNAM2= <>
##$DBPNAM3= <>
##$DBPNAM4= <>
##$DBPNAM5= <>
##$DBPNAM6= <>
##$DBPNAM7= <>
##$DBPOAL= (0..7)
0.5 0.5 0.5 0.5 0.5 0.5 0.5 0.5 
##$DBPOFFS= (0..7)
0 0 0 0 0 0 0 0 
##$DE= 6
##$DECBNUC= <off>
##$DECIM= 32
##$DECNUC= <off>
##$DECSTAT= 4
##$DIGMOD= 1
##$DIGTYP= 9
##$DL= (0..7)
0 120 120 120 120 120 120 120 
##$DP= (0..7)
150 150 150 150 150 150 150 150 
##$DP07= 0
##$DPNAME0= <>
##$DPNAME1= <>
##$DPNAME2= <>
##$DPNAME3= <>
##$DPNAME4= <>
##$DPNAME5= <>
##$DPNAME6= <>
##$DPNAME7= <>
##$DPOAL= (0..7)
0.5 0.5 0.5 0.5 0.5 0.5 0.5 0.5 
##$DPOFFS= (0..7)
0 0 0 0 0 0 0 0 
##$DQDMODE= 0
##$DR= 18
##$DS= 0
##$DSLIST= <SSSSSSSSSSSSSSS>
##$DSPFIRM= 0
$$ [...]
##$SUBNAM2= <"">
##$SUBNAM3= <"">
##$SUBNAM4= <"">
##$SUBNAM5= <"">
##$SUBNAM6= <"">
##$SUBNAM7= <"">
##$SUBNAM8= <"">
##$SUBNAM9= <"">
##$SW= 18.05172834244
##$SWIBOX= (0..15)
0 0 2 0 0 0 0 0 0 0 0 0 0 0 0 0 
##$SW_h= 3612.71676300578
##$TD= 16384
##$TD0= 1
##$TE= 0
##$TE2= 300
##$TE3= 300
##$TEG= 300
##$TL= (0..7)
0 120 120 120 120 120 120 120 
##$TP= (0..7)
150 150 150 150 150 150 150 150 
##$TP07= 0
##$TPNAME0= <>
##$TPNAME1= <>
##$TPNAME2= <>
##$TPNAME3= <>
##$TPNAME4= <>
##$TPNAME5= <>
##$TPNAME6= <>
##$TPNAME7= <>
##$TPOAL= (0..7)
0.5 0.5 0.5 0.5 0.5 0.5 0.5 0.5 
##$TPOFFS= (0..7)
0 0 0 0 0 0 0 0 
##$TUNHIN= 0
##$TUNHOUT= 0
##$TUNXOUT= 0
##$USERA1= <user>
##$USERA2= <user>
##$USERA3= <user>
##$USERA4= <user>
##$USERA5= <user>
##$V9= 5
##$VALIST= <valist>
##$VCLIST= <CCCCCCCCCCCCCCC>
##$VD= 0
##$VDLIST= <DDDDDDDDDDDDDDD>
##$VPLIST= <PPPPPPPPPPPPPPP>
##$VTLIST= <TTTTTTTTTTTTTTT>
##$WBST= 1024
##$WBSW= 4
##$XGAIN= (0..3)
0 0 0 0 
##$XL= 0
##$YL= 0
##$YMAX_a= 263306
##$YMIN_a= -195959
##$ZGOPTNS= <>
##$ZL1= 120
##$ZL2= 120
##$ZL3= 120
##$ZL4= 120
##$ABSF1= 10
##$ABSF2= 0
##$ABSG= 5
##$ABSL= 3
##$ALPHA= 0
##$AQORDER= 0
##$ASSFAC= 0
##$ASSFACI= 0
##$ASSFACX= 0
##$ASSWID= 0
##$AUNMP= <proc_1d>
##$AZFE= 0.1
##$AZFW= 0.1
##$BCFW= 1
##$BC_mod= 2
##$BYTORDP= 1
##$COROFFS= 0
##$CY= 11.3945322036743
##$DATMOD= 1
##$DC= 2
##$DFILT= <>
##$DTYPP= 0
##$F1P= 2.36226072786647
##$F2P= -0.459571619588291
##$FCOR= 0.5
##$FTSIZE= 0
##$FT_mod= 4
##$GAMMA= 1
##$GB= 0.15
##$INTBC= 1
##$INTSCL= 1
##$ISEN= 128
##$LB= 0.24
##$LEV0= 0
##$LPBIN= 0
##$MAXI= 10000
##$MC2= 0
##$MEAN= 0
##$ME_mod= 0
##$MI= 1.114404
##$NCOEF= 0
##$NC_proc= 0
##$NLEV= 6
##$NOISF1= 3.799351
##$NOISF2= 2.8
##$NSP= 1
##$NTH_PI= 0
##$NZP= 0
##$OFFSET= 15.70392
##$PC= 1
##$PHC0= -19111.5
##$PHC1= 9.20078
##$PH_mod= 1
##$PKNL= yes
##$PPARMOD= 0
##$PSCAL= 0
##$PSIGN= 0
##$REVERSE= no
##$SF= 200.130013532006
##$SI= 16384
##$SIGF1= 3
##$SIGF2= 2
##$SINO= 400
##$SIOLD= 16384
##$SREGLST= <1H.CDCl3>
##$SSB= 0
##$STSI= 0
##$STSR= 0
##$SW_p= 3612.71676300578
##$SYMM= 0
##$S_DEV= 0
##$TDeff= 0
##$TDoff= 0
##$TI= <>
##$TILT= no
##$TM1= 0
##$TM2= 0
##$TOPLEV= 0
##$USERP1= <user>
##$USERP2= <user>
##$USERP3= <user>
##$USERP4= <user>
##$USERP5= <user>
##$WDW= 1
##$XDIM= 8192
##$YMAX_p= 0
##$YMIN_p= 0
$$ End of Bruker specific parameters
$$ ---------------------------------
##NTUPLES= NMR FID
##VAR_NAME=  TIME,          FID/REAL,        FID/IMAG
##SYMBOL=    X,             R,               I
##VAR_TYPE=  INDEPENDENT,   DEPENDENT,       DEPENDENT
##VAR_FORM=  AFFN,          ASDF,            ASDF
##VAR_DIM=   8192,          8192,            8192
##UNITS=     SECONDS,       ARBITRARY UNITS, ARBITRARY UNITS
##FACTOR=    0.0002768,     1,               1
##FIRST=     0,             0,               0
##LAST=      2.2672688,     0,               0
##MIN=       0,             -195959,         0
##MAX=       2.2672688,     263306,          0
$$ Real data points
##PAGE= N=1
##DATA TABLE= (X++(R..R)), XYDATA
$$ [...]
1957a301Q55p1J40n91J12N21n6o61J564J03n03J092j30l6k67J18k35m89m96R31
$$ -1301 -446 -517 -377 -968 -856 -335 -391 -1052 512 615 112 1204 1074 1038 771 889 654 165 -331 600
1977F00r00l13J084q53l86K38L98j86n09J010L42j647M38O32n43j65K88J126n6
$$ 600 -300 -613 471 -382 -768 -530 -132 -318 -827 183 525 -1122 -684 -52 -595 -760 -472 654 598
1996E98l99P10K33j150P01L32q41J66M4kp42o42J005m58r00J262K96m67M19k73
$$ 598 199 909 1142 -8 693 1025 184 350 394 392 -350 -992 13 -445 -1345 -83 213 -254 165 -108
2016a08J33o62l1J179j282M12R39m36m56P26j15o4m32O75O87j316O41O23j287
$$ -108 25 -637 -668 511 -771 -359 580 144 -312 414 299 235 -197 478 1165 -151 490 1113 -174
2035a74m03K57J44l27l35J001k50p02J124m60m32N11M06O1j65J28M83j283m43
$$ -174 -577 -320 -176 -503 -838 163 -87 -789 335 -125 -557 -46 360 421 256 384 867 -416 -859
2054h59J105k64k11O09j6m4m10N9M76j056J1R17q86N0L42l8q4n85O46L58o18J228
$$ -859 246 -18 -229 380 364 320 -90 -31 445 -611 -600 317 -569 -519 -177 -215 -299 -884 -238 120 -498 730
2076G30L84j193N80J38k06m50k07N88j66p10J010k24j063O75j80P2p6N3L60k62
$$ 730 1114 -79 501 639 433 -17 -224 364 198 -512 498 274 -789 -114 -294 -222 -298 -245 115 -147
2096a47l17Q89q73k53P51j64P4J91L10l5l88J25K82m75P94j8r19M44k36j6j93
$$ -147 -464 425 -448 -701 50 -114 -40 151 461 426 38 163 445 -30 764 746 -173 271 35 19 -174
2117a74l53M36J12n86N48jk02r2j99P37n24O2P03j61m78P83l46m85O06n28M40
$$ -174 -527 -91 21 -565 -17 -18 -220 -312 -511 226 -298 -236 467 306 -172 611 265 -220 386 -142 298
2138B98k81J70N76o73k0K94o07J54M47m45K79m95K67L8q84O46K87o98N79J13K5
$$ 298 17 187 763 90 70 364 -243 -89 358 -87 192 -303 -36 2 -882 -236 51 -647 -68 45 70
2159G0J79m24O81k16n67N57K62p85L23J59j29l25k98O19j41PL15j20n0L43o23
$$ 70 249 -175 506 290 -277 280 542 -243 80 239 110 -215 -513 106 -35 -28 287 167 117 460 -163
2180a63K15m9l25K32o82J97P71o22K2Q55k58K2Q4J3M37j005L13j35k61R1l09P5
$$ -163 52 3 -322 -90 -772 -575 196 -426 -404 451 193 215 299 312 749 -256 57 -78 -339 -248 -557 -482
2202d82L37l73L54K96l27N18J7n96O41l66q8j4j29L30j87l95Q26k41R0L06ql84
$$ -482 -145 -518 -164 132 -195 323 340 -256 385 19 -69 -83 -212 118 -69 -464 362 121 211 517 509 125
2224A25j66j54K41q72J42J88p28K56L27P6M23J48L48L08k13O80m16l34K84k49
$$ 125 -41 -195 46 -826 -684 -496 -1224 -968 -641 -565 -142 6 354 662 449 1129 713 379 663 414
2244D14l27N3k42QJ22n47Q12l29l9N57o86k38M10n02k03J3m57L60k65L45P80R2
$$ 414 87 140 -102 -94 28 -519 293 -36 -75 482 -204 -442 -32 -534 -737 -724 -1181 -821 -1086 -741 39 131
2266A31M68M15m26J004l87j40Q8q88n2l81l85K69l63J19L9l4K09L33m00L99k74
$$ 131 599 1014 588 1592 1205 1065 1153 265 213 -168 -553 -284 -647 -528 -489 -523 -314 19 -381 18 -256
2287b56l73K67k13n04L60p25J053K53j50J062j25Q51J31l42J84J05j168J53k75
$$ -256 -629 -362 -575 -1079 -719 -1444 -391 -138 -288 774 649 1500 1631 1289 1473 1578 410 563 288
2306B88o71Lk90k18J60j11O51k57J35J60l8p8p1n73M71k02k97O61n5O03N63oL98
$$ 288 -383 -380 -670 -888 -728 -839 -188 -445 -310 -150 -188 -266 -337 -910 -439 -641 -938 -277 -332 271 834 828 1226
2329A226K65k49J11k94k7k95m70m06m40o17M40k12k53Q16k55J04L74n4K05l77
$$ 1226 1491 1242 1353 1059 1032 737 267 -139 -579 -1196 -756 -968 -1221 -405 -660 -556 -182 -236 -31 -408
2349d08J7L47p28M59J53l28P75J20M28K55R7L89J78o97q0k35m82l08p63j59J18
$$ -408 -391 -44 -772 -313 -160 -488 287 407 835 1090 1187 1576 1754 1057 977 742 260 -48 -811 -970 -852
2370h52p61M46J96l85R13j18L94N20N8j49o4l03N03p75M55K03O3JN08j4L33n7
$$ -852 -1613 -1167 -971 -1356 -443 -561 -167 353 411 262 198 -105 398 -377 78 281 344 345 853 839 1172 1115
2392A115l49J43n58n00Q0n63n09j65R2K63j41N21L54R3K23L72m71O97j15l24j01
$$ 1115 766 909 351 -149 -69 -632 -1141 -1306 -1214 -951 -1092 -571 -217 -124 99 471 0 697 582 258 157
2413A57j39J28k33l4P85p24M71N01%k80K10o03J66o03m18M28p45l53M28J01J10
$$ 157 18 146 -87 -121 664 -60 411 912 912 632 842 239 405 -198 -616 -188 -933 -1286 -858 -757 -647
2434f47K8n6J009m24K85L93l64L09K30m30n2j39J17J59m26P37j96m38M52J52m85
$$ -647 -619 -675 334 -90 195 588 224 533 763 333 281 142 259 418 -8 729 533 95 547 699 214
2455B14n31K42K3n74k54K06m74k6L01K13L97M65Q8L63k0j63M78o63N3L33o97Q5
$$ 214 -317 -75 -52 -626 -880 -674 -1148 -1174 -873 -660 -263 202 290 653 633 470 948 285 338 671 -26 59
2477E9L11m5l45k72J66L5l39M97K56r03L98j39o3o68J74M41l4j73J013J29o2N5
$$ 59 370 325 -20 -292 -126 -91 -430 67 323 -580 -182 -321 -384 -1052 -878 -437 -471 -644 369 498 436 491
2499D91Q2K08j87k1L28m45m35K20o47l44L06k4P8J63K32K27l01k76L82m24k01
$$ 491 573 781 594 573 901 456 21 241 -406 -750 -444 -468 -390 -227 5 232 -69 -345 37 -387 -588
2520e88O49l4j75n1K88K34o53M45N13m12N15N2k29o0k37r8l47j94M08k88J00P5
$$ -588 61 27 -148 -199 89 323 -330 115 628 216 731 783 554 494 257 159 -188 -382 26 -262 -162 -87
2542h7j64j71J73j82K52k82L55L27m46O0M21m91K04J11K01oR1J87L66r49n4L79
$$ -87 -251 -422 -249 -431 -179 -461 -106 221 -225 -165 256 -235 -31 80 281 275 366 553 919 -30 -84 295
2564B95k62p4q8K42l64j24K65Pl36J89k6j97N07o4j74j53K84K82m60r2P84j16
$$ 295 33 -41 -129 113 -251 -375 -110 -103 -439 -250 -276 -473 34 -30 -204 -357 -73 209 -251 -343 441 325
2586C25l73J24M58n4n01M9L59o14J1N56m78r1NR6j27k32K29J85l47N04pq6k0K3
$$ 325 -48 76 534 480 -21 28 387 -227 -216 340 -138 -229 -224 -128 -255 -487 -258 -73 -420 84 77 -9 -29 -6
2610fJ45j53J13K02n02k1M57k86m70N16r6m4K94j66K10n25j04L03k6K7J8K44j27
$$ -6 139 -14 99 301 -201 -222 235 -51 -521 -5 -101 -145 149 -17 193 -332 -436 -133 -159 -132 -114 130 3
2633Cp7K9L17k68J02L20o95J90J03Nk07K71K1K41o15O98n10k34M35j70q9J56m13
$$ 3 -74 -45 272 4 106 426 -269 -79 24 29 -178 93 114 355 -260 438 -72 -306 129 -41 -130 26 -387
2656c87M76l8l03O46P9k76J6j6o5Q7l98M6k46L3n8j09M46M7j90J77Q2l06L50j86
$$ -387 89 51 -252 394 473 197 213 197 132 219 -179 -133 -379 -346 -404 -513 -67 -20 -210 -33 49 -257 93 -93
2680i3K6L47k60n9K8r1j2p1M32k18P8o4L07k08RJ38j80n8k35K14j41l68L42o6
$$ -93 -67 280 20 -39 -11 -102 -114 -185 247 29 107 43 350 142 151 289 109 51 -184 30 -111 -479 -137 -203
2704b03o6J56m33O27j17l3K78k63k24K85k18K33Q1j29L27J3J91q9j98J5L08l50
$$ -203 -269 -113 -546 81 -36 -69 209 -54 -278 7 -211 22 103 -26 301 314 505 416 218 233 541 191
2726A91k66J34j55j95P0j62K22k79L02j43l6L73k03k21L20j53O0O9J01R6l39K41
$$ 191 -75 59 -96 -291 -221 -383 -161 -440 -138 -281 -317 56 -147 -368 -48 -201 -141 -72 29 125 -214 27
2748B7N00o99N36j12j62L11o7m8j41k14j39N0l33m5J67j29J66R9O0J75o9J00J87
$$ 27 527 -172 364 252 90 401 334 286 145 -69 -208 -158 -491 -536 -369 -498 -332 -233 -173 2 -67 33 220
2771B20l16J23j91j19K24j3n5L67jR4rK1L94m07k45J96k34j58k26l19M36j43J38
$$ 220 -96 27 -164 -283 -59 -72 -127 240 239 333 324 345 739 332 87 283 49 -109 -335 -654 -218 -361 -223
2794b23n6M6j01J26L71m5m7q9J45k28R8L59l89J67J88l52K66q1J20J78l01O5q9
$$ -223 -279 -233 -334 -208 163 118 71 -18 127 -101 -3 356 -33 134 322 -30 236 155 275 453 152 217 128
2817A28j3j45l7q5p7OP1K53o51M49p3J82j25M29O0j47n21M85l75o6N09l04q6L59
$$ 128 115 -30 -67 -152 -229 -223 -152 101 -550 -101 -174 8 -117 312 372 225 -296 189 -186 -252 257 -47 -133 226
2841B26j97J41k64K27r7J80p6O4m43Kn1qKk79K08K17j28L57noJ41mK58k46k84
$$ 226 29 170 -94 133 36 216 140 204 -239 -237 -288 -296 -294 -573 -365 -148 -276 81 76 70 211 207 465 219 -65
2866f5M05k27j17J43l40L3L29l32J15L42k19K28l60K39k16k84J06J01O1J39j76
$$ -65 340 113 -4 139 -201 -168 161 -171 -56 286 67 295 -65 174 -42 -326 -220 -119 -58 81 -95
2887i5J08K86k46NJ03j84K48j22n5M7M1j16N5m74K80K1k61M79j48j01L76k73Q2
$$ -95 13 299 53 58 161 -23 225 103 48 95 136 20 75 -399 -119 -98 -359 120 -28 -129 247 -26 56
2910E6J70l52L31l51K5L29k68k32K54J61M6j14J0L65l34q0K46o44L90j56L9M3
$$ 56 226 -126 205 -146 -121 208 -60 -292 -38 123 169 55 65 430 96 16 262 -382 8 -148 -109 -66
2932f6k84M24k20j33K39J08l46K96L11j95q0n6L89l84q1J83M0k89N50k75J12j70
$$ -66 -350 74 -146 -279 -40 68 -278 18 329 134 54 -2 387 3 -78 105 145 -144 406 131 243 73
2954G3k05L76j90k53K47l2k40L22m17N55l82j28K59r5J65j40K9K96j56lL26m13
$$ 73 -132 244 54 -199 48 16 -224 98 -319 236 -146 -274 -15 -110 55 -85 -56 240 84 81 407 -6
2976fK01Pj70M03j09m11K95k49J76m9j2J46k80j19K87k86k72L94J03N9j52l1R5
$$ -6 195 202 32 435 326 -85 210 -39 137 88 76 222 -58 -177 110 -176 -448 -54 49 108 -44 -75 20
2999B0J26k68L03j21J39K28l58J73l11K64m21Q4M08j93m97K16L13m62K11J94j82
$$ 20 146 -122 181 60 199 427 69 242 -69 195 -226 -142 266 73 -424 -208 105 -357 -146 48 -134
3020a34kK8L65l60r1K68P6k40Q9k12K12j39J49K55p7j30J56l67J29r9J36j35N
$$ -134 -136 -108 257 -103 -194 74 150 -90 -1 -213 -1 -140 9 264 187 57 213 -154 -25 -124 12 -123 -118
3043a18pK19l62K32M2j62P7R8P6j7j81K93n9m40K67j03o6k11K84q4J60NL02k07
$$ -118 -125 94 -268 -36 6 -156 -79 19 95 78 -103 190 131 -309 -42 -145 -211 -422 -138 -222 -62 -57 245 38
3067C8l19L19QQ5k78L67j22j65k51L94k93m5J82m9O7J59K39l82K0J18P2k50J74
$$ 38 -281 38 46 131 -147 220 98 -67 -318 76 -217 -262 -80 -129 -62 97 336 -46 -26 92 164 -86 88
3090H8n3k15N01k13M6l10j51J53N4l16N84m30J02L38k32k4j08N7M0K46j19J8j21
$$ 88 35 -180 321 108 154 -156 -307 -154 -100 -416 168 -262 -160 178 -54 -78 -186 -129 -89 157 38 56 -65
3113f5M0L94m62J57k07K91j43j52J65k7m0n6J08j74k6J04k05M33o80L94k8J9L01
$$ -65 -25 369 -93 64 -143 148 5 -147 18 -9 -49 -105 3 -171 -197 -93 -298 135 -545 -151 -179 -160 141
3136A41l11K16q1J91j80K5K30j09j72J02QJ96j47Qm95K86j93lL42k69k34J30J44
$$ 141 -170 46 -35 156 -24 1 231 122 -50 52 60 256 109 117 -378 -92 -285 -288 54 -215 -449 -319 -175
3159a75J80k4m0nR2r0K46k33j09K8j16L28R4l21N97j72l8j84k20M29l34j91k04
$$ -175 5 -19 -59 -64 28 -62 184 -49 -158 -130 -246 82 176 -145 452 280 242 58 -162 267 -67 -258 -462
3182d62N28l60j64M19q6r9p8K44j32K35n5q7K78j63k34N21l03o5K86k93mL54j36
$$ -462 66 -294 -458 -39 -125 -224 -302 -58 -190 45 -10 -97 181 18 -216 305 2 -63 223 -70 -74 280 144
3205A44%m0Q2j12J2j72K00l78K30J92l35RJ18P3q7l4K57o9q8l4r2O4K46k48k0
$$ 144 144 104 186 74 86 -86 114 -264 -34 158 -177 -168 -50 23 -64 -98 159 90 2 -32 -124 -60 186 -62 -82
3230h2l0K70L0m06L42J18k15k7J51k36Lp7K40l05n5J69O1k02L24K34m00KK45q1
$$ -82 -112 158 188 -218 124 242 27 0 151 -85 -82 -159 81 -224 -279 -110 -49 -251 73 307 -93 -91 154 73
3254G3oJ8r6j32K84J12k14P1J91m45J90k06K57L0k31Q0K7o5j78J01J40j47j3r0
$$ 73 67 85 -11 -143 141 253 39 110 301 -144 46 -160 97 127 -104 -24 3 -62 -240 -139 1 -146 -159 -249
3278b49k2L64J35m56J15P2l9J72j31qM1L25m01L43j50k35L87j42j82J95j03P1
$$ -249 -271 93 228 -228 -113 -41 -80 92 -39 -47 -6 319 -82 261 111 -124 263 121 -61 134 31 102
3300A02P4k86L58j02l91M67l89J71K7k09P8O0q1Q7k9k44L11j22K31k50l9J8Q7
$$ 102 176 -110 248 146 -245 222 -167 4 31 -178 -100 -40 -121 -34 -63 -307 4 -118 113 -137 -176 -158 -71
3323g1R2R3k05N6J3jL4l22J68m6J80O5p1Q1R9j60L8k19Q0K77m04Q2m1K17J92m04
$$ -71 21 114 -91 -35 -22 -23 11 -311 -143 -189 -9 56 -15 66 165 5 43 -176 -96 181 -223 -141 -182 35 227 -177
3349a77K65j0j43k9L77o6l21J04J33k83L3L8J57K7J49k13r5P9P0J44R7k20j38
$$ -177 88 78 -65 -94 283 217 -104 0 133 -150 -117 -79 78 105 254 41 -54 25 95 239 336 116 -22
3372b2L65n07K95m72J06N3q9L01P7j71M7jR4k5J2q9r6%J15l0j7R3k41L78L9j76
$$ -22 343 -164 131 -341 -235 -182 -271 30 107 -64 -17 -18 76 51 63 -26 -122 -122 -7 -37 -54 39 -202 176 215 39
3398C9j0K66l39J23Q2j08j51L4M0J2r8K61ml78L42k97K29N5r5j0mk62J93J14j06
$$ 39 29 295 -44 79 161 53 -98 -64 -24 -12 -110 151 147 -231 111 -186 43 98 3 -7 -11 -273 -80 34 -72
3423g2K29j78J03k43J07L11k37J21k52J10q5O6k77L54j96K00k63m4L8M67k22j5
$$ -72 157 -21 82 -161 -54 257 20 141 -111 -1 -86 -20 -297 57 -139 61 -202 -246 -208 259 37 22
3445B2J91J08k31j96M0K36j68k21K89k87J15L24j04j48O5j10K18K4j90O9j31J00
$$ 22 213 321 90 -106 -66 170 2 -219 70 -217 -102 222 118 -30 35 -75 143 167 -23 46 -85 15
3467A5l1j41P5O9P1j0j48M75n61K54R2k9l55L55m0o2l5j86K53P2m12O2K94j2n4
$$ 15 -16 -157 -82 -13 58 48 -100 375 -186 68 160 131 -224 131 91 29 -6 -192 61 133 -279 -217 77 65 11
3492A1J12p3J33j71K48m76o3J88J68L6K91o7l77J01J74k7k07K43r8k65l4J44J91
$$ 11 123 50 183 12 260 -216 -279 -91 77 113 404 337 -40 61 235 208 1 244 146 -119 -153 -9 182
3515A82l54J3r5KK15nJ24k32L51o8l34L68j13J38j98N9Kj47K58l11K93q0J0j08
$$ 182 -172 -159 -254 -252 -37 -42 82 -150 201 133 -201 167 54 192 -6 53 55 -92 166 -145 148 68 78 -30
3539c0K58l23L0Qk18K16j74j35O3J4M49l62R1L51k22J71p2n2M0J43k31P7J18k02
$$ -30 228 -95 -65 -57 -275 -59 -233 -368 -305 -291 158 -204 -113 238 16 187 115 63 103 246 15 92 210 8
3563Hj37K7K10M9k30R4k91L12J52m39J29o4J92j26r3R2R1J05J53j84j06K09JP3
$$ 8 -129 -102 108 157 -73 21 -270 42 194 -245 -116 -180 12 -114 -207 -115 -24 81 234 50 -56 153 154 227
3587B27k64m0J04O4j92L71p8o4q0n9j50K87j28j61L41k04Q2P4l52L63l13M7M07
$$ 227 -37 -77 27 91 -101 270 192 128 48 -11 -161 126 -2 -163 178 -26 56 130 -222 141 -172 -125 282
3610B82l84K72j67P3J89l85J76J24k83K27k87J3K52j32k2J6j2J02r7m4J28L4o4
$$ 282 -102 170 3 76 265 -120 56 180 -103 124 -163 -150 102 -30 -52 -36 -48 54 -43 -87 41 75 11
3633A1k08K90p8j80K76j92k5j9j45N00j90j41J23K56j40k3j80K13L0k19q2R4L52
$$ 11 -197 93 15 -165 111 -81 -106 -125 -270 230 40 -101 22 278 138 115 -65 148 178 -41 -123 -29 323
3656C23k15J2j23K54l64j0J06m2N9j0K1J26k84K28j7j74Jj1J98Q1R8k41K51j47
$$ 323 108 120 -3 251 -113 -123 -17 -59 0 -10 11 137 -147 81 64 -110 -109 -120 78 159 257 16 267 120
3680A20k91L84k70J10o1n6J32l6q0M5J57n5O3l17k2J17j07K63j8n63L11J25r2
$$ 120 -171 213 -57 53 -8 -64 68 32 -48 -3 154 99 162 -155 -177 -60 -167 96 78 -485 -174 -49 -141
3703a41K23M3j61O5Rl1K1j74O3J00j26K28L0O0j9r8J17k04n4J91k58Q8K8j87J78
$$ -141 82 125 -36 29 38 7 28 -146 -83 17 -109 119 149 209 190 92 209 5 -49 142 -116 -28 0 -187 -9
3728iJ36j31J11l16L36p2j83L45k5k4j65j93J42k9K29m5j64k63K86k01M54j97
$$ -9 127 -4 107 -209 127 55 -128 217 192 168 3 -190 -48 -77 152 107 -57 -320 -34 -235 219 22
3750B2l24J27J38K97j74Q7k88J73k27KL07l3J18j13L1l70P6J87L0j6j55J3j19
$$ 22 -302 -175 -37 260 86 173 -115 58 -169 -167 140 107 225 112 143 -227 -151 36 66 50 -105 -92 -211
3773b11L03j44J96j42K62k89j12R0Op1R4K51k40J00j96Q1o9P5pK20k28J09k05
$$ -211 92 -52 144 2 264 -25 -137 -47 -41 -112 -18 233 -7 93 -103 -22 -91 -16 -23 197 -31 78 -127
3796a27J53n9J22j32m3O1K93m92K25K5j1Q0p9j87L66P0l53R9ok4j09J30J25j27
$$ -127 26 -33 89 -43 -86 -25 268 -224 1 26 15 95 16 -171 195 265 -88 11 5 -19 -128 2 127 0
3820@k00J0K74k99K00j81J61Q1l01L28k81n3L26J05m2J71j19J28k06p0k2J89j6
$$ 0 -200 -190 84 -215 -15 -196 -35 46 -255 73 -208 -261 65 170 128 299 180 308 102 32 10 199 183
3843A83j80p5K38l21O4r7K40J54j54k83j10L73j07K1K91q0k41Q3K36n16L65j24
$$ 183 3 -72 166 -155 -91 -188 52 206 52 -231 -341 32 -75 -54 237 157 -84 -1 235 -281 84 -40
3865d0J33j78J02O8Q1l20K36J22q5k11J39l8p9k7l29K91K27k13P6J41j15J40r2
$$ -40 93 -85 17 85 166 -154 82 204 119 -92 47 9 -70 -97 -426 -135 92 -121 -45 96 -19 121 29
3888B9J17l40jJ28k24J53p3J50m6M06M7n72J36L87l07j5J29r5O7k00J15O1k57
$$ 29 146 -194 -195 -67 -291 -138 -211 -61 -107 299 346 -226 -90 297 -10 -25 104 9 76 -124 -9 52 -205
3911b05K11q4M9M5J60R3j07j69L9j7J86m06L04j06k15L79q7j06r3L42j28M7o2
$$ -205 6 -78 -29 16 176 269 162 -7 32 15 201 -205 99 -7 -222 157 70 -36 -129 213 85 132 70
3934G0j6m4lo4k64J76K19J04p8k05q3J45K41j37L1m2J52l7j08Q8k68q3K04j88
$$ 70 54 10 7 -57 -321 -145 74 178 100 -105 -188 -43 198 61 92 50 202 165 57 145 -123 -206 -2 -190
3958a90K65%k3j33K55m79M05j89l2m4J73k40J42j00L17q8O2k60J52J52j81L18
$$ -190 75 75 52 -81 174 -305 100 -89 -121 -165 8 -232 -90 -190 127 39 101 -159 -7 145 -36 282
3980B82j18j08N4K02n68L62k22oP8l61M62N8J82j41r1O5k54j44J41P5J48P1l29
$$ 282 164 56 110 312 -256 106 -116 -122 -44 -405 57 115 297 156 65 130 -124 -268 -127 -52 96 167 -162
4003a62J08M90m93Q4pr1J35k1p2J46R8k97K54n01L73j04j10L00j00j59N60l84
$$ -162 -54 436 -57 27 20 -71 64 43 -29 117 215 -82 172 -329 44 -60 -170 130 30 -129 431 47
4025D7j57L28k45j89K48Q1j77k44K58l84K64M67k53KK28k08J46q4j15J19j68k56
$$ 47 -110 218 -27 -216 32 113 -64 -308 -50 -434 -170 297 44 46 274 66 212 128 13 132 -36 -292
4047b92L97j91J5k57L72L6l40J30L30m21L8K17M2j61J41l29N74k55k4K14k08q3
$$ -292 105 -86 -71 -328 44 80 -260 -130 200 -221 -183 34 76 -85 56 -273 301 46 22 236 28 -55
4069e5Q5L46m22J80k33P8Q9k93P2J28J2j09J5J59R7M7o5k28J93j12J02M2l57J99
$$ -55 30 376 -46 134 -99 -21 68 -225 -153 -25 -13 -122 -107 52 149 196 131 -97 96 -16 86 128 -229 -30
4093c0N7M0j02%k9j35J98j8J52l59K40K22q5j10p2q1J00J9R1j29l28M04O4j53
$$ -30 27 67 -35 -35 -64 -199 -1 -19 133 -226 14 236 151 41 -31 -112 -12 7 98 -31 -359 45 109 -44
4117d4K82k77p6J34%No3R0R3K6r0k66r2L14O6r5Q7k66K54K9j65P5k45N2J93K14
$$ -44 238 -39 -115 19 19 24 -39 51 144 170 80 -186 -278 36 102 7 94 -172 82 111 -54 21 -224 -172 21 235
4143B35o65N41k13K34Kl59M79k16J1k28q6M18k03Q1K5j10K74k62L1L9j34K81j33
$$ 235 -430 111 -102 132 134 -225 254 38 49 -179 -265 153 -50 31 56 -54 220 -42 -11 28 -106 175 42
4166D2k4J41k56j57M12k28J34k20L83l79q6L28J09l19J84j91J26J28n1Q2k71J84
$$ 42 18 159 -97 -254 158 -70 64 -156 227 -152 -238 90 199 -120 64 -127 -1 127 76 158 -113 71
4188G1m12L32O6P5k00M36m65K7L7R6J30j91J05J53j15r8j02j15r8K51l2j99L11
$$ 71 -341 -9 57 132 -68 368 -97 -70 -33 63 193 2 107 260 145 47 -55 -170 -268 -17 -49 -248 63
4211F3P9j93J61k29L00k03j73N0J56j79o9L25j83M3j64P0P9J12l0j63Q2Q9k30
$$ 63 142 -51 110 -119 181 -22 -195 -145 11 -168 -237 88 -95 -52 -216 -146 -67 45 15 -148 -66 23 -207
4234b07L22J14L9l28J75q0L6j45J00o3j53J47J62j77J03j33Q9k11M6L6L47k33
$$ -207 115 229 268 -60 115 35 71 -74 26 -37 -190 -43 119 -58 45 -88 1 -210 -164 -128 219 -14
4256a4j32J93J91l04j49K59k10K14J5K57k08j53K9j94J05J68l34J82O9J24M7j56
$$ -14 -146 47 238 -66 -215 44 -166 48 63 320 112 -41 -12 -206 -101 67 -267 -85 -16 108 155 -1
4278al2O6m1O3k10K66K74o37K23O0j62J86q2pL6J19o7K40k75o1J07n3j23P5M25
$$ -1 -33 33 -8 55 -155 111 385 -252 -29 31 -131 55 -27 -34 2 121 54 294 19 -42 65 12 -111 -36 389
4303C89m78k35L22m1l51K02O6K59l45J07K82m76J60K8M4k4J90k15k2L53k43J45
$$ 389 -89 -324 -2 -43 -394 -192 -126 133 -212 -105 177 -299 -139 -111 -67 -91 99 -116 -138 215 -28 117
4325A17j22J64r1o4m03N38m17M27m01L82n2k33J89p0K03l26K04l40J47O4j7M56
$$ 117 -5 159 68 4 -399 139 -278 149 -252 130 78 -155 34 -36 167 -159 45 -295 -148 -84 -101 355
4347C55m84O2L7J9N5l35Q6k8K52M0J1k70Q1K99k99jL0J55m3k81M5J68j68j7J61
$$ 355 -129 -67 -30 -11 44 -291 -205 -233 19 59 70 -200 -119 180 -119 -120 -90 65 22 -259 -214 -46 -214 -231 -70
4372g0k5k17K99K64R9k57j28j04J31p4k19J87J59M5k4j75PJ34k41J75j39K15j68
$$ -70 -95 -312 -13 251 350 93 -35 -139 -8 -82 -301 -114 45 90 66 -109 -102 32 -209 -34 -173 42 -126
4395a26J21r7Q2R3M7q6k11K57K19k77mn5K01j09m31K89j40N2QL48k41%P5l4p9
$$ -126 -5 -102 -20 73 120 34 -177 80 299 22 18 -37 164 55 -376 -87 -227 -175 -167 181 -60 -60 15 -19 -98
4420i8J00l1j55L6J14l8j89M31n3pL04l23j17O0J26k15p3L97j02j07M6Q8l69J58
$$ -98 2 -29 -184 -148 -34 -72 -261 170 117 110 414 91 -26 34 160 -55 -128 269 167 60 106 194 -175 -17
4444a7j68M08n5l63J09j23J66m4J50j45o4L57O4m13K87l5k28K83j64J19j91J20
$$ -17 -185 223 168 -195 -86 -209 -43 -87 63 -82 -146 211 275 -138 149 114 -114 169 5 124 -67 53
4466E3J87J67o92K80pK32p2k13P3j49L59M2m61l0L24j93n5P8K30j41K09k94m5
$$ 53 240 407 -285 -5 -12 220 148 -65 8 -141 218 260 -201 -231 93 -100 -155 -77 153 12 221 -73 -118
4489a18J51j61qK08N8j2k3N4k54P2R1k82L09P2m45K47k3jJ50m7j44J34K05j34
$$ -118 33 -128 -136 72 130 118 95 149 -105 -33 58 -224 85 157 -288 -41 -64 -65 85 38 -106 28 233 99
4513I9k66M49m23J93l74K52q7J49J58m23J14J57O8m8q9J62L8k9j47L5P2J20l39
$$ 99 -167 282 -141 52 -322 -70 -157 -8 150 -273 -159 -2 66 18 -71 91 129 100 -47 -12 60 180 -159
4536a59K14Mj50J27k32K49J12l62N16l06l19J75K36p6j6r8J9J02l53L74RN4P4
$$ -159 55 59 -91 36 -196 53 165 -197 319 13 -306 -131 105 29 13 -85 -66 36 -317 57 66 120 194
4559A94j67l12K07K03n0J75k01J59l44J62j0J07j50J4k00K98j45q5J39L8o0Q4
$$ 194 27 -285 -78 125 75 250 49 208 -136 26 16 123 -27 -13 -213 85 -60 -145 -6 32 -28 56
4581E6K36j61j95K34n7l27o3K99k41J25K38k20M8J99k09j42L13k74J92k41K36
$$ 56 292 131 -64 170 113 -214 -277 22 -219 -94 144 -76 -28 171 -38 -180 133 -141 51 -190 46
4602D6Q2l04O2J17j46L41k51J72k77Q2J80k59j0K2J31O0m9O12m78l93K53Q1k36
$$ 46 128 -176 -114 3 -143 198 -53 119 -158 -76 104 -155 -165 -143 -12 48 -1 611 133 -260 -7 74 -162
4625a62J56Q1K4J01n35L32j51R3j4J60m9J9k00L7j5l94K15J95K03r8K75k23K8
$$ -162 -6 75 99 200 -335 -3 -154 -61 -75 85 36 55 -145 -108 -123 -517 -302 -107 96 -2 273 50 78
4648G8J52m03K55J77m3j16j4j19J24j01l2J58p4j19K6J26k3j63K33k1lJ21k72
$$ 78 230 -173 82 259 216 100 86 -33 91 -10 -42 116 42 -77 -51 75 52 -111 122 101 98 219 -53
4671e3L4j43K48k91K36L20k25j61J15L4j7j77K43k86J62j86N79l83J33K9l36K15
$$ -53 -19 -162 86 -205 31 351 126 -35 80 114 97 -80 163 -123 39 -147 432 49 182 211 -125 90
4693I0R5j06J16m01J50m4J33m5j55jJ88J87j32J04l46j8K91j13J26j01K1k5k35
$$ 90 185 79 195 -206 -56 -100 33 -12 -167 -168 20 207 75 179 -167 -185 106 -7 119 18 39 14 -221
4716b21J88K9o6L00m57J10J39j53o7K54l27M52P6k55J31j14k5j76K5K47l2k5J5
$$ -221 -33 -4 -70 230 -227 -117 22 -131 -198 56 -271 181 257 2 133 19 -6 -182 -157 90 58 33 48
4739D8qJ32k29K69l85L48j35J8j46Q5J3m9m9OJ51n6L5l13K57Q8Q5l17J78P0j26
$$ 48 40 172 -57 212 -173 175 40 58 -88 -3 10 -39 -88 -82 69 13 48 -265 -8 80 165 -152 26 96 -30
4764c0MK09l09Q0k0K1J22n39K45J01J94j46L4j45K5J98j84J89J26l5R8l03L8k1
$$ -30 -26 183 -126 -46 -66 -45 77 -462 -217 -116 78 -68 -34 -179 -154 44 -140 49 175 140 238 -65 -27 -48
4788d8O6r1K34k45K83O4l17J94Q2l78J56P2J64n06L10k39K96L1j07k16L18J42
$$ -48 18 -73 161 -84 199 263 -54 140 222 -156 0 72 236 -270 40 -199 97 128 21 -195 123 265
4810B65j51p3k11K94R3k19J82q1l0k08J0O3K7O7K0P8k1k26M0J75J0m4k35j16K10
$$ 265 114 41 -170 124 217 -2 180 99 69 -139 -129 -66 -39 28 48 126 105 -121 -81 94 104 60 -175 -291 -81
4835h1L6j92K53l61J78K51j09l28K68j4p2K04j60N0r2J28J23J34k16j00O5Q2j54
$$ -81 -45 -237 16 -345 -167 84 -25 -353 -85 -99 -171 33 -127 -77 -169 -41 82 216 0 -100 -35 47 -107
4858a07J0j23O8PL41k31k12M23l39L02l47R3j92L45N3j84K59J49l06J64k04j89
$$ -107 -97 -220 -152 -145 196 -35 -247 176 -163 139 -208 -115 -307 38 91 -93 166 315 9 173 -31 -220
4880b20K42j14J58m0J81k88P3j8K4J43O3k00j07Q6M72l05j90O3PK25k59PR2k37
$$ -220 22 -92 66 26 207 -81 -8 -26 -2 141 204 4 -103 -17 455 150 -40 23 30 255 -4 3 95 -142
4904a42K76k47OL62m18L0P2j29L13P6l09j84K14L62j0k35J1l1J85j95K02j33m09
$$ -142 134 -113 -107 255 -163 -133 -61 -190 123 199 -110 -294 -80 282 272 37 48 17 202 7 209 76 -333
4927c33J91N5j9R0k12K17J35k40J49J82o01K03N0J02m0j09K28j31K43k14o1L21
$$ -333 -142 -87 -106 -16 -228 -11 124 -116 33 215 -386 -183 -133 -31 -71 -180 48 -83 160 -54 -115 206
4949B06k50K26j92k9O7K10l26K28N2j44Qj78M6k6m5L91o06O70k93j29j50r3M54
$$ 206 -44 182 -10 -39 28 238 -88 140 192 48 56 -122 -76 -102 -147 244 -362 308 15 -114 -264 -357 97
4972I7l71L07k06K44m4p5K51j80k30J87J66P4K0J25l09Q2j06R1l39M3M0j71N95
$$ 97 -274 33 -173 71 27 -48 203 23 -207 -20 146 220 240 365 56 138 32 123 -216 -173 -133 -304 291
4995B91m36j18K63j97O8rK59l49K53j22KQ5J44l2O7l57r1L82j71Q9K0j7oJ08j15
$$ 291 -145 -263 0 -197 -129 -138 121 -228 25 -97 -95 -10 134 102 169 -188 -279 103 -68 21 41 24 18 126 11
5020A1K88k81q4N3q9k4J76j06k06K55j51J17j00J60l2k36M21l05K27J7K7k49J53
$$ 11 299 18 -66 -13 -102 -126 50 -56 -262 -7 -158 -41 -141 19 -13 -249 172 -133 94 111 138 -111 42
5043D2l62N71k42j8J99k12j66L23j08K5j81o2L11j62j08K78j65k44J83R6R2j07
$$ 42 -320 251 9 -9 190 -22 -188 135 27 52 -129 -191 120 -42 -150 128 -37 -281 -98 -2 90 -17
5065a7m8k36N8K68j09L06l97Nk7L00j4J04j75q2K29k22N7P5K79k89j32j9k19M45
$$ -17 -65 -301 -243 25 -84 222 -175 -170 -197 103 89 193 18 -64 165 -57 0 75 354 65 -67 -86 -305 140
5089A40j59R7j97L9O0l0oP7n2P4K96l62O2k8k87M58o5j11J57j64Q7P7j66J33J02
$$ 140 -19 78 -119 -80 -20 -50 -56 21 -31 43 339 -23 39 11 -276 182 117 6 163 -1 86 163 -3 130 232
5114B32k92J08k56K68K5j47K06j32j72K37l1k28J73R6j14K18k3l26M85k90K88
$$ 232 -60 48 -208 60 85 -62 144 12 -160 77 46 -182 -9 87 -27 191 168 -158 327 37 325
5135C25n06J2R6J47O8k09L8K38l01R4J23j92P2j8l62L75r3J40k60K31K63m67Q7
$$ 325 -181 -169 -73 74 142 -67 -29 209 -92 2 125 -67 5 -13 -375 0 -93 47 -213 18 281 -186 -99
5158i9r2O2J12k10K44r8K02j76kj13M3K61o9k29j43j13J56K64J06k31J84n6k3
$$ -99 -191 -129 -17 -227 17 -81 121 -55 -57 -170 -127 134 65 -164 -307 -420 -264 0 106 -125 59 3 -20
5181b0J32k55L18l43L99k94J25l60J93k17L99k25K07j01R1k32K28J01k21j04P4
$$ -20 112 -143 175 -168 231 -63 62 -298 -105 -322 77 -148 59 -42 49 -183 45 146 -75 -179 -105
5202a05L80m90J3R5N8j02K49j60K55j66j52K54j13RJ59l19K19l67K35N1l57L96
$$ -105 275 -215 -202 -107 -49 -151 98 -62 193 27 -125 129 16 25 184 -135 84 -283 -48 3 -354 42
5224D2k03M5oJ50j47O1J66j08j28L80k67o9q2K88j8m42M51j41j22J33j81O4J75
$$ 42 -161 -116 -122 28 -119 -58 108 0 -128 252 -15 -84 -166 122 104 -338 113 -28 -150 -17 -198 -134 41
5247D1K38l84j38L47J10l2n1j75m2j91J82o4Q1K17l60L99p0j86j33J99j97L36
$$ 41 279 -105 -243 104 214 182 131 -44 -86 -277 -95 -159 -78 139 -221 178 108 -78 -211 -12 -209 127
5269A27J55j04k99L09j41nN6Kj99k3L43k30j67K53o1k3l07M72j3m08J69J48l4
$$ 127 282 178 -121 188 47 42 98 100 -99 -122 221 -9 -176 77 16 -7 -314 158 145 -263 -94 54 20
5292B0j45J59L4Q7l47L72k80RJ10jJ21k00J50k5L1l39L25n7J10k85J02K74l00
$$ 20 -125 34 68 155 -192 180 -100 -91 19 18 139 -61 89 64 95 -244 81 24 134 -151 -49 225 -75
5315g5P5RJ19k48R2k38M10j31O5j26K7j36Q5o2N8oj03K64M6j84J93j50O6j24J51
$$ -75 0 9 128 -120 -28 -266 144 13 78 -48 -21 -157 -72 -134 -76 -82 -185 79 125 -59 134 -16 50 -74 77
5340G7R8j66o6j35L35m17K71n3J13j91K51k28L07l08J32k99L88Q3k85k8P7k22
$$ 77 175 9 -57 -192 143 -274 -3 -56 57 -134 117 -111 196 -112 20 -279 109 192 -93 -121 -44 -266
5362b66K27J23j27j20K19n1J9N%k81K94l57L22L9J01j70K9K05k84j25N6L26l42
$$ -266 -39 84 -43 -163 56 5 24 29 29 -252 42 -315 7 46 147 -23 6 211 -73 -198 -142 184 -158
5385a58O7J3J66j44J0L3J7l4q0L76k19p9l8j2J47k9NN9k86J80L6K2q2K93J6k35
$$ -158 -91 -78 88 -56 -46 -13 4 -30 -110 266 47 -32 -70 -82 65 36 41 100 -186 -6 30 52 -30 263 279 44
5411D4M8j00k30K66l23K81k27j8L80k71L28J72k60n5m84N46j20j66J56K48l39
$$ 44 92 -8 -238 28 -295 -14 -241 -259 121 -150 178 350 90 35 -449 97 -23 -189 -33 215 -124
5432a24J59K0j64J43N6o1p8O9J22pM1ol9j26L55j92j96j23r7J02k1K03j80N6J09
$$ -124 35 55 -109 34 90 29 -49 20 142 135 176 170 131 5 360 168 -28 -151 -248 -146 -167 36 -144 -88 21
5457B1l6l1N0N2l32O9K20K02J71l58R5j82K77j97j46J72k8j05K67l63L52r8k26
$$ 21 -15 -46 4 56 -276 -207 13 215 386 28 123 -59 218 21 -125 47 19 -86 181 -182 170 72 -154
5480a54J0Q3o3P9r4L19j14j91L81j47J00j24k63J49%p4L8K02j54k35j43K26L63
$$ -154 -144 -61 -124 -45 -139 180 66 -125 256 109 209 85 -178 -29 -29 -103 -65 137 -17 -252 -395 -169 194
5503A94k72L3R9j72j5L38n27N27m03R5r7nL18k33O7L13k12N1n4J50j74K5N6J52
$$ 194 -78 -45 54 -118 -133 205 -322 205 -198 -103 -200 -205 113 -120 -53 260 48 99 45 195 21 46 102 254
5527B54j16O1P0j40n8k3o1L9P6l0O2J07l24j01L0On2K79P6k25l1K79l88J98K18
$$ 254 138 199 269 129 71 48 -13 26 102 72 134 241 -83 -184 -154 -148 -200 79 155 -70 -101 178 -210 -12 206
5552B06j98M8M9j54l7J46J12K1k42q6N1J71M2j27k26K51k32J98J98k63m7J04p4
$$ 206 8 56 105 -49 -86 60 172 193 -49 -135 -84 87 129 2 -224 27 -205 -7 191 -72 -119 -15 -89
5575h9O5J46k81o1L50L7j20O8mk23L81m47L4N5r9L47q5j94K36lP0J56j76l36K90
$$ -89 -24 122 -159 -220 130 167 47 115 111 -112 269 -178 -144 -89 -188 159 74 -120 116 113 183 339 163 -173 117
5600A17J02j77J48m13J62o1p2J73r5N9O4m2j17J7P9n1j69K37R6K22k01j37m6K59
$$ 117 219 42 190 -223 -61 -122 -194 -21 -116 -57 7 -35 -152 -135 -56 -107 -276 -39 57 279 78 -59 -105 154
5624A54j81PK8j57J05j41J15M6Q0j71J88J27p8j70L25k65lj72KJ09L50r0N9m0
$$ 154 -27 -20 8 -149 -44 -185 -70 -24 56 -115 73 200 122 -48 277 12 9 -163 -161 -52 298 208 267 227
5648B27l19K24k54lK90j70j50O5L06j7l00L8k4K93j00L4j51l3J32n3k10J63O4
$$ 227 -92 132 -122 -125 165 -5 -155 -90 216 199 -101 -63 -87 206 106 140 -11 -44 88 35 -175 -12 52
5671E2j08j40L43j15p1r5O9J84m21M28k63nJ28J05k86K28p0J3J26p4k30J69K12
$$ 52 -56 -196 147 32 -39 -134 -65 119 -302 126 -137 -142 -14 91 -195 33 -37 -24 102 28 -202 -33 179
5694A79o3j2nR3m0l52M3J85o5j68m7K39Q8l0jj58m5J40Rj7o8N4L3J70l4k12J48
$$ 179 116 104 99 192 152 -200 -157 28 -37 -205 -252 -13 75 45 44 -114 -159 -19 -10 -27 -95 -41 -8 162 128 -84 64
5721F4j91O5P8m2o4J20J4o8R2nl7J42O4j74k52M13k34P3m8l3K21k52K30n24L12
$$ 64 -127 -62 16 -26 -90 30 44 -24 68 63 26 168 232 58 -194 219 -15 58 10 -23 198 -54 176 -348 -36
5746c6J76j43L91l54o9j98J75K45J33l2q1k40L88l35n4J1J22j51j37J79L4J28
$$ -36 140 -3 388 34 -35 -233 -58 187 320 288 207 -33 355 20 -34 -23 99 -52 -189 -10 24 152
5768A52l45L26k51N7n8K88K4k77J25k52M10j06j24K08k21k09J81O9J53j77K07
$$ 152 -193 133 -118 -61 -119 169 193 -84 41 -211 199 93 -31 177 -44 -253 -72 -3 150 -27 180
5789A80m30L51l6o6k45J41K06P1l54M8K19L2np5J53l82k39N29j72K25j32k8j30
$$ 180 -250 101 65 -1 -246 -105 101 172 -182 -134 85 117 112 37 190 -192 -431 98 -74 151 19 -9 -139
5812a39J80L7j36K20l01J6j23J82J59k62o0J72K38k76P2J33L5m21K15K14J52j53
$$ -139 41 78 -58 162 -139 -123 -246 -64 95 -167 -227 -55 183 -93 -21 112 147 -274 -59 155 307 154
5834A54j73K85J5k90j49K01k51P6j9J66Q9r2l03L40K8P9j32RPk90K81n6K58j93
$$ 154 -19 266 281 -9 -158 43 -208 -132 -151 15 104 12 -291 49 77 156 24 33 40 -250 31 -25 233 40
5858D0l7o1J93P1j15j94p7J07J10M7J6m32L49M4j59P3O6j08K92l74Q4M3L31l09
$$ 40 3 -58 135 206 91 -103 -180 -73 37 84 100 -332 17 61 -98 -25 41 -67 225 -149 -65 -22 309 0
5882@J03n7k85L01l2j9k41K22n1N5J07j28K6L00l96J27L2J23k57N2r9N2j39K22
$$ 0 103 46 -239 62 30 11 -230 -8 -59 -4 103 -25 1 301 -95 32 64 187 -70 -18 -117 -65 -204 18
5906A8J7k43K51k7k0O8j96J38r9r8K61k47J37o6J77o9J16k03L34k39k39J62J67
$$ 18 35 -208 43 16 -4 64 -132 6 -93 -191 70 -177 -40 -106 71 2 118 -85 249 10 -229 -67 100
5929A00j16K89l38K20K4k22L5q2J70m6n0Q6r5Jn1K6j46J44K3p2J48k52J61k29
$$ 100 -16 273 -65 155 179 -43 -8 -90 80 34 -16 70 -25 -24 -75 -49 -195 -51 -28 -100 48 -204 -43 -272
5953b72L90j13O9L1l81K17K08k57o9K53j91L4J91k28J55o4J08n5J9K88k67m3q7
$$ -272 118 5 74 105 -276 -59 149 -108 -177 76 -115 -81 110 -118 37 -27 81 26 45 333 66 23 -64
5976f4J7J74j53pk0j09J42J99l87K00M7P0j3k51L6J35m0k02L25k2l7J12j90J25
$$ -64 -47 127 -26 -33 -53 -162 -20 179 -208 -8 39 109 96 -155 -119 16 -24 -226 99 77 40 152 -38 87
6000H7k7j60M2j8n6Q0Q7r1K52l19j68K83qJ37k26k97N38p9Lj91J52j37k00K10
$$ 87 60 -100 -58 -76 -132 -52 35 -56 196 -123 -291 -8 -16 121 -105 -402 136 57 60 -131 21 -116 -316 -106
6024a06l8J23j5J61m18K91J06j02j61K52O2Jm7J14l76P1j25K48P9j4k18J48o1
$$ -106 -144 -21 -36 125 -293 -2 104 2 -159 93 155 156 109 223 -153 -82 -207 41 120 106 -112 36 -25
6047b5qj12L17M3l83L67Q9m35K29K20m21K90O6m09J2K2j7J55j40jM02K9m03J67
$$ -25 -33 -145 172 215 -168 199 288 -147 82 302 -119 171 237 -172 -160 -138 -155 0 -140 -141 261 290 -113 54
6071E4l42N24k30k85K45q9j06K91j04J41j97L2K3m7J08P7j41N9J57j56p9j26L42
$$ 54 -288 236 6 -279 -34 -123 -229 62 -42 99 -98 -66 -43 -90 18 95 -46 13 170 14 -65 -191 151
6094A51l62K0K26P5m4K15j20m7k75J97l20L60l2j49K25j10j62o4M25l88L29k77
$$ 151 -211 -191 35 110 66 281 161 114 -161 36 -284 76 44 -105 120 10 -152 -216 209 -179 150 -127
6116a27K08k19k6L58l71N7K7J65l0O3j71J87k03J71j25J11K80m42J88R1l86L08
$$ -127 81 -138 -164 194 -177 -120 -93 72 42 105 -66 121 -82 89 -36 75 355 -87 101 192 -194 114
6138A14j38j17k6J15J55P5k26J55m2J20l7l59M0K1J29L86k76j29K02l26N2K89
$$ 114 -24 -141 -167 -52 103 178 -48 107 65 185 148 -211 -171 -150 -21 365 89 -40 162 -164 -112 177
6160A77l43K46j74K80k03K9L7o8P7r6K27m50L30P0j6J05l53K20j33J56Pl03M26
$$ 177 -166 80 -94 186 -17 12 49 -19 58 -38 189 -261 69 139 123 228 -125 95 -38 118 125 -178 248
6183B48M9k30M9j33J26pq9K90k97j3J11J53k89J14j21j4p1m0K73J6k59M3q7K6
$$ 248 297 67 116 -17 109 102 13 303 6 -7 104 257 -32 82 -39 -53 -124 -164 109 125 -134 -91 -178 -152
6207a52q4K42j30Q7K06N7l97K64j04o0o3J59k83J29J21J25k4Q6k39K31N5q7k30
$$ -152 -236 6 -124 -37 169 226 -171 93 -11 -71 -134 25 -258 -129 -8 117 93 179 -60 171 226 139 -91
6230i1j8j51L74j62J7J80k00J17Q0j11k7M8o5K04m07O5J01r1k2J42K32m5k0l33
$$ -91 -109 -260 114 -48 -31 149 -51 66 146 35 8 56 -9 195 -212 -147 -46 -137 -159 -17 215 170 150 -183
6254a83N05k91o4j22J82j80L00l84J66J9J38o1j53J33J60k30J03J94l49J39j64
$$ -183 322 31 -33 -155 27 -153 147 -237 -71 -52 86 25 -128 5 165 -65 38 232 -117 22 -142
6275a42K74j1qk11N7K17m10L58Nr6k80K56kp9j04K81j54j28ok3K41j6O0j58R7
$$ -142 132 121 113 -98 -41 176 -234 124 129 33 -247 9 7 -72 -176 105 -49 -177 -183 -206 35 19 79 -79 18
6300A8q4P1j73J28J7J2q4K3J69L8j14J10k91%P6L1O7rl5j46J56K7J02m04M15J9
$$ 18 -66 5 -168 -40 -23 -11 -95 -72 97 135 21 131 -160 -160 -84 -53 14 5 -30 -176 -20 7 109 -295 120 139
6326A39l20O5J74q6n3J56LN2m4J27j74j1n8L8p4K85j05L4j03J64p1o2o9j61K17
$$ 139 -181 -116 58 -28 -81 75 78 130 86 213 39 28 -30 8 -66 219 114 148 45 209 138 76 7 -154 63
6351F3M4l6K46m40N8l5J94R0k32K7k38M54m48K04j25L07k21J88J1k66J4j61K32
$$ 63 107 71 317 -123 -65 -100 94 184 -48 -21 -259 195 -253 -49 -174 133 -88 100 111 -155 -141 -302 -70
6374g0O1j37M9j89J20J29J03J7l9j71q9J36J30Q0p5J16L2j55j90K02k28J25k28
$$ -70 -9 -146 -97 -286 -166 -37 66 83 44 -127 -216 -80 50 130 55 171 203 48 -142 60 -168 -43 -271
6397b71K42Q2j10J4n6P4J26j26O3Rj17K19j07j1O7j26r3P4l1J70k02m9K65k64
$$ -271 -29 53 -57 -43 -99 -25 101 -25 38 47 -70 149 42 31 98 -28 -121 -47 -78 92 -110 -159 106 -158
6421a58K12k7l57M54k28J25k94R4L84j67p3mk4K26Kj16J3j01J52o8j62K85l0j82
$$ -158 54 27 -330 124 -104 21 -273 -179 205 38 -35 -39 -63 163 165 49 62 -39 113 45 -117 168 138 -44
6445d4k7L26k53J31J04M5l74L37j71M3m1l61K08J24j2o4J81k45j7j7P7L6j07k3
$$ -44 -71 255 2 133 237 282 -92 245 74 117 76 -285 -77 47 35 -29 152 -93 -110 -127 -50 -14 -121 -144
6469a44K90Qk08m3n9K59l58Q6P9J05p4rJ5%k03k7L55r0o5m5J66k21K82j2j53J82
$$ -144 146 154 -54 -97 -156 103 -255 -169 -90 15 -59 -68 -53 -53 -256 -283 72 -18 -83 -128 38 -183 99 87 -66 116
6495A16k28K76j69k94M50o3q3l1J68o77M82o2Q4qJ1Q2j29l8J21k86K36O1Mj13
$$ 116 -112 164 -5 -299 151 88 5 -26 142 -535 -53 -115 -31 -39 -28 54 -75 -113 8 -278 -42 19 23 -90
6519i0J43l5Q7l52L6J31L2L8K09m47K35N9j25N0o9R5K3K06k54q6mm6j09M04p8
$$ -90 53 18 105 -247 -211 -80 -48 -10 199 -248 -13 46 -79 -29 -98 -3 20 226 -28 -114 -118 -164 -273 131 53
6544E3J01j17k12J00K74k04M2J49n34J94L26q4L9k83L4P4J25ro0j42M80m03P3
$$ 53 154 37 -175 -75 199 -5 37 186 -348 -154 172 88 127 -156 -122 -48 77 68 8 -134 346 -57 16
6567A6J6r2J86N3j00q6q8R6J17m5j76L4m2R3K52l86M06k95n4K12l94K11J11k04
$$ 16 32 -60 126 179 79 -7 -95 1 118 73 -103 -69 -111 -18 234 -152 254 -41 -95 117 -277 -66 45 -159
6591a59K57j98N4k2J25o9R5j68L4P6r2L20j5l7k94j8J04j38k13O6J86J04J44k14
$$ -159 98 -100 -46 -68 57 -12 83 -85 -51 25 -67 253 238 201 -93 -111 -7 -145 -358 -292 -106 -2 142 -72
6615g2K13q2J4K8n9k3M1N1J85k46j16J69j5r9O7P0j43J50K39m77J04K91j54k34
$$ -72 141 59 73 101 42 19 60 111 296 50 -66 103 88 -11 56 126 -17 133 372 -105 -1 290 136 -98
6639i8L9J12k05L94K4k9k41K4k46J74qj98K20r2J36M9j75J29J17P5k03n5k7j71
$$ -98 -59 53 -152 242 266 237 -4 20 -226 -52 -60 -258 -38 -130 6 55 -120 9 126 201 -2 -57 -84 -255
6663b55j32J69K71J65k58O0K5J28o2q1nk2j88M33j67j83J15J23k63q6O9L74j78
$$ -255 -387 -218 53 218 -40 20 45 173 111 30 25 3 -185 248 81 -102 13 136 -127 -213 -144 230 52
6686E2j02L17k41J9k62K69O9N4pj81j36Q5q2L38l21L65l4l59J63j22j6O6j5J02
$$ 52 -50 267 26 45 -217 52 121 175 168 -13 -149 -64 -146 192 -129 236 202 -157 6 -116 -132 -66 -81 21
6710B1j8j12K90n07L58L1L8k40J70o7j02J07k6Q6j98N3J14j52N72l58L7j40J5
$$ 21 3 -109 181 -326 32 63 101 -139 31 -36 -138 -31 -57 29 -169 -116 -2 -154 418 60 97 -43 -28
6733b8m2L2j29R5K03k15R5n3k19L04k9M5j4O6L1j39jJ44J31m91M44n4k70K31j05
$$ -28 -70 -38 -167 -72 131 -84 11 -42 -261 43 14 59 45 111 142 3 2 146 277 -214 230 176 -94 137 32
6758C2j69K13K8j87J02r8q9K72j1q1Q5m09L71Mk9R9k88O5j80K81lJ81n2l59J66
$$ 32 -137 76 104 -83 19 -79 -168 104 93 12 97 -312 59 63 34 133 -155 -90 -270 11 8 189 137 -222 -56
6783e6J0K55l80L22k69J13n5K38l80N0K27o3N0O1k70J81p5K1J97l92K1K04J54
$$ -56 -46 209 -171 151 -118 -5 -60 178 -202 -152 75 12 62 123 -147 34 -41 -20 177 -215 -194 10 164
6806A64k04n7k76K51K62j26j01K37N5l01NL08l39L3j17K47p6Q4J01j19J00l80
$$ 164 -40 -97 -373 -122 140 14 -87 150 205 -96 -91 217 -122 -89 -206 41 -35 49 150 31 131 -249
6828b49L48J83j32l59K83j81oj8J3R1L43m36N5J25m6j62Q9J05nK07j04l21R1L61
$$ -249 99 282 150 -209 74 -107 -113 -131 -118 -27 316 -120 -65 60 14 -148 -59 46 41 248 144 -177 -86 275
6852B75m90K58j73J72j01J41k62J33PJ49j44K3J50L15m00k4P2K8j83Q1n3k0l5
$$ 275 -215 43 -130 42 -59 82 -180 -47 -40 109 -35 -12 138 453 53 29 101 129 -54 27 -26 -46 -81
6875h1K66n35n3M41k1j03J64J89l82M9j45K00O9j06j70J87q7K26j11Ol1M9nJ50
$$ -81 185 -350 -403 38 17 -86 78 267 -115 -66 -211 -11 58 -48 -218 -31 -118 108 -3 3 -28 21 16 166
6899A66j16J95j65l2R9j99K10J17l05p4Mk7N5J61p7J85k67J28j06K06j08o7k89
$$ 166 50 245 80 48 147 -52 158 275 -30 -104 -100 -127 -72 89 12 197 -70 58 -48 158 50 -17 -306
6922c06M58k06K65N0j81j7k73J61P6M4J63k10j29K73l80J37K7P5N3j70J94O2j00
$$ -306 152 -54 211 261 80 63 -210 -49 27 71 234 24 -105 168 -212 -75 -48 27 80 -90 104 166 66
6945F6q2j14M8M68k71j46K19j14j32L56m82K44p7o1L16j43k8r7J8nk4K53n17L04
$$ 66 -16 -130 -82 386 115 -31 188 74 -58 298 -184 60 -17 -78 238 95 67 -30 -12 -17 -41 212 -305 -1
6969aqj1J86m25M95m19L27j48P6r7p4l9J34K91l61o1J90q1K37j60K88k89l4R8
$$ -1 -9 -20 166 -259 236 -183 144 -4 72 -25 -99 -138 -4 287 -74 -135 55 -26 211 51 339 50 16 114
6993A14j44J7j31K07k21J07K34j45q3J72M5l40K04L9K35l31k8k88J74R6K65l24
$$ 114 -30 -13 -144 63 -158 -51 183 38 -45 127 172 -168 36 75 310 -21 -49 -337 -163 -67 198 -126
7015a26Q7rj26K95l26K81k67J91k47M99l34o0K60k11L08j97MN3j18J14K3l53J68
$$ -126 -39 -48 -174 121 -205 76 -191 0 -247 252 -82 -142 118 -93 215 18 22 75 -43 71 94 -259 -91
7038i1M11j30q5N7p2K00k68K7J08n6k4O7l16N15m04j11KK82j17J04k49M59J52
$$ -91 320 190 105 162 90 290 22 49 157 101 77 144 -172 343 -61 -172 -170 112 -5 99 -150 309 461
7061D61p34K61j31J50M5N7k04K5J10K05j40k52K50m16M19j64K83k72j27L70j29
$$ 461 -273 -12 -143 7 52 109 -95 -70 40 245 105 -147 103 -313 106 -58 225 -47 -174 196 67
7082F7k54n6J63o2K55r2L7k3R2J38j79J7p9k1k57J80Q1o3J14K9j04j65K4J60J80
$$ 67 -187 -243 -80 -142 113 21 58 35 127 265 86 103 24 3 -254 -74 7 -56 58 87 -17 -182 -158 2 182
7107A82k19O9K2J8k49L85k83J02o0k8j17k7Q6K01j35KL2M30l98J04k56j50M29
$$ 182 -37 32 54 72 -177 208 -75 27 -33 -61 -178 -205 -119 82 -53 -51 -19 411 13 117 -139 -289 140
7130A40l08K58J83l70j04R6J14M9j76n8N33l23J06l82p8N39l21K33j43K46l19
$$ 140 -168 90 273 -97 -201 -105 9 58 -118 -176 357 34 140 -242 -320 219 -102 131 -12 234 -85
7151h5P1M6j35J4N0K12j52k19J00pj40K92o6M7j85L66p7j77LN5J22j97j60J55
$$ -85 -14 32 -103 -89 -39 173 21 -198 -98 -105 -245 47 -19 28 -157 209 132 -45 -42 13 135 -62 -222 -67
7175f7J27K37l89J66k4l37K14j84K37K38j50J20j80K37j23j46q4K28l9k61J03
$$ -67 60 297 -92 74 50 -287 -73 -257 -20 218 68 188 8 245 122 -24 -108 120 81 -180 -77
7196g7j97L15j56n0L6R8o6JJ86j83j50L32M6j66K15k49O8K36m29J68J52k77J51
$$ -77 -274 41 -115 -165 -129 -31 -97 -96 90 -93 -243 89 135 -31 184 -65 3 239 -190 -22 130 -147 4
7219Dq6J85j17l4jJ47q2J22k69j37J43L80l87J38J42k09J47j27mO5k25K37J69
$$ 4 -82 103 -14 -48 -49 98 16 138 -131 -268 -125 255 -132 6 148 -61 86 -41 -45 20 -205 32 201
7242B01k82P8k4J22j23k07K68R1k39J76j97l0K25j9r7P4n4K04l1j53J07J30q2
$$ 201 -81 -3 -27 95 -28 -235 33 124 -115 61 -136 -166 59 40 -57 17 -37 167 136 -17 90 220 138
7265A38k8j16k7J30j39J85k2J47m96L07J17J09k87J44k07l0l49O77o4n23L06k17
$$ 138 110 -6 -33 97 -42 143 121 268 -228 79 196 305 18 162 -45 -75 -424 253 189 -334 -28 -245
7287b45K47L8K38p2j48Np9j26Q7K30j50J20k06Q4qJ6Q0k08K19j84J10k74M45j59
$$ -245 2 40 278 206 58 63 -16 -142 -55 175 25 145 -61 23 15 31 111 -97 122 -62 48 -226 219 60
7311F0k27J89p1O6k67K73J14Rl5k38l7J38J64j19k57J11J00O5k73K25m1m7M7M3
$$ 60 -167 22 -49 17 -250 23 137 146 111 -127 -164 -26 138 19 -238 -127 -27 38 -235 -10 -51 -98 -51 -8
7335hq3r7K03l8K4n4lk2J71rj8l48K94j4r3J95K2r4P4l01K45p0l1J42j45J8k01
$$ -8 -91 -188 15 -23 1 -53 -56 -78 93 84 66 -282 12 -2 -95 100 122 28 102 -199 46 -24 -55 87 -58 -40 -241
7362b41L17l7j44N4O6l2l2p7K01r8m0R7r7q2L17m33J22K2P7P1N8j56J39j65R7
$$ -241 76 39 -105 -51 15 -17 -49 -126 75 -23 -63 34 -63 -145 172 -261 -139 -117 -40 31 89 -67 72 -93 4
7387Dj28O3Q2J26k64n2J49R5j58m9R2j04J27J64k36J1K26j72J00l06L37L0r4R6
$$ 4 -124 -61 21 147 -117 -169 -20 75 -83 -132 -40 -144 -17 147 -89 -78 148 -24 76 -230 107 137 43 139
7411A39k28J19R1k7l5q9j63L80k13j09%j46J84K00K6k22K44m5k55J76l01O9J82
$$ 139 -89 30 121 94 59 -30 -193 187 -26 -135 -135 -281 -97 103 129 -93 151 106 -149 27 -274 -205 -23
7434b3J10l25L94P2n8j39J26r9j23J17j39r2k0K21J73k66K68r2n8o2N2K2r4k4
$$ -23 87 -238 156 228 170 31 157 58 -65 52 -87 -179 -199 22 195 -71 197 105 47 -15 37 59 -35 -59
7458e9k0L77m01J00J82k84o7K89M3j49P2j95L06k92p8M5L3m1R6m1j31K66P6q9
$$ -59 -79 298 -103 -3 179 -105 -172 117 160 11 83 -112 194 -98 -176 -131 -98 -139 -43 -84 -215 51 127 38
7482C8j45J74p2M2j04J63n0J1l40J33M95n88K41oR3l72L78O2j27N6j14K35j62
$$ 38 -107 67 -5 37 -67 96 46 57 -283 -150 345 -243 -2 -8 85 -287 91 153 26 82 -32 203 41
7505D1j61kK16K6o4j1M4Q1k29m4J8K74l4Q9q1J23l24j28J21L42j66l40K38m38
$$ 41 -120 -122 94 120 56 45 89 170 -59 -103 -85 189 155 244 163 286 -38 -166 -45 297 131 -209 29 -409
7529d09L82R4q0J26K2k05JR1mk5l0K4k0p3r6J4K77J26j79J71k58J58m6mj19J64
$$ -409 -27 67 -13 113 135 -70 -69 22 18 -7 -37 -13 -33 -106 -202 -188 89 215 36 207 -51 107 61 57 -62 102
7555A02j23l9K59j34j91J37l1r1j16j5K48n7J44L5k48K78j30q3K9K08j69q8j06
$$ 102 -21 -60 199 65 -126 11 -20 -111 -227 -242 6 -51 93 128 -120 158 28 -55 -26 182 13 -75 -181
7578a81J93k4r7K40J07k84L32l18J82l1k44J27j58K56k66j15L55P7n5L19k17k44
$$ -181 12 -12 -109 131 238 -46 286 -32 150 119 -125 2 -156 100 -166 -281 74 151 96 415 198 -46
7600d6n8k9M11n4j97o6K16j11k03N4P6N1k5oj1J32q5K82j22j25j78K66k58M7l4
$$ -46 -104 -133 278 224 27 -39 177 66 -137 -83 -7 44 19 13 2 134 49 331 209 84 -94 172 -86 -39 -73
7625g3L6J47k34k0p2K35N5j13k19L66j05j08K9J09rj5J39r6J95k43q1L98k38r8
$$ -73 -37 110 -124 -144 -216 19 74 -39 -258 108 3 -105 -76 33 24 9 148 52 247 4 -77 321 83 -15
7649a5p7o7K70m92N32k06j6J26k3J44l97l4J68J96J5p5j2q1K40k80J3k32K38M5
$$ -15 -92 -159 111 -381 151 -55 -71 55 32 176 -221 -255 -87 109 124 49 37 -44 196 -84 -71 -303 -65 -20
7673b0j1J64O9k24j92N7J55L00l74M4J37M4m91M72j20j19J62o9J83l57J47O9J16
$$ -20 -31 133 202 -22 -214 -157 -2 298 -76 -32 105 149 -342 130 10 -109 53 -16 167 -190 -43 26 142
7696A42j51n8J08k03j1J50k02J85Q5j05j24L83q8J4m34K06J60r9o0K51Q8k94K31
$$ 142 -9 -67 41 -162 -173 -23 -225 -40 45 -60 -184 199 111 125 -309 -103 57 -42 -102 149 237 -57 174
7719A74j39k5J55o0j7q6J37j14k77J67Rk58L30j59J83R5M7k32N3p7j97K35K35
$$ 174 35 10 165 105 88 2 139 25 -252 -85 -76 -334 -4 -163 20 115 162 -70 -17 -94 -291 -56 179
7742A79k89M7L79l73K75n5j55j96M44m29P1j53J28J07j59L06p7K73l53O7kk33
$$ 179 -110 -63 316 -57 218 163 8 -188 256 -173 -102 -255 -127 -20 -179 127 50 323 -30 37 35 -198
7764a98J80J69J67n5l15L45m84K58O2k92j0J54q7J23r8j2K45k58P3k91N4M25k94
$$ -198 -18 151 318 263 -52 293 -191 67 129 -163 -173 -19 -106 17 -81 -93 152 -106 -33 -324 -270 155 -139
7787a39O3J87m5p0J16L7j20j3m1NK1ln9j42o5o8M89q4j96J09q8j10J50p8L7J20
$$ -139 -76 111 66 -4 112 149 29 16 -25 -20 1 -2 -61 -203 -268 -336 153 69 -127 -18 -106 -216 -66 -144 -107 13
7813A3J75j41j03o2P1J74k04J60J4j29m7j06J20K47L8k11J66k82O7o5R0P7k6P7
$$ 13 188 47 -56 -118 -47 127 -77 83 97 -32 -79 -185 -65 182 220 9 175 -107 -40 -105 -15 62 36 113
7837A13k08k77L34k5J20n4J38j35K1j64J67k9m5J3k15L5J8K92o8P1k01J55Q3j59
$$ 113 -95 -372 -38 -63 57 3 141 6 27 -137 30 1 -44 -31 -246 -211 -193 99 31 102 -99 56 139 -20
7861b0j22L32j5j35j17J09J90j44p2k12L48l76J17M2K79k67JJ40n3nK01k50l5
$$ -20 -142 190 175 40 -77 32 222 78 6 -206 142 -234 -117 -75 204 -63 -62 78 25 20 221 -29 -64
7884f4j2J31o9J9J15l01K13j72q0R4l5K37j06j8J02l12K37m07O65k2j19j64K05
$$ -64 -76 55 -14 5 120 -181 32 -140 -220 -126 -161 76 -30 -48 54 -258 -21 -428 237 215 96 -68 137
7907A37J15n49J39J03P2m8r9L81m12K68M3j99j10L47j69Qj69K1J18j4N9J12l66
$$ 137 252 -297 -158 -55 17 -31 -130 251 -161 107 150 -49 -159 188 19 27 -142 -121 -3 -17 42 154 -212
7930b12R2P0J51j65J57p6r2r0K43o6J8M7m01M15k18l4pJ50Km4l9M2k1j34K50J0
$$ -212 -120 -50 101 -64 93 17 -75 -165 78 12 30 77 -324 91 -127 -161 -168 -18 -16 -60 -99 -57 -78 -212 38 48
7956D8k8N7N2k63J2R5r4N7L8J63O5o4P9j29j98KJ26j38O9J10j44N4P8L1m4l6K40
$$ 48 20 77 129 -134 -122 -27 -121 -64 -26 137 202 138 217 88 -110 -108 18 -120 -51 59 -85 -31 47 78 34 -2 238
7983B38k43l1o3K17l32K64r2L0K1o5q6K94j09o9P9k5Q7l86L04j27K22m25K12K87
$$ 238 -5 -36 -99 118 -214 50 -42 -12 9 -56 -142 152 43 -26 53 28 115 -271 33 -94 128 -297 -85 202
8007B02n13L50p1J26j56qP0J47L9p5k37L10j43j0j12L43k60j71K63k95J62J27
$$ 202 -311 39 -32 94 -62 -70 0 147 186 111 -126 184 41 31 -81 262 2 -169 94 -201 -39 88
8029H8k15j36L62m1j13k2o2K49k53L71j90J9j79J32K51k48r4l8L39k51N5op5O9
$$ 88 -127 -263 99 58 -55 -77 -139 110 -143 228 38 57 -122 10 261 13 -81 -119 220 -31 24 18 -57 12
8053A2R0RK6k62K70m32K20J22Q9l12Q4O4O1j24J26k96Q2J89k45L98l84K45j03
$$ 12 102 111 137 -125 145 -287 -67 55 144 -168 -84 -20 41 -83 43 -253 -171 18 -227 171 -213 32 -71
8076g1L9K69k86JO8P1j64k7J75J25k20m5P5M7K1N4p4J53j13j67L13q3m98J13J86
$$ -71 -32 237 -49 -48 20 91 -73 -100 75 200 -20 -65 10 57 78 132 58 211 98 -69 244 161 -337 -224 -38
8101c8j56M35j57p4k65K62Q0kJ4J2k48P9k05N9K43n8j26n0L00o8Mq6Nk7J46j34
$$ -38 -194 241 84 10 -255 7 87 85 99 111 -137 -58 -263 -204 39 -19 -145 -195 105 37 41 -45 -40 -67 79 -55
8127e5K09l7j64n4O6o9k2K6J77p7N9j18r3j99M67k27L54l91L05p4J40m67M33r6
$$ -55 154 117 -47 -101 -35 -104 -126 -100 77 0 59 -59 -152 -351 116 -111 243 -148 157 83 223 -244 189 93
8151I3J14j47L4j28j39M30k86J52k52K91k08J70k37J25P2J01K2m39M60m11J42
$$ 93 207 60 94 -34 -173 257 -29 123 -129 162 -46 124 -113 12 84 185 207 -232 228 -183 -41
8172d1J45m6k45M34k56k0m5k56J03K98k28J17r1q5K00N5k65P9Q4
$$ -41 104 58 -187 247 -9 -29 -74 -330 -227 71 -157 -40 -131 -216 -16 39 -226 -147 -63
8191f3
$$ Imaginary data points
##PAGE= N=2
##DATA TABLE= (X++(I..I)), XYDATA
0@%%%%%%%%%%%%%qJ6j6J6k0K8l2M0m8N6o4P2q8J04j20J36j55J79k05K32k62K96
$$ 0 0 0 0 0 0 0 0 0 0 0 0 0 0 -8 8 -8 8 -12 16 -16 24 -24 32 -32 40 -48 56 -64 72 -83 96 -109 123 -139 157
35A57l34L75m20M71n26N84o49P21p98Q83r77J078j189J312j443J588j750J931
$$ 157 -177 198 -222 249 -277 307 -342 379 -419 464 -513 565 -624 688 -755 833 -917 1014
53A014k131K352k604K891l219L600m049M588n249O080p160Q627j0749J4101k0192
$$ 1014 -1117 1235 -1369 1522 -1697 1903 -2146 2442 -2807 3273 -3887 4740 -6009 8092 -12100
68a2100L4681j28941q9599L47320O4093j81670P91K16273O006j80017o2236N2919
$$ -12100 22581 -106360 -195959 151361 215454 33784 34575 250848 256854 76837 14601 67520
80F7520k7963j4572j6424p1993J689J10347J9519j13786m6543J13934L1324j11204
$$ 67520 39557 24985 8561 -63432 -61743 48604 68123 -45663 -92206 21728 53052 -58152
92e8152n1045J9865M512J2093j2693l8082K0161J13384P3947o3168j6812J24312
$$ -58152 -109197 -89332 -84820 -72727 -85420 -123502 -103341 10043 83990 20822 4010 128322
104A28322M5020p4055m1393P816J916j9806l1447m9105l9921M5645L5954o7792
$$ 128322 173342 99287 57894 65710 67626 47820 16373 -32732 -72653 -27008 8946 -58846
116e8846j6222P7424K6742k4718o87L899l8553j2483M5500m4645r8282N5147J06166
$$ -58846 -75068 2356 29098 4380 3693 7592 -30961 -43444 2056 -42589 -140871 -85724 20442
129B0442l5000o7978N9601J12365J791m8467L1316L1771j4556q582l7307n5576
$$ 20442 -14558 -82536 -22935 89430 91221 42754 74070 105841 91285 82703 45396 -10180
141a0180j0338J5383k1242n3277R331N9360j720j8116K0166M289l044J1511n384
$$ -10180 -20518 -5135 -26377 -79654 -70323 -10963 -12683 -30799 -10633 -6344 -9388 2123 -3261
154c261k7984j3694K6218K958l9013J4394M3625N188J4269L4095J5908m002K886
$$ -3261 -31245 -44939 -18721 -15763 -54776 -40382 3243 8431 22700 56795 72703 68701 71587
167G1587J4530k8570m8860J08n765l5355j4118p904q197J1208K1989M422j6909
$$ 71587 86117 57547 8687 8795 3030 -32325 -46443 -54347 -62544 -51336 -29347 -24925 -41834
180d1834K9087N7234k2211m3955K4601K6903k6520l8211P874K7740n637M172K0336
$$ -41834 -12747 44487 22276 -21679 2922 29825 3305 -34906 -27032 708 -4929 -757 19579
193A9579l076J2139K6955n975k1006o290J0605r849l8783j3009J77j1222M090
$$ 19579 16503 28642 55597 49622 28616 22326 32931 23082 -15701 -28710 -28533 -39755 -35665
206c5665j764p602K0067K6200P783j3196j01K8769l672k5135L902M595m717J94
$$ -35665 -37429 -45031 -24964 1236 9019 -4177 -4278 24491 20819 -4316 -414 4181 -536 -342
220c42m52J591j538J0834J6926j2360m128J8503k219j1501r856j2273m090o368
$$ -342 -794 797 -741 10093 27019 14659 10531 29034 26815 15314 5458 -6815 -10905 -17273
234a7273l658q816j1086J9735J4456j6208M973K2953J0376m556n586J4039L744
$$ -17273 -20931 -29747 -40833 -21098 -6642 -22850 -17877 5076 15452 10896 5310 19349 23093
247B3093j5044P27j909q982L712n39r03K582J181O821l620l412P548j0738q341
$$ 23093 8049 8776 6867 -2115 1597 1058 155 2737 3918 10739 7119 3707 11255 517 -7824
262g824M849p446p665j684L350M708o525P601J4590m094M770J2003k449j355j061
$$ -7824 -2975 -10421 -18086 -19770 -16420 -11712 -18237 -10636 3954 -140 4630 16633 14184 12829 11768
277A1768J643j021j2150J82K099p163L436k375m439R010J008l447j991J005Q092
$$ 11768 13411 12390 240 422 2521 -4642 -1206 -3581 -8020 990 1998 -1449 -3440 -2435 5657
292E657q134r362R394n41n614L349l58M067M17J331P982n051o1R817n400l083
$$ 5657 -2477 -11839 -2445 -2986 -8600 -5251 -5609 -1542 -1125 206 8188 3137 3076 12893 7493 4410
308D410K68k624K167m914k833K600m382M442Q30q841O293M691m779r67PN905k83
$$ 4410 4678 2054 4221 -693 -3526 -926 -5308 -866 -36 -8877 -2584 2107 -2672 -3639 -3632 2273 1990
325A990p209O842J000n496M641k78j099J613j911M165k175l822N706l230k026
$$ 1990 -5219 1623 2623 -2873 1768 1490 391 2004 93 4258 2083 -1739 3967 737 -1289
340a289L758m041K121O63l652J538l459P90L312n519K856M462l875L378J608L52
$$ -1289 2469 -1572 549 1212 -2440 -902 -4361 -3571 -259 -5778 -2922 1540 -2335 1043 2651 3003
356C003K243l792L710K654o548K132o98m934K28m527Q7J933l299M432J408j946
$$ 3003 5246 1454 5164 7818 1270 3402 2704 -2230 -2002 -6529 -6442 -4509 -7808 -3376 -1968 -3914
372c914N197o70O37K526m265K187J619k853J287l134J749M477m977K288M937o66
$$ -3914 1283 613 1250 3776 -489 1698 3317 464 1751 -1383 366 4843 -134 2154 7091 6425
388F425J374m805j835K762p749m127k12l184K597p87L60O300j373L397N480j621
$$ 6425 7799 2994 1159 3921 -3828 -7955 -8167 -11351 -8754 -9541 -9181 -2881 -4254 -857 4623 3002
404C002L104L92n81K321n396j414K387l384J837j049k432N748n44k624M81l276
$$ 3002 6106 6498 5917 8238 2842 1428 3815 431 2268 1219 -1213 4535 3991 1367 1848 -1428
420a428K268k555n183L864k534j984L869l468N24K788P42L964l242P32R888k800
$$ -1428 840 -1715 -6898 -3034 -5568 -7552 -3683 -7151 -6627 -3839 -3097 867 -2375 -1643 8245 5445
436E445k305K907L97K034l913k994L309l858j00J694n831L570L454k424j202k706
$$ 5445 3140 6047 6444 8478 4565 1571 4880 1022 922 2616 -3215 355 3809 1385 183 -2523
452b523K911o09r309Q60P01n507K377P24Q15M303K987P965L163l8P780j293m577
$$ -2523 388 -221 -9530 -8670 -7969 -13476 -11099 -10375 -9560 -5257 -2270 5695 8858 8820 16600 15307 10730
469A0730K234n605n439j315j223P86o089l99P361m359k996L629q99J406j438k562
$$ 10730 12964 7359 1920 605 -618 168 -5921 -6320 1041 -3318 -6314 -2685 -3584 -2178 -3616 -6178
485f178Q06l411K673J818p194O550R082j783Q06M048O109j909o765N744P07q429
$$ -6178 -5372 -8783 -6110 -4292 -11486 -4936 4146 2363 3169 7217 13326 11417 4652 10396 11103 2674
501B674K916m66p317j692M50j83n460j031J0821j240n559O935K219l937k823l47
$$ 2674 5590 5124 -2193 -3885 -3435 -3618 -9078 -10109 712 -528 -6087 848 3067 -870 -3693 -4040
517d040K884m013o13O320l980p61O329p67N35L145K492K653k926J697J71r351
$$ -4040 -1156 -5169 -5782 538 -3442 -4203 2126 1359 1894 5039 7531 10184 7258 8955 9126 -225
533b25N04K502p220n54K794K369j203m995L378l80n033N164r62l956N841K926
$$ -225 279 2781 -4439 -4993 -2199 170 -1033 -6028 -2650 -3030 -8063 -2899 -3861 -7817 -1976 950
549I50l539l178L406Q116l967k775J0310J674k634l97k502k91k750j419J42p145
$$ 950 -2589 -5767 -2361 5755 1788 -987 9323 10997 8363 7966 5464 5173 2423 1004 1146 -5999
565e999J413N374q763m468N114K928k42j332P549O103o051K398K400o793m08J328
$$ -5999 -4586 788 -7975 -12443 -7329 -4401 -4643 -5975 1574 7677 1626 4024 6424 -369 -777 551
581E51m11q9j137M032k6l573L655p68j979M755j374l185o53j378l63n812j611
$$ 551 140 51 -1086 2946 2920 -653 3002 2234 255 5010 3636 451 -202 -1580 -1943 -7755 -9366
598i366O599r99J457O157j396NQ38n65p08m773L524M310o236q75L268k504j416
$$ -9366 -2767 -3766 -2309 3848 2452 2457 3295 2730 2022 -2751 773 5083 -1153 -2028 1240 -1264 -2680
615b680j129J972L307j417L917L7m220M233j299o302J913K780M15l616j515N761
$$ -2680 -3809 -1837 1470 53 3970 4007 -213 4020 2721 -3581 -1668 1112 1527 -2089 -3604 2157
631B157m130n246N195P15l17K421J603K489k776j505K480m196j187L906j976M26
$$ 2157 -1973 -7219 -2024 -1309 -1626 795 2398 4887 2111 606 3086 -1110 -2297 1609 -367 59
647E9J337j413K26j953Q75J268l631L351K521m302J563M09k230q18M51M431l44
$$ 59 1396 -17 209 -1744 -869 399 -3232 119 2640 -1662 -99 310 -1920 -2738 -2287 2144 1800
664A800l003N891m9m851J362k19j04q63j175L663k361k685L201k799k209J963
$$ 1800 -1203 4688 4639 -212 1150 931 827 -36 -1211 2452 91 -2594 607 -2192 -4401 -2438
680b438n44J380O18M79K341k966Q61L430l652J655K481j933L84p98K50J02m180
$$ -2438 -2982 -1602 -984 -505 1836 -1130 -269 3161 -491 1164 3645 1712 2096 1298 1548 1650 -2530
697b530K584J688l794K340J242j770P4j918R03j54k869K606j90j708K412o25O59
$$ -2530 54 1742 -2052 288 1530 -240 -166 -2084 -1181 -1335 -4204 -1598 -1788 -3496 -1084 -1709 -1050
714a050K128j523K467J085l41K509k730j29J863m177l77K81j072N62l079N01L380
$$ -1050 1078 -445 2022 3107 2766 5275 2545 2416 4279 102 -275 6 -1066 -504 -3583 -3082 298
731B98k968Q94K542j982J654q02l70J541k942L29J695k212K385k32K94L447j463
$$ 298 -2670 -1776 766 -1216 438 -364 -734 807 -2135 -1806 -111 -2323 62 -170 124 3571 2108
748B108M89K059j857P87j250k552J389l337j391N51j979J559L31o14L842m16M56
$$ 2108 2597 4656 2799 3586 2336 -216 1173 -2164 -3555 -3004 -4983 -3424 -3093 -3707 135 -281 175
765A75K369j529J752l04k441J513j583j083J387k254J626J493o37K994k02o49
$$ 175 2544 1015 2767 2463 22 1535 -48 -1131 256 -1998 -372 1121 484 3478 3276 2627
781B627K106k955p43q18l189L47k220j260K579j410J112K836l04K794J473l59
$$ 2627 4733 1778 1035 217 -2972 -2625 -4845 -6105 -3526 -4936 -3824 -988 -1292 1502 2975 2616
797B616K704j896m53L90l182N03l77k183K372q16NK486q93Q26j35j913J453k337
$$ 2616 5320 3424 2971 3361 179 682 305 -1878 494 -322 -317 2169 1276 2102 1967 54 1507 -830
815h30k143J014k822n49J41j157L032L04O66M491O02K098J731j513J672j857k758
$$ -830 -2973 -1959 -4781 -5330 -5189 -6346 -3314 -3010 -2344 2147 2749 4847 6578 5065 6737 4880 2122
832B122J385l043j476J55k232J667N3j328K924k57j13J000k318P81j067l258R57
$$ 2122 3507 464 -1012 -857 -3089 -1422 -1369 -2697 227 -30 -143 857 -1461 -680 -1747 -5005 -4048
849d048j216j88K207K11L231L206p91L466M96q92J197k919n19m52l905N66j436
$$ -4048 -5264 -5452 -3245 -3034 197 3403 2612 6078 6574 5682 6879 3960 3441 2989 -916 -350 -1786
866a786j850J276j109J179J501r89K048m19k107J495j600q55J502j822J310J018
$$ -1786 -3636 -2360 -3469 -2290 -789 -1778 270 -149 -2256 -761 -2361 -3216 -1714 -3536 -2226 -1208
882a208o53L095p0O16L058j443J063J475j639l0j841j176k10l473k4N30l226J640
$$ -1208 -1861 1234 1164 1780 4838 3395 4458 5933 4294 4264 2423 1247 1037 -2436 -2460 -1930 -5156 -3516
900c516J131o95J412l74J982J159k701J820M53k607J531p89J09Q18n62K170N79
$$ -3516 -2385 -3080 -1668 -2042 -60 1099 -1602 218 671 -1936 -405 -1194 -1085 -267 -829 1341 1920
917A920o56L606r84j140J508j765j258o61j577L18k879N76L008l370J26K847j047
$$ 1920 1264 4870 3886 2746 4254 2489 1231 570 -1007 -689 -3568 -2992 16 -3354 -3228 -381 -1428
934a428K88n59J585J406l227J380K276l230R28J079m68J360k85J364K66j885J784
$$ -1428 -1140 -1699 -114 1292 -1935 -555 1721 -1509 -581 498 30 1390 1105 2469 2735 850 2634
951B634j233k850K529l92j903Q30k37J036j714j433L681k574j274L289j46r18
$$ 2634 1401 -1449 1080 688 -1215 -385 -622 414 -1300 -2733 948 -1626 -2900 389 243 -675
967f75O04J35O48k354J200K903k865N70K677k310n95l77k17L78k061K141R91k480
$$ -675 -71 64 712 -1642 -442 2461 -404 166 2843 533 -62 -439 -656 -278 -2339 -198 793 -1687
985a687K379R31k755R23J061L19J30j064K695j289l370K534q48k213J845M70J351
$$ -1687 692 1623 -1132 -209 852 1171 1301 237 2932 1643 -1727 807 -41 -2254 -409 61 1412
1002A412j038m94K376l519j776K477k274q07J801N61J13r00J404K359j730K193
$$ 1412 374 -120 2256 -1263 -3039 -562 -2836 -3643 -1842 -1281 -1168 -2068 -664 1695 -35 2158
1018B158L425j644P55N41k081j730k180L21q79k549L390P49l044J960N37j752
$$ 2158 5583 3939 4694 5235 3154 1424 -756 -435 -1314 -3863 -473 276 -2768 -808 -271 -2023
1034b023k77L06K387j319k024K945j830k609K099p7R15K256K013K956q55R36K260
$$ -2023 -2300 -1994 393 -926 -2950 -5 -1835 -4444 -2345 -2422 -1507 749 2762 5718 4863 5799 8059
1051H059m164j072J443k695j502r19r94j329l692J402J519k453K965L923p34R39
$$ 8059 3895 2823 4266 1571 69 -850 -1844 -3173 -6865 -5463 -3944 -6397 -3432 491 -243 696
1067F96k43K72j913k879K830q2j696M103P93m33J993J257J240o1K81K517l668
$$ 696 453 725 -1188 -4067 -1237 -1319 -3015 1088 1881 1448 3441 4698 5938 5877 6158 8675 5007
1084E007k799L73n079m062l46l71k32n8L286L491k209J729L296k206R3J490l00
$$ 5007 2208 2581 -2498 -6560 -6906 -7277 -7509 -7567 -4281 -790 -2999 -1270 2026 -180 -87 1403 1103
1101A103m41j907J555K03k975L569K874q46L098K104Pj384k879l80l778m697Q96
$$ 1103 662 -1245 310 513 -2462 1107 3981 3135 6233 8337 8344 6960 4081 3701 -77 -4774 -3878
1118c878k076l362J944J22L49P36K330M252p04J477M415j956j681R71j444j706
$$ -3878 -5954 -9316 -7372 -7250 -6901 -6165 -3835 417 -287 1190 5605 3649 1968 2939 1495 -211
1134b11r35J375K639j879J914L588j944P52O19j470j706k702j348k105m609J2
$$ -211 -1146 229 2868 989 2903 6491 4547 5299 5918 4448 2742 40 -1308 -3413 -8022 -8010
1150h010q25k059K820K106K004L179K127L163P19r39K759j874k815R27j394j552
$$ -8010 -8835 -10894 -8074 -5968 -3964 -785 1342 4505 5224 4285 7044 5170 2355 3282 1888 336
1166C36j96m71K289q43J36L160p15r55L79k786j809k422k937k83k288M33J928
$$ 336 140 -331 1958 1115 1251 4411 3696 2741 3120 334 -1475 -3897 -6834 -7117 -9405 -8972 -7044
1183g044j77L546L408J317L649J538J387L34j978M84j613l985J19j197j674P50
$$ -7044 -7221 -3675 -267 1050 4699 6237 7624 7958 5980 6464 4851 866 985 -212 -1886 -1136
1199a136L16J304M22p24K180r41k067L11k822j646j126k187N76j3M40L637J946
$$ -1136 -820 484 906 182 2362 1421 -646 -335 -3157 -4803 -5929 -8116 -7540 -7553 -7113 -3476 -1530
1216a530K857M123O40K472Q08j104o6l134j360j620l816m21n14j999J607M53O30
$$ -1530 1327 5450 6090 8562 9370 8266 8200 5066 3706 2086 -1730 -2151 -2665 -4664 -3057 -2604 -1974
1233a974J516q52J344j38k548L0j596j624M45q44J702K258P49L747K455J814K665
$$ -1974 -458 -1310 34 -104 -2652 -2622 -4218 -5842 -5397 -6241 -4539 -2281 -1532 2215 4670 6484 9149
1250I149o06L81j2l556j425k305l109j399k282p36J220q76J815J474K54J587p47
$$ 9149 8543 8924 8912 5356 3931 1626 -1483 -2882 -5164 -5900 -4680 -5556 -3741 -2267 -2013 -426 -1173
1267a173j01P20k081P9J51j080J456L68J344K598P31K284J833L34P95j389j476
$$ -1173 -1274 -554 -2635 -2556 -2405 -3485 -2029 -1661 -317 2281 3012 5296 7129 7463 8258 6869 5393
1284E393o53l777k296j139k749n83o56q8K174J43J172K293k22J183L36p99R00
$$ 5393 4740 963 -1333 -2472 -5221 -5804 -6460 -6548 -4374 -4231 -3059 -766 -988 195 531 -268 632
1301F32k084j02Q11r87J889J267N75K466P52N94J431j497n36r99l456q01k708
$$ 632 -1452 -1554 -743 -1730 159 1426 2001 4467 5219 5813 7244 5747 5211 4212 756 -45 -2753
1318b753k113k76j467Q7R08K67K519J031P17K528l88M92K82j009K31r48l92J664
$$ -2753 -4866 -5142 -6609 -6522 -5614 -5347 -2828 -1797 -1080 1448 1060 1552 1834 825 1056 108 -284 1380
1336A380n06N20J774k97J375L25r35N96j614j704n49k825r79r12j765Q73j84O54
$$ 1380 874 1394 3168 2871 4246 4571 3636 4232 2618 914 365 -2460 -3439 -4351 -6116 -5243 -5427 -4773
1354d773J815O90K110J086k44J918n5j386J071r31l67k31p34J662k61n21J889
$$ -4773 -2958 -2268 -158 928 684 2602 2547 1161 2232 1301 934 703 -31 1631 1370 849 2738
1371B738k49l05M90j220l15j357j844J44j869m92Q21j028J278J494l58J686R84
$$ 2738 2489 2184 2674 1454 1139 -218 -2062 -1918 -3787 -4279 -3458 -4486 -3208 -1714 -2072 -386 598
1388E98P55J096j435J322J24j821P95m65r01L89p43J151Q1p13J348L3j439P99
$$ 598 1353 2449 1014 2336 2460 639 1434 969 68 457 -286 865 946 233 1581 1614 175 974
1406I74j184n19j41j383Q86o81n58J513o74K02J892n61R49J068l35N37q85j7O64
$$ 974 -210 -729 -870 -2253 -1367 -2048 -2606 -1093 -1767 -1565 327 -234 715 1783 1448 1985 1100 1083 1747
1425A747k522O53P87j256L79J88J44R0q64Q92Q84k151J089L07r00O3k79p9n81
$$ 1747 -775 -122 665 -591 -212 -24 120 210 -654 238 1122 -1029 60 367 -533 -470 -749 -828 -1409
1444a409p8J473k24j75J957p00o53P87q99q5j58L39J202j693k51J196j403l41
$$ -1409 -1487 -14 -238 -413 1544 844 191 978 79 -6 -164 175 1377 -316 -567 629 -774 -1115
1462a115O32j16P29n66Q29N37j884P75N63q59O48N57j91O26q33K04m45j462J477
$$ -1115 -483 -599 130 -436 393 930 -954 -179 384 -475 173 730 539 1165 332 536 91 -1371 106
1481A06l74j080J633J04p99j97J36M33j500K44K118j132n84K220q99q46n2P70
$$ 106 -268 -1348 285 389 -410 -607 -471 -38 -1538 -1294 824 -308 -892 1328 429 -417 -469 301
1499C01R99j018O02J997j953r5O16j783J66l41Q1J8j084R57k33j725J083O94r54
$$ 301 1300 282 884 2881 928 833 1449 -334 -168 -509 -428 -410 -1494 -537 -770 -2495 -1412 -718 -1672
1518a672J154Q61N46m30n51J740j574j600K171K84n06M80P75J1j138j64J617j739
$$ -1672 -518 343 889 459 -92 1648 74 -1526 645 929 423 903 1678 1689 551 387 2004 265
1536B65o96J984j177j231j85l01o54j499J277J416r65J283J896j283M28N37j4
$$ 265 -431 1553 376 -855 -1040 -1341 -1995 -3494 -2217 -801 -1766 -483 1413 130 558 1095 1081
1553A081n50o22J678m22k034J879O7j728P66Q28M98o30j00J596j622k608J688
$$ 1081 531 -91 1587 1165 -869 1010 1077 -651 115 943 1441 811 711 2307 685 -1923 -235
1570b35j120j501O59L81K8j52P02J622r25L63K309q71j04J431l40j105j275N41
$$ -235 -1355 -2856 -2197 -1816 -1788 -1940 -1238 384 -541 -178 2131 1260 1156 2587 2247 1142 -133 408
1588D08m9j977J398J299j901Q97P09o96l78m58P30j84j886J586k57j700P52M43
$$ 408 359 -1618 -220 1079 -822 75 784 88 -290 -748 -18 -202 -2088 -502 -759 -2459 -1707 -1264
1606a264L1N54P69J818J45l90J373j092j207Q75q38r20j2j80Q9j516K01J340j276
$$ -1264 -1233 -679 90 1908 2053 1663 3036 1944 737 1612 774 -146 -158 -338 -249 -1765 -1564 -224 -1500
1625a500M77J532l49m35M6J20l20j698R03N59r93J027J143L6N40L40N40J83j059
$$ -1500 -1023 509 160 -275 -229 -109 -429 -2127 -1224 -665 -1658 -631 512 548 1088 1428 1968 2151 1092
1644A092J204o32j528M25p83j217J75p32N46o4J68J807p91m36J513r51j85L91
$$ 1092 2296 1664 136 561 -222 -1439 -1264 -1996 -1450 -1514 -1346 461 -330 -766 747 -204 -389 2
1662Bj69O32j044L69O45q25L93J366j88O97P6k53M72j429j01l36j278M9m32q94
$$ 2 -167 465 -579 -210 435 -390 3 1369 1181 1878 1954 1701 2173 744 643 307 -971 -922 -1354 -2248
1682b248Q89k52k7O80k50J333r8k93J281l46q15Q69k86k55j82N7R66m74J43R24
$$ -2248 -1359 -1611 -1638 -958 -1208 125 27 -266 1015 669 -146 723 437 182 0 57 1023 549 692 1616
1702A616o87K49L93j030L23n45j012J10j030j9K16q34R74L29k96J152J56N37Q9
$$ 1616 929 1178 1571 541 864 319 -693 -583 -1613 -1632 -1416 -2250 -1276 -947 -1243 -91 65 602 691
1721F91o20J169j86q47P54p42K47K24k33N25p9n43P73l93m85K70r12j53J6r67
$$ 691 71 1240 1054 207 961 219 466 690 457 982 903 360 1133 740 255 525 -387 -540 -524 -1491
1741a491L18k33l24O81k41L79R61n70Q71J13J3N35l96K27O9n63K43k2n19N43n58
$$ -1491 -1173 -1406 -1730 -1049 -1290 -911 50 -520 351 464 477 1012 616 843 912 349 592 570 51 594 36
1762C6K14M96p96M02l47m93N60k80q32Q60j061L70K93n03M72J08J2M79j92N14
$$ 36 250 746 -50 352 5 -488 72 -208 -1040 -180 -1241 -871 -578 -1081 -609 -501 -489 -10 -202 312
1782C12M13k85N57m51j05L64r43J38N56p15K83j16j61M93o48q2N83j113N32N4
$$ 312 725 440 997 546 441 805 -138 0 556 -159 124 8 -153 340 -308 -390 193 -920 -388 -334
1802c34l00M55o64K00M08l86K31N55l12Q76m77K02N30p58L7N03q69L97m25k69
$$ -334 -634 -179 -843 -643 -235 -621 -390 165 -147 729 252 454 984 226 263 766 -103 294 -131 -400
1822d00Q23n19k94J94k66L79k0l46N19m85K27L37j64J35o8m11P58o04O3L75m29
$$ -400 423 -96 -390 -196 -462 -83 -103 -449 70 -415 -188 149 -15 120 52 -359 399 -205 -142 233 -196
1843a96K47J83p09R59m88l68P79n25J29j93m31O61k99k88N75j11L44P6l14N56
$$ -196 51 234 -475 484 -4 -372 407 -118 11 -182 -613 48 -251 -539 36 -75 269 345 31 587
1863E87r2j76L73o06L24Ro86P3m5o50O77p10J04M51j66J8O75p41P73j89n8N18
$$ 587 495 319 692 86 410 419 -267 -194 -239 -889 -212 -922 -818 -367 -533 -515 160 -581 192 3 -55 463
1885D63p11O32J80o68P55r5k84N81k85J77k84l71N56q45q39O70n45o6M58n64M17
$$ 463 -248 384 564 -104 651 556 272 853 568 745 461 90 646 -199 -1038 -368 -913 -979 -521 -1085 -668
1906f68L33m04P05l82M96P00n66K79L01m55k89k69N56J59o82J009R5j015M75K8
$$ -668 -335 -739 -34 -416 80 780 214 493 794 339 50 -219 337 496 -186 823 918 -97 378 406
1926D06l78P0l95O97n52o51M59m20p32Q52j82K08L48QP38l15j30Q70r36O4P71
$$ 406 28 98 -297 400 -152 -803 -344 -764 -1496 -644 -826 -618 -270 -262 476 161 31 901 -35 29 800
1947H00l06J79k70M65k00q89O14P96j426N19Q25r39m10l8r1k04r35N01M94p98
$$ 800 494 673 403 868 668 -221 393 1189 -237 282 1107 168 -242 -280 -371 -575 -1510 -1009 -515 -1313
1967a313Q49L84k48Q6K18P10k67M3J166r06o87R94n84o94L34L8L20m49q8Q44j330
$$ -1313 -464 -80 -328 -242 -24 686 419 462 1628 722 35 1029 445 -249 85 123 443 -6 -94 750 -580
1988e80l62J414q52n93O52o0k6j081P53P12j022O57J007m97N27M10l01j04q20
$$ -580 -942 472 -380 -973 -321 -381 -407 -1488 -735 -23 -1045 -388 619 122 649 1059 758 654 -166
2007a66O07N8q87N36M15j036K89J30l6m25K97P96q22n84J263o61o86M98L08n2
$$ -166 441 499 -388 148 563 -473 -184 -54 -90 -515 -218 578 -244 -828 435 -226 -912 -414 -106 -158
2027a58l31L59Q49q81J55R45p72k16M64J02K72n97Q9J95j386N36L56q40N43L10
$$ -158 -489 -130 719 -162 -7 938 166 -50 414 516 788 191 280 475 -911 -375 -19 -859 -316 -6
2047fm9j03k45N66n04m63J041L02p63O94N5m16m07k7Q64o88K8J142l05o75M55
$$ -6 -55 -158 -403 163 -341 -804 237 539 -224 470 525 109 -298 -325 539 -149 -121 1021 716 41 496
2068D96n04l53m03pQ69o70J07N97r66P12Q3n19O94j69L43M38q72N36P8q13M34
$$ 496 -8 -361 -764 -771 98 -572 -465 132 -834 -122 -39 -558 136 -33 310 748 -124 412 490 -323 111
2089A11M71q61O14o5K10m13m45O71m68o30Q36Pk86K63m84M94o56j93J059l67O6
$$ 111 582 -279 335 270 480 67 -378 293 -175 -805 31 38 -248 15 -469 25 -631 -824 235 -132 -66
2110f6O52l59r8M75k67l37j85O76K82o20K77J09j085K56o8K26n3l88P34j62o39
$$ -66 586 227 129 604 337 0 -185 491 773 153 430 539 -546 -290 -358 -132 -185 -573 161 -1 -640
2131f40L24N0o3L56k9K39q9j43M27m35l70P08m83l46R75k45L3j26O3K82p66K14
$$ -640 -316 -266 -329 27 -2 237 148 5 432 -3 -373 335 -148 -494 481 236 269 143 206 488 -278 -64
2153f4M60q29J22M58n57l0r0J00R08r86O97M04n62L87j74m46O58m77r7K25l68
$$ -64 396 -433 -311 147 -410 -440 -530 -430 478 -508 189 593 31 418 244 -202 456 -21 -118 107 -261
2174b61L17j90j85N65L2m38N37j81J41p7o27O08m10m15N59k32J85l4k42P85k74
$$ -261 56 -134 -319 246 278 -160 377 196 337 260 -367 241 -169 -584 -25 -257 -72 -106 -348 437 163
2195A63k04J017o37k8K1k53l1l71l59M98j83J46J89l27M99k9j22L37k28m3R1n52
$$ 163 -41 976 339 311 332 79 48 -323 -682 -184 -367 -221 -32 -359 140 111 -11 326 98 55 146 -406
2217d06K31k43J2P96k59q9O70j27L26k43l75O15j052q5O9l24l25j67k7M63l23
$$ -406 -175 -418 -406 390 131 42 712 585 911 668 293 908 -144 -229 -160 -484 -809 -976 -1003 -540 -863
2238h63J11O89K55J14M92p89N92M7l89K51m89O2K59o14Q18k89J02M60j26o19N59
$$ -863 -752 -63 192 306 798 9 601 648 259 510 21 83 342 -272 546 257 359 819 693 74 633
2259F33l56l38n32n03M82m32k52M12l12N44K27J53P37K68J52M71p26M77k83m96
$$ 633 277 -61 -593 -1096 -614 -1046 -1298 -886 -1198 -654 -427 -274 463 731 883 1354 628 1105 822 326
2279C26m4j74q9N35q03M04L69n05K36k97j04j54pm94n1m69lK85j78N97K64L49
$$ 326 282 108 19 554 -249 155 524 19 255 -42 -146 -300 -307 -801 -852 -1321 -1324 -1039 -1217 -620 -356 -7
2301gN66OM94J98k28J86k83k92k20l74J8j48k67N18l19m0P57o52j27M48o34k73
$$ -7 559 565 1059 1257 1029 1215 932 640 420 46 64 -84 -351 167 -152 -192 565 -87 -214 234 -400 -673
2323f73j03l78P8k16K08L95m0Q41L98j38O32K02L71j2m26l11P9o75o2k49l95M19
$$ -673 -776 -1154 -1076 -1292 -1084 -689 -729 112 510 372 1004 1206 1577 1565 1139 828 907 232 170 -79 -474 -55
2345e5k41l5J64J53J54o84O8J19o03p2L26o88L09J44L78P11P1M65O37m4M77j06
$$ -55 -296 -331 -167 -14 140 -544 -476 -357 -960 -1032 -706 -1394 -1085 -941 -563 148 219 684 1321 1277 1754 1648
2367A648j76k21n72k95k18p19j71j5o02J012q2l87N49k94N53l52l82P33l73m78
$$ 1648 1472 1251 679 384 166 -553 -724 -739 -1341 -329 -411 -798 -249 -543 10 -342 -724 9 -364 -842
2387h42M13M8k55M90K59Q76j88K59N61n80j27M4l63l41m94j12k53n98M59K84n51
$$ -842 -429 -381 -636 -146 113 989 801 1060 1621 1041 914 958 595 254 -240 -352 -605 -1203 -744 -460 -1011
2408a011O09K62l10L09J93K4k95m45L29j62m36Q05K9l5M34k16R67m02L7P45m64
$$ -1011 -402 -140 -450 -141 52 76 -219 -664 -335 -497 -933 -128 -99 -134 300 84 1051 649 686 1431 967
2429I67n14Q9q39jk03l81O5j54L93M17n1j35L56k01L49k7J63j65n22K36L66q67
$$ 967 453 542 -297 -298 -501 -882 -817 -971 -578 -161 -212 -347 9 -192 157 130 293 128 -394 -158 208 -659
2451f59N27L86J33K22N05j34m3l55N9j30r44L73l37m08l59N16n0j72j03O69L52
$$ -659 -132 254 387 609 1114 980 937 582 641 511 -433 -60 -397 -805 -1164 -648 -698 -870 -973 -304 48
2472D8k91Q06k2k8n7l90p2N9P5J17m09K42N71p22R3LK05k94JP8j66n78J21J67
$$ 48 -243 563 541 513 456 66 -6 53 128 245 -164 78 649 -73 20 23 228 -66 -65 13 -153 -731 -610 -443
2496d43o93L14J86Q3P47o9L59k14l06P41j03n44J05K48r9k67m7J05m48r5Q11m49
$$ -443 -1136 -822 -636 -553 194 125 484 270 -36 705 602 58 163 411 312 45 -2 103 -345 -440 371 -78
2518g8k8K95l21j3R9m10K7n36N31L95n95L48L68N7PP5K3M73m24M81P1o01rk43
$$ -78 -106 189 -132 -145 -46 -456 -429 -965 -434 -39 -634 -286 82 139 146 221 244 717 293 774 845 244 235 -8
2542hl81K82j36n7M61m02L53m33m11P40l19l73O13p4L60o30J61M49m84J25P72
$$ -8 -389 -107 -243 -300 161 -241 112 -321 -732 8 -311 -684 -71 -145 215 -415 -254 195 -289 -164 608
2563F08m19K40K4j28M4k84J43o7l47K46L06l69J86q1k23j62j01J46J10k05M50
$$ 608 189 429 453 325 369 85 228 161 -186 60 366 -3 183 102 -121 -283 -384 -238 -128 -333 117
2584A17n0l67L37l25J11j78L00N35n46J64O75p65j40M05n6k53L07j16q9j55k38
$$ 117 67 -300 37 -288 -177 -355 -55 480 -66 98 773 8 -132 273 217 -36 271 155 66 -89 -327
2605c27L50n10J60J59K55j5r4J93k6n56K90M05m42N37j03j41k36r5N29n24l17
$$ -327 23 -487 -327 -168 87 72 -22 171 145 -411 -121 284 -158 379 276 135 -101 -196 333 -191 -508
2626e08N61m2k15M52l31j2M8N5L29j77r9J80j88J53J5m46L7P5K22M6k31K48m64
$$ -508 53 11 -204 248 -83 -95 -47 8 337 160 61 241 53 206 221 -225 -188 -113 109 155 -76 172 -292
2649b92n6K65L30l28r4mO5j01m95M63L88p39P00M4m4O20n87K53j27j88j44J19
$$ -292 -348 -83 247 -81 -175 -179 -114 -215 -710 -247 141 -598 102 146 102 722 135 388 261 73 -71 48
2671D8m18J36j77M03K56m02J02jj67M68k03L4J62l03n6n2R1K62l46J63L00m43
$$ 48 -370 -234 -411 -8 248 -154 -52 -53 -220 248 45 79 241 -62 -118 -170 -79 183 -163 0 300 -143
2693a43K03J25m3j54J09J54J69p25O05j23l86J73O3j79j2q2J95K2j90K95n65J53
$$ -143 60 185 142 -12 97 251 420 -305 300 177 -209 -36 27 -152 -164 -246 -51 -29 -219 76 -489 -336
2715c36L04l16qL98r3K28j38j74L62J02k30L40j80j66K19l36L31p7k14n4R5Jr9
$$ -336 -32 -348 -356 42 -51 177 39 -135 227 329 99 439 259 93 312 -24 307 230 16 -38 57 58 -41
2738d1l42N55j16l85N65n01j5p5K60l0j99j62N93q9l28L71K1K95Q1j09J39j09
$$ -41 -383 172 56 -329 236 -265 -280 -355 -95 -125 -324 -486 107 18 -310 61 82 377 458 349 488 379
2760C79k2k68l91L44j31j04j34p9J97K49l20J84R4l3Mq7l90K99j77L28P5l6j31
$$ 379 357 89 -302 42 -89 -193 -327 -406 -209 40 -280 -96 -2 -35 -31 -118 -508 -209 -386 -58 17 -19 -150
2783a50L30N2K11r7L17j07l36L68k83k18r1n9l15J45k38L63k4k90L48J27p5P1
$$ -150 180 232 443 346 663 556 220 588 305 87 -4 -63 -378 -233 -471 -108 -132 -422 -74 53 -22 49
2805D9j34j33M58l19L8j33J36K14l59L27J56j39k6Q1J23Q3m31J85No36N90P3k98
$$ 49 -85 -218 240 -79 -41 -174 -38 176 -183 144 300 161 135 216 339 422 -9 176 181 -455 135 208 -90
2828i0J17k37j54K45j06K13mo9K32k17m0J56j12K56k49j45J36K78M3o5k7J12J0
$$ -90 27 -210 -364 -119 -225 -12 -16 -85 147 -70 -110 46 -66 190 -59 -204 -68 210 253 188 161 273 283
2851B83k44k5k62K59l78J52J34p4k82L64q3K19R4l33L36k9k70L64k07n6J26m17
$$ 283 39 14 -248 11 -367 -215 -81 -155 -437 -73 -156 63 157 -176 160 131 -139 225 18 -38 88 -329
2873c29K06K60k01R4r1J74Q0k04n0N6k89J22K26k32J84k34K03Q0l09M45j19o8
$$ -329 -123 137 -64 30 -61 113 193 -11 -61 -5 -294 -172 54 -178 6 -228 -25 55 -254 191 72 4
2895DK10O7m14N56o46L04Q7j92J06j7J21l47J18k06R3j82L08J70l5J0m0m36L01
$$ 4 214 281 -133 423 -223 81 168 -24 82 65 186 -161 -43 -249 -156 -338 -30 140 105 115 75 -361 -60
2918f0j91K28J78j15K49k52o0J99l07J40K31j39l1j57J24K49m80M28j39l74L43
$$ -60 -251 -23 155 40 289 37 -23 176 -131 9 240 101 70 -87 37 286 -194 234 95 -279 64
2939F4Pj82j32j33L38j61q1J72K09l15R9J53p0j18L08K21k05%m3J66m62J85J24
$$ 64 71 -111 -243 -376 -38 -199 -280 -108 101 -214 -115 38 -32 -150 158 379 174 174 131 297 -165 20 144
2962A44k32k5K18k52Q0n7K12l58K42r2k09J92m8K88j56k67pM39k31kK59J02q1
$$ 144 -88 -113 105 -147 -67 -124 88 -270 -28 -120 -329 -137 -185 103 -53 -320 -327 112 -119 -121 138 240 159
2985A59J47k66J0k2J73q2j44J60J34m4m86J07j4Kj00K02o0Q1L03m69J09P4K35
$$ 159 306 40 50 28 201 119 -25 135 269 225 -261 -154 -168 -166 -266 -64 -124 -43 260 -209 -100 -26 209
3008B09r8r3K42J23m65K33R1m27K87k5P8l72K86J45r1j95P0k35K25j12J97j81
$$ 209 111 18 260 383 -82 151 242 -185 102 77 155 -217 69 214 123 -72 -2 -237 -12 -124 73 -108
3030a08O7m53M58k86L77j69K64k42K36M3p9j64R5j93o4K79K6k76L91j91r6K02
$$ -108 -41 -494 -36 -322 55 -114 150 -92 144 187 108 -56 39 -154 -218 61 87 -189 202 11 -85 117
3052A17k04j0L4Q8o4K60k27p0K67j77j02r3J26K41n26L64o8k21L06J08JJ56j52
$$ 117 -87 -97 -63 25 -39 221 -6 -76 191 14 -88 -181 -55 186 -340 24 -44 -265 41 149 150 306 154
3075A54J25m82M7J1M9l0L10o16M57J56j43O9m60M54%j39K20R3l79J33j58k07M12
$$ 154 279 -203 -156 -145 -96 -126 184 -432 25 181 38 107 -353 101 101 -38 182 275 -104 29 -129 -336 76
3098G6j15j77L68M6k06l2j70n1K38k3J96m04M43k35o0J06J34l13J85K03Q8r9k66
$$ 76 -39 -216 152 198 -8 -40 -210 -261 -23 -46 150 -254 189 -46 -106 0 134 -179 6 209 297 198 -68
3121f8M32k56J2j1o9K18m55K34o5K3l06J99k01P0J95j01K41j16j40O5n9j30K93
$$ -68 364 108 120 109 40 258 -197 37 -28 -5 -311 -112 -313 -243 -48 -149 92 -24 -164 -99 -158 -288 5
3144Ek1J33Q3j30Q1Mn0jj72K24p9l62L24k71l5M77o17K83O3j46J86j41k06M21
$$ 5 -16 117 200 70 151 155 105 104 -68 156 77 -285 39 -232 -267 210 -407 -124 -61 -207 -21 -162 -368 53
3168E3k31R6q3N3J09J01l01K60k9K36L2j14r5J38l05N22o14N9M8k20K29r1l05
$$ 53 -178 -82 -165 -112 -3 98 -203 57 28 264 296 182 87 225 -80 442 -172 -113 -65 -285 -56 -147 -452
3191d52J90J40j94J84m49O62N2k33J66k93O4K42j68M00j35l0l6J29K3m47K30j2
$$ -452 -262 -122 -316 -132 -581 81 133 -100 66 -227 -163 79 -89 311 176 146 110 239 262 -185 45 33
3213C3M20l82K55r1l82J0N7j65P8q3K05j41p4l0K33M9k9j93K79J76j16K7j01K5
$$ 33 453 71 326 235 -147 -137 -80 -245 -167 -250 -45 -186 -260 -290 -57 -8 -37 -230 49 225 109 136 35 60
3237F0J4j16J56K3j20J96l60K9K54l23o2K17J35j80j84J66J30l29K85K2K02k98
$$ 60 74 -42 114 137 17 213 -147 -118 136 -187 -249 -32 103 -77 -261 -95 35 -294 -9 13 215 -83
3259h3R3J03k22M9Ml8Q8L3k1j9j7K18m03K34k27K48r7p1M7Q0k2m6J08n6l02K89
$$ -83 10 113 -109 -60 -56 -94 -6 27 6 -13 -30 188 -215 19 -208 40 -57 -128 -81 -1 -23 -69 39 -17 -319 -30
3285c0J53k17j20M08J36k93J87m54L04j10r8M15j59l36P63m38k34L34k06K32o4
$$ -30 123 -94 -214 194 330 37 224 -230 74 -36 -134 281 122 -214 549 111 -123 211 5 237 173
3306A73m08K38J3N1n7p5j08L22R8m24o3K07j4L6N4K12k03j26n1K22Q4j98J00j61
$$ 173 -235 3 16 67 10 -65 -173 149 247 -177 -240 -33 -47 -11 43 255 52 -74 -125 97 181 -17 83 -78
3330g8nn7o4J57LJ45j80J82L3j21Nj19K90j56O9P3P6k80q0L3J86k23k50L40j52
$$ -78 -83 -140 -204 -47 -44 101 -79 103 136 15 20 -99 191 35 104 177 253 -27 -107 -74 112 -111 -361 -21 -173
3355a73j3L30k17m2K48pk53M5K76k09J72k3l23k7K19k56O72l00m0N1j26jK07k30
$$ -173 -186 144 -73 -115 133 126 -127 -82 194 -15 157 134 -189 -216 3 -253 419 119 79 130 4 3 210 -20
3379b0oJ5k08J24o1K28O4m10K53J37k92P2K26j30J76j79L3J45m36Q5J44L6P2r2
$$ -20 -26 -11 -219 -95 -156 72 136 -274 -21 116 -176 -104 122 -8 168 -11 22 167 -269 -184 -40 -4 68 -24
3403b4L80n5o44N36j18j33l6j4K46p0j73K94n06K90K97k94J74l5j68L19j97J67
$$ -24 356 301 -343 193 75 -58 -94 -108 138 68 -105 189 -317 -27 270 -24 150 115 -53 266 69 236
3425B36j67KN7J00l10K06j18j94L36Qk98R4n1L24l44L5J40k68r6L28j64J94j54
$$ 236 69 71 128 228 -82 124 6 -188 148 156 -142 -48 -99 225 -119 -84 56 -212 -308 20 -144 50 -104
3448a04K17nk51K33K02l74K00J79k15P8j10l42k7k3J92J30J37J17Q2l52Pm6K83
$$ -104 113 108 -143 90 292 -82 118 297 82 160 50 -292 -319 -342 -150 -20 117 234 316 -36 -29 -75 208
3471B08j74l01J75K95l12J43J49j67Q5K8j21M4J42J23k21j62pj23K60k53K14P
$$ 208 34 -267 -92 203 -109 34 183 16 101 129 8 52 194 317 96 -66 -73 -196 64 -189 25 32
3493C2K48k03L52l17k78K51mj16j31O2K0p5M28j63n29M31K13l49M9N48l71k7M8
$$ 32 280 77 429 112 -166 85 81 -35 -166 -104 -84 -159 269 106 -423 8 221 -128 -79 469 98 71 119
3516A19j83j12qK95Q8l17O4K07j52j97N5K2j40K92J44m00K03J4J10ql3J39K04
$$ 119 -64 -176 -184 111 199 -118 -54 153 1 -196 -141 -119 -259 33 177 -223 -20 -6 104 96 63 202 406
3539D06m32m2L27Rk17L46k11k97o2N9J47k17J88j93j07Q2O1K76j1L8k73p6K52
$$ 406 -26 -68 259 268 51 397 186 -111 -173 -114 33 -184 4 -189 -296 -214 -153 123 112 150 -123 -199 53
3562E3Q7j05j22J61K13k62J69m7J81k64j87N0K81l47r6P8n8K47j32Q0L0k7R5l27
$$ 53 140 35 -87 74 287 25 194 147 328 64 -123 -73 208 -139 -235 -157 -215 32 -100 -20 10 -17 78 -249
3586b49K24j1N6K16j77J8r2r7m1L1J31k8R9o0j06L03l24L29j25J30k45J8j26J24
$$ -249 -25 -36 20 236 59 77 -15 -112 -153 -122 9 -19 80 20 -86 217 -107 222 97 227 -18 0 -126 -2
3610bp9j85K7L74l12j9L69k91L6j10J20R7j10J97J56k64M6K95n67J79K43k01k5
$$ -2 -81 -266 -239 135 -177 -196 173 -118 -82 -192 -72 25 -85 112 268 4 50 345 -222 -43 200 -1 -26
3633b6O7j81K24j21j82N06n52K60j88j39J53M1p7K33l1K03j34j57M40j54j99J83
$$ -26 41 -140 84 -37 -219 287 -265 -5 -193 -332 -179 -138 -215 18 -13 190 56 -101 339 185 -14 169
3655A69n19M28JK7j44L4J26J2k28K09M5j78j3J38j03k9j96R3L1R9L1O4l08J86
$$ 169 -350 78 79 106 -38 -4 122 134 -94 115 160 -18 -31 107 4 -25 -221 -128 -97 2 33 97 -211 -25
3679b5R2n9J88m15J39L52m00K34k25L9J22j21r9K7J62j02k06K79K41m46K21j32
$$ -25 67 8 196 -219 -80 272 -128 106 -119 -80 42 -79 -178 -151 11 -91 -297 -18 223 -223 -2 -134
3701a34k5LR4k35J29J31K45l7j66J33k41oK94k00K10k97J61j47K21m7J24j64r6
$$ -134 -159 -156 -62 -297 -168 -37 208 171 5 138 -103 -109 185 -15 195 -102 59 -88 133 86 210 46 -50
3724e0R2M5j28p1n9L43Mj39k3l70K94R3k53M2K19k96N00l01J3K9j39K43k29q1
$$ -50 42 87 -41 -112 -171 172 176 37 14 -356 -62 31 -222 -180 39 -257 243 -58 -45 -16 -155 88 -141 -222
3748b22L20j04K52k97k08J36J81k36J71L0k15R0PJ33K57l33M10l49pJ4J13rk30
$$ -222 98 -6 246 -51 -259 -123 58 -178 -7 23 -192 -102 -95 38 295 -38 372 23 16 30 143 134 -96
3771i6r6K11k31J62O0j18kN4j50N32k86j58J53j62L18k95M2J89j73M81m77j41
$$ -96 -192 19 -212 -50 10 -108 -110 -56 -206 326 40 -118 35 -127 191 -104 -62 127 -46 435 -42 -183
3793a83KJ15J38l8Nk6r6j61K13j8J14k10J20j46L86k59k23K11k01M03l38K37Q7
$$ -183 -181 -66 72 34 39 13 -83 -244 -31 -49 65 -145 -25 -171 215 -44 -267 -56 -257 146 -192 45 132
3816A32j57r6MP3N9o6j22L09l15J08J42J62l63K72j10j2j54J18k52K77k08J72
$$ 132 -25 -121 -117 -44 15 -51 -173 136 -179 -71 71 233 -130 142 32 20 -134 -16 -268 9 -199 -27
3838b7L5k9L07l28K76k42KK24q9%j6k33O4L7j8K36J12l86m9K33L9r3k8P0K09l68
$$ -27 8 -21 286 -42 234 -8 -6 218 129 129 113 -120 -56 -19 -37 199 311 -75 -124 109 148 55 27 97 306 -62
3864f2J0J59J75m56K38L4k50K50j33L5j91K91j21j15K62j8Km51L31pj16L91M1
$$ -62 -52 107 282 -174 64 98 -152 98 -35 0 -191 100 -21 -136 126 108 110 -341 -10 -17 -133 258 299
3887B99m83K68Kj44k34N23k30j17J78j70Q8J10j03K69L9l53k5K35j19O4p3j60
$$ 299 -184 84 86 -58 -292 231 1 -116 62 -108 -20 90 -13 256 295 -58 -83 152 33 97 24 -136
3909a36K63j13J44m07L26L12k86j56Q4L6j25ql3K63k03j02R9M1j22L6K76M6m68
$$ -136 127 14 158 -249 77 389 103 -53 31 67 -58 -66 -99 164 -39 -141 -42 -1 -123 -87 189 235 -233
3932b33L06N9k31JQ0K7k37N04k52k84J85J54j62J03o0K24j53j83P2L9j25J20j14
$$ -233 73 132 -99 -98 -18 9 -228 276 24 -260 -75 79 -83 20 -40 184 31 -152 -80 -41 -166 -46 -160
3955a60P4M30j40k08j56J70P9j41J41k2K59k08k16j0j62P1J03p8R5K75l74K0k22
$$ -160 -86 344 204 -4 -160 10 89 -52 89 67 326 118 -98 -108 -270 -199 -96 -174 -79 196 -178 -158 -380
3978c80M37j0k53N8M34l56k74K44J14k5O7q1J50L1j63n9Np9L1o7J70J12j18k01
$$ -380 57 47 -206 -148 286 -70 -344 -100 14 -11 56 -25 125 156 -7 -66 -61 -140 -109 -176 -6 106 -12 -213
4002b13K30l7M4k51N9m2q9L11k84J94J09p8L8q7K7J92j4J9j55P7K2n0l76L71N4
$$ -213 17 -20 24 -227 -168 -210 -299 12 -272 -78 31 -47 -9 -96 -69 123 109 128 -27 50 72 22 -354 17 71
4027G1l9J63l54k28L94j28r4j23J05N01m28J07rPJ13O1j89L8Q3J44l28J53L25
$$ 71 32 195 -159 -387 7 -121 -215 -338 -233 268 -160 -53 -62 -55 58 119 -70 -32 51 195 -133 20 345
4050C45k81M6p5Jr7k26L19L7M5K0l63L85j84Qj68R4l5J97J1l53M14k82J72P9N9
$$ 345 64 110 35 36 -61 -287 32 69 114 134 -229 156 -28 -20 -188 -94 -129 68 79 -274 140 -142 30 109 168
4075A68j53K62l34Q2J29j41K52k67m7J55J6n8k31l1K83M8j44M24m62N9Lk78j3
$$ 168 15 277 -57 25 154 13 265 -2 -49 106 122 64 -167 -198 85 133 -11 413 -49 10 13 -265 -278
4098b78O58n80J06M4O4P6k41N08l90K39l00K96l16J57j23l7M98k89j65P0j29K94
$$ -278 380 -200 -94 -50 14 90 -151 357 -33 206 -94 202 -114 43 -80 -117 381 92 -73 -3 -132 162
4120A62q4l1k9k05K34or5J32k8k18j30N19m02J72M8j36L2P7m0m4J46j29j3j77
$$ 162 78 47 18 -187 47 41 -54 78 50 -168 -298 221 -181 -9 39 -97 -65 12 -28 -72 74 -55 -68 -245
4144b45O76l46l10N2K98k9k48K85J90k17J50n8j67jj78J63M5k76K34j4j50J72
$$ -245 431 85 -225 -173 125 96 -152 133 323 106 256 198 31 30 -148 15 60 -216 18 4 -146 26
4166B6lj79K46j28j51L17j87K57m30K82O5k05M9j0J94j0k40K12l27Q6N03j69k73
$$ 26 23 -156 90 -38 -189 128 -59 198 -232 50 115 -90 -41 -51 143 133 -107 105 -222 -136 367 198 -75
4189g5J32mJ78j96j22qp5j38M91k92L9J14MO8l22M82L6l00M4j4k0J95n5J5k06
$$ -75 57 53 231 35 -87 -95 -170 -308 183 -109 -70 44 48 116 -206 276 312 12 56 42 22 217 162 177 -29
4214b9Q6m8o8J81k94K98j68j59MJ79K9K76j92mk01K6Q9l5Lk09L79k26r1K39j5
$$ -29 57 9 -59 122 -172 126 -42 -201 -197 -18 11 287 95 91 -110 -84 5 -30 -27 -236 143 -83 -174 65 50
4239E0j10J88j69K15q5j89K06o7j44K06j13j87L36l28K29m02N29j04o9K39l34
$$ 50 -60 128 -41 174 89 -100 106 39 -105 101 -12 -199 137 -191 38 -364 165 61 -8 231 -103
4260a03j55L02k3j81K57p2N5R6j71J84l85r2L39J6l0K2l05K07K38L1j62l33J83
$$ -103 -258 44 21 -160 97 25 80 176 5 189 -196 -288 51 67 37 59 -246 -39 199 230 68 -265 -82
4283h2J69m5k69K93N2o9k70J84P1j66K45j44L8k49K12J78k23l6J3K19k56L3J26
$$ -82 87 42 -227 66 118 49 -221 -37 34 -132 113 -31 7 -242 -30 148 -75 -111 -98 121 -135 -102 24
4306B4j30O8M6K5J7j76n3L20n16L32q6J76k62O7J67k1L5K05m80R0L03j02j08K80
$$ 24 -106 -38 8 33 50 -126 -179 141 -375 -43 -129 47 -215 -148 19 -2 33 238 -242 -152 151 49 -59 221
4330B21k98R5j20M0M15l55k6J11m9l7M2k77L76l62Q8K03j83J78k4q9L61m12K19
$$ 221 -77 18 -102 -62 353 -2 -28 83 34 -3 39 -238 138 -224 -136 67 -116 62 38 -51 310 -102 117
4353A17j47o8J44P3j40R6p9j1p4j13J07M3jo4L78m13J14j16P4j25J45L7O3P3k34
$$ 117 -30 -98 46 119 -21 75 -4 -15 -89 -202 -95 -52 -53 -117 261 -152 -38 -154 -80 -205 -60 -23 40 113 -121
4378a21LJ17k4m7K12j56k08r5J38L03K21m22k80K20J93J57j27j55P2k24R3p5K47
$$ -121 -118 -1 -25 -72 140 -16 -224 -319 -181 122 343 -79 -359 -139 54 211 84 -71 1 -223 -130 -205 42
4401D2R1k38J36r5j61L57j12m8L07r3k03j34J48K48P3m24K22j39P1l07M73l72
$$ 42 133 -105 31 -64 -225 132 20 -28 279 186 -17 -151 -3 245 318 -106 116 -23 48 -259 214 -158
4423a58J78n4r9M8K20p0k64K84l28M19k96J63j64J64mJ67r7p2O9k57K10K40k61
$$ -158 20 -34 -133 -85 135 65 -199 85 -243 176 -120 43 -121 43 39 206 109 37 106 -151 59 299 38
4446C8r8J65k94J26J0Q3Q1j22r2K81k99O1J60j74j17J75j9M2J32k51M16n61M2
$$ 38 -60 105 -189 -63 -53 30 111 -11 -103 178 -121 -60 100 -74 -191 -16 -35 7 139 -112 304 -257 -215
4469b15K69n7M16m89K00r2k42J42J66k32J18J84m89L56j65J78j77J7j49L48oK40
$$ -215 54 -3 413 -76 124 32 -210 -68 98 -134 -16 168 -321 35 -130 48 -129 -112 -261 87 81 321
4491C21l89K21j81j50n5M45k46l3mK38p8k98L57o7K2M7k66J80J46o53L25J47N0
$$ 321 -68 153 -28 -178 -233 212 -34 -67 -71 167 89 -209 148 81 103 150 -116 64 210 -443 -118 29 79
4514G9j30J74k70mL7K27K87o85K16L1j07j02J26JJ08K23k61j02k4K76r6J37N0
$$ 79 -51 123 -147 -151 -114 113 400 -285 -69 -38 -145 -247 -121 -120 -12 211 -50 -152 -176 100 4 141 191
4537A91n4N2M3l34j27K63l6J61j65j52J25j38j0K07L6L58j20k94J45k39R4J34
$$ 191 137 189 232 -102 -229 34 -2 159 -6 -158 -33 -171 -181 26 62 420 300 6 151 -88 6 140
4559A40l38L74k13o2J80n8pJ00j40K09J7k02J59k73OJ20l1Mr7P9L03k17o7j27
$$ 140 -198 176 -37 -99 81 23 16 116 -24 185 202 0 159 -114 -108 12 -19 -15 -112 -33 270 53 -14 -141
4583a41J1L7j16oJ62k3J5L69m18K20j87M3j50K00J71j93O6k14K18k36K71L1k1
$$ -141 -130 -93 -209 -215 -53 -76 -61 308 -110 110 -77 -34 -184 16 187 -6 60 -154 64 -172 99 130 109
4606A09L1j34q2l8j21J66n6r4N00k93J2Q3k61J24k46J23J32L0o0J74k17K46k64
$$ 109 140 6 -76 -114 -235 -69 -125 -219 281 -12 0 83 -178 -54 -300 -177 -45 -15 -75 99 -118 128 -136
4629a36L79k70J57j55l2L13l95J25q1J39j48O8j11J12K92m19l80O29q6k2j04K34
$$ -136 243 -27 130 -25 -57 256 -139 -14 -95 44 -104 -36 -147 -35 257 -162 -542 87 1 -21 -125 109
4651A09j6Q8K12m81K28k88J29j27J2M78m65M98l85r2O3L48l32J33M4j69K47j55
$$ 109 93 181 393 -88 140 -148 -19 -146 -134 344 -121 377 -8 -100 -37 311 -21 112 156 -13 234 79
4673G9O5j70L45l18J16k35K9M2k51J97J25q4p0J46K74k17O3k03O4K96j24j6l39
$$ 79 144 -26 319 1 117 -118 -89 -47 -298 -101 24 -60 -130 16 290 73 136 -67 -3 293 169 153 -186
4696a86M3K23n5M9K40l60J82j16r9O7p4O7P9k9lL9K6l13J81J25m1j14L8L59n43
$$ -186 -143 80 25 74 314 -46 136 20 -79 -12 -86 -19 60 31 28 67 93 -220 -39 86 45 -69 -31 328 -215
4721b15M11m53L90k35m6J64p8j09M4J41qK18k83M4j13J6K70J41k78J92j76J51
$$ -215 196 -257 133 -102 -148 16 -62 -171 -127 14 6 224 -59 -15 -128 -112 158 299 21 213 37 188
4743A88k26J12j17K5J56k39L0k13M47j39J19N1l1k85J53l18K64o1JJ34j16J70
$$ 188 -38 74 -43 -18 138 -101 -71 -284 163 24 143 194 163 -122 31 -287 -23 -84 -83 51 -65 105
4765A05k43k1J33J91j08J31j19j14QJ78j24Kk2ql8J50n4n1K16k99m6k7J73o6L2
$$ 105 -138 -159 -26 165 57 188 69 -45 -37 141 17 19 -3 -11 -49 101 47 -4 212 -87 -133 -160 13 -53 -21
4790b1K19j44j26q9N4J76M5j3k00L81m58J12lj19K23rk87R5J24J23l13K44j4l4
$$ -21 198 54 -72 -161 -107 69 114 101 -99 282 -176 -64 -67 -186 37 28 -259 -164 -40 83 -230 14 0 -34
4814c4m6J33l9K17k09j08J84j08N7j50J22k69K76R9k0Pp2K35k85l4Q2k25J7Q0
$$ -34 -80 53 14 231 22 -86 98 -10 47 -103 19 -250 26 125 105 112 40 275 -10 -44 38 -187 -170 -90
4838i0J2J32j29K24nj63k03J56n5M28l45K06k62K40n55O14j68m5R5J18k22K06
$$ -90 -78 54 -75 149 144 -19 -222 -66 -121 307 -38 168 -94 146 -409 205 37 -8 87 205 -17 189
4860A89j18k24K43k68L52k02M1q0K05Om24K38L3K0k75J50R4k09J11J16j1j15J33
$$ 189 71 -153 90 -178 174 -28 13 -67 138 144 -280 -42 -9 11 -264 -114 -20 -229 -118 -2 -13 -128 5
4883EJ39k09K44k88j35K4P1L16k90J60m1M7r3K06j41J85j91m9k6J15j2J11j97
$$ 5 144 -65 179 -109 -244 -220 -149 167 -123 37 -4 43 -50 156 15 200 9 -40 -66 49 37 148 -49
4906d9jj59J08r8L32k30J70n2Q1j09K11J03m10L6K08k4J3j05K68p16M52K6J09
$$ -49 -50 -209 -101 -199 133 -97 73 21 102 -7 204 307 -103 -67 141 117 130 25 293 -423 29 55 164
4929A64j09m5M5m0j03O2R6k48K79j55j6K3j90L82j11J95k02k37J53j24O0J91j44
$$ 164 55 10 55 15 -88 -26 70 -178 101 -54 -70 -47 -237 145 34 229 27 -210 -57 -181 -121 70 -74
4952g4j04K61k69J35jJ8J16j98L78k44j33K13j63j62L37J20k62Q0n7J68k10P8
$$ -74 -178 83 -186 -51 -52 -34 82 -116 262 18 -115 98 -65 -227 110 230 -32 48 -9 159 -51 27
4974B7J71j22l2j41M9J66j34j75K81O8o5j22L0k42M08J4J33l88K07l1n16K90N0
$$ 27 198 76 44 -97 -48 118 -16 -191 90 158 93 -29 1 -241 167 181 314 -74 133 102 -414 -124 -74
4997g4L11p4j91n4J66j8o6o8L33j42N2l77K94j68J74q8j5K17l18J07J39k55M55
$$ -74 237 163 -28 -82 84 66 0 -68 265 123 175 -202 92 -76 98 10 -5 212 -106 1 140 -115 340
5020C40n4j31q1R2l29K94j58J68L5m80L41j96L22k40k63N77l48J00j37R6j17L04
$$ 340 286 155 74 166 -163 131 -27 141 176 -304 37 -159 163 -77 -340 237 -111 -11 -148 -52 -169 135
5042A35O6k07L9j79L33l94K85j44j08J09J97j91N7j1K4J59k49PO6J27j95K68k33
$$ 135 201 -6 33 -146 187 -207 78 -66 -174 -65 132 -59 -2 -13 11 170 -79 -72 -6 121 -74 194 -39
5065c9J11o8j23J92l70K46L30o00L70k74K04P4p6m3L27j70k40J85m6o3R5K3o5
$$ -39 72 4 -119 73 -297 -51 279 -321 49 -225 -21 53 -23 -66 261 91 -149 36 -10 -73 22 45 -20
5088b0qr1K74n0J03m63K07P5j27RQ2R7k13P6j5J8K69l41J1K11J38l87L35j18J46
$$ -20 -28 -119 155 105 208 -255 -48 27 -100 -91 -9 88 -125 -49 -64 -46 223 -118 -107 104 242 -145 190 72 218
5113B18M7Q7j69o9j9j90m8K5J41J40k85Q0J48p1k54K87j12j17J23J2R7M9r0k04
$$ 218 265 352 183 114 95 -95 -143 -118 23 163 -122 -42 106 35 -219 68 -44 -161 -38 -26 71 120 30 -174
5137a74J35JM9J07r0K65k27j19J64j82n3J01N5j64K15m8j91J08k4J39J64l62J03
$$ -174 -39 -38 11 118 28 293 66 -53 111 -71 -124 -23 32 -132 83 35 -156 -48 -72 67 231 -131 -28
5160b8q5K10K59m63j54K95R1l23R8j37K82Qn3J09p2j97L36l67J06L19k16Qo4j62
$$ -28 -113 97 356 -107 -261 34 125 -198 -100 -237 45 53 0 109 37 -160 176 -191 -85 234 18 26 -38 -200
5184b00K86l91L03L80l79K19j07j86JJ47j40P2p4J73q4j30L89l02M8J21j8o7q5
$$ -200 86 -305 -2 378 -1 218 111 -75 -74 73 -67 5 -69 104 20 -110 279 -23 25 146 128 61 -24
5207b4j4J76j53J35j16J6J39l3j94J3K09m1l99L50k6L4n8R2l77L05N2k19L56k43
$$ -24 -38 138 -15 120 4 20 159 126 -68 -55 154 113 -286 64 38 72 14 106 -271 34 86 -133 223 -20
5231b0k02L04j99J68m7Q6j79j48J8K26k95J74j22K97k6j75qJ22M6j10K24j79O7
$$ -20 -222 82 -117 51 4 90 -89 -237 -219 7 -288 -114 -236 61 35 -140 -148 -26 20 -90 134 -45 22
5254B2J09k88K82M1j80j25K8J14l3j61K53j98o7L14k02J79rm3J16n43L87l3r6
$$ 22 131 -157 125 166 -14 -139 -111 3 -30 -191 62 -136 -203 111 -91 88 79 36 152 -391 -4 -37 -133
5277a33J59l09L01j21J63k17R4P9l28J35J02M01l33K43l53n0J88k2k44N3M64m18
$$ -133 26 -283 18 -103 60 -157 -63 16 -312 -177 -75 326 -7 236 -117 -167 21 -1 -245 -192 272 -146
5299a46N3J68j33J28k96R5J91k1rj6J3n0L04m56K02q7j3L48j96k29N9L21k60J67
$$ -146 -93 75 -58 70 -226 -131 60 39 30 14 27 -23 281 -175 27 -60 -73 275 79 -150 -91 230 -30 137
5323A37p1q8J53N5j09j09N8l09J93P4P7J95l33n2L11j2k61K61k83K08K80m86J73
$$ 137 66 -22 131 186 77 -32 26 -283 -90 -16 61 256 -77 -129 182 170 -91 170 -113 95 375 -111 62
5346F2j28J51k52q7J23L33k54j06K27K7j37K11k5R0j14j21j15k8J01J55j86o9
$$ 62 -66 85 -167 -254 -131 202 -52 -158 69 96 -41 170 145 235 121 0 -115 -143 -42 113 -73 -142
5368a42J95k00L21k63K32k4n7p5m2J46k15M8K46k85Q4r9p6J3J21j52O47l76k80
$$ -142 53 -147 174 -89 143 119 62 -13 -55 91 -124 -76 170 -115 -31 -130 -206 -193 -72 -224 423 47 -233
5391b33J77J29J71k48k00J46J16j9j8N1j71J72j77j04M05l03K25K6j41J14j55
$$ -233 -56 73 244 -4 -204 -58 58 39 21 72 -99 73 -104 -208 197 -106 119 145 4 118 -37
5412c7J57k90J54l0j01n2%J51J41Q4k65J0O2j13J55k14J21M1N4J11Kk31J87N0
$$ -37 120 -170 -16 -46 -147 -199 -199 -48 93 177 -88 -78 -16 -129 26 -188 -67 -26 28 139 141 -90 97 147
5436A47k29K9j21P8j66pJ62k7J48k64K90K24m8m52N7J38nK09j82p0k60L13r9J37
$$ 147 -82 -53 -174 -96 -262 -269 -107 -134 14 -250 40 264 216 -236 -179 -41 -46 163 -19 -89 -349 -36 -135 2
5460Bj24N3p2K60L4l2k15J93R0p2m68K35J38j03J72o0r4K53k02J4L98n20J71K
$$ 2 -122 -69 -141 119 153 121 -94 99 189 117 -351 -116 22 -81 91 31 -63 190 -12 2 400 -120 51 53
5484E3N7j69o9J07J28j19j24Km9R6M8O5j97J78J72o2l58K79J51k64Qm7K5K86k04
$$ 53 110 -59 -128 -21 107 -12 -136 -134 -183 -87 -39 26 -171 7 179 117 -241 38 189 -75 -67 -114 -89 197 -7
5509gp1J63j55j29J81J90k40j57j38M22J60k82R4k51q5L02K0P5r6L64k49l5q2
$$ -7 -78 85 -70 -199 -18 172 -68 -225 -363 59 219 -63 31 -220 -305 -3 17 92 -4 360 111 76 -6
5532fO8j46K49n74M42q9J22J27k46R9j32%R9m5K6M0k28M01k24L8o4l3J03K42k12
$$ -6 62 -84 165 -409 33 -56 66 193 -53 46 -86 -86 13 -32 -6 34 -194 207 -17 21 -43 -76 27 269 57
5557E7m49M17k18O8K17j01J52m89J92K9K35q9j77M19l58n5jR2K06l01J03M3J46
$$ 57 -392 25 -193 -125 92 -9 143 -346 -154 -125 110 21 -156 263 -95 -150 -151 -59 147 -154 -51 -8 138
5580A38l71N7K91l2P3j00k8qJ83j72k0J40j10q4M7k16K50Q4p6N0j06Q1n8K2J58
$$ 138 -233 -176 115 83 156 56 28 20 203 31 11 151 41 -43 4 -212 38 122 46 96 -10 71 13 35 193
5605A93k37j0r9J90K51n40L34j58J16J07l83M13j21k48M05k71L6n5K07k03JJ70
$$ 193 -44 -54 -153 37 288 -252 82 -76 40 147 -236 177 56 -192 213 -58 -22 -77 130 -73 -72 98
5627I8l08L56k77j97L82p1K46k82m4M2n0O2m0O1k27K33n5K16k48K32N2r4k14J86
$$ 98 -210 146 -131 -328 54 -17 229 -53 -97 -55 -105 -43 -83 -22 -249 -16 -71 145 -103 129 181 87 -127 59
5651E9J06k32M80l74o9J84k35M4j7j23J94J3j82O8J1J52q4J06J06m3j84m2J94
$$ 59 165 -67 413 39 -30 154 -81 -37 -54 -177 17 30 -152 -84 -73 79 -5 101 207 164 -20 -62 132
5674A32j43L3J35k29J72k2m3j91L94j38l71L69M0j84j4p7jj67O9J21M8r6K33j30
$$ 132 -11 22 157 -72 100 78 35 -156 238 100 -271 98 138 -46 -60 -137 -138 -305 -236 -115 -67 -163 70 -60
5698f0Ok07K54J40r1M03m70L88m34O7L00k98jjO5%l11J10j06K16K19k26K88n31
$$ -60 -54 -261 -7 133 42 445 -25 363 -71 -4 296 -2 -3 -4 61 61 -250 -140 -246 -30 189 -37 251 -280
5722b80L29r7M1K08k44l9j39K76j4j79N33l90j68K75J31k93J82j21J9J17ll7j63
$$ -280 49 -48 -7 201 -43 -82 -221 55 41 -138 395 5 -163 112 243 -50 132 11 30 147 144 107 -56
5745e6j0J53n6R8l63K87K27j34r1O1m6p4o1j39J53j9K43j63M3J68k87j9n7N2n6
$$ -56 -66 87 31 129 -234 53 280 146 55 116 70 -4 -65 -204 -51 -70 173 10 53 221 -66 -85 -142 -90 -146
5770a46J50j00m5L04j6j60Q1j06J83k16J02J40l7k83P9O2J78j37O8Q6j70O2O2
$$ -146 4 -96 -141 163 147 -13 68 -38 145 -71 31 171 134 -149 -70 -8 170 33 101 187 17 79 141
5793A41k19J64k2j49K07Q0k18p7j11M69l07N7l39N02m25L65k8l16L29l36J13K16
$$ 141 -78 86 64 -85 122 202 -16 -93 -204 265 -42 15 -324 178 -247 118 90 -226 103 -233 -120 96
5815I6j55ok48L69J39l51J45K11n1K01l01k7j44L30j85O2k52M39j00p4o7k43M9
$$ 96 -59 -65 -313 56 195 -156 -11 200 149 350 49 22 -122 208 23 85 -167 272 172 98 31 -212 -163
5838a63o5K18r8r8J53J91j9k26J38j24K14j59j29K33j53K55j58N0k40J29K8j18
$$ -163 -228 -10 -108 -206 -53 138 119 -107 31 -93 121 -38 -167 66 -87 168 10 60 -180 -51 -23 -141
$$ [...]
8191a28
##END NTUPLES=NMR FID
##END=
