##TITLE=1H_Pr Q-14-2
 CDCl3
 8 sc, 
 14.12.2022
##JCAMPDX= 6.0         $$ Bruker NMR JCAMP-DX V2.0
##DATA TYPE= NMR FID
##DATA CLASS= NTUPLES
##ORIGIN= UXNMR, Bruker Analytische Messtechnik GmbH
##OWNER= root
$$ XWIN-NMR		Version 3.5
$$ Wed Dec 14 14:30:15 2022 Russian Standard Time (UT+4h)  she@DPX200
##.OBSERVE FREQUENCY= 200.13135
##.OBSERVE NUCLEUS= ^1H
##.DELAY= (6, 6)
##.ACQUISITION MODE= SIMULTANEOUS
##.ACQUISITION SCHEME= undefined
##.AVERAGES= 8
##.DIGITISER RES= 18
##SPECTROMETER/DATA SYSTEM= spect
##.PULSE SEQUENCE= zg30
##.SOLVENT NAME= CDCl3
##.SHIFT REFERENCE= (INTERNAL, CDCl3, 0, 15.7039)
##AUDIT TRAIL= $$ (NUMBER, WHEN, WHO, WHERE, WHAT)
$$ ##TITLE= Audit trail, XWIN-NMR		Version 3.5
$$ ##JCAMPDX= 5.01
$$ ##ORIGIN= Bruker BioSpin GmbH
$$ ##OWNER= she
$$ F:/spectra/data/she/nmr/H-F/1/audita.txt
$$ ##AUDIT TRAIL=  $$ (NUMBER, WHEN, WHO, WHERE, WHAT)
(   1,<2022-12-14 14:29:18.17 +0400>,<she>,<DPX200>,
      <created by zg, POWCHK disabled, PULCHK disabled
       configuration hash MD5:
       00 E9 B6 7A A2 85 ED C7 34 08 36 98 17 FE 4E 26
       data hash MD5: 16K
       34 83 35 96 8E A1 EA 13 B4 9F A6 92 1A E2 2E CC>)
$$ ##END=
$$ 
$$ hash MD5
$$ B0 D7 94 51 AE CB BD 0C 94 4A 3C DC 55 17 3A E4
##$RELAX= 
##$RELAX= 
##$RELAX= 
##$RELAX= 
##$RELAX= 
##$RELAX= 
$$ Bruker specific parameters
$$ --------------------------
##$DU= <F:/spectra>
##$EXPNO= 1
##$NAME= <H-F>
##$PROCNO= 1
##$TYPE= <nmr>
##$USER= <she>
##$AMP= (0..31)
100 100 100 100 100 100 100 100 100 100 100 100 100 100 100 100 100 100 
100 100 100 100 100 100 100 100 100 100 100 100 100 100 
##$AQSEQ= 0
##$AQ_mod= 1
##$AUNM= <au_zg>
##$AUTOPOS= <>
##$BF1= 200.13
##$BF2= 200.13
##$BF3= 200.13
##$BF4= 200.13
##$BF5= 200.13
##$BF6= 200.13
##$BF7= 200.13
##$BF8= 200.13
##$BYTORDA= 1
##$CFDGTYP= 0
##$CFRGTYP= 5
##$CHEMSTR= <none>
##$CNST= (0..31)
1 1 145 1 1 1 1 1 1 1 1 1 1 1 1 1 1 1 1 1 1 1 1 1 1 1 1 1 1 1 1 1 
##$CPDPRG= <>
##$CPDPRG1= <>
##$CPDPRG2= <>
##$CPDPRG3= <>
##$CPDPRG4= <mlev>
##$CPDPRG5= <mlev>
##$CPDPRG6= <mlev>
##$CPDPRG7= <mlev>
##$CPDPRG8= <mlev>
##$CPDPRGB= <>
##$CPDPRGT= <>
##$D= (0..31)
0 1.2 0 0 0 0 0 0 0 0.06 0 0.03 0 0 0 0 0.0002 0 0 0 0 0 0 0 0 0 0 0 0 
0 0 0 
##$DATE= 1671013757
##$DBL= (0..7)
120 120 120 120 120 120 120 120 
##$DBP= (0..7)
150 150 150 150 150 150 150 150 
##$DBP07= 0
##$DBPNAM0= <>
##$DBPNAM1= <>
##$DBPNAM2= <>
##$DBPNAM3= <>
##$DBPNAM4= <>
##$DBPNAM5= <>
##$DBPNAM6= <>
##$DBPNAM7= <>
##$DBPOAL= (0..7)
0.5 0.5 0.5 0.5 0.5 0.5 0.5 0.5 
##$DBPOFFS= (0..7)
0 0 0 0 0 0 0 0 
##$DE= 6
##$DECBNUC= <off>
##$DECIM= 32
##$DECNUC= <off>
##$DECSTAT= 4
##$DIGMOD= 1
##$DIGTYP= 9
##$DL= (0..7)
0 120 120 120 120 120 120 120 
##$DP= (0..7)
150 150 150 150 150 150 150 150 
##$DP07= 0
##$DPNAME0= <>
##$DPNAME1= <>
##$DPNAME2= <>
##$DPNAME3= <>
##$DPNAME4= <>
##$DPNAME5= <>
##$DPNAME6= <>
##$DPNAME7= <>
##$DPOAL= (0..7)
0.5 0.5 0.5 0.5 0.5 0.5 0.5 0.5 
##$DPOFFS= (0..7)
0 0 0 0 0 0 0 0 
##$DQDMODE= 0
##$DR= 18
##$DS= 0
##$DSLIST= <SSSSSSSSSSSSSSS>
$$ [...]
##$SUBNAM2= <"">
##$SUBNAM3= <"">
##$SUBNAM4= <"">
##$SUBNAM5= <"">
##$SUBNAM6= <"">
##$SUBNAM7= <"">
##$SUBNAM8= <"">
##$SUBNAM9= <"">
##$SW= 18.05172834244
##$SWIBOX= (0..15)
0 0 2 0 0 0 0 0 0 0 0 0 0 0 0 0 
##$SW_h= 3612.71676300578
##$TD= 16384
##$TD0= 1
##$TE= 0
##$TE2= 300
##$TE3= 300
##$TEG= 300
##$TL= (0..7)
0 120 120 120 120 120 120 120 
##$TP= (0..7)
150 150 150 150 150 150 150 150 
##$TP07= 0
##$TPNAME0= <>
##$TPNAME1= <>
##$TPNAME2= <>
##$TPNAME3= <>
##$TPNAME4= <>
##$TPNAME5= <>
##$TPNAME6= <>
##$TPNAME7= <>
##$TPOAL= (0..7)
0.5 0.5 0.5 0.5 0.5 0.5 0.5 0.5 
##$TPOFFS= (0..7)
0 0 0 0 0 0 0 0 
##$TUNHIN= 0
##$TUNHOUT= 0
##$TUNXOUT= 0
##$USERA1= <user>
##$USERA2= <user>
##$USERA3= <user>
##$USERA4= <user>
##$USERA5= <user>
##$V9= 5
##$VALIST= <valist>
##$VCLIST= <CCCCCCCCCCCCCCC>
##$VD= 0
##$VDLIST= <DDDDDDDDDDDDDDD>
##$VPLIST= <PPPPPPPPPPPPPPP>
##$VTLIST= <TTTTTTTTTTTTTTT>
##$WBST= 1024
##$WBSW= 4
##$XGAIN= (0..3)
0 0 0 0 
##$XL= 0
##$YL= 0
##$YMAX_a= 114506
##$YMIN_a= -144626
##$ZGOPTNS= <>
##$ZL1= 120
##$ZL2= 120
##$ZL3= 120
##$ZL4= 120
##$ABSF1= 10
##$ABSF2= 0
##$ABSG= 5
##$ABSL= 3
##$ALPHA= 0
##$AQORDER= 0
##$ASSFAC= 0
##$ASSFACI= 0
##$ASSFACX= 0
##$ASSWID= 0
##$AUNMP= <proc_1d>
##$AZFE= 0.1
##$AZFW= 0.1
##$BCFW= 1
##$BC_mod= 2
##$BYTORDP= 1
##$COROFFS= 0
##$CY= 11.3945322036743
##$DATMOD= 1
##$DC= 2
##$DFILT= <>
##$DTYPP= 0
##$F1P= 2.36226072786647
##$F2P= -0.459571619588291
##$FCOR= 0.5
##$FTSIZE= 0
##$FT_mod= 4
##$GAMMA= 1
##$GB= 0.15
##$INTBC= 1
##$INTSCL= 1
##$ISEN= 128
##$LB= 0.24
##$LEV0= 0
##$LPBIN= 0
##$MAXI= 10000
##$MC2= 0
##$MEAN= 0
##$ME_mod= 0
##$MI= 1.114404
##$NCOEF= 0
##$NC_proc= 0
##$NLEV= 6
##$NOISF1= 3.799351
##$NOISF2= 2.8
##$NSP= 1
##$NTH_PI= 0
##$NZP= 0
##$OFFSET= 15.70392
##$PC= 1
##$PHC0= -19113.15
##$PHC1= 17.60072
##$PH_mod= 1
##$PKNL= yes
##$PPARMOD= 0
##$PSCAL= 0
##$PSIGN= 0
##$REVERSE= no
##$SF= 200.130013532006
##$SI= 16384
##$SIGF1= 3
##$SIGF2= 2
##$SINO= 400
##$SIOLD= 16384
##$SREGLST= <1H.CDCl3>
##$SSB= 0
##$STSI= 0
##$STSR= 0
##$SW_p= 3612.71676300578
##$SYMM= 0
##$S_DEV= 0
##$TDeff= 0
##$TDoff= 0
##$TI= <>
##$TILT= no
##$TM1= 0
##$TM2= 0
##$TOPLEV= 0
##$USERP1= <user>
##$USERP2= <user>
##$USERP3= <user>
##$USERP4= <user>
##$USERP5= <user>
##$WDW= 1
##$XDIM= 8192
##$YMAX_p= 0
##$YMIN_p= 0
$$ End of Bruker specific parameters
$$ ---------------------------------
##NTUPLES= NMR FID
##VAR_NAME=  TIME,          FID/REAL,        FID/IMAG
##SYMBOL=    X,             R,               I
##VAR_TYPE=  INDEPENDENT,   DEPENDENT,       DEPENDENT
##VAR_FORM=  AFFN,          ASDF,            ASDF
##VAR_DIM=   8192,          8192,            8192
##UNITS=     SECONDS,       ARBITRARY UNITS, ARBITRARY UNITS
##FACTOR=    0.0002768,     1,               1
##FIRST=     0,             0,               0
##LAST=      2.2672688,     0,               0
##MIN=       0,             -144626,         0
##MAX=       2.2672688,     114506,          0
$$ Real data points
##PAGE= N=1
##DATA TABLE= (X++(R..R)), XYDATA
0@%%%%%%%%%%%%%%qJ6j6J6j6K4l2L8m6N3o1P2q6R8j12J30j50J68j90K17k44K75
36A46l11L50l91M36m85N40o01O67p38Q15r01R95j096J209j333J466j614J779j964
55a031K174k410K678k989L354l787M312m963N797o910Q475j0862J4986k4067Q2296
70F7053o6762j37880J44891Q8274q6094q0190Q0878M1741n7582l5621M2141R594
82A0443q826J7492m264o0689N5P7298K1366p4319k6889N3255K3003l8324r110
95a9509K9951J0144j7796j2367o407Q250L0429J1005l8615k7568K8477K9847j5057
108A0784j6533Q071P4j0113N867K848j1149J1703K2908k7738m1663L1821N6480
121D3360k7688n6153K7730M6386l9286l8023N6651L9401o5406l8556O7241L2073
$$ y = [0, 0, 0, 0, 0, 0, 0, 0, 0, 0, 0, 0, 0, 0, 0, -8, 8, -8, 8, -8, 16, -16, 22, -24, 29, -32, 40, -46, 52, -60, 70, -80, 88, -102, 115, -129, 146, -165, 185, -206, 230, -255, 285, -316, 351, -387, 428, -473, 522, -574, 635, -698, 768, -846, 933, -1031, 1143, -1267, 1411, -1578, 1776, -2011, 2301, -2662, 3135, -3775, 4700, -6162, 8824, -15243, 67053, 291, -137589, 7302, 95576, 9482, -70708, 10170, 51911, -5671, -41292, 849, 10443, 1617, 19109, 14845, -45844, -45789, 31509, 52875, -21444, -48333, 4922, 27925, -10399, -19509, 10442, 20586, 2790, -9577, -15984, -7734, 22695, 33700, -4915, -32483, -4006, 25841, 10784, -5749, 2322, 2396, -7717, -1850, 998, -10151, 1552, 24460, -3278, -44941, -13120, 43360, 15672, -40481, -12751, 33635, -5651, -43674, 12977, 52378, -13028, -51584, 15657, 47730]
133D7730o5747j8401P1009R025p7061j0790P3316J3111n8141j0064L8865k039
145A0813k6944J2626J9528j7596j2412J6683j938j9826J4820K7999j8418l2532
157b7197J5174L0441r533k0053J1102J1986j4173q920J3825Q493o230l495j248
170A72m212L715Q336k870o926L240q32j1055M028J7258l910j9885N016J6645j0983
185b263j3630K1096J4701k9007j7196L2496J6981l3548j0395L8315O839m3082
197a8693n970M5726Q870m0910j0157L1887N530k4366r31J8749k889j3046L641
210b559L276p078N417J3329j1952k1436J1858K4273q778k2068Q479J9143p684
223D220j6233P516J4733l249r964j062L354K219L782R21n842l423L971K735j532
$$ y = [47730, -18017, -36418, 34591, 43616, -33445, -44235, 29081, 42192, -15949, -26013, 12852, 10813, -16131, -3505, 16023, -1573, -13985, 2698, 760, -19066, -4246, 23753, 5335, -27197, -12023, 18418, 8885, -11168, -66, 11920, -2253, -11173, 2652, 11145, 4915, 1420, 172, -4040, -325, 8011, 5141, -1785, 1455, 623, -10432, -6404, 10854, 6944, -12941, -7925, 8720, -2263, -15893, 5203, 19904, -9103, -26299, 6197, 23178, -10370, -20765, 17550, 24389, -18693, -24663, 21063, 29933, -10977, -21134, 10753, 16283, -8083, -9014, 9735, 6846, -6200, -2559, 717, -6361, -944, 12385, 433, -21003, -9145, 15128, 6350, -15718, -7239, 11904, 4220, -12013, -4497, 10236, 6987, -2977, -4039, -685, 1534, 5316, 6237, 395, -3028, 943, 3678, 2146]
238B146j032j192j176J502L80o400j117J2478M208j7468q818J8546J2108j7849
252c684j1250J7001R543j7476p180J8570P306j5702m574J3267L62j0803N228J0499
266A1107r301j1579R912J0121j0324p599J0908M957j3133m487J2462L037j0627
279d546j933P890k009o460N843P318o666o627O971N962n760m715P131M640p162
294a23n822N930P398k353p135l24N995J111o045k050N867J938p230m569O700N562
310D850n947m249N166K068o070m42P968m24q490J620Q246j997p570M981Q791o295
326B206q674O467Q938o356p038N900M430p529l352P926K885q136k142O690Jp270
342e054J244P703l077q082K707Q208k087o416L004N931l163n431L422O515k568
$$ y = [2146, 1114, -78, -1254, 248, 628, -5772, -6889, 5589, 9797, -7671, -16489, 2057, 14165, -3684, -14934, 2067, 11610, -5866, -13046, 5524, 12830, -2872, -7446, 5821, 6183, -4620, 608, 11107, 1806, -9773, 139, 10260, -64, -7663, 3245, 8202, -4931, -9418, 3044, 6081, -4546, -6479, 1411, -598, -7058, -1215, 6103, -563, -7190, -219, 5743, -17, -4732, 2399, 7039, -123, -5945, -15, 7383, 5030, -2105, -2429, 3566, 4677, -1368, -3418, 2449, 4387, -2843, -7412, -712, 4850, -1097, -5346, -180, 1888, -4182, -4624, 3344, 2920, -5570, -3950, 4296, 2299, -5271, -290, 8501, 2206, -6468, -1, 8937, 2581, -4457, 1443, 5873, -1656, -5008, 2918, 5803, -2333, -4475, 2215, 2216, -5054, -3810, 3893, 816, -7266, -4559, 3649, 1562, -4854, -1850, 4081, 918, -4513, -1091, 5424, 2856]
357B856n581J220N241q60m009J627L858j877m471J093L840j481l988J293L084
372A845k843l779L425M796l631n624L426N472l393n205L944N675l799n034L767
387i58N287k129l312K660J315l179O4M355j508n771J868O685l100p548K920Q499
403F148k551j0327J042R538r4q700j097P074J120n143l45M652j92k840J748J911
419A944k615j420M884J919n760k952O437M434n746n171M771M792m977m585L425
434f20L832l587l456L264J861l515q94M938j7o357n18P406J395p467j329P322
450B258K146n583k012N591J813l613p84J987j384j673M339J542p069l356Q665
465B867N574j0151p827Q912J0063q752j1765O506J2066m121j0925J482R215P93
$$ y = [2856, -2725, -1505, 3736, 2876, -1133, 494, 4352, 2475, -1996, -903, 2937, 1456, -2532, -1239, 1845, -998, -4777, -1352, 3444, -187, -5811, -2385, 3087, -306, -5511, -1567, 4108, 309, -4725, -958, 4329, 2200, -1112, 1548, 2863, -316, -252, 4103, 2595, -3176, -1308, 5377, 2277, -5271, -2351, 6148, 3597, -6730, -5688, 3850, 3756, -4944, -6041, 1033, 2153, -2990, -3335, 1317, 1125, -1715, 33, 1944, -671, -2091, 2793, 4712, -1048, -4000, 2437, 6871, 1125, -4046, 725, 5517, 540, -4045, -620, 3212, -375, -3831, -567, 1294, -2221, -3115, 1823, 1806, -4551, -5069, 2337, 3732, -3735, -5064, 2258, 4404, -1179, -3191, 2400, 4213, 600, -184, 1803, 419, -1254, 3085, 4627, -2442, -5798, 2867, 8441, -1710, -9537, -625, 9438, 686, -11079, -4573, 7493, 3372, -7553, -6071, 3144, 3937]
479C937n533j040K490M24O88J466k479l540L619P260l764r589K564J1858j000
494G361j2542j729J1506K554j0162m196Q251L837o383l567M661K204l624k35L025
509I61j566l756L717M823m082n613N048O724m418o650N028O327n014o033N283
524G79N433o798m421P461M145r489m123J0437M616j1654o258J1057O815j0164
538b164p452Q568P283o080n866M121M480k252j451J690j585j432M238L541o161
553e22n388P496P315o887r252N220J0411l713j1502J107J0171R75q820k721O525
568D15K588l705k505K275K81m66K068l50l758o9O362J767p630k538Q589M260q664
585a080n125Q142N312p554n283P155M844p546l631O895K394p420k183P569J156
$$ y = [3937, -1596, -2636, -146, 278, 966, 2432, -47, -3587, 32, 7292, 3528, -6061, -3497, 8361, 7361, -5181, -6910, 4596, 7150, -3012, -7208, 1043, 4880, -1503, -5070, -409, 1795, -1829, -2064, 961, -605, -4361, -644, 4179, 97, -5516, -468, 6256, 1838, -4812, 216, 6543, 1529, -4504, 779, 6212, -586, -5007, 2454, 6599, -2890, -7013, 3424, 8040, -3614, -9872, 1185, 8000, -2164, -9616, -1048, 6235, 155, -5711, -1590, 2890, 638, -813, 877, -708, -2140, 2098, 5639, -522, -5910, 1586, 8901, 2014, -7238, -2018, 8393, 4680, -6822, -5715, 4456, 5431, -3389, -6110, 415, 3003, -702, -3207, -932, -651, -1117, 951, 601, -3157, -3226, 3136, 4903, -2727, -5265, 3324, 7584, -1080, -6205, 1937, 7249, -305, -5588, 1567, 6411, -1135, -4766, 2129, 4523, -2897, -5080, 2489, 3645]
600C645q021q53P435J305o859j356O122J782m878o88L350o2j533J368Q76k702
616a069m80M533J382n215k484N719L230n397n008M135N223k887o191J099N849
631B439k13m344j365L271J507j509j259L9l55J545K066j545l445J782N553m55
647C712o487o86P258J986p620l063P003L725o215l910M919L248m116k722K770
662a98J418k608n38J927n16k357K164K230j806k444K412K864k147k623J798K621
678B197j781j629J440J676j063o84P85N21j009n91R88o4j551l93J360O03j705
695i00p24J461R20j740j132J813J033j809j354K174J608k102n24K222J216k532
711c70m37K586O81l035n12L197J62l250k40L325j71l380K00K919p26l099M12K680
$$ y = [3645, -4376, -5229, 2206, 3511, -3348, -4704, 1418, 3200, -1678, -2366, 984, 922, -611, 757, 1633, -1069, -1549, 2984, 4366, -849, -3333, 2386, 5616, 219, -4789, -654, 4569, 1682, -4509, -3410, 2439, 2226, -2118, -3483, -212, 1295, -214, -1473, -1434, -1789, -244, 1822, 277, -3168, -1386, 4167, 3712, -2775, -3461, 3797, 5783, -1837, -4900, 2103, 5828, -387, -4297, 622, 3870, -246, -2968, -198, 1220, -1388, -1926, 1, -515, -2872, -708, 1522, -284, -2728, -316, 2548, 401, -2222, -424, 2197, 416, -1213, 227, 1903, 840, 156, 941, 1462, 453, -138, 850, 786, -765, -1158, 202, 805, -900, -1624, -163, 757, -983, -2115, -302, 731, -1078, -2432, -258, 1350, -752, -1276, 946, 2162, -370, -807, 1779, 2460, -575, -1087, 2110, 2272, -978, -1218, 2107, 1936, -1444, -1244, 1675, 949, -2150, -1738, 942]
729I42r83j910L82J860m22j446P01J350o62n92O62P25o75j64J182J89j181o4J618
748A512K95j803l73J601L97k146n94J677K34j629n85J570M10j429l91J117L12
765A75j534j33J479M02j876L69K240J36k157M06K218k9k113M6K179l32j904L73
783e5J422m44j571O66J524j231j586J067J197j595j496J576J220j612j158J697
799c79J403j562n92J299Q32r36n31O47O68p71RP92R2q81M59Q52o34j314N79Q48
819H80p29j310J26K006n88j404j95K000m10j629k87J643K74j572n35J819O50j158
837d19%J018M09r20PR44m79r28P83J255j270j064J117J379j705j473J582R10j425
856b79j458J191J021j380o70J059O31q75n8J070K31j323L43J560n27j166L22J749
$$ y = [942, -41, -1951, -1569, 291, -131, -1577, -876, 474, -188, -780, -118, 607, -68, -232, 950, 1139, -42, -106, 1512, 1807, 4, -369, 1232, 1629, -517, -1111, 566, 800, -829, -1414, 156, 566, -863, -1254, -137, 175, -1359, -1492, -13, 389, -1487, -1118, 1122, 1258, -899, -493, 1725, 1696, -417, -371, 1808, 1476, -428, -55, 1367, 923, -648, 18, 1542, 311, -1275, -208, 989, -606, -2102, -526, 694, -918, -2076, -379, 1024, -538, -1130, 169, 1001, 65, -466, 181, 849, 78, 87, 879, 971, 90, 549, 1401, 767, -547, 32, 880, 151, -1159, -1033, 973, 385, -1019, -1214, 786, 376, -1253, -1540, 103, 377, -1195, -1730, 89, 739, -419, -419, 599, 1008, 88, 95, 1039, 560, -368, 415, 1670, 400, -664, 453, 1832, 127, -1346, 236, 1146, -279, -1737, -546, 475, -905, -1575, -516, 115, -760, -818, 252, 483, -840, -497, 1063, 536, -630, -308, 1441]
874A441m21r73K54Q92l51o73K39J20l97l61J04K59n90k25N55K63m71r01Q02Q87
894D53p71j170O13J513l77j302PJ971L58j312j04J140k20o14L93L64q40m81J447
913A068Mj631j68J936%k494j77K227l45j848l8J773l5j670Q32J541j227j244J584
932H8J192k001p45J955J269j753q17J683R43j382o56P66L3m19J22K32j054j90
950g34J204L70j376q94J300Q38j004j527N06J657K34j679p15J632J733j248j381
967a084Q19J472j53j380J3J097l33K8L08o39o79J198J143j873k069J886K480k428
985a94k873J976K970j945k799K212K230k025j094J430J038j983k59K717p32j875
1001a206O64K722r54k450R97K632j186k472J205J616j475j012J207O21j567n05
$$ y = [1441, 1020, 47, 301, 1193, 842, 169, 408, 528, 131, -230, -126, 133, -457, -682, -127, 136, -335, -1236, -434, 453, -318, -1488, -875, 638, 261, -1041, -1034, 937, 1295, -17, -121, 1019, 799, 185, 578, 942, 102, -379, 1068, 1072, -559, -727, 1209, 1209, -1285, -1462, 765, 420, -1428, -1466, 307, 272, -1398, -566, 975, -252, -1496, 88, 1280, -721, -1466, 489, 1758, 5, -812, 871, 1814, 432, -224, 542, 575, 156, 278, 510, -544, -734, 470, 840, -536, -1430, -130, 708, -296, -1823, -1317, 340, 574, -1105, -1820, -188, 1545, 297, -1084, -265, 1207, 1054, -326, -313, 784, 451, 479, 787, 148, -531, 667, 1810, -63, -2132, -246, 2234, -194, -3067, -1091, 1879, -66, -2865, -653, 1577, -448, -1542, -112, 926, -1057, -1316, 1401, 669, -1206, -542, 2180, 1226, -1224, -227, 2405, 1219, -1253, -48, 1568, 93, -919, 288, 909, -658, -1163]
1017a163J402M42j409o06J226N05r43q64R19J075j59j161K6J221P66j404n36J318
1035F55M58q37n57R30P9p18N61N90j145j088J865J194k896j742L033J664l254
1052a208j888L372J711l311j052K725J274k676l02K242k14k008J399J697j356
1067D05j458J883J603k784j061K221J255k328j159K294N10k021l58J422j35j124
1083h35M65N66o35m24N28R8k38J01K21l8j20O21m4l77P36K17q17k07R84j8r40
1104a56K3J022j28j277N59J409j664j398J709J006k104j042K552O89k549l99K372
1121F24O51k596R3J922j0k111J165J489j164j075J786P46j696m00J943qj795p0
1139e06J618n84j367N36P93k21r60N34L50q74j5O48m26m81P50L49p02Q7J143j35
$$ y = [-1163, 239, 681, -728, -1334, -108, 397, -546, -1410, -491, 584, 425, -736, -710, 511, 1277, -127, -663, 655, 1113, 276, -281, 649, 728, 10, 571, 1161, 16, -1072, 793, 1987, -909, -2651, 382, 2046, -1208, -3096, 276, 1987, -1324, -2376, 349, 1623, -1053, -1355, 887, 673, -1335, 64, 1761, 405, -1053, 830, 2433, -351, -1412, 809, 2064, -264, -1423, 871, 1381, -640, -998, 424, 289, -835, -370, 196, -439, -863, -335, -237, -475, -374, -153, -191, -311, 310, 266, -111, 625, 842, 25, -182, 802, 784, -156, -133, 889, 761, -516, 43, 1452, -212, -1610, 99, 1105, -999, -2041, 511, 1200, -1349, -1748, 624, 1275, -1321, -1228, 694, 684, -1427, -262, 1227, 63, -1012, 774, 1520, -176, -576, 1367, 1359, -436, -506, 1112, 528, -839, -303, 490, 269, -691, -157, 193, -681, -696, -48, -474, -955, -205, 144, -558, -471, 672, 537]
1159E37r25M93N36l50m66N49O32r60j24J211l96j047L71J052j148j117J115J183
1177A146j766j041J826N19j658k83J637P2j735N16J508p39j042Q77J032q72p56
1194g59J640L39j430k94J384O0j235J72Q45n28q78Q51N57j050k68Q77k4j038J65
1213f14P68l32q74N19O88o64j64Q52j65o49Q92N64n42m29N82M06j019j48R89j51
1233E09j013N85J002q71j060J241N12j571j80J316l0j509rJ443j75j122J87J429
1251F84p76o75N79Q90j153k39J402J08r92j88J223k16p68J20J011o06q71P59J74
1270D66o35j89M85K91q41n1O21l90l55N1M68p68K59L23J51k15M33L02n14J85K64
1291C41k5n71O1Q38N7q60K53P23n78m64L36N36p35n04R58q8j009J75Q52P0j121
$$ y = [537, -388, 105, 641, 291, -175, 374, 1006, 46, -78, 1133, 737, -310, 61, 1113, -35, -1152, -37, 1146, -620, -1661, 165, 684, -974, -1257, 380, 452, -1283, -767, 741, 2, -1040, -163, 869, -3, -759, 881, 1220, -210, -504, 880, 940, -295, -123, 722, 194, -684, 167, 724, -326, -594, 283, 259, -779, -614, 154, -178, -1052, -533, 155, -509, -673, 179, 14, -635, 257, 821, 279, -150, 432, 838, -181, -329, 660, 509, -504, 81, 1083, 212, -848, 393, 905, -666, -846, 470, 440, -1069, -1078, 365, 190, -932, -745, 684, -92, -767, -188, 702, -451, -690, 712, 820, -172, -360, 863, 647, -121, -1, 1010, 404, -467, 292, 466, -169, -358, 127, 418, -423, -474, 147, -243, -598, -547, -79, -847, -588, -265, -114, -329, 104, 406, -108, 77, 341, 316, -255, -194, 644, 701, -159, 94, 817, 239, -225, 111, 647, -88, -592, 366, 278, -731, -556, 296, 366, -755]
1312g55L09O57l70o55M44Q27p14m38Q10L23o41j01J104k2n87PN68o20k60L49J33
1333C68l19nJ79J11o61J51N10j82o10L13j12N4l08J06j3J51L49J15o85L04P18
1354E34j49m29L30J15j34k85K10O32n13k62M22K19p66q2L37m6l43l05P08n72j81
1375e60J72L07J19n74M83j25j34j64M71q4j48O3N39J25k43q3M03q2l73R3K9j20
1397A14o4J26K55m42j11K96L7n41K6L39l26k26r8K62K46Pj96M11j09o6J83j25
1419bm5l2J79J64R9Q1j97J97k14n6j6m7j4l32mJ01L3l0j62L5j57J12J26r8k26
1444e05J52K42J68k43j55M38N4k61J90L15P2l42Q0J16j03j25j74M10j97j2k3n4
1466D3l03J45M8J64j45l44l8M57n35K92p7N23l31j55K32J53p5k06L14K74m24j42
$$ y = [-755, -446, 211, -159, -814, -370, 457, -257, -695, 115, 438, -203, -304, 800, 778, 191, 198, 766, 146, -114, 235, 368, 49, 44, 223, 334, -327, -176, 334, 152, -458, -145, -257, -203, -511, -405, -418, -267, 82, 197, -488, -184, 534, 385, -44, 286, 401, 267, -18, 192, 824, 311, 49, 471, 690, -76, -158, 179, 133, -210, -515, 193, -379, -560, -388, -81, 38, -536, -53, -178, -312, -476, -5, -89, -237, -174, 365, 490, 247, 164, 567, 485, 112, 205, 234, 114, 50, 176, 431, -11, -122, 174, 211, -330, -304, 35, -291, -517, -615, -353, -107, -100, -296, 115, 6, -60, 123, -2, -47, -79, 100, 264, 363, 444, 247, 444, 230, 174, 158, 111, 97, -235, -239, -138, -105, -135, -297, -262, -419, -307, -181, -279, -505, -353, -111, 57, -186, -341, 97, 151, -110, 80, 395, 467, 125, 205, 321, 218, 93, -81, 329, 132, 120, 97, 43, -260, -115, -67, 97, -48, -392, -430, 27, -508, -216, -293, 230, -101, -256, -24, 129, 54, -152, 162, 436, 12, -130]
1488a30N05J16l60M7J46J3l08o2K24J29m45k67O44m85l40L16M69k73n03M44K13
1509I3k21j7n8J81j79J2K30N42j00m47K12j12Nj9J10N8o6k89q0J09L64k20J72
1532B80%m59j16j99N19k57m42M94J69K07n26K14K19k37j39N04J54l36l61M42K29
1553C59l62r0L48K1n39K44M24j73q54M47N00l54m98K11M19l20j24K9K60k6l29
1574d07M43j6r5l3K84K29k82N9K1N7l5Qp2l3j63K89N5p3j88j07J07j15q1j59M1
1599b66J08m8j46kR2m9J16P0L51l17N0N6M71n65o5K08J16r0n4M19l96r5K01j10
1623E5n4j33J42K0k1l06K0J01m7m9K51l0k71J54J08o8k45K89J8k0K20k64J19K4
1647A3J07m4J38j20n8M45k77j4J55k99j43K87r2k32m6j0L81n38K3K49k7l91J9
$$ y = [-130, 375, 491, 131, 178, 324, 337, 29, -33, 191, 320, -125, -392, 252, -233, -573, -257, 212, -61, -564, -120, 93, -128, -145, -203, -22, -201, -189, 41, 583, 483, 36, 248, 136, 141, 122, 232, 290, 224, -65, -145, -36, 328, 108, 280, 280, -179, -295, -494, 25, -232, -674, -180, -11, 196, -330, -116, 103, -134, -273, 231, 385, 49, -312, 130, 359, -3, -93, 255, 276, -263, -19, 405, 232, -622, -175, 325, -29, -527, -316, 103, -217, -341, -312, -52, -78, -407, 36, 20, -75, -108, 176, 405, 123, 182, 203, 260, 225, 233, 161, 128, -35, 254, 309, 236, 48, -59, 48, -67, -148, -307, -266, -158, -206, -352, -354, -262, -311, -195, -125, 226, -91, -41, 15, 486, -79, -144, 64, 180, 90, 36, 455, 59, -36, 165, 55, 1, -132, 10, 30, 9, -297, -277, -176, -223, -272, -21, -51, -322, -168, -60, -128, -373, -84, -66, -86, 134, -130, -11, 13, 120, 76, 214, 94, 36, 481, 204, 190, 345, 46, -97, 190, 98, -134, -180, -190, 191, -347, -324, -75, -102, -493, -474]
1670d74N30j71j55L50J42l86J36K35k7P1m94O64r4m66K30J41K18n82J13M05n56
1691a70J04K4Q7l48L2N14k45j32k80K62Kj6r2J69j37J44r0J77M44j96n2oj31N9
1715A23k6j88K40Q0J9j52K31m9j06j75J67k11q9l4K85m10l05O55r5N3l28K85K41
1738B11k17k98K65K30n1k22L73M3m45J61K24k09M5k2j07L7j82l8N50m69K1n0K42
1761I2l50p8K52l3k56J03R4Q2K2q2K57j45J0K00j21L15k75J44m07L49r5j93J72
1784E7J27j16M6J03p2j49k42J70K45l87k69R8M66k37p6J36K11q9k28K69l9r3N6
1807a3J67J77l30L9K61L5m3MQ6k55J3k34N04m03l08O0M25M2l35J38q8j64L9j83
1831c66P4q9J73K82P9l21L16J8k62L05l6P6R1k26j34K28k06J63j67J47j34J49
$$ y = [-474, 56, -115, -270, 80, 222, -164, -28, 207, 180, 251, -243, 421, 327, -139, 91, 232, 450, -132, -19, 386, -170, -66, -42, 45, -303, -271, 243, -2, -134, -414, -152, -150, -166, -258, -89, -226, -82, -172, 5, 449, 253, 201, 195, 64, 123, 97, -91, 149, 229, 248, 96, 327, 278, 172, -3, 164, -47, -136, -170, 115, -295, -600, 55, -40, 13, -315, -30, 211, -6, -304, -39, 191, 140, -82, 291, 334, -111, 50, 274, 65, 110, 88, -19, 18, -164, -202, 348, -121, -100, -150, 92, -258, -336, -84, -117, -373, -270, -176, -94, -72, -154, 103, -42, -32, 168, 47, 362, 87, 231, -176, 173, 78, -115, 57, 184, 68, 114, 217, 145, -4, -246, -76, 169, -218, -487, -389, 77, -160, -236, -100, 111, 22, -206, 63, 24, -69, -13, 154, 331, 1, 40, 301, 336, 293, 297, 383, 128, 141, -93, 411, 8, -300, -240, 185, 227, -108, 30, -58, -222, -183, -366, -292, -381, -208, 74, 153, -168, 148, 166, -96, 209, 173, 249, 340, 114, -20, 208, 2, 165, -2, 145, 11, 160]
1853A60k47M9O4M5l51q9K57k28N6K97J3J4o2j03K35j15n0J23K20j90R8k02J87
1876A81J07p5J4k71L94m82J47l0k50K64j09N1k07J28N9q4K2j14L10j75mj93K79
1899c8J31Jj28J57K64l57J82k20K04p9J3k13L93m59J87p0M13l80l2m8j6N5K0q7
1923a07j00P3k67J48M56l45k13L88j47L9k1J50M8n2M2P5k61LK62OJ5l17J94k19
1947a50K36j74J06k1p8P8k24J49j41K59p5j74J51l78N35k49j03K09j41K55j60
1968i0J25J2K15o7k30K08N2r3l39M5J46l9J58j44j27J12o3J45Q4l17K8L6J77p7
1992d3N9J62j63j23J70L3m3k10L8K66k8M9J10J42j48k49Q2m4K5j49q9L23j56l32
2016c18L35o1j45K1k2l5r8N9J20O9J56j53K71j67o7o5L32k1o5k09j39M37j81j20
$$ y = [160, -87, -38, 26, 71, -280, -369, -112, -340, -284, 13, 26, 40, -22, -125, 110, -5, -55, 68, 288, 98, 196, -6, 181, 288, 213, 227, -44, 350, -132, 15, -15, -265, -1, -110, -59, -266, -138, -79, -163, -141, -255, 55, -120, -124, -317, -38, 93, 94, -34, 123, 387, 30, 212, -8, 196, 117, 130, -83, 310, -149, 38, -32, 381, 1, -31, -79, -95, -40, -20, -107, -207, -134, -401, -253, 203, -142, -355, 33, -114, -75, -96, 54, 102, 50, 92, 167, -94, -91, 171, 177, 192, -125, 69, -150, 86, -88, 18, -3, -81, -3, -227, -78, -219, 40, -35, -209, -58, -436, 99, -150, -253, -44, -185, 70, -90, 35, 47, 262, 195, -35, 173, 225, 132, -207, -162, -16, -55, 103, -41, -168, -56, -119, 26, 110, -207, -179, -143, 34, -43, 16, 178, 15, -108, 62, 95, 52, -158, -120, 146, 118, 167, 277, 419, 271, 22, 104, 60, 85, -64, -153, 170, 14, -318, 17, -44, -189, -168, -190, -225, -323, -264, -144, -75, 81, -72, 199, 32, -35, -100, 232, 211, 146, -63, -202, 235, 54, -66]
2040f6K17o1P8j76M2K2K9j62Q6j71m8J1j01M48n02J64p0L65J29l11j19K00k80
2063b76M1L02J37j33K36l01K82l7m69M14p1j64N2J73k93K30j69J32l46J19O6m1
2085a16L6O7j43R4R1j95o4L29k59J78r3m7J57K04j40j37K64j05j63J96Q1j99k85
2108b49O0K22m9j33J54J63m77m6M07o9k04n4L29O6l97K00J39k52J06K33N7k15
2130ij46N07k49J40k87K39j20j49j37N35k84p7p5Q7%k32L31k4l71K50j10kR3K1
2154f9J30k72K24j5J93p2m6J25j94o9K18L3j52j30K61R1k85L50j23j43j83J38
2176A0j65J73j44J46J65n96J27K08j0j75p5M90k19k17J43O9J18j21L3L11n0p6
2198A45j01J57l6J0N9j88j78O5J97k34j37L40J22l00K85l32n2N8M48l49l50K38
$$ y = [-66, 151, 90, 168, -8, 34, 56, 85, -77, 9, -162, -210, -199, -300, 148, -354, -190, -260, 105, 234, -77, -196, 4, -276, -235, 67, 204, 71, 307, 6, 288, 251, -218, 196, 125, -39, 13, 186, -107, 123, -46, 86, -260, -141, -75, -116, -80, -13, -156, -62, 29, -166, -230, 99, -160, 18, -75, -122, 35, 239, 99, -38, 226, 121, -42, 154, 235, 36, -249, -189, 33, -16, -149, 5, 168, -309, -355, 52, -17, -221, -275, 54, 120, -277, -77, 62, -190, -84, 149, 206, -9, -155, 352, 103, 243, -44, 195, 75, -74, -211, 324, 40, -37, -112, -25, -25, -257, 74, 50, -321, -71, -181, -183, -90, -69, 61, -211, 13, -2, 191, 119, 73, 198, 4, -65, 153, 186, 34, -96, 165, 256, -29, 321, 198, 55, -128, 10, -155, 18, -126, 20, 185, -411, -284, -76, -86, -261, -336, 154, -65, -282, -139, -70, 48, -73, -40, 271, 221, 145, 44, 201, 165, 175, 234, 46, -132, -67, 130, -104, -241, 99, 221, -79, 206, -126, -178, -120, 328, -21, -371, -133]
2220a33L98m82Q1J70n8l12L03PK32m89J17K90l23k3L30J4l01K41kp6Q3m47M16
2243C6m8m1k52L81k4j99P3K9n80N16L3L9j08J11K91n6j43r4K19N7j44J9j9k9o8
2268aj16K69j73l7K20m55o6M20J72l35j84j9J62J37J6Q2o0K1Q4j95j9J24K1j06
2292c8N2P5K08j62j45J56N9j24OJ97l02q3k14K79J53l46P7K60l07j12M44j01l12
2315b80P6RJ17kj04J40k48K23J08P9P2j04K52j58j14Q9j88Q9k2r6J53j8j22K39
2339A90k47k08K64k10J55l47J90K51j60j16K18k5j3K23o6R6k68j13N02n8k56J04
2361A06J66l03j21K84K35l86J48q4Q4n39K56K07k0m9K87m02m5P1j39J69Rk19J71
2384a14k2K17J21j92o8m5M17l25Oo8L58k08R9O1m9j82j81K17j02L8J56k10q1Q4
$$ y = [-133, 265, -217, -136, 34, -24, -336, -33, -26, 206, -283, -166, 124, -199, -222, 108, 122, -179, 62, 60, -16, 67, -380, 36, -12, -53, -305, 76, 52, -147, -74, -45, -625, -109, -76, -37, -145, -34, 257, 201, 58, -36, 183, 240, 96, 115, 96, 67, -1, -117, 152, -21, -58, 162, -293, -359, 61, 233, -102, -286, -305, -143, -6, 10, 92, 32, 53, 137, -58, -77, 47, 68, -38, 14, 89, 297, 135, -10, 146, 205, 81, 87, 284, -18, -101, -315, -36, 117, -229, -152, 108, -199, -311, 133, 32, -280, -204, -195, -78, -80, -184, -44, -292, -69, 39, 118, 190, 86, 338, 180, 66, 155, -33, 56, 34, -62, 91, 73, -49, 190, -57, -265, -1, -211, -56, -403, -213, 38, -122, -238, -20, -45, -58, 165, 99, 195, -73, -186, 316, 258, 2, 106, 272, -31, -152, 132, 367, -19, 129, 45, 129, -410, -154, 53, 33, -16, 271, -131, -176, -105, -244, -75, -66, -285, -114, -136, 81, 202, 10, -58, -103, 314, -11, -5, -73, 285, 77, 176, 237, 188, 6, -175, 42, -60, -22, 134, -76, -157, -73]
2408g3o1J26l52J44L58n0l10J69K20j37r0j22L14l5k04rM69k48j96J00L13k76
2430E0k12Q6L06l32J25j73L20l90oJ17J66%k39j0J13k33l0K53K72l13l8M50j40
2453A42P0R2m12n6L22Qj87N0k51J48K73l06J62O3R6l65J26k07J07J06nk69M29
2476A36l90K04p1k7Q6N10m16m3p3J14L41j83l52J60J85j94K10j39N5J36k71P8
2498E6j15L0j86K78k07M4no2j38N94l55k4J80j14k1j8M1J50j49R0j16l9K13j19
2522HJ70m05lK37k39J70J18O9m9P2l79N0K02r6M7r1N0j4n2l8J18N5j28J16p5L
2548h4M2p6Q3J07Q2j18j26J82K40l20pl5J25j78J99k70J61m5JL0q3LO2J41k82
2573a66J8J35m9j62J45j2J71J07k63K36J77k43j0j10K22j02Kj76J51q7K5j09J56
$$ y = [-73, -134, -8, -360, -216, 142, 92, -218, -49, 171, 34, -56, -178, 136, 101, -103, -112, 357, 109, -87, 13, 326, 50, -162, -76, 230, -102, 23, -150, 170, -220, -226, -109, 57, 57, -182, -192, -79, -312, -342, -89, 183, -130, -168, 282, 142, 212, 304, -108, -164, 158, 166, -21, 29, -222, -74, 199, -107, 55, 118, 214, -151, -25, -232, -125, -19, -24, -293, 136, -254, -50, -121, -148, -62, 448, 32, -11, -84, 30, 371, 188, -164, -4, 181, -13, 197, 58, 113, 249, -22, 56, -59, -29, -215, 63, -144, -100, -105, -167, -305, 289, -66, -90, 90, -24, -45, -63, -22, 128, -21, 69, -47, -86, 127, 8, 178, -227, -230, 7, -232, -62, 56, 125, 76, 148, -231, -181, 21, -75, -28, -119, -69, -83, -135, -173, -55, 0, -128, -12, -87, -84, -42, -118, -35, 72, 154, 36, -90, 92, 332, 12, 5, -30, 95, -83, 116, -154, 7, -38, -37, -7, -90, -87, -25, 116, -166, -148, -13, -62, -224, -79, -91, 80, 187, -76, 160, 337, 94, 84, -26, 196, 94, 96, -80, 71, -16, 9, -100, 56]
2596E6J39J4k33J53lk50J7J60P9l6k80Q6L42j60k09K16l8R2O6j44k55K60m8j9
2620EJ52k0r4K24m83J66Q7M3J24k31P7j99J04PM5l1n8J44Q5j86o8Q0K5L6J5n6
2646gQ4l3P2k70J87Q3r3K22l96N13m93r4L16n0k2l05L07K0m26K94J59j57o7k37
2670c93L40K27k80J05j01J70j53Q6M3L4N8k03J10l4m8M8l20K19J66L94l53J37
2692B52k08j77J59o4J24l65M77k15P9j27J81r2j26j66L67p9j35P9O9M6k19K19
2714G9J44O6k07j16J94P1n8k83M01l04j95K90k88P9K4j5K06k79j41N9L43l25L5
2737b20J91L26l05j48K44p7Q3j11J27N8j22J72l00K35j94n3M8K39j59l31K04J03
2759A0P4j49L3K9N3k4J20r3q5j51J45L37k17J67j98j4O5j9Q3k02K34j04M3k11
$$ y = [56, 195, 209, -24, 129, 126, -124, -107, 53, 132, 96, -184, -98, 244, 84, -125, 91, 53, 145, 211, 67, -188, 72, 24, 5, 157, 137, 43, 267, -216, -50, 37, 80, 204, -27, 50, -149, -45, -38, 7, -24, -82, 62, 147, -39, -107, -27, -2, 34, 49, -7, 77, 44, 116, -154, 33, 116, 23, 245, -151, 362, -131, -225, 91, 41, 19, -286, 21, 41, -385, -91, 68, -89, -156, -393, -53, 174, -106, -1, -102, 68, -85, 1, 44, 78, 136, -67, 43, 9, -39, 9, -311, -92, 74, 468, 115, 252, 44, -133, 26, -38, 86, -279, 198, -17, 62, -65, 116, 24, -102, -268, 99, 20, -115, -36, 33, 79, -140, 79, 223, 289, 82, -34, 160, 231, 173, -110, 291, -13, -208, 82, -206, -127, -103, -118, 88, -191, -332, -273, 70, -255, -220, -29, 297, -8, -156, 88, 11, 94, -17, 110, 168, 46, 218, -82, 153, -41, -94, -46, 193, 34, -297, -93, 10, 84, -65, -32, -3, 50, 26, 146, 53, -32, -183, -38, 299, 82, 249, 51, 37, 102, 83, 166, -36, 198, 94, 137, -74]
2783g4j42J36R7K1l7O5J29k90M4J96k45l76M25M7J38k15r0J20J47rk7j32J09l8
2807aj29J75Rj06K43Q7k83j43J96nk48R1j33K81J44n8k87k3j71L76l05L16K05
2830B31l02J77j75J8n9M38m21J43j72r7M09l13J32o2R9j40J02j23JL6k0J61k8
2853C5k30n3J35J49j01R1k29K28j65K47n2N9P4j72J81m12j8K41K27k19j0K25k77
2876d6K48j17l9j00N4L3L5j44j10L8L58p2k43o5J47R2k57J20J42lk92L50l13k0
2900b04K76j79J31J24n1l02N50k72k80J07J62jk4j0j14L35l16oK33l07j06Q2K50
2923G8L5k0r6N6L9n8k56L12j31P7m5m7M5k08M83j02j91J89o4QK96n21L59j82n2
2948DkL7j7J05l08K48k37J37J81m07K77j01J20l1q1J01n1M1O7J30j50K7r9j13
$$ y = [-74, -216, -80, 17, 38, 1, 66, 195, -95, -51, 145, -100, -476, -51, -4, 134, -81, -171, -51, 96, 87, 60, -72, 37, -1, -130, 45, 54, -52, 191, 278, -5, -148, 48, 43, -205, -114, -247, 34, 178, 120, -167, -190, -361, 15, -290, 26, 231, -71, 106, -69, -51, -110, 328, -93, 50, -122, -219, 190, -123, 9, -53, 46, -94, 8, -115, -114, -78, -98, 63, 35, -195, -248, -113, 36, -65, 26, -203, 25, -140, 107, 55, 114, 188, 16, 197, -215, -233, 8, 235, 16, 6, 231, -46, 202, 85, 46, -54, 0, 33, 68, -76, -186, -148, 210, 138, -105, -170, -23, 69, -188, -68, 74, 71, -221, 129, -184, -204, 72, -107, 24, 148, 97, -205, 345, 73, -207, -100, 62, 61, 37, 27, -87, 248, -68, -74, 159, -148, -254, -172, 78, 113, 93, -3, 53, 92, 34, -222, 90, -41, 36, -9, -56, -11, -219, 264, 162, -29, 160, 96, 104, 400, -121, 238, 56, 4, 2, 39, 22, 127, -181, 67, -170, -33, 148, -259, 18, -83, 37, 6, -75, 26, -25, 16, 83, 213, 63, 90, -9, -122]
2972a22K20j34MR0l30O27n5k59j8m1J59k22N8j11R0j29M9L42k09j49J08J13k13
2995a32o1J35j3J34m5J12O7J5k54P5j76J12O6j04J81k85J70j55K24o0OJ23j3J5
3019A37k29k8J97l13L45k5j4oj46K53k18K25j98M3J6j18J22j05j6K47q5j38R1
3042C7N9k39K08j34J86p5o4M5j19K8K96k93O5j49Q3O6J07M3R0j83p0P4J08j34
3066C5jp4J63j48J7K49j64j03J65j60k13K74k14J39P6o5j18J61k72K31j64J83
3088cj70pM04l62K1m1R3J29L1J2j04N8q6j06R9p4O0j9j83L69l49L32J26k25J42
3113A47Q1m01J56O9j90P4k7K30l28R8q7J44k3l4K39lj23k02K44n8K32l70M5K58
3137A71L9j29k02j54L06RO7k99K22Q1kj43J55l76n0K50L6J05k15J99j47K2J93
$$ y = [-122, 98, -36, -32, 58, -272, 355, 300, 41, 23, -18, 141, -81, -23, -134, -44, -173, -124, 218, 9, -140, -32, 81, -132, -193, -58, -71, 63, 18, 130, 197, 212, -42, 33, -143, -31, 35, -69, 112, -173, -3, -158, 66, 6, 12, 135, 122, 137, -92, -120, 77, -236, 109, 84, 70, 64, -82, 171, -47, 178, -20, 23, 39, -79, 43, -62, -78, 169, 84, -54, 37, 96, -143, 65, -69, 117, 42, -22, 23, -96, -68, 228, -65, 0, -149, -66, 0, 107, 150, 240, 57, -13, 61, 169, 35, 34, -40, 123, -25, -8, 241, 77, -26, 139, -21, -234, 40, -174, -35, 41, -24, -142, 19, -253, -22, -186, -3, -173, -180, 224, -138, -117, -158, -65, 64, 95, 107, 3, 61, -25, -131, -32, -106, -46, -65, -248, 121, -228, 104, 230, 5, 147, 228, -173, -17, 52, -138, -64, -91, 139, -189, -91, -178, -34, -57, -91, 148, 145, 22, -180, 64, 6, 238, -132, -87, 171, 210, 81, -121, -275, 31, 40, 107, -192, 30, 111, 109, -34, 121, -255, -305, -55, -19, 86, -129, 70, -77, -55, 138]
3160A38m6K3j9k86L02r2k97M07p9j9r9J94J47n16L26o0l12L55j12J46m6m0qp4
3184f7k02J69O7o0j28K36j57K11p1J14j15M7L7O2k02J84j68K98k54jj46K32M1
3207A27j47K67j73l2j81J56K0n9j0J13q7l6K84j6j73l6k88L57op7K72r1j22L7
3231I9k83J91j08J06l1J05j4o6P4j18J44nj2l5k03M87k24r8r1l4J65j52K02k25
3255a26L97j64j18l3LKP5Lj16N0j34K79K13k82j61J80m9k25J79K3J00K7j82l3
3279i2K02j58Q7o4J39l16K99kj73O9p8K52K88m32M2j67J09M7k41J53j03J10K31
3302B02q2j45p4L64r0k01Q4J49l7o6J4r7j35J08J9L6j33K48m9R2l61O05l72k7
3326E2q2L30j33k41K18j04q8Q2R6j45j6K53l24K45l19L33Ll84K55l56L39j73M6
$$ y = [138, 92, 115, 96, -190, 112, 20, -277, 130, 51, 32, -67, 127, 274, -242, 84, 24, -288, 67, -45, 101, 55, 15, 7, -67, -269, -100, -33, -93, -221, 15, -142, 69, -2, 112, -3, 44, 81, 143, -59, 125, -43, 255, 1, 0, -146, 86, 127, -20, 247, 74, 42, -139, 17, 37, -22, -32, 81, -6, -42, 242, 226, 53, 17, -271, 86, 80, 3, 275, 184, 62, 99, -184, 7, -101, 5, -26, 79, 65, -1, 73, -45, 99, 94, 82, 47, -156, 331, 107, 9, -82, -116, 49, -103, 99, -126, 271, 107, -11, -44, -41, -39, 36, 39, -77, -27, -161, 118, 331, 49, -112, 68, 19, -206, -27, -4, 96, 123, -59, -92, 110, -48, 39, -25, 114, -202, 97, 95, -78, -9, -87, 165, 453, 21, 63, -104, 5, 52, -189, -36, -139, -29, 202, 120, -25, -99, 265, 175, -26, 58, 207, 170, 104, 118, 21, -114, -6, 13, 49, -84, 164, 115, 207, -154, 451, 79, 52, -30, 300, 167, -74, 144, 40, -48, 34, 130, -15, -31, 222, -102, 143, -176, 157, 160, -224, 31, -325, 14, -159, -113]
3349a13J75K79l71Q2J38j54j24R7O5Q0l48K7K27k7k08L95l8j29J7N8ml80J88J36
3373F8p0n8j48K56j33J43l2j46O1m3K6J57j03JN1j61J84r0L6J11k07J7K76m5j52
3398am3J32j65K03k72j0p7Q9k7O3K5K15k49R7j54N6K0K7J95j06k9j47M0O9O7K71
3424B89k00k16K40p6J17r5J14m93J63J33R8jj76P2L2j46K62q0L7nK5k94J99J32
3448A31k23K25q3k35K49r0k37L62m2K97l03l8r1L59k37o7K42k78L6L9j08j84K11
3471f5Pp1k2Q3Q4Pq2r0J68o3q7j1K43j57J92R8k13K1J57k42L11j99m9J98k84J85
3497A19k87J89j17j29O16n23L41m22K89p7l8K4J91k06Q6n2k64N27l31K27k41O7
3519a1K95j36j03J34j46o5J60k23L24j22p6l0q4NJ19P3k91J61j32j09L96j52J3
$$ y = [-113, 62, 341, -30, 52, 190, 36, -88, 9, 74, 154, -194, -167, 60, 33, -175, 220, 182, 53, 70, 128, 124, -256, -68, 68, -2, -60, -208, 48, -85, 58, 26, -120, -59, -102, -76, 81, -22, -21, 30, -131, 53, -37, -1, 110, -97, -80, 196, 151, -1, -44, 88, -77, 126, -146, -156, -233, -144, -171, -108, -83, 132, -117, -20, -174, -118, -98, -71, 124, 18, -11, -158, -118, -49, 18, 289, 89, -127, 113, 37, 154, 59, 173, -320, -157, -24, 74, 73, -103, -31, 1, -145, 117, 37, 74, 69, 94, -200, -1, 131, -92, 133, 50, -185, 64, -26, -263, 99, 57, 354, 51, 13, -78, 281, 44, -23, 219, -59, -23, 16, -92, -276, -65, -58, -129, -151, -68, 16, 23, -59, -149, 19, -44, -131, -142, 101, -56, 136, 234, 21, 42, 199, -43, 268, 69, 20, 218, -66, 119, -168, 21, -96, -225, 391, -132, 209, -213, 76, -1, -39, -15, 176, -30, 56, 4, -260, 267, -64, 163, -78, -11, 284, 148, 45, 179, 33, -32, 128, -95, 229, 107, 31, 1, -83, -78, 41, 114, -177, -16, -148, -257, 139, -13, 0]
3542@J75j76j11R0JLK4N7K21k55j75K06J44j44J11o2j10j27J35n0n8J4Q1J57m96
3567c45L18j19J93k16J19j14N1j15O9K57o0J67m57J90K91k59qJ64l99M31k41k3
3589a06q3L25p0j4j34J81l11J29L37l87J0L97R5m29j3pR5r1J42M4M4P1k31k69
3613b75J06L2K86o8l43K41j90J72J35j46K67j80k75M19k00j1j49Q4J14r1m6K8
3635i0N6N8L7j51PR9m1j37K48J35J31m22R7J29l68J82O2p0L00j58l27K59J41m61
3659b84M34j57n5MmM5j75J40j05N8K31j83J95j50J12q2J7p3K1Q3j00L0q0Q6J23
3684A31l19J68L05L1j74p4k57J73J63j02K8p4L3j63J86K06j83j04Q5j35R5j45
3706a26j06M85m07K07o7P5J17j91L5o9j06J31l8J14j68j79L93p3l32L84r3l9j82
$$ y = [0, 175, -1, -112, -22, -21, -18, 6, 63, 284, 29, -146, 60, 204, 60, 171, 109, -1, -128, 7, -43, -101, -87, -6, 151, -345, -27, -146, 47, -169, -50, -164, -113, -228, -159, 98, 38, 205, -252, -62, 229, -30, -38, 126, -273, 158, -83, -106, -189, 136, 66, 52, -82, 99, -212, -83, 254, -133, -123, 274, 369, -60, -73, -80, 15, -76, 66, 110, 154, 225, -6, -275, -169, -137, 149, 81, -262, -21, -211, -39, 96, -50, 217, 37, -238, 181, -19, -30, -179, -95, 19, -72, -118, -90, -34, 24, 61, -90, -83, 16, -25, -162, 86, 221, 352, -70, 27, 156, -212, -30, 32, -38, 262, 104, -223, 36, 177, -284, 150, -7, -62, -58, -62, -17, -192, -52, -157, -99, 132, -51, 144, -6, 106, 24, 41, -32, -11, 72, -28, 2, -78, 8, 131, -188, -20, 285, 316, 142, 68, -189, -16, 147, 45, 73, -1, 32, -131, 55, 261, 78, -26, 59, -76, 19, -126, -232, 253, -154, 53, -14, 61, 178, -13, 22, -47, -153, -22, -60, 54, -114, -293, 100, 27, -305, 79, -14, -53, -235]
3729b35J60r6J89j04J69J53k41Q6k19L96l26K98k07j41K4J31n4q3M6O4m8j63P0
3752a31J3R9k6k1J3J2P9L0k07M0L46l63k1J15J43K1j20p0r9O5J47J78j75j65K45
3777A48k30J53j27J25K05m13J63R9l37k9J83J98Kl11K96j08k94K55O1o0Lj58n7
3800b33J52K22O4j46k87L38k67K17k6J06j43K15j96L9mj26j17M3R5J16l19K58
3822Aj87K03j7l33N33k8j60m4m1K15j70J87j65m1J65k84K62j10K61k62M7J20m12
3845b60K81J1p8kJ07J32k37n6Q7MQ1k07j75K02P1J15K8L5L2m47L10ql7j34J69
3870B4J58k01R7j90J33N2J19l85K71P8j26OK0%K9k22K87k22J66k43j1K07o3J85
3894A69j49M3j58P8q3R4J30j82K0N3j5m1K08l56J36J50O9j30M4L1k13L56k94J31
$$ y = [-235, -75, -171, 18, -86, 83, 236, -5, 81, -138, 258, -68, 230, 23, -118, -94, 37, -17, -100, -54, 10, -38, -201, -131, -118, -19, -45, -66, -53, -41, 38, 68, -139, -99, 247, -116, -137, -22, 121, 142, 22, -48, -147, -82, 65, 243, 68, -97, 148, -82, 71, -56, 69, 274, -139, 24, 123, -214, -243, -60, 138, 140, -171, 125, 17, -277, -22, 39, -21, -18, -176, -233, -81, 141, 205, 59, -228, 110, -157, 60, 34, 140, -3, 212, 16, 55, 51, -75, -192, -149, -54, 62, -257, 1, -186, 17, 0, -333, 200, 172, 12, -32, -73, 142, -28, 159, -6, -47, 118, -166, 96, -14, 247, -15, 32, 152, -260, 21, 32, -46, -48, 59, 191, -46, -102, -15, -11, 70, -137, -312, -110, -39, 76, 104, 139, 171, -276, 34, 26, -11, -145, 24, 182, -19, 78, -112, 21, 73, 192, -193, 78, 156, 30, 36, 56, 56, 85, -137, 150, -72, 94, -149, -160, 47, -16, 169, 20, 63, -95, -17, -100, -6, 124, -58, -38, 15, 0, -41, 167, -189, -53, 97, 166, 36, 80, 111, -102, 254, -40, 91]
3918I1j69J06R9q9n4Q3N2j81l2N2J18j55M7k10J22K33j68J72k52J80m5m8J63%
3942A15k79R6J35j1j65j0J39n8K2M3Q7k66J7K53q3k4k4J0q7L04k00j9q2K00J32
3967B45j73nj72J22J80k56j73l3K70n2j04K93k89J67m4N5k01P1j1K06l7q7k49
3990b77J98J89j68m6J57m0k15L13KK24l33k6k1j4J1J3Q4l5p6k2kJ77Q3l73K77
4015H0k3k75J21k5l0J86k84J39K14R2M8l27Oj11R2o9K88k55L2K42%j92J5J06k24
4040a54K98j12J30l0J65k93q1Q3M6n2R7Q6k05j64J16J06r7O9m04L34O1K52n01
4063b50M4J88q8l3J86O8j21J23j2j05j82L44k48l0J12n4P8N9j9l6Lpj30n6J42
4088b4j13L53o32L66R5q2L50m51M9k2K18j26q8J57j44L47k56l1K16j46J27k62
$$ y = [91, -78, 28, 127, 38, -16, 67, 119, -62, -94, -42, 76, -79, -32, -242, -120, 113, -55, 117, -135, 45, 0, -48, 115, 115, -164, -68, 67, 56, -109, -119, 20, -38, -16, 27, 114, -152, -135, 118, 35, 11, -13, -3, -90, 214, 14, -5, -87, 113, 245, 72, 67, -105, 17, 197, -59, -232, -265, 5, -47, -151, 142, -147, 20, -24, 31, -170, -99, -110, 96, 59, -28, -277, -79, 110, -58, -104, 53, 13, -202, 111, 113, 337, 4, -22, -43, -57, -46, -33, 51, 16, -60, -82, -84, 93, 176, -197, 80, 57, -218, -97, -122, -152, 34, -250, -111, 103, 195, 243, -84, -78, -189, -97, -166, 122, -133, -101, 141, 141, -51, -36, 70, -154, 144, 32, 162, 132, 297, 4, -77, 6, 52, 0, 97, 183, -22, -186, -70, 36, -61, 8, -396, -62, -1, 251, -250, -206, -18, -106, -139, 47, 115, -6, 117, 105, 0, -182, 162, -86, -116, -4, -58, 20, 79, 60, 24, 27, 20, -110, -166, -24, -137, 216, -416, -50, 45, -37, 313, -138, -89, -111, 107, -19, -107, 50, -94, 253, -3, -34, 182, 36, 163, -99]
4110i9k29K46L02j51l08J25K23Jj83M07n08J53K9J28j20R1k2j15J13o8J04k05
4132h6j11J9K32k9P8k11K14Kj04L1m5q8K04j79Q7J6m01K02K33k50J94l1j11J6
4156a18L30l86L17L3K3l23K25j25j02J76N1l12J83j10k96M41m3J39j7m5O1l08
4178b06J22P3j84J74K68m86K89j01M8q6K48m66L57j46L55k85J15j11N3J45k32
4199e6J02j66J04O7k39M8P0J03OlL8k52J67k65K94pj42n9OJ34K2k14K50m2J20
4224H6q9J09O8j01p8N2J36j0j20l18L95n0j94K5L01l26J1O0J84p8J5m30K31J79
4248E8q0q2J05j03R7J25p0l8K26m91L99p5q8R2k96M63j60O4j58Nj00J53R6L5k56
4273g9K93Q2j75m04R5j05L82j41j50L62m35L12J21k37N5N5N1j58m9J70k8J06j6
$$ y = [-99, -328, -82, 220, 69, -239, -114, 109, 110, -73, 334, -174, -21, 8, 136, 16, 107, 85, -30, 83, 15, 119, -86, -197, -178, 54, 25, 103, -108, 106, 108, 4, 35, -10, -98, 106, -73, 14, 30, -371, -169, 64, -186, 8, -23, -134, -118, 212, -174, 143, 176, 199, -124, 101, -24, -126, 50, 101, -211, -28, -138, -434, 7, -36, 103, 86, 41, 102, -206, -84, -11, -195, -21, 247, -239, 50, -51, -3, -89, 159, -307, 50, -96, 259, -26, 89, -22, 31, 176, -56, 46, -120, -16, 51, -188, -140, -70, 33, 39, 36, 74, -178, -11, -276, 18, 11, -131, -190, -184, -50, -28, -242, 8, -34, 86, -3, 106, 174, 73, -5, 47, 183, 173, 53, -265, 130, 80, -114, -89, 212, -114, -103, -43, 141, 63, 78, -352, -121, 58, -22, -104, 1, -102, -5, 120, 50, 12, 238, -253, 146, 71, -17, 75, -221, 242, 82, 146, -12, -7, -107, 46, 142, 177, -79, 214, 296, 121, -283, -188, -293, 89, -52, -202, 160, -275, 37, 158, -79, -24, 31, 82, -76, -125, 45, 17, 123, 107]
4296A07j39K87m22R4K4K24p7j99j11K31p9m0L88k88j22J03q1k8K43r2r3K64m7
4319A47J35m27L62j27k47o4K30O1k1J23m9j10O0m8q2k0J38n1R9k40Oq1J61J56
4343A11j09l0J30j95k7K10k26K94k07L3o9K31k84j17K30P0l04J49M5K39R3j81
4365H6j88L44j39J3j48Q2j45j24J33o1k9K99N2k19K9n5J86R1k18k0L1Q5n8N4k81
4390b00n0M37k97O4J08P5k4k42n9J90k32L76Rr4k84O9M2J66j71K89o6M1j81p2
4414a06m2J64l4K2k41J46J03q5J95L6j09J79k99k14M11j00m0L7j68L9J54l57K73
4437c6k1%j18K33rJ54k23q4M10k84J41k49K05k80M1N3n1O5K2J09n5N5j55j32K60
4462E1q2J33J76l58NJ56j52p7O2K8O1j23K03k23o2J52l5K59k9k94K58j6o8j5j8
$$ y = [107, -32, 255, -167, -73, -49, 175, 98, -101, -212, 19, -60, -100, 288, 0, -122, -19, -100, -128, 115, 23, -70, 194, 147, 282, -145, 217, 90, -157, -221, 9, 70, 49, 172, 123, 13, 73, 25, -57, -77, 61, 10, 109, -131, -125, -206, -45, 111, 2, -28, 102, -93, -120, 90, -136, 158, -49, -16, -85, 146, -138, -255, -25, 45, -259, -110, -65, 174, 267, 86, -102, 242, 103, 116, -32, 50, -95, -219, -86, -147, -176, 123, 175, -44, -15, -70, 116, 207, -11, -31, 0, 85, 27, 81, -200, -250, 187, -110, -46, 62, 137, 113, -129, -188, 2, -230, 146, 155, 61, -223, -154, -112, 54, -117, 172, 106, 147, -34, -106, -148, 16, -18, 4, -237, -91, 12, -73, 122, 158, 49, 228, -71, -285, 126, 26, -14, 23, -145, -106, 48, -309, -36, -57, -57, -175, 58, 49, 203, -20, -104, 306, 22, 163, -86, 119, -161, -120, -67, -118, -53, -31, 78, 23, 78, -77, -209, 51, -31, 102, 278, -80, -75, 81, -71, -148, -86, -58, 3, -120, 83, -140, -202, -50, -85, 174, 145, -149, 109, 93, 25, 10, -8]
4487hJ48l56L20n3k13j30J50J07K82k28J45k19j07K16L2j93P7pq1J51J2L7lM7
4511A26k58J16k7M6k5n2N7K02K1j77lo8K49k86j73K85o1j03J34k06J61J69r7L1
4535F1k19K36k33N6Q7M8O6L4j9m8j30R0q5lJ13oJ1k20M04L0k86P1j94K83j84j4
4561e1J30j54K17j64l9p9K07pl36N15j77k44M15l32N0n4j32L20m0m0o2J81k88
4584a64OJ64k06M82o52L90k05K58j08j13R9M3q7P0j21j3J68j02m0J99j87Q7J86
4607A54j98J69k96K54j58J60j33J68n5J14k31LK8NJ48j3r1j57J97k28J67OK9j02
4631f0p3J52q0j5n3O8k37N08k93O2l4K16qK12m74J38j47q3L07k11J38l4M0j14
4655g5R5K01m38L07nk48P4R6or2K41r0j17J87j10L1r0mJ61N1k88J20J60l04J26
$$ y = [-8, 140, -216, 104, 51, -162, -292, -142, -35, 247, 19, 164, -55, -162, 54, 86, -107, -30, -37, -118, 33, 45, 82, 79, 126, -132, -16, -43, 3, -22, -74, -17, 185, 206, 29, 26, -42, 207, -79, -252, 33, -28, -131, 3, -203, -42, 127, 30, 61, -158, 78, -155, -99, -12, 36, 102, 136, 117, 69, -61, 29, -56, -59, 54, 48, 59, -161, 243, 273, -13, 58, -136, 147, -37, -51, 79, -75, 142, -22, -61, -140, 67, 60, -276, 239, 62, -182, 233, -99, -49, -103, -235, 85, 45, 5, -57, 124, -164, -158, 6, -200, 282, -370, 20, -185, 73, -35, -148, -49, -6, -93, -23, -144, -157, 11, -91, -131, 68, -119, -32, 154, -44, 125, -171, 83, -75, 85, -48, 120, 65, 179, -52, -49, -21, -16, 132, 119, 28, -129, 68, -160, 7, 13, 42, -60, -133, 19, -61, -76, -129, -61, -298, 210, -83, -21, -55, 161, 153, 365, -109, 29, -118, -201, 106, -105, 33, -1, 39, -75, 20, 221, -217, 90, 85, -163, -89, 7, 1, -91, 150, 60, -57, 130, 20, 51, -39, -43, 118, 169, -119, 1, 161, -143, -17]
4680a7l3L02l82M59j91p6l9Oj44J66Rj55j90N31l52J53m0k51J13K92j26n4J91
4703A72j36m3L61m06j14K52k48J96J95l37J3J07j23k77L36k38K77j10m8O9J88
4724H6R6j73k52L84o6J6J40k98M2P1J51l50K91j13L20o03K33J27j91J41j87K92
4746A57k30K00l85J77O4j03J74J40j88n2J49q2j17K67l69J88O5o4K3l9n6J08P6
4769A03O9k52M3Jj37n9J42O8N0N3n1J08k03J13k4j02P2k2J26j90L81k30j62Q8
4793a5K1j74J28k5j33K80k57L70j20j22j03J19J04j5j6O3q2K7j25p5J14J11p9
4816do6j4J21lm4l0K00o4j55J68o4j65Q1P0R5k27j94N8L37k50l0L94k35P0j94
4841a45O2J51k79OJ17L03n43L37j1j13LJ8j21L43j43nn0l3K33k26K25J5k07L8
$$ y = [-17, -50, 252, -130, 329, 138, 62, 23, 29, -115, 51, 60, -95, -285, 246, -106, 47, 7, -244, -131, 161, 35, -19, 172, 36, -7, 354, -52, -166, 86, -162, 34, 229, -108, -95, 12, -111, -388, -52, -290, -13, -123, -171, -102, 86, 182, 9, -243, 141, 75, 91, 231, -67, -25, 46, 197, -153, 138, 25, 345, -258, -25, 102, -89, 52, -135, 157, -73, 127, -258, -81, -17, -120, 54, 194, 6, -46, 103, 21, -96, 171, -198, -10, 55, -9, 14, -25, -81, 27, 103, 172, -80, -37, -36, -173, -232, -90, -22, 28, 81, 30, 138, -65, 48, 24, -78, -6, -28, 98, -92, 289, 59, -103, -15, 6, -168, -40, -65, -198, 82, -175, 195, 75, -47, -150, -31, 73, 58, 42, 105, 23, 50, -75, -150, -36, 75, -4, -70, -84, 37, 34, -10, -40, 160, 96, -59, 109, 45, -120, -39, 31, 126, -101, -295, -237, 100, -150, -180, 214, -21, 49, -145, -83, 68, -211, -205, -88, 215, -328, 9, -2, -115, -112, -94, -215, 128, -15, -20, -70, -103, 130, -96, 129, 144, -63, -25]
4865b5J36K15k22K1l47P2N0K3P7j07K68j48m6ln5k8J68k08J80j11j32L55j16J19
4889A36l14L1K0j8L9l9L26l90K40Q1j20K26j41O5m3m1p5J9P0k55J86Q7k57K69
4913A02J00k70L31k16J3J7j11p6J81k28J96N1j16J02j06J06k44J32l5R7J4P8j28
4936a0j17L00k57j40J52L13r4j93j3p4J44q0K04k38J58n8n7j29N04k64k69L11
4958I3l91L23k35R5q4K24K33j58q7l37K68J09l1K1J6q2J00k54j2J72J20l00K73
4981G6n3J27Pp3o0k15J43K73Jj73q7Q6k58j58K28K35k53P4j16J42Q7k92J77J28
5005D6J78k27j06j25L29o8o1n7M79k94j85J34j00Q3L2k18J83j79J36k0k6P7J29
5028A40J69j28k37j02n0l8K75j11L53k52MM39m61K01l26K94l4j40K4q9J21k36
$$ y = [-25, 111, 326, 104, 125, -222, -150, -100, -77, 0, -107, 161, 13, -33, -36, -91, -119, 49, -159, 21, -90, -222, 133, 17, 136, -178, -147, -127, -145, -106, -145, 181, -209, 31, 112, -8, 218, 77, 142, 99, 58, -17, 2, 72, -183, 3, 90, -167, 102, 202, -68, 263, 47, 60, 77, -34, -110, 71, -157, 39, 90, -26, 76, -30, 76, -168, -36, -71, 26, 40, 118, -10, -127, 173, -84, -224, -72, 241, 147, -46, -59, -133, 11, -69, 135, -103, 55, -3, -60, -189, 315, 51, -218, 93, -298, 25, -210, -115, -199, 25, 258, 100, 13, -324, -56, 53, 22, 43, 59, -23, 77, -177, -189, -17, 103, -197, 76, 23, 150, 157, 84, 24, -191, -48, 225, 226, 53, -34, 52, -206, -364, -136, 99, -154, -80, -196, -54, 33, -259, -82, 46, 224, -3, -109, -234, 95, 27, -34, -91, 388, 94, -91, 43, -57, 26, 58, -160, 23, -156, -20, -40, -66, 11, 140, 309, 181, -56, -158, -208, -246, 29, -82, 271, 19, 23, 462, 1, 202, -124, 170, 136, -4, 20, -69, 52, -184]
5050a84J92q4j6M6O9j1P3k45K21K4l35K22p0P7j20K45qk60L7j51Q4L59n4j37O3
5075C7p0L2p0n5K78k70J51J5J36k55j68K67M5k42k28L42K76k77J24j05j33K59
5097H9O8j91m3m8L3KJ31O8J88j17k14K4L7k96L12rl90L16J52j92J04j05K00j80
5121f1P3Pop3J57L8K09k43j7j56j69N11k93l2J96k07L36k52K06l16mJ90p9l7k28
5146b50k6K05J28l2r0KJ71j15Q5Q9j48J19j04j98J88K20l04M7R6q8M0j13J88J64
5170B74l15mJ98k29j26J28Q1J42j14k30R2J43j33J02K46k42nJ3j22J12j88K30
5192E3K29j99j80K05k74K23l5j82M39l95O7J63j5n8l22jL96m25K86J1R9j37O4
5215A2n1J9Q3o6N9l8k22J95k83K25K11q4m4j41J49m4J07j36R2Rj47J39l1j51L27
$$ y = [-184, 8, -76, -92, -46, 23, 12, 85, -160, 61, 85, -250, -28, -98, -21, -141, 104, 96, -164, -127, -278, -194, 165, 111, -26, 37, -33, -1, -71, -126, 152, -118, 33, 48, 184, -71, -239, 28, 73, -169, -397, -55, 221, -56, 68, -37, -170, 89, 157, -34, -77, -125, -92, -90, 41, 109, 297, 180, -34, -10, 27, -269, 43, 34, -356, -40, 112, -80, 24, -81, 119, -61, 12, 19, 13, -60, 97, 135, 344, 101, 84, -72, -241, 270, -23, -55, 141, -66, 270, 18, 224, -92, -96, 94, 15, -22, -250, -276, -71, 57, 25, -65, -63, 108, -7, 78, 167, 19, 138, 34, -164, 24, 244, -60, -13, 83, -5, 35, -78, 110, 274, -41, -45, 153, -76, -202, -74, 7, 149, 35, -195, -103, 40, -93, 9, 255, 13, 8, 21, -101, 11, -177, 53, 282, 83, -97, 108, -166, 57, 22, -160, 279, -116, -49, 114, 99, 41, -281, -282, 114, -311, -25, -14, 85, -52, 12, -39, -20, 63, -3, 56, 18, -204, -9, -292, -67, 144, 60, 16, -125, 24, -20, 87, -49, 43, 52, -95, 44, 13, -138, 189]
5240A89k83o6k0K46l9k2R0j19J01p3R2j69K51m28K30J60l25J22o1K9K62j94J56
5263A29Q2k91m0N8J37J37p3L7k61Q6M3J11l72Q1N0J59m3p6j10L83k51K12j40j34
5287h6j47K76j00q5O6k3oQ0K8J7O0j9J09k44K05j75L63p03O27k39M0J12k00q7
5311a31K30j79j4J6j96M26P7k3j33k6j30L37k80j36J90K05j0j26k21J81q0L14
5333B91l17k75L52q8J40O4l28M00m15J63J2J27j04P7Q9l03k4J39oj23o2J77K53
5356B39j92Ko9J11j25m0J11j32M7%L35l73Q4J71j44kK11l15K16p9n0P2j1k12J69
5381B4r7N12m09j67L26j85J13m3j17J55N1j34k32K91J03K9l16P3K98k89j05L33
5403B14o6k60R4P5K7m5k1J5J17j02l20M65k39L9J09k72K19k88R1J19mJ36o6j79
$$ y = [189, -94, -160, -180, 66, 27, 5, 95, -24, 77, 4, 96, -73, 178, -250, -20, 140, -185, -63, -124, -95, 167, -27, 129, 211, -80, -120, -62, 75, 212, 139, 176, -85, 1, 44, 155, -217, -136, -86, 73, 30, -46, -156, 227, -24, 188, 48, -86, -233, 43, -57, -142, -76, -99, -105, -25, 3, 20, 80, 61, 170, -74, 131, -44, 319, -384, 243, 4, 44, 156, -44, -131, 99, -80, -94, -78, -274, 152, 229, 206, 73, 47, -83, 254, -26, -162, 28, 233, 223, 97, -124, 57, -23, 291, -26, -301, 51, -37, 103, 167, -161, 239, -176, -13, -1, 126, 22, 99, 188, -115, -139, 0, -6, -129, -191, -14, 239, 47, 49, -20, 91, -34, -74, 37, -95, -48, -48, 287, -86, -2, 169, 25, 23, 234, -81, 135, 56, 6, 78, 67, -145, 24, -73, 439, 30, -137, 189, 4, 117, 74, -43, 112, 163, 29, -203, 88, 191, 220, -96, -23, 275, -14, -119, 214, 148, -112, -18, 57, 84, 39, 18, 33, 150, 48, -272, 193, -46, -7, 102, -170, 49, -239, -148, -29, -33, 103, 37, -142]
5427a42J93J48k86J9J42M0ll05M76l21J18P4O4l94N3K98P0P5k42P0j72j2l5k59
5451c31L56Q3j18n7R1RJ64j06M8j29K23l11K31K3o0k11J96k08L02k49k3M7j32
5474a62K96j04K71k34Q9l83M70j92P1o3L2M2k85J35L26m39J76N2M1j08K8m4N5
5497G0j67K90k82M20l80k5J17j55Q1j03K88k44J26k34K33J28l03L81O1k22K16
5518B96l43j57K29M6O0J02j38l31M1L39l47L13o6mJ26m11L19pkK28k74L2p5j36
5542a60J69R6k6k42L28j23k11J99o2l1L20k41k64K03N1o1N0K17m17L26j83J21
5564E9k5j52j10O7N8K68j94J62k72J13j0L9k6J92l07J4j1L0J49j44J42K08j40
5587A10l4j43k4Q6kM7j90N93n57K86j44J13K5l11J2J77k07J10P0p1J39k63j6K96
$$ y = [-142, 51, 199, -87, -68, 74, 114, 111, -194, 282, -39, 79, 153, 217, -177, -124, 174, 244, 319, 77, 147, -25, -37, -72, -331, 25, 108, -10, -67, 24, 33, 197, 91, 139, 10, 233, -78, 153, 176, 116, -95, 101, -107, 195, -54, -77, -30, -162, 134, 30, 301, 67, 156, -227, 243, 51, 122, 59, 91, 133, -152, -17, 309, -130, 46, 98, 139, 31, 59, 15, 70, -97, 193, -89, 331, -49, -74, 43, -112, -31, -134, 154, -90, 36, -198, 35, 163, -140, 241, 302, 80, 296, -47, -204, 25, 71, 131, 233, 95, -236, -195, 144, -203, 110, 44, 40, 166, -245, 74, 67, 65, 293, 19, 51, -24, -160, 9, 105, 79, -163, 165, 42, -169, 30, -32, -63, 257, 16, -248, -45, 6, -55, -5, 212, -205, 121, -62, 59, 34, -118, -228, -161, -103, 165, -29, 133, -139, -26, -36, 3, -23, 169, -138, -124, -135, -105, 44, -100, 42, 250, 110, 76, -67, -91, -5, -7, 40, -150, 443, -114, 172, 28, 141, 166, -145, -133, 44, -163, -53, 17, -54, 85, -178, -194, 102]
5611A02K4p3j99N9Q1lk6J7k20N12j96j40j48K06k3K26l4o8p0J43k03r7J48J58
5635A76j74j39N4J35j53L0j3K7K3k2qq5M37l75l2J04l3k11L67k25NJ32p4N8K1
5660B5P9J46k45K68m61%J4L35j26J12r7k9k26L41k42K10q3K9j8r3J89j91k8K56
5684A65l07K52m6k6O2j54K4L2J36l57L31k42L89k88j00K44j76J39l1K1q4L70n00
5707a46j17Q0K5M73m64J72J89P3m05K21p7Q0n5p6K74l69J32j25K54j62Lm2J20
5730E8j26j23J25L9M7j07j06K32M4j09L05k54k9O5j20p2J54K01k33J4P1j85R3
5753a6J39L0l44M5l1O1M1K4J80l28K98k68K95l33K77K9n0j33O6k31J05J93j16
5776f7lM3j17k5J73J91j82%o4J40o2j59R8j20J25k06L71m57M76J27l60J68j61
$$ y = [102, 126, 53, -146, -87, -6, -9, -35, -18, -238, 274, 78, -62, -210, -4, -27, 199, 165, 97, 27, 170, -33, -130, 18, 176, 2, -137, -83, 52, -101, -71, -84, -57, -34, -56, -64, -149, 288, -87, -119, -15, -48, -259, 108, -117, -112, 20, -54, 4, 25, 104, 250, 5, 273, -188, -188, -174, 161, 35, 147, 50, 21, -205, 136, -106, 104, 21, 50, 32, -61, 128, -63, -91, 165, -142, 110, 64, 38, 100, -54, -30, 2, 138, -219, 112, -130, 259, -29, -129, 115, -61, 78, 47, 68, -16, 354, -146, -263, -183, -158, 315, -149, 23, 212, 285, -120, 101, 24, 104, 49, -27, 247, -122, 10, -115, 139, -23, -20, -62, 58, -68, -191, -66, -27, 20, -87, -193, 39, 83, -26, 279, 25, -4, 61, -59, -131, 23, 224, -9, 5, 76, -109, -16, 123, 153, -191, -146, -177, -116, -75, -51, 129, -199, 99, -169, 126, -207, 70, 99, 49, -84, -18, -249, -144, 49, -67, -70, -27, -144, -169, 4, 195, 13, 13, -51, 89, 27, -132, -34, -154, -29, -235, 136, -321, 155, 282, -78, 90, -71]
5799g1J4m1Q0j6J44j67o9K88j66N9Q5j44R9j83L3J5oj11k0L19k32J21j09q1Q3
5824g6q0J17Q0K64k01r1l65M89q9k9o1k75M08Q2j31j04L13m95J38R0j22J15JJ53
5848A31q2N7Q9%k08j26J65k39K61k12P3K44l32K40o1k63Q8K03m6P3j56K9K63l12
5872a21j20L49j72OJ25M1j92J61j01o3K50k25J15j75K28Jj88J35m8J71p1k23K97
5895A80k64K72k63J47O0N9k7j58p6P4Lj72L47j33N3J22l54J87j64K64o7J4j67
5918f3P8M8j5j7n7J38P1j31j67K39j54nJ44j11m3k1J77j83j15P5j32J99k55L79
5942G9j60J36l4K9j77J91J06m31J07q3J48J08n3J63k80L22k1J7k47J16L9m4R2
5965A23J47l82R6J32R6j46j01J28k00L08n92O56l10j29K17J18k14K0N3R5k85L47
$$ y = [-71, -57, -98, -18, -34, 110, -57, -126, 162, -4, 55, 140, -4, 95, -88, -55, -40, -46, -157, -177, 142, -90, 31, -78, -159, -76, -156, -39, 41, 305, 104, 13, -352, 137, 48, 19, -42, -317, 91, 173, 42, -62, 251, -244, -106, -16, -138, -23, -22, 131, 49, 106, 195, 195, -13, -139, 26, -213, 48, -164, -91, 153, -179, 61, 0, -263, -175, 28, -18, 55, -101, -72, 191, -121, -241, 108, -64, -58, 67, 108, -84, 77, -24, -87, 163, -62, 53, -122, 106, 107, -81, 54, 6, 177, 106, -117, 180, -84, 188, -75, 72, 132, 191, 164, 6, -70, 4, 7, -165, 182, 49, 102, 224, -130, 57, -107, 157, 90, 104, -63, 15, 63, 48, 31, -26, 112, 183, 52, -115, 124, -30, -35, 109, -2, -45, -66, 111, -72, -187, -112, -244, -45, -300, 79, -81, 55, 21, 50, -127, 64, 170, -261, -154, -237, -89, 19, -34, 129, -151, 171, 150, 167, -80, 36, 75, 31, 123, 270, -112, -16, 116, 212, 66, -35, 93, -107, 201, -391, 265, -45, -174, 43, 161, -53, -33, 20, 115, -170, 177]
5987A77j42O4k54J5J52n4n0K6J47j13j25R3n9K93l1k33mm2K51p3k1n1J51m3p4
6012@J79j75o1j63P7k5L96p5j59j09Lk3j12L67j49l5M5K20j39q3M5j23J79l07
6036b27J42L44k65O1j17J11j7j95O2m5J68J16L2J2j0k36N0M7q5M7J51k50M3J49
6060H8j93j06J5L19p4l40J15P8j68J25Q4j55K42j8J9J36km4m6K5q7J36j93n3K33
6085A36k23J08kj5r1J11JJ18J3o9j24p9p0J71l8J0J26p1llJ40m06oL41J98k06
6111F7j1l7J82k2o1q2L83m26l40L36l2j3J46r3j37J33q4N9N3l71J47L37J26M5
6135C05j27l23M92l35K73n38L14l06L76ko8R3j69J61O7l15k68L91p2K21l26K51
6157I5k20L41k39J08j63J63q2j05L5K16N2j59Qk01K95m5p4m4J36k86J56j47m8
$$ y = [177, 35, 99, -155, -140, 12, -42, -92, -66, 81, -32, -157, -64, -123, 170, 139, -94, -98, -140, 111, 38, 17, -34, 117, 74, 0, 179, 4, -57, -220, -143, -168, 228, 153, -6, -115, -112, -135, -247, 120, -29, -64, -19, 201, 62, -21, 24, -99, 80, -227, -85, 259, -6, 55, -62, 49, 32, -163, -101, -146, 22, 138, 170, 182, 172, -64, -14, 33, -52, -5, 146, -104, -61, 88, -105, -211, -196, 123, 49, -291, -176, -98, -266, -141, -57, -212, 30, 12, 31, 167, 165, 121, 75, 100, 13, 149, -44, -97, 136, -87, 21, 19, 4, -87, 24, 25, 143, 156, 87, -37, -116, -186, -15, -53, -43, 83, 12, 9, 6, 146, -260, -266, 75, 273, 67, 56, 19, 201, 179, 118, 36, 419, -7, -347, -11, -43, -56, 90, -3, -140, -7, -91, -32, 21, -350, -203, 134, 260, 305, 178, -145, 347, 12, 285, -253, 61, -245, 131, 129, 61, 154, -15, 146, 213, -102, -370, 21, -51, 170, -156, 95, -125, 216, -23, 85, -78, 85, 3, -102, -67, 149, 201, 42, 50, -151, 144, 99, 25, -19, 117, -169, -13, -160, -208]
6180b08K85r7J44l01K64k08Q0K04j37J35k80O4Q5j23L26l22j56K89k19OL4K17
6202H2m8j10J57J00k32M01n39K75j60j9J69l06J76J81j57j21K61m1n5k19K07J41
6224A43j58L3l2j07o3L07J08j63R0p6p3P3j82J98j49q1K16k09qL46l52K90M8j39
6248F0n1k17J85O9%l36L70j22J57k44J19m0jL2J10p9o2K17j16J42j22j33O4l5
6272c3J61j98P0O7o5J08o4k38J77j61L93m12LM55j05N7j40J65k73O1R3j66J19
6295G4k56M9K00q7l7Q9k93J02o1J86k2o1N7k9rK45j90k6L0o3J84O2k57J73N6P3
6321A89k31J90k51K17m7j40q1nL89p4J7j25l25J60J52j83J82J48k06Kj44pJ75
6344BM2J95Rm84K24N4oJ22J17r7k45O8R7J22l2k08O9j61J90k49Q4K0m4J67k15
$$ y = [-208, 77, -20, 124, -177, 87, -121, -41, 163, 26, 161, -119, -55, 30, -93, 233, -89, -245, 44, -175, -169, -135, 82, 34, -76, 81, 181, -51, 350, -189, 86, -74, -93, 76, -230, -54, 127, -30, -151, 110, 69, 14, -205, 2, 143, -15, 18, -14, -121, -184, 123, 231, 68, 158, 82, 9, 82, -100, 98, -51, -132, 84, -125, -133, 213, -139, 151, 199, 60, 9, -208, -23, 46, 46, -290, 80, -42, 115, -129, -10, -50, -51, -19, 91, 12, -50, 167, 51, 193, 71, -62, 2, -33, 128, -70, 0, 67, 2, 110, 46, -192, -15, -176, 217, -195, -192, 263, 158, 215, 75, 240, -33, 28, 121, -45, 74, -182, -133, 67, -20, -57, 32, -261, -159, -220, -34, -56, -117, -60, -89, -98, 147, -43, -69, -39, -102, 82, 144, -113, 60, 116, 189, -42, 148, -103, 114, 67, -73, -154, -159, 230, 156, 173, 48, -277, -117, 35, -148, 34, 182, -24, -22, -166, -173, 2, 44, 239, 248, -236, -12, 42, 36, 158, 275, 178, -67, 1, 98, 220, 188, -20, 49, -112, 78, -171, -87, -67, -111, 56, -159]
6369a59L9K02L7j36jp8J89j32k00l3L77j25J02L6o6m7p7k7L4n9K87J22k10L0l20
6394b15L05m2J2q7J88k30oK32M2k22p2P7pj42J65p0k6J56n7q0r2K09q0K01k30
6419g1Q0m5J98K5k73J41J8j34qM3o1j24K22j37J76J32k09L0p3r9J61J99j66k04
6443a79K07J04j86J44m3r1j67J92j1kQ7n2oL47l37J19l83Q0K60k65L04k13K03
6466A12k51L84j88P7l2l17k6J76P4LR3j92K46j83q8J63J40k90Q1k6j99K35n1K9
6490c0K64m13P2J18K31m42M55o7k23n9N5l8K88R6l32R4m6j00L4P2j73R4K2J65
6514A37k22J61n6J22l6r4K51k85j48K75j93J0j99M53k7l78J11K81j15j85K13j36
6536f0j30K72%k55M67l25J58q7j08J89m60N12q1M2m2j56J4m5kO4J55J11n37L17
$$ y = [-159, -120, 82, 119, -17, -18, -96, 93, -39, -239, -272, 105, -20, 82, 118, 52, 5, -72, -99, -65, -124, 163, 285, 75, 105, -215, 90, 48, 60, -27, 161, -69, -75, 157, 199, -23, -95, -18, -25, -167, -2, -72, -98, 58, 1, -79, -171, 38, -42, 159, -71, 9, -36, 162, 187, -86, 55, 73, -61, -69, -26, -87, -211, 11, -126, 50, 182, -27, 3, -70, -169, -8, 191, 25, -179, 28, 132, -54, 90, 47, -44, -211, -19, -30, -32, 55, 3, -3, 344, 7, 126, -257, -177, 83, -182, 122, -91, 112, -139, 245, 57, 134, 102, -215, -241, -65, 9, 12, 105, -87, 159, -24, -112, 51, 191, -99, -18, -44, -243, -8, -59, -30, 234, -179, -107, 11, 242, -200, 255, 188, -35, -94, -39, -77, 211, 307, -25, 69, 23, -77, -43, 29, -144, -50, -28, 137, -85, 76, 20, 142, 106, 12, 263, -22, -170, 105, -88, -78, -277, 176, 149, -229, -118, 163, 48, -137, 76, -60, -190, 82, 82, -173, 294, -31, 127, 40, -68, 121, -339, 173, 92, 134, 92, -64, -50, -95, -97, -33, 122, 233, -304, 13]
6560A3R2k49j42K84K28k88P1R8j66K90k98o7L65j53p9J0p1r0J47O2j21J52O3L4
6584A85k59J35q9q3L1J19j57J21J72j96J00j25j18J78k19k5J88j16K22k90K09
6605a7k11L9L25k15J37o5J40r4j22K11j70j39L52j52n6qp7J56J27k36J02N4j39
6628e8L06j22P3j11O1j81j51J45K0op4K13l7k46L0K24J5j81mJ87j20O9kj0k21
6653a81J51k06L25j61K2j39K29R2k07j27N9L13j89m9K14k44L9J65P6j96k65L63
6675H4j59J95j22l43L37j30K26k70Kk1J4K61l4j48J87j62J69%r9j10J1lL22k57
6699e0O1r6j14J49Q9J47j77k73J08K22Jr1k0O5j80L56k21J46N3k59r7J42J00Q1
6723A42R8j59k06L0m6J63r4M3rk5J10k20K61p1p6j4O6m3k19K54J28J4j8k67K78
$$ y = [13, 105, -144, -286, -2, 226, -62, 9, 107, -59, 231, -67, -134, 231, 78, -1, 9, -62, -152, -5, 57, -64, 88, 151, 185, -74, 61, -28, -111, -80, 39, -118, 3, 175, -21, 79, -46, -164, 14, -205, -230, -42, -158, 64, -226, -17, -228, -189, 136, -79, 58, -7, 133, 39, -83, 128, -42, -181, 171, 19, -37, -45, -122, 34, 161, -75, 27, 81, -58, 248, 126, 199, 88, 149, -32, -183, -38, -18, -24, -98, 115, 78, -168, -138, 86, 101, -80, -84, 103, -17, 52, 50, 40, -181, -30, -236, 89, -72, -50, -189, 40, 132, -75, -202, -143, 170, -19, -68, 146, -98, -59, 106, 182, -14, -279, 84, -75, 120, -2, -345, -8, -138, 88, -182, -180, -201, -187, 74, 40, -108, 79, -83, 86, 86, -13, -123, -112, -115, 207, -50, 11, -85, -199, -50, 39, 186, 9, -264, -156, 66, 67, -24, -44, 21, -159, 197, -24, 122, 175, -84, -181, -39, 61, 142, 240, 81, -125, -95, -141, 22, -72, -29, -38, -63, 47, -173, 88, 17, -59, -73, -7, -50, -269, -15, 113, 127, 109, -158, 120]
6748A20k07J42j41K42j98j91L03n4j06N6j47J50Q8O4m3j17L9l0RK29l40K3J7j27
6772b19K59k01J17RL10k72O6K8k06J42J87q4j99K56r8k6j18J32J2J0J9q3l0J03
6796A14j83L28k18N9k70RJ68j19M6qNK26j9J00k10j24J8K58l24k04N03m48K10
6819h3M9J33j06J79j51M1j06m1J35j68L3OR5O9M4j3j68J00R2k00J09O3k22J67
6843E7M3j3J11k36l1n2J67O2j02J87k73J37j38R7R3J42l74K25K9l08j7J02L72
6866B80k13o4K20k50Mn9K02p8K0J8o9J74O7l62J71Nj79R1l5L79k85m6JJ56j05
6891D3m6p5N2j0o4J63J01k47N2mJ12j54L1N9J51l1j47%j25L4L4j39O5K14j73K04
6917A00ok13P2J87q4N6o5r3K8P8k47q8L53k21n3K91j50j07L8K11q9r6J19J58k37
$$ y = [120, -87, 55, -86, 156, -42, -233, 70, 16, -90, -34, -181, -31, 57, 121, 78, -39, 0, -30, -21, 208, -132, -109, -92, -219, 40, -161, -44, -35, 275, 3, 69, 97, -109, 33, 220, 136, -63, 193, 95, 69, -49, 83, 95, 105, 124, 41, 11, 114, -69, 259, 41, 100, -170, -161, 7, -112, -66, -74, -69, 157, 138, 238, 28, -96, -78, 180, -144, -348, 155, -293, -83, -34, 99, -7, 172, 21, 62, -44, -85, 50, -118, -85, -79, 16, 85, 129, 116, -52, 48, 140, -60, 49, 112, -110, 57, 100, 87, 198, -38, -69, -121, 46, 108, 6, 193, -80, 57, -81, 16, 109, 251, -123, 102, 131, -177, -194, -92, 280, 67, 3, 223, -27, -23, -82, 120, 42, 62, 80, 11, 185, 252, -110, 61, 66, -113, -22, -57, 322, 37, -9, -8, 148, 43, -3, -78, -26, -36, -100, 63, 164, -83, -31, -35, 77, -77, -46, 13, 164, 133, -14, -14, -139, -105, -71, -210, -145, 69, -104, 100, 94, -119, -47, 140, 56, 112, 47, -46, -18, 60, -187, -275, 78, -143, -196, 95, -55, -162, -124, 87, -2, -98, 21, 179, -58]
6942e8j21L12O9k79J64K51l87K12n3m20L99j56k9J51n4K09j32j42R2k38L83J02
6964B75l72j91K82j36%L7L6k9N4N6N1j81J14j80J25J09j11M9n2P8n8j50k22J30
6988b86L36M5oq8K03k18k3N1J8j36L24k77j72K14J02K49n10J85M8J63l49N2J85
7011A10l08J77qJ38k09J05K2o8J68j32K04k64J0L35k25j76R9j25k3L40j40J67
7033A97l9j31j29M01l97J09K84j71m6k41J94j31J39o0J39r9j80J51N8k15J43J59
7055A35j85J30R9j90j21P2r7K47k49Q1J7l9K17k38J92l7k43L80j50l0O6j2j03
7078e8O0%n9J15k04p8K46j45Q6J22m3p5L1J0n8J35q6p6K01j87J47j20k05J70K07
7103A36q9q5J27k40K57n4q7k6r3J92n3J87j91J27R0J04J1m31Rj5J71j43K40k95
$$ y = [-58, -179, 133, 202, -77, 87, 338, -49, 163, 110, -310, 89, -67, -96, 55, 1, 210, 78, -64, 28, -210, 173, 275, -97, -288, -6, -142, -142, -105, -69, -98, -44, 12, 63, -118, -4, -184, -59, 50, -61, -12, -64, 14, -44, -194, -416, -286, 50, 95, 89, 1, 204, -14, -37, 14, 32, -104, 220, -57, -229, -15, 87, 336, -174, 11, 59, 222, -127, -75, 110, -198, -21, -29, 109, -100, 5, 27, -41, 127, -5, 199, -65, -55, 280, 55, -121, -22, -147, -170, 170, 30, 197, 158, 27, -102, 299, -98, 11, 295, 124, 78, -163, 31, -100, 39, -21, 118, 19, -161, -10, 48, -167, -24, 135, -50, 80, 179, -11, -132, -60, -157, 90, -159, -78, -61, -100, 117, -121, 71, 34, -209, 171, 21, -9, 57, 45, -58, 2, 2, -57, 58, -146, -224, 22, -123, -37, 85, 42, -33, -2, 8, -50, 85, -1, -77, 124, -63, 84, -36, -241, -71, 136, 47, -38, 89, -151, 106, 52, -35, -61, -154, 38, -15, 172, -19, 108, 198, 302, 313, -118, -109, -124, 47, -96, 144, -151]
7127a51J28J53j98Q7m2K29j64j07N2J34P7m66L27j19m6K23n6j69J86k66R3N9k3
7150e9j89O9K10j31J23j64K25j03j28Q6P0o8P7Q4m7J34k76k4Q2K06j78j7J04o8
7174A8k17J35J62j09Q8nj52r0J77k39L97j42r6J7q0J67j21j50O0L71j43L3n5k98
7198b72L75k71R8r7MN8J40O8q3Kj17P6J88k31l36P32m76N9K85k56N8R9j08j10
7222a15K09L3j98J10j49Q1O9l6Q7m5j08lJ2k32J30K38n3k10K99k17r4J17J05j29
7246i9qL5N4O0k77R1k1m2P0J13O2k79R6R9k4K42j24K08k80j19mP0J08P3l7j14
7272d7M21m58K98j02j03l5j00P9K04j98R0n5k1J08p2N8QN9j42j9Q0nj61r5L3Q0
7298i5M7J49r3l8j3qJ19LJ46J17n88M54k19J44o7N1l08K72k74J78j54K27p6j2
$$ y = [-151, -23, 130, -68, 19, -23, 206, 42, -65, -13, 121, 198, -268, 59, -60, -106, 117, 61, -108, 78, -188, -95, -36, -59, -248, -179, 31, -100, 23, -141, 84, -19, -147, -61, 9, -59, 18, 102, 55, 189, -87, -111, -29, 177, -1, -18, 86, 18, -199, -64, 98, -11, 77, 72, -80, -170, 7, -232, 165, 23, -73, -56, -136, 31, -90, -240, -180, 191, 48, 81, 26, -272, 103, -168, -70, -167, -163, -105, 35, 103, 20, 22, -95, -19, 169, -62, -398, 334, -142, -83, 202, -54, 4, 103, -5, -115, 94, 127, -71, 39, -110, -29, 40, 4, 91, 46, -62, -65, -53, -285, -155, 83, 30, -180, 119, -98, -192, -75, 30, -99, -107, -72, -18, 42, -235, -144, -165, -207, -137, -24, 38, -241, -145, -46, -70, 172, 48, 256, -24, -143, -147, -77, 31, 104, 67, -47, 374, -84, 214, 112, 9, -26, -126, -47, 157, -41, 49, -6, -27, 81, 9, 67, 75, 134, -8, -27, 53, 48, -113, -208, -175, -95, -48, 101, 8, -30, -43, -51, 68, 71, 217, 334, -254, 200, -19, 125, 58, 109, -199, 73, -201, -23, -177, 50, -26, -38]
7322c8p3k05K44K6J74k54K32m18J43K73jJ2q2l1k5j07J06L8j36M6K43j0j84J7
7346a0K12j40j30J55m48M47j23N7N7r1q9J15J1P0l2qQ2O7l92J44j5J1R1k17K44
7371F8m1K04l05QK04L6j97k01J80L6j9J51k6j36O4M1M4n4l1P4J4j49j07R1J26
7396G5L7qj10k36J19J37K28k96J85k47K49J69l09j38K84j02J57j61Qj37K60k89
7418a25J23j36o4N48l02q5N7J86k65K8P2o3LJ24Q7j16r8J17q8O9j12K30l45J40
7442a5J70k22N1l5N3M7j39R1P9j24K2j18Q0J33j42L46k86k92M78j08j20Q8N6J61
7466B54p7j86j15J36L5k29j5K03J48l08J75J5n8n0j3K15j08q3m2N0j06K3l3L5
7490a34K15Qk66K63l32K55J17k06k02J94K01J6k40R2j40K3K00r2J04J9j28K7N1
$$ y = [-38, -111, -316, -72, -46, 128, -126, 106, -312, -169, 104, 103, 115, 33, 2, -23, -130, -24, 14, -122, -76, 167, 157, -27, -10, 202, 62, -68, 87, -361, 86, -37, 20, 77, -14, -103, 12, 23, 93, 61, 53, 135, 202, -190, -46, -61, -50, 41, -176, 68, 27, 231, -74, -66, 138, 174, -23, -224, -44, -8, -27, 124, 98, -38, 26, 67, 111, 57, 26, 100, 114, -35, -142, -51, 75, 112, 104, -6, -242, -123, 14, 242, -54, 131, -116, 133, 302, -7, -145, 139, 37, 194, 33, 41, -96, 164, -125, -2, -138, -202, 346, 44, -41, 16, 202, -63, -35, 37, -26, -23, 101, 188, 72, -26, 91, 3, 72, -40, 190, -155, -15, 155, -67, -16, -51, 2, 49, -90, 1, 80, -44, -22, -140, -60, 73, -69, 277, -9, -301, 177, 69, -51, 37, 93, 254, 177, -9, -124, 12, 47, -182, -197, 6, 154, -154, 21, 36, -22, -72, -85, 130, 22, -61, -103, -53, -159, -136, -169, -134, 81, 89, -177, 86, -246, 9, 126, -80, -282, -88, 113, 129, -111, -19, -159, -136, 64, -28, 76, 95, -33, -6, 45]
7513D5k00O5J3J85j12J22j16j46q3J42J99k14J12m8r4j04M40j39m3o3N1L2J6p3
7537a3m7k19O5L68k05%J88k3P8k86K13j4l37K56k90L19k11R2k16Q6K68K48m44
7560a24J97k7j70J02n7J04kj78K40P1j79J48r1K55o88L19K41j35j52R1J09R4l03
7583a35J14q4j68O07m85J42m6j5J12P6q0p5q3K64k76J38m5j30K26k34J41J43j58
7606e1k8J67p0o1O8j9Mr0pJ1o2K28k03k4L24k26r3J28k7L04k8l41J84j57l5K17
7632A13l86K04J06j32o8l3J74k44P4K76m00J80j68K51J23l08K07J14k44K7J88
7653E4P1m5p1J02n2j3J02k61k8L08k61l2J60J25r7L1j3j58J43l99R5K24r7J19
7677Gl4j36K86k34K35k85J74J46n1l61J67O0p4k23K19L56m05M12r0k06O5J29j67
$$ y = [45, -155, -90, -77, 108, -4, 118, 2, -144, -227, -85, 114, -100, 12, -36, -130, -234, 206, 67, 24, -39, 12, 44, 60, -13, -60, -279, -214, 154, -51, -51, 137, 114, 192, -94, 119, 105, -232, 24, -266, 53, -158, -66, -282, -196, 72, 320, -124, 73, 46, -124, -22, -79, 25, 23, -155, 85, 156, -23, 125, 34, 289, -399, -80, 161, 26, -126, -35, 74, 168, -135, -21, -105, -273, 334, -151, -9, -55, -70, 42, 118, 38, -37, -120, 144, -132, 6, -39, -169, 57, -177, -36, 107, -51, -79, 88, 18, -43, 25, 6, 10, -80, -87, -76, -138, 90, -113, -137, 187, -39, -132, -4, -31, 273, 245, -96, 88, -69, -104, 113, -273, -69, 37, -95, -163, -196, -22, -266, -192, 84, -316, -136, -304, -53, 70, -238, -31, 83, -161, -134, 54, 125, 80, 9, 111, 59, 46, 148, -113, -141, 167, -94, -126, 34, 159, 62, 93, 80, -78, 65, -334, -239, -15, -112, 7, -27, -163, 123, -111, 124, -161, 13, 159, 108, -253, -86, -26, -100, -323, -104, 252, -153, 259, 169, -37, 28, 157, -10]
7700a0p5R3N0J92j23K0M0k34RR9k97L17q1j01L27j88J92j39k23N41k57r8K36l27
7724c7J24j05N3p7J5J25r2n9mp4K58j04m4L17k17j49R9K6j00j5k52K95N6J36m2
7749A33j63j4j17J7Q1k3oJ57l0k78M82l80R2l3m4J39q2j14K84j58N7J6LJ1J58
7774A88j29L15m11k9j16K74j61j34K16j39o4J61K31J7k41N7l9N2n5J14k52J22
7796b3L6J22k25K56j21L0r7m1k23J47K26j12j06N2J2K8K12j27n6j51J0M9k7K04
7820G5j11J46L3k63K02R3k75N0M0M1N4r9l0n8J30j40J53j00L3P3j63J45O7O6j29
7845C3n4R5j0j19R1j3p0J67J22k56J38K3j25K1j91R1J07k28L16j99M92o59MK21
7869cj57J47k21L56k53K56k16kl5K58j51J00j52N8N9P3j3q7k12K26p6K30j00k94
$$ y = [-10, -85, 8, 58, 250, 127, 147, 187, -47, -38, 61, -236, 81, 0, -101, 226, 38, 230, 91, -132, 409, 152, 54, 290, -37, 87, -18, 35, -42, -27, 98, 6, -53, -57, -131, 127, 23, -21, 296, 79, -70, 29, 55, -45, -60, -312, -17, 39, 175, 133, -30, -44, -161, -144, -63, -86, -92, 65, 35, -243, 239, -141, -49, -82, -126, 13, -69, -183, 101, -57, 0, 16, 19, 30, 188, 59, 374, -37, -66, -182, 92, -69, -203, 13, -126, -190, -29, 202, 219, -22, 35, -4, 48, -7, 107, -145, -23, 13, 135, -90, 166, 45, 75, -22, -63, -286, -139, 87, -25, -131, -79, -67, -39, 173, 46, -10, -161, -151, -102, -129, 75, -36, 110, 143, -120, 82, 175, -100, -50, -10, 31, 85, -14, -44, -102, 28, -112, 41, -59, -26, 47, -116, 29, 96, 162, 33, -21, 74, 64, -55, 36, 23, -47, 120, 242, -14, 124, 147, 22, 43, -148, -57, 50, -178, 138, -61, 431, -228, -224, -3, -160, -13, -234, 122, -131, 125, -91, -93, -128, 130, -21, 79, -73, -15, 44, 117, 104, 17, -195, 31, -45, 185, 85, -209]
7893b09L15k1%q4K51l42L1j9N7k51M39j6k67p7J23j3R8j29j52J39J33p2j37K3
7917a80J93J44l32M67l03K51l20L10l89R1K43k14N7j02j08J59k51J96M0P6j09
7938h1J15o8N5J59j83m5k03J28O4q7L45n8kk68P9l6J14j56J03J23r0m5P6P8k07
7963i0k2J3J76n9J22n4j41J20o9k08L12J05m1k4j0q3l6Q6J56m52J79K10k00K39
7987B29n67K49J65R9p1J69l11k57J89J99K6J00j74j02J88n2k97N8K22k81K4J49
8009d6K7n0n3j84L29O6J14l50m8L90j27oj31J47j9Q7L9l06o2J07L8J9j5O7L6J53
8035B22k69j90J29N9J47k5P5l8K47k74J73l93R8j96K44k86L18J58k55k3J01j4
8057Hj3Jk49L33j72j21J88K1N3j61M0M3J15O1q4j72L3J91k96L92l19J49p9j09
$$ y = [-209, 106, 85, 85, 1, 252, -90, -59, -78, -21, -272, 167, 151, -116, -193, -70, -83, 15, -114, -266, -127, 6, -66, -203, -180, 13, 157, -175, 292, -11, 240, -80, 230, -159, -68, 175, -39, 18, -84, -192, -33, -284, -88, -48, 28, -81, 34, -34, 21, 180, -3, -48, -251, -123, -59, -146, 199, 141, 139, -129, -50, -86, 28, -128, -25, 98, 8, -37, 39, 117, -90, -112, -99, 77, 18, 140, 86, -55, 65, -4, -212, 100, 205, 164, 140, 130, 47, 11, 97, 253, -199, -20, 190, -10, 229, -338, -89, 76, 175, 104, 273, -38, -295, -106, 93, 119, 219, 45, -57, 131, 79, -218, -160, 62, -219, -195, -46, -19, -69, -122, -306, 23, 89, 203, -147, -195, 195, 68, 62, -69, 78, 59, 146, 185, -121, -183, -76, -38, -19, -34, 33, 69, 222, -47, -237, -108, -49, 98, 73, 148, 110, 357, 83, 256, -137, -39, -235, 9, -277, 41, 199, -56, -79, 22, 8, -5, -4, -253, 80, -92, -213, -25, -4, 49, -112, -72, -29, 86, 147, 63, -109, -76, 115, -181, 211, -108, 41, -38, -147]
8081a47J73r6J60l42J34K14k42k64N74m11K63q6N2J01j25J05k04K3Pk0J04P2j04
8104e9R8q5P3P6l01K24l12K24j46K56j14J61k0J12k40k32L98n9j90j14J74m6K39
8127A17M8q2j90m5P1j84J78n8L12q8j60K4J30j22K66j24k37M42j08K3j45j0k59
8150b01K52j97J26J28j00j91J06m7K27n8j25k8j3l0J83j79l2J16j06J69J26J80
8172C06l24J37k92P7nP7J96j90K87j87l2K86j05l13J13j27P0J83j50
$$ y = [-147, 26, -70, 90, -252, -118, 96, -146, -410, 164, -247, 16, -70, -18, 83, -42, 63, -141, -118, -111, -131, -27, 45, -59, 39, -46, 27, 103, -198, 26, -286, -62, -208, 48, -66, 95, 75, 187, -53, -285, 113, 54, -136, -250, -76, -122, 117, 165, 83, -107, -152, -81, -265, -87, -145, 167, 79, -81, -57, 73, -49, 217, 93, -144, 298, 190, 213, 68, 58, -201, 51, -146, -20, 108, 8, -183, -77, -124, 103, 45, -80, -108, -121, -151, 32, -147, -179, -63, -169, 0, 126, 306, -18, 119, -173, -96, -101, -24, 172, -18, 269, 82, 50, 336, 231, -82, 31, -96, -26, 157, 7]
8191G
$$ Imaginary data points
##PAGE= N=2
##DATA TABLE= (X++(I..I)), XYDATA
0@%%%%%%%%%%%%%%%%%%Nj3J6j6J6j6J8k6L2l2L5m3M9n6O5p3Q2r1J00j11J26j42
40g5J58j74J92k13K36k60K86l15L48l84M23m67N14n66O28o96P73q64R69j093J246
61F66j437J678j995K440l108M201o298J1663m7238j05198J52198J06934j06970
74G536q8311Q5510N7603o7370l9523N2970K2468k4518Q06k84m0952M675P0950
87D1560J0707p9944k6041O3198K6048m5142j5693L3196Q871k5915j1423P155J2824
100e99K0028J478l6455j9528L5382L1749k0317k3905R804P885r005M169P618q136
114A68L414J5517k1026l2213L0476M9672l0592n9105K5628N1665l2915m1422M8382
127G649L8159o2548l9291O7572L6856o5829k4971O8179J3387p4490q335P7687
$$ y = [0, 0, 0, 0, 0, 0, 0, 0, 0, 0, 0, 0, 0, 0, 0, 0, 0, 0, 0, 5, -8, 8, -8, 8, -8, 10, -16, 16, -16, 19, -24, 25, -31, 34, -39, 43, -48, 52, -59, 67, -75, 83, -91, 101, -112, 124, -136, 150, -165, 183, -201, 222, -245, 269, -297, 331, -365, 408, -456, 513, -580, 666, -771, 907, -1088, 1352, -1756, 2445, -3853, 7810, -39428, -144626, 7572, 114506, 7536, -80775, 4735, 62338, -5032, -44555, 8415, 30883, 6365, 7171, 6887, -34065, -29390, 41560, 52267, -27677, -53718, 9480, 35528, -9614, -25307, 7889, 16760, -9155, -20578, -13423, -599, 19429, 20907, -15548, -35076, 306, 32055, 11738, -12167, -2363, 5522, -3483, 686, 8304, 168, 3582, 19099, -1927, -34140, -3664, 46008, 15416, -43689, -18061, 33604, 689, -40733, 7649, 45808, -16740, -56031, 11541, 48397, -17432, -42403, 25776, 39163, -35327, -43662, 34025]
139C4025J2806o6138j2816M8452M727l2090P574K2603j6308j7201J6505N159j7656
152a0358Q632K2826j7958l1594J7161L2228j1941k5936R601J5573j2909r619J5772
165A478R587r977o355K515M48L808P457l421q348K270L334o457K988J4474m626
180I175j9932L851J7989p621j5282J5147J3361k6249j6484L1112J7517l2543j3756
193b3715L5547Q414m0611n807M5650P807m3745r972L7404Q792k7463k530K1680
206A1451j396j6206L525Q284n190Q13R601r853j7897J2264K2997j0480k4193Q077
220h203K0199q260j8110Q078J5715n745j2863J270P205K375J615o28n028j786
234d166N397L596k437j910L39j72J202J049l987j79R137J546j5807o682J8298
$$ y = [34025, 46831, -19307, -32123, 16329, 21056, -11034, -3460, 19143, 2835, -14366, 2139, 7298, -10358, -1726, 21100, 3142, -28452, -11291, 20937, 8996, -16940, -7339, 8234, -4675, -14294, 1478, 11065, 1088, -5267, -2752, -2304, 1504, 8961, 5540, -2808, -538, 2796, -3661, -673, 13801, 9175, -10757, -6906, 11083, 3462, -11820, 3327, 16688, -9561, -26045, 5067, 22584, -9959, -23715, 11832, 20246, -20365, -26172, 19478, 27285, -16460, -26432, 10972, 19764, -7699, -10229, 11451, 10055, -6151, -2626, 5658, 468, 1281, 10882, 1029, -16868, -4604, 18393, 7913, -16280, -8203, 11996, 3736, -14374, -6296, 9419, 3674, -9189, -7919, -714, 1661, 3276, 2648, -2380, -4166, 1231, 4827, 2390, 480, 819, 647, 1849, 2898, -1089, -1268, 7869, 9415, -6392, -13074, 5224]
249E224R772j8512j2721J6824J0812j7234q313J8008P731j7713n946J4924K565
262E421j1435L142J0888p416j0539J0138J1620r794q813J0301O320j2546m152
275f865J2712L277j1867l106Q942k94p332L916O542o903p413O514O604o702n181
290g156O287N123p281m824P503P082l811p484J411O937J061n726j437N787J865
305E337o531l027P243M701o614n487N467K614o112j418O592j12q687O83Q709j812
321A546p661L575Q269o081q337P038Q853o257p472O445N935o200l556Q022L103
336G222q358k179P068Q52p140L99P197k414q201K554Q035k613p427K137N884l079
352f3o146L565O012l059n769K264N839n57m293J336M013j581l986J928M318j171
$$ y = [5224, 14996, -3516, -16237, 587, 11399, -5835, -14148, 3860, 11591, -6122, -12068, 2856, 5421, -6014, -2872, 8016, 600, -9939, 199, 11819, 2025, -6788, 3513, 9833, -2713, -6865, 5847, 9124, -2743, -5849, 3093, 2799, -4533, -617, 5925, -978, -8391, -1877, 4727, -1975, -7156, -869, 4254, -3027, -7851, -348, 6734, 2923, -4561, -3150, 3787, 4848, -878, -2315, 3472, 5337, -1194, -4221, 3022, 7723, 1109, -4378, 1089, 3703, -2409, -3827, 2765, 2653, -6034, -5351, 3358, 1546, -6115, -2540, 5729, -352, -8689, -1651, 7202, 945, -6527, -82, 5853, -347, -3903, 4119, 7222, -1136, -3315, 3753, 4605, -2535, -2136, 5061, 2647, -5554, -3000, 5035, 2422, -5005, -2868, 3016, -63, -6209, -2644, 3368, 309, -5460, -3196, 2643, 2086, -2207, -871, 3142, 1561, -2425, -497, 3821, 2650]
368B650l935J405L373k138l246L151L840l975n518L204N340l936n793L579N450
383C451l877n490L582N638k929m031K363K435k562R8L774r39m701K369O064k002
399C243o939K801Q141l121r461J303J0258m83r763r24P884Q72o340n90M141J80
415A202l989M57K357k141j245L962K000n283k139O072M455n963m720N778M881
430E684m847m574M518M266l912l503L623K347l588j477M144j05o297j13O934K3
446C123p662j428P428K384o663k138N459K165m078j350L087q9j620L364J542n330
462a806k444Q306M503r291o953R548Q559r009j1060P165J2227n614j1592J982
476e479J0435o38p571j419M179N74r88R54j793k502L438N830l645q074L757J0806
$$ y = [2650, -1285, 120, 3493, 1355, -1891, 1260, 5100, 1125, -4393, -1189, 4151, 215, -5578, -1999, 3451, -426, -5916, -2334, 3304, 375, -3656, -1293, 1142, -1420, -1322, 2452, 1513, -3188, -819, 5245, 3243, -3696, -895, 7246, 4125, -5336, -4033, 6225, 5742, -4021, -4945, 2939, 3811, -2529, -3119, 1022, 1202, -2787, -2330, 27, -2114, -3359, 603, 2603, -2680, -4819, 1253, 5708, -255, -4975, 803, 5684, 837, -3737, 781, 5047, 1135, -2368, 1255, 3602, 14, -1463, 2681, 2576, -3721, -3834, 3100, 3123, -4539, -5967, 1461, 3845, -2818, -4956, 503, 2668, -1410, -2760, 327, 238, -1382, 1982, 3524, -1806, -4250, 4056, 8559, -732, -7685, 1863, 10422, 1413, -9647, -2482, 9745, 4131, -7461, -5479, 4956, 4318, -3253, -4672, -493, 81, -907, 47, -1746, -4248, -810, 5020, 1375, -6699, -2942, 7864]
492G864j879j2179k78J2224K627j0700l880R229M222p199m136M982K973m322j758
507b210K973q43l432K943L705l892n353M817O199m946o362M920O723m880o283
522e921N694N777n579m620P129M382q567l727R963M355j1588n421J1225O411j0966
537a453p263R235P100p593o324M706M545k665l204J471L14j607L071K791n210
552b086m127P304O496p148q348O457J0233m721j0841K553J0862M99j0083k130
566e080P822K478n397k834K930Q83j436M12L04k771k19N079Q55o881k197Q237
582B185L668q880m426Q500N670p555n234P742M925o882m034P072L037p235k471
597c918P398J267p744j236P894J109p768j317O192J414n424j682M033L47k698
$$ y = [7864, 5985, -6194, -6472, 5752, 8379, -2321, -6201, 3028, 7250, 51, -4085, 897, 3870, -452, -2210, 763, -80, -3512, -569, 3136, -756, -6109, -1292, 4907, -39, -6401, -1481, 5242, 362, -5921, -227, 5550, -29, -4649, 2480, 6862, -1705, -5432, 4531, 8886, -2702, -8123, 3102, 9513, -1453, -8716, 519, 7619, 26, -6298, -1592, 2953, 288, -2916, -1445, -1131, -2738, 333, 3124, -2086, -6213, 1091, 7587, 439, -7909, -1452, 8781, 4060, -6781, -4228, 6634, 7133, -2950, -5080, 2742, 5220, -177, -3011, -81, 802, -634, -222, 82, -2689, -2908, 2171, 3026, -3855, -6052, 2185, 5853, -3027, -7453, 1047, 6717, -838, -6072, 1670, 6595, -287, -4321, 2751, 5788, -1447, -3918, 3480, 4747, -2997, -4233, 3661, 4770, -2998, -4315, 1877, 3291, -2133, -3815, 218, 565, -2133]
612b133P85J790k031n40M102Q56m746j650N897K772n859l993N156N419l605n607
628c387J821N816k57n288j437L706J448k257j985L49Q05N69Q87j237k838J362
644a923M923j210o033o0P392J153p464k300P868L850o597l945N970L726m828k988
660b466L422K055l030q32K098k85k223J201J949k245k450J912K519j972k790J950
676a187K490j541k200J627J795o25j440J144O80o36k22Q05L16r52m15J674M23
693A736j492q52J606O00j687j469J782Q69j914j378J973J263k261n21J533R85
709G73k306o21K615O74k609l49K989N55k534l98L512k31l046J81K948l03k901
726a051L40K707m96k800O36J902o96j764L82J171o28j167N35N50p57l90J324M42
$$ y = [-2133, -1348, 442, -1589, -2129, 1973, 2829, -1917, -3567, 2330, 5102, -757, -4750, 406, 5825, 2220, -3387, -1566, 4250, 3993, -1295, -2732, 974, 2422, 165, -1820, -1471, -666, -97, 790, -447, -3285, -1923, 3000, 1790, -4243, -4303, 3089, 4242, -3222, -5522, 2346, 6196, -401, -4346, 1624, 5350, 522, -2466, 956, 3011, -19, -851, 1247, 962, -1261, -60, 1889, -356, -2806, -894, 1625, -347, -3137, -1187, 1303, -238, -2438, -811, 984, 359, -1081, 63, 743, 107, -115, 690, 1006, 54, -361, 1313, 1736, 244, -608, 998, 1598, -89, -1558, 224, 1093, -821, -2199, -226, 1037, -1224, -1745, -212, 773, -1533, -2154, 461, 1135, -1474, -1823, 1166, 1721, -813, -1211, 2301, 2070, -976, -795, 2153, 1850, -1051, -711, 1996, 1500, -1300, -664, 1238, 542, -1222, -840, 331, -297, -1464, -929, -379, -1136, -1526, -202, 240]
744B40q40k95J662L58j745j34J720L65j637l24J525Q65j357j010J854N41j742
761D6p06J425k9j817j18J604N4k059K2K267k73k284J15K149K44k103Q6K001J68
780G92j844K77K197q1j397K05J535j041j303J084J310j348j215J254J290j579
796A36j471J281J398j864j381J310Q61j167q03J079P63o44o00J227K77m41j3P15
814F63k14j054O41J201o74r81O39J377k55j711K02J350j39j761m73J762K29j824
832a022m47J742J44j360l50R66M74j151L9J024j09q11P89J288j106o36J086J479
850B039j559j279J464J119j333j522J536J048j352r90J105M78q47r76Q21K75j334
867a307L04J265n15j100O62J426p04j064K83J474j72o83K01L57k40m8N11M21o95
$$ y = [240, -600, -895, 767, 1125, -620, -754, 966, 1331, -306, -630, 895, 1760, 403, -607, 1247, 1788, 46, -660, 765, 736, -1081, -1199, 405, 459, -1600, -1578, 689, 416, -1868, -1753, 396, 640, -1463, -1377, 624, 792, -1052, -775, 1422, 1341, -56, 149, 1684, 643, -660, 424, 1734, 386, -829, 425, 1715, 136, -1335, -54, 1344, -520, -1901, -591, 270, -897, -1700, -621, 142, -502, -1102, 125, 402, -39, -52, 663, 449, -605, 36, 1237, 563, -418, 221, 1598, 1343, -368, -166, 1184, 1045, -716, -1189, 573, 802, -1022, -1469, 273, 417, -943, -1293, -327, 147, -1004, -965, 59, -50, -861, -72, 1216, 110, -526, 560, 2039, 480, -799, 665, 1784, 451, -1071, 465, 1513, 161, -829, 276, 754, -93, -1069, -248, 27, -1307, -1003, 262, -253, -1353, -691, 735, 31, -1033, -750, 724, 552, -131, 70, 427, 187, 139, 650, 1071, 376]
886C76J24K58K81q62o26Q21J82o52j001N85J045k61j893M93J467J31j559l74J281
905a84O00j135L20Q27l89l07R89K83j208o8J603O5k145k79K393K94k365p6J835
924A053p6j783P42P73j096j245J296J233j742j295K164J277k263r39K048J181
940A328j460q15J014N63n41J46L46k94k42R16L66j383n39J112J058j364j586Q63
958e12J523k21j809n45J673P09r07j806J133J515q11j336K08J519m26r1O00l1
976C85r29J024J442j738j626J674K342j843l007K167L100k328l001K000K290j781
992A71k439K008J124k052l44K015k99k207R42K646q40k648Q91L083j233k388J414
1009a56J702r59j491J465R82j272m58J203J41j613j18J348J34j640m86J127Q23
$$ y = [376, 500, 758, 1039, 177, -449, 372, 554, -98, -1099, -514, 531, 270, -1623, -1130, 337, 468, -1091, -1465, -184, 416, -719, -399, 428, 39, -268, 721, 1004, -204, -272, 1331, 1396, -749, -1028, 1365, 1659, -706, -782, 1053, 977, -806, -64, 709, -387, -1632, -336, 897, -845, -2140, 24, 1301, -962, -1901, 147, 1328, -132, -947, 67, 630, 89, 235, 581, 287, 45, 961, 1327, -56, -595, 517, 1575, 211, -1375, -512, 1011, 790, -1019, -1564, 109, 818, -89, -1895, -762, 753, -58, -1394, -1186, 333, -93, -184, 416, 385, -544, 480, 1922, 184, -1442, 232, 2574, 731, -2276, -109, 2991, 663, -2338, -338, 1952, 171, -2268, -260, 864, -1188, -1532, 483, 184, -2023, -1081, 1565, 725, -1923, -1032, 2051, 818, -1570, -156, 1546, 587, -904, 561, 1543, 271, -187, 1016, 1157, -456, -574, 774, 908, -732, -1218, -91, 732]
1026G32o82j229J63J095L94j407n27J197Q27j027n51J038L64k22O6R20j042q77
1044g68J769J233k796j012K552J726l041j795L220J590l377j799K970J313l079
1059a294m36K075m8j685N33K016j472j437J785J774k417j228K383J312k232j178
1075a549K488Q29j839l90J469P6j228J98O80o46o20K92M49o62N0L86j96k11J40
1094b84m7l27K44M87o51l13P57P30j098l3J444k31j260O53J336j246j198J580
1112E43J304k245p52K279O29k320r51K390K92k371l12K099J3k095Q21J425j048
1129b99q59J318P61j822n30K414P6k087J78K167m58j491P06J105m02q90L79M41
1147G07p83r4N93k10q38O88J75p43j99P14M7j106L04Q73n62m75P19N45q85k3J193
$$ y = [732, 50, -1179, -1016, 79, 473, -934, -1461, -264, 563, -464, -1015, 23, 387, 165, 231, 1151, 109, -768, 1001, 2234, -562, -1574, 978, 2704, -337, -2132, 1088, 2678, -699, -2498, 472, 1785, -1294, -1730, 345, 297, -1388, -855, 1161, -311, -1748, 37, 1811, -606, -1834, 549, 1861, -371, -1549, 939, 1768, -71, -461, 1008, 1084, -144, 54, 734, 88, -532, -240, 209, -453, -403, -17, -213, -424, -284, -331, -658, -414, 73, -578, -891, -134, 596, -502, -535, 909, 678, -582, 71, 1407, 161, -1037, 543, 1847, -398, -1150, 1129, 1758, -562, -1513, 877, 1169, -1202, -1514, 585, 598, -1497, -676, 749, -299, -1158, 160, 921, -901, -1431, 983, 1059, -1028, -850, 1317, 859, -632, 74, 1179, 777, -113, 266, 707, -76, -170, 423, 213, -625, 63, 238, -505, -704, 10, 57, -1049, -745, 128, -434, -909, -190, 355, -530, -553, 640]
1168F40m8j012K68J143m85j080J067R83j443q09J258Q91j607m87J314L03j852
1185i56J36J392m71j552R47J002o30j206J371P16j579k35J385J81j134K29J055
1202F51j80q42M79R01r49l33J194k07j047P1R68m42q06O46M13q26k19O60o1o25
1222e54K61N19o26o44Q12L74q73K62J002j30q40K78J098n50p72P88P17j302k57
1241d37R14N15j495R1J498n51j237NJ379o76j112Q73N63r93l97J067M64j052k80
1260h61J153J2p95m4J083l64m52L22P64m09n27O73R6m33l32P66k44o79L12J63
1280B04k98m73N93j14k91J71j0k95l12Q84j56l83r4R67l41m55L12R16m83o13P18
1301D47K67o15m17P34J89o00k39J017j71j002K47P79p47q13M81N91n06l29O70
$$ y = [640, 592, -420, -152, 991, 506, -574, 493, 1476, 33, -776, 482, 1373, -234, -721, 593, 896, -956, -820, 572, 101, -1451, -504, 498, -132, -1338, 33, 749, -830, -1065, 320, 501, -633, -404, 651, 471, -371, 108, 1009, 60, -273, 921, 714, -333, -262, 706, 264, -542, 104, 517, -309, -528, 132, 71, -554, -293, 226, -400, -1044, -232, 142, -731, -469, 533, 403, -437, -159, 939, 389, -383, 405, 1122, -180, -437, 477, 992, -503, -412, 1086, 535, -702, -697, 682, 6, -1106, -233, 330, -663, -1060, 7, 471, -581, -861, 292, 304, -491, -535, 548, 184, -268, 54, 818, 409, -118, 555, 651, 218, -114, 652, 408, -271, 41, 204, -94, -567, 26, -88, -379, -208, -218, -513, -825, 59, -97, -480, -574, 393, 52, -403, -91, 825, 342, -271, 447, 714, 99, -318, 416, 605, 5, -234, 783, 612, -390, -143, 636, -111, -924, -443, 148, -358, -687, -17]
1320a7K46r20K80O89k58p60L68N95j96l41L22N97p20K86K35K41n87N5J88J52k95
1341A60p1J79j83k14K19j23k75PK39k74j01M33k4m32o4O44j78l74L77O14o25m83
1363e49P66M82n72j73K44J4r9l0K31J55n12nP61o48m85N61J45l78n60P89pm88
1385c58o5N47k17n70K04L94o4j65M00j05R5J13K83k28k05J33K74k21p5j11K77
1406C36p4l58K15k51J95j86J48k85J18J4k76j8j74O03j88m9J73J14j61K08p0r1
1428e7M18j69P6k50K5M01k11l0J35j50m0j67N2k46q0j93M48k10q2J42L0k1l11
1451d90J63N0L01k29k73K36J72P0K41j5K7j1lK36k95m5P4Jl04j06L10K13m85l20
1475d82K19O13n10m38M55m6j49l85O08Kp8OO2L47m17J62Q0L76m13j86M96m3l06
$$ y = [-17, 229, -691, -411, 278, 20, -740, -372, 223, 27, -314, 8, 605, -115, 171, 406, 647, 60, 115, 303, 455, 160, 89, 268, 85, -129, 90, -33, -308, -301, -62, -336, -437, -4, -28, -460, -524, 120, -58, -432, -55, 559, -66, -549, 217, 699, 127, -46, 198, 212, 113, 83, 314, 469, -43, -48, 713, 65, -420, 141, 286, -92, -652, 137, 130, -358, -423, 124, -93, -663, -459, -65, -129, -294, 106, 1, 96, 209, 492, 264, 59, 192, 466, 245, 170, 59, 336, 262, -96, 119, -132, 63, -123, 25, -260, -142, -128, -404, -422, -596, 7, -181, -230, -57, 57, -104, 104, 34, -57, 361, 192, 268, 18, 43, 444, 233, 203, 338, 188, 148, -19, 33, -213, -293, -486, -38, -248, -330, -188, -158, -179, -490, -327, -277, 24, -205, -478, -242, -70, 0, 241, 226, 253, 242, 239, 475, 180, 135, 209, 210, -94, -200, 110, 323, -162, -482, -263, 350, -160, -598, -143, -189, -338, -723, -115, -113, -191, -185, -123, 224, -193, -31, 49, 425, 12, -174, 322, 279, -27]
1498b7J80K41r1l73L32O5J7l95J21K28m44l83K56J21q7p4N4M27m06j39L56j4j52
1521a87k3J25K56o2K12j36L12J8n94M25K30m40j20J47K52k93j49J5L68m26m14
1542d84M97j45o8l59L41K57m39K63MJ02j65o8L25J36l52K30K75j87j17J71L37
1563E54j18n73K19L37m09j15J00K44l34l00K21l4j06j06L20R4j30j68L15k24K87
1584G4j79L5M0J74L28m24j2L65j97o7L77l40jrR7l97J35M9K05j6l87L19j59j27
1608a17j33L10j03m91J23M82l15k9J39M41m43J30j53L67J5k94K14K19j28k59J58
1629A33K74k19k86L29J17l71k16L10k23j78L8NR4j78J78M9K2K6j17j64O04k13
1651A4j07Q9O9k8L0L24o8k20p4J22k7J67k50j16K18Pk68J57J62m25j83L21K00
$$ y = [-27, 153, 394, 303, -70, 262, 327, 344, -51, 70, 298, -146, -529, -273, -152, -239, -313, -259, 168, -238, -377, -21, -35, -187, -210, -85, 171, 109, 321, 185, 497, 515, -79, 346, 576, 136, 16, 163, 415, 122, -27, -12, 356, -70, -484, 13, -132, -200, -559, -218, 39, -400, -137, -133, -31, -196, -264, 61, 197, -155, 75, 350, 163, 46, 217, 554, 436, -137, 82, 419, 10, -105, -5, 239, -95, -395, -174, -208, -314, -420, -100, -6, -136, -304, 11, -213, 74, -105, -70, -30, 144, 472, 48, 36, 401, 204, 137, 514, 174, 173, 164, 261, -136, -1, 48, 253, 237, -150, 169, 10, -117, -250, 60, -43, -534, -411, 71, -244, -273, -134, 307, -136, -6, -159, 208, 223, -71, 143, 362, 234, -25, 133, 407, 188, -98, 231, 348, -23, -239, 71, -152, -330, -292, -287, -193, -371, -193, -144, -122, -96, -213, -377, 227, 14, -93, -4, 65, 37, 67, 391, 323, 103, 29, 151, 124, 291, 41, -75, 143, 150, -118, 39, 201, -224, -407, -86, 114]
1674A14n52J00J80J71l36J90K55j4j13p9J06J4j71K61K10r4l85L76R1P1k74J43
1696B64M6m69J75l8j0o8m16N23qj35J67O3l75J75l21L83j57J57l10J69J4L01k05
1719g5K41O8j08NR1R1K1j13k17L27k52p6O2Q2k00l72M44l4o8l31J33M85l82j60
1743c38K04M3j73P9K79J23l36J03K95L2k70j03L03j70j71K87q4Nj58J31O4j19
1765B6m9k77J60k80J63K85j54j01L1k20K64j52Q7P5o1J88j21J72M67l54q3J20
1787A86K77k16j24j28L77m12j16K52Pk02Q3o4j22J47m29L55P2k45j49L16J8Oj71
1810b82K86j95J71qK86j93j5p2L50klj70L12k58q8r0P4J43k76L5j50N7L3K1j20
1835a54k08Q5k1K24j44J37J22l01K01n3J07J36K10l88K16K63k10j20J09m1q1j63
$$ y = [114, -438, -338, -158, 13, -323, -133, 122, 108, -5, -84, 22, 36, -135, 126, 336, 242, -143, 233, 324, 395, 121, 264, 310, -159, 16, -22, -32, -100, -516, 7, -1, -136, 31, 94, -281, -106, -427, -44, -201, -44, -354, -185, -171, 130, -75, 166, 234, 126, 131, 222, 313, 334, 221, 4, 331, 79, 3, 65, 147, -53, -425, 19, -15, -83, -414, -281, 204, -178, -338, -134, -91, -264, -185, 94, 217, -119, -16, 279, 311, 41, -62, 241, 71, -100, 187, 103, 108, -50, 81, 145, 26, -23, -300, -140, -420, -257, 28, -126, -227, -196, -416, -152, -304, -217, -142, -203, -15, -136, 36, 503, 149, 66, 186, 463, 247, 123, -5, 372, -40, -156, 96, 103, -99, -16, -80, -202, -55, -484, -129, -57, -302, -451, -135, -117, -111, -282, 4, -191, -20, -28, 258, 65, 50, -22, 328, 326, 323, 153, 465, 207, 119, 29, 103, 246, -30, 5, -145, -88, -55, -34, -154, -362, -277, -298, -74, -218, -81, 41, -260, -59, -112, -5, 131, 341, -47, 169, 432, 222, 102, 211, 170, 89, -74]
1857g4J09k9J16j23K6n1J18m36K6K35r8p9J68J0m8n5j74P08m72K6P0J60k31o1
1881a59L27N0j06j12L13m0J3j41n5l9M4q1k68J29J09r7J14M9j17j32N2K7J29k8
1905a9J9M3q6Q5k07J81p9J07M9P3Q8Jj90q0q9J9K06p6K7k04M17k95J23k91K61
1930H3n8l41M15o9J50o21L92J39p0j89J94N8j46K5j45M23k19K99k69M9J15L7j24
1953A28K59k94n6N4j31q6j7r2K09J63k24k13K65j01n1J13l6N7j20K5K14J9l28
1976b43K07J53m5L3P6M1n6j15K48j44j48j39K68J1k91m9J56N7l32J92k05J84J07
1999c4k33K41J16k41Q4J62j00J07nj35J08j72J31R7o5l7M24k09l2l03M0J68m62
2022c50J93R8O8l6k74J72O4p5q2J28k2o5N3J99q6j22K47k55K58j42K90m4k56K68
$$ y = [-74, 35, 6, 122, -1, 25, -26, 92, -344, -318, -83, -181, -260, -92, -82, -130, -185, -359, 349, -123, -97, -27, 133, -98, -159, 168, 218, 112, 0, 313, 273, 286, 145, 90, 51, 95, 14, -254, -125, -16, -113, 1, 50, -67, -199, -147, -120, 9, -19, 0, 43, -43, 42, -165, 16, -63, 44, 93, 166, 254, 255, 65, -15, -104, -85, 121, 45, 72, -132, 285, -10, 113, -178, 83, 25, -316, 99, 30, 180, -441, -49, 90, 20, -169, 25, 83, -63, -38, -183, 240, 21, 320, 51, 100, 215, 252, 128, 387, 93, 37, 91, -40, -126, -143, -235, -26, 137, -87, -300, -35, -136, -187, -74, -110, -53, -173, -148, 66, 85, -243, -36, 117, 72, 105, 181, 222, 166, 51, 299, 155, 7, -132, 136, 147, -144, -193, -37, 20, -312, -120, -325, -141, -34, -267, -26, 90, -151, -67, 95, -5, 102, 97, -38, 70, -102, 29, 126, 61, 24, 448, 239, 207, -96, -56, 112, -350, -157, -59, 9, -27, -301, -129, -65, -140, -222, -94, -116, -181, -128, 71, -15, -137, 110, -145, 113, -29, 261, 217, -39, 229]
2046B29l31M30j66j70RK1j3K46l03Q9J05k09j93J69J97l47j50L26L7q8k13L14
2068a1Q3O7j92N1r1J52j84K83j71j00N53j96j10k3l4L03o14K49k8L33m38j13N2
2091a79L1o5L3M1l2M6Q1j19m5L23j2J13k99K74j84KJ8K55l47N5p2K30k4j73J86
2116A37K29n86j85N56l88k05J02L02l51J46k2K37l53J50L12k79R0j05K69k35k6
2137b05J65K85k79J1J78j58K33k51K66k50j39k7L54l32m1K20o4N1q8O7j88K7J69
2160DQ9j13k42K69J54j44l03M64j08q8J87Q8k21m8J09L79n78P2M13k57k23P9L19
2183C01l19l35M82r0q1k52K58q0p7K56o3p6M9n0k9J3k0J98l07K71k79L21n5q1
2207d5RJ89j62J02j0N2k22n7K50k44l47L55L37k59l01K73k41j5L2R7J36R4q1K64
$$ y = [229, -102, 328, 162, -8, 1, 22, 9, 255, -48, 41, 146, -63, -256, -87, 110, -237, -387, -61, -24, -112, -325, -11, 72, 139, -53, -2, -93, 59, -125, 158, -13, -113, 440, 244, 134, 111, 77, 380, -234, 15, -13, 320, -118, -231, -179, -148, -213, -180, -139, -171, -125, -44, -163, -208, 115, 103, 216, -83, 191, 7, 9, 27, 282, -65, -10, -82, 148, 124, -49, 137, 366, -220, -405, 151, -237, -442, -340, -38, -389, -243, -265, -28, -381, -231, 81, -198, -108, -213, 56, -179, -205, -40, 245, -34, -23, 155, -3, 230, -21, 245, -5, -144, -171, 183, -149, -190, 30, -34, 17, -71, -4, -192, -165, 4, 93, -20, -262, 7, 161, 17, -286, 178, 70, -18, 169, 257, 36, -12, 97, 476, -102, -30, 383, 126, -97, -18, 301, -18, -353, 129, 39, -42, -294, -36, -116, -193, 63, 0, -76, -27, -77, -106, -93, -113, 85, -222, 49, -230, 91, 36, -45, -36, 153, -9, 93, 83, 135, -87, -144, 106, -138, -485, -130, 207, -52, -353, -80, -321, -336, -304, -207, -71, 23, -58, 206]
2231B06j9k26J7L79l19n0J85k3n6j7J03K4l23J13m5Q9j73l9K18j28k17M20p0k02
2255a53P6K74k59j83q6M35k88k23K06J42Q5j58L09k69K48K72k41N9j41L61m21
2276D5N1m1J10J50l15o0J73j94L3k04K50q8L8M7M0k96k0L36k66o9L92J13k40O8
2300E3j15J48j12J28J37n7j13k2L62l71j19K55J20k80j39K00j42k10J47K2k1o4
2322a93J80j17L9l0m2L13K4j69J66q8j32J76J22l36MK79j93m3j58P01l33j8j33
2345A9K06l02p6J80m8P4k00J98k98j3K33K01k77j58J58j9L43n42N53j45p6k0J34
2368A25K2l17K11q3M57k31j1j7k16r0J24nR8m43M66k78J09l0j4RK7j63M10k90
2392a30kJ13j19M34K1qk52J88J67j98r2j44J31j15j67J39K37l53j9K50j7o0k5
$$ y = [206, 187, -39, -22, 357, 38, -12, 173, 150, 94, 77, 180, 204, -119, -6, -51, 38, -135, -174, 44, -84, -301, 119, 49, -153, -77, 197, -62, -245, -331, 104, -184, -407, -201, -59, 26, -132, 177, -92, 156, 428, 187, 246, 105, 466, 45, 96, 55, 165, 315, 0, -60, 113, -81, -48, -252, -2, -90, -52, -5, 35, -261, -281, 55, -211, -280, 112, 225, -15, 53, -62, 86, -26, 102, 239, 182, 69, 47, 409, 38, -81, 174, 294, 14, -125, 75, -67, -277, -130, -108, -129, -193, -13, -130, -91, -121, -163, 150, 174, 5, 171, 83, -49, 127, 249, -87, -83, 196, 3, -40, -198, 503, 170, 152, 19, 225, -77, -153, 27, -21, 53, -147, 51, -247, -260, -27, 174, -103, -261, -103, -122, 221, -321, 232, 87, 11, -9, 125, 147, -170, 41, -42, 415, 184, 173, 156, -60, -150, -26, -31, 67, -376, 90, -188, -79, -109, -123, -114, -87, -250, 160, -130, -132, -19, -138, 296, 317, 309, 57, 245, 412, 214, 122, -22, 109, -6, -173, -34, 203, -150, -169, 81, 64, 4, -21]
2415b1k30J06m1L2J44j23J17J83j26K00j88r1K47k81J7K5J44m8J30k61J31K96
2437C62k26k40K33O8j27j41k50P6K10J79j7l71J69j62O5J99K2j83L3r8K7K16P5
2460A19p1q0mL64k40Q0n0P9m1o9J86j84j05k02K93j75l0K31k47m4K12j24j21J70
2484e3k74K11L88k76j33L21l47N0j8J46M6k66K43p4M6k28K67Q9J74k91m6o8P0
2507b3l4m4J43K2k74j00L94j10j16M0N5m2j65J51K60m4j70Q8n7Q2q8p9K02j1j44
2532f4J81j05%J8l2k70L37m3K02q9k66m4K75j44JO8j38K8K0J07O8m27K61J41N9
2557A44j10J01J04j53J6P6j47M4ln9J65K4l78L6K30j12j81J61P4R9j63L0m03N70
2581A65j50m2j40Q4k1J98k6j25O2%J41K68l00j75J15k09J49j0K45l65M02k45k4
$$ y = [-21, -251, -145, -186, -154, -10, -133, -16, 167, 41, 241, 53, -38, 209, -72, -55, -30, 114, 66, 196, -65, 66, 362, 136, -104, 129, 197, 70, -71, -321, -245, -35, 144, 127, -244, -75, -237, -172, 27, 49, -134, -101, -199, -172, 44, 119, 48, -32, -36, 328, 88, 168, 118, 197, 156, 87, 273, 89, -16, -218, 75, -100, -130, 101, -146, -190, 22, -102, -223, -53, -327, -116, 272, -4, -137, 184, -163, -113, -131, 15, 61, -205, 38, -36, 10, -218, 49, 138, 312, 21, -25, -93, -23, -57, -101, 42, 64, -210, -310, 84, -26, -142, -102, -47, -89, -254, -103, 157, 113, -57, 31, -26, 56, -32, -111, 91, 80, -64, 117, 12, 12, 30, -2, -272, 65, 22, 224, 135, -131, -175, 100, -44, -43, 25, -113, -85, -65, 42, 110, -317, -56, 85, 144, 34, 135, 239, 86, 102, 178, 31, 75, 72, 13, 178, 202, -176, -140, 90, -22, -203, -42, 32, 131, -32, -2, -405, 165, 15, -27, -167, -83, -104, 94, 68, -57, 5, 5, 146, 414, 114, -61, 54, -155, -6, -16, 229, -136, 266, 21, -3]
2604cj36J6J37j85J72l4P6j35r7O2pj73K05J81n6L00l63K28k74K01J62l77K50
2627A50j60J58m6KmO9K9k32J23p3l07L21Kk8o2r9K60j57j50L7K42j08r3K16j67
2652g7K07Kj65K03j27N5J82j76q5NR6j32R5N5n5j46J56j95l0J87j29J98j48j80
2676b04L82j12P5k14R6J57k02L5K1J37j75k3p4J66j36q6J45J95k49J29j21K49
2698A91j09lj24K24j51J0j79O6J62k22j92J55J96p3N7J01K7l33K59N9k68j3j74
2721c34M96k34k03P07j13l54M0J47k27m4p1J00K36M1k57K2K49l84m2J95P8k32
2743a84L26j68o4k4J44j41L0r1L6L05j24L2L1k07M3J97p4J30j82q3J1r6R4j23
2767a82P3n2K87l62J53P0k3J82l59J50N5j78RL68Q9l60K74n4l07R8Q6k9m5J22
$$ y = [-3, -139, -123, 14, -171, 1, -33, 43, -92, -189, -127, -134, -307, -102, 79, 23, 323, -40, 188, -86, 115, 277, -100, 150, -10, 148, 102, 104, 100, 169, 198, -34, 89, 16, -291, 30, 32, 4, -58, -157, 103, -54, -204, -167, 75, -33, -126, 90, -77, 130, 132, -33, 170, 43, 98, 280, 104, 19, 24, 120, -12, 83, 138, 83, -63, 93, -102, -132, 55, -74, 124, -24, -204, 178, 66, 141, -73, 23, 180, -22, 13, 34, 171, -4, -27, -101, 65, -71, -157, -12, 183, -66, 63, -58, 191, 82, 79, -45, 179, 28, 38, -141, -75, 87, -135, -327, -172, 24, -49, 8, 109, 136, -197, 62, 121, -147, -160, -334, 162, -72, -275, 432, 319, -35, 5, 152, -75, -119, -190, -90, 146, 187, -70, -48, 201, -183, -225, -30, 48, -184, 142, -26, -90, -114, 30, -111, -81, -172, -136, 169, 45, 77, 108, -99, -56, 141, 67, 197, 15, -68, -57, -153, -59, -182, -109, -161, 126, -236, -83, -13, -36, 146, -213, -63, -8, -186, -177, 191, 280, -80, 194, 140, -167, -69, 17, -12, -57, 65]
2791F5O2j40k14L95j64j54K18o0n1J98j79p4m4J37J9j20N7M6k1j41J48P0j42K41
2815A52Q4j97j82M5K77m43K00J27L83n17j4j01L01o2k00o0M13k75M8j32j09L45
2837H3k24J68K7J97m7j18J5j20p8J52l1kj12J46K9q7J04l4q1K05j33K5n6j95K52
2862H5M1L4l30K99o3k74l1K29m2r1J31kJ2J08J56k08j16N8J3L21k71k62L64j78
2886a7N6n9j70K95j6pk38P5K43k39Q8q4N0J20j20j62P0P2o0J40O2J77j70l58R1
2911a61J93j32J39P7j05j5J34r0j44J63P2l81M48N7k34m7j46j36J67J70n4j70
2933a95K45j75J24K7k4J69q3j03M7k12L26o7l7j22j04J87O0p5O0K13p8k53m2J13
2957Ar6On4J07P3o6%m2J93k38k78K49N1rL0J23j15R9m8K49k31j07P8L53m28K66
$$ y = [65, 127, -13, -227, 168, 4, -150, 68, 8, -43, 155, -24, -98, -142, -5, 14, -106, -49, -3, -24, -165, -17, 53, -89, 152, 236, 39, -143, -98, 179, -264, -64, 63, 446, -71, -85, -186, 115, 53, -147, -207, 206, -69, -21, -153, -262, 83, -141, 27, 54, 251, 204, 86, 101, -19, -97, 55, 24, 22, -90, 56, 85, -2, 102, 68, -13, 192, 59, 84, 28, -167, 85, 126, 160, -170, 129, 66, -208, -239, -10, -52, -143, -12, -14, -2, 106, 262, 54, -62, -4, 9, 330, 59, -203, 161, -17, 39, -20, -190, 105, 89, 82, -156, -81, 162, -77, 11, -73, -23, 97, -23, -185, -115, -43, -103, 37, 99, 276, 106, -252, -161, 32, -100, 39, 116, 11, -4, 130, 40, -104, 59, 131, -250, 198, 255, 21, -26, -172, -308, -141, 29, -25, -195, 50, -125, -1, 26, 2, 171, 88, -15, 32, -180, 146, 79, 42, -80, -184, 3, 63, -12, 48, 261, 183, -70, -112, 1, -95, -89, -143, -36, 37, -29, -29, -71, 122, -116, -394, -145, -94, -103, -73, 50, -65, 34, -14, 235, 4, -103, -25, 328, -100, 166]
2983A66k05K08j99J78j39K64j96k92N59l27j49K00j81K05j72j27K96j54K65k18
3003a8Qk0K9J78k06M1j45j07J12P3J1K50J12k43o7p0J6p4J68p8j23MJ30r0J51
3028D2k11J37K7J36J33l90K14k70l46M82O3M9k20K53L1K22k28o2p2K12k86Ok0
3051i8O2O1k02m6J50K11j80K58l35oj10J25O7J50k7o4J80M5n15J43J60j70m0J55
3075b6J72k6q3k2J64q3R5k96J37j64M5K51m50K85n2J62q1m6j96J72n4J06k8j72
3099a90j40O3J13K54q3K55J17l99mq9L15m34J98J07J62l37K51m90K70j40J22Q0
3121Apj18J49J05l34L03j5j85J96j35P6j53K08N0k41L05l95K55k40N2K1K15k88
3144a75L21J7k51o4K21J59l88L08k30k0K53k73J08m1R9L8j26J48k44j29K73L28
$$ y = [166, -39, 169, -30, 148, 9, 273, 77, -215, 344, 17, -132, 68, -113, 92, -80, -207, 89, -65, 200, -18, -10, -30, -1, 177, -29, 12, -133, -240, -128, -55, -44, 206, 318, 75, 8, -62, -46, -120, 48, -30, -153, -149, -19, -109, 42, -169, -32, -5, 131, 264, -126, 88, -182, -528, -46, 17, 66, -154, 99, 130, 352, 124, 62, -10, 202, -84, -78, -98, -36, 25, -177, -223, -73, 138, -42, 216, -119, -125, -235, -110, -43, 107, 80, 16, 196, 241, -274, -131, 29, -141, -181, -26, 146, 120, 37, 15, 179, 96, 191, -105, 32, -132, -87, 164, -286, -1, -53, 109, 28, -18, -214, -42, -96, 10, -18, -190, -330, -267, -154, 100, 17, 272, 389, -10, -14, -103, 212, -222, -24, 83, 245, -92, 159, -331, -61, -201, -79, 1, -6, -124, 25, 130, -204, 99, 84, -101, 95, -40, 36, -117, 91, 141, -100, 205, -190, 65, -175, -123, -102, 113, -175, 146, 163, -88, -152, 69, 228, -160, 148, -82, -102, 151, -122, -14, -55, 44, 82, -44, 104, -140, -269, 4, 332]
3166C32m55j07J47M12j84J02l43K16R0j59j08J06k03J92K46k84%m1o9N3M6J00
3188H9l49J95K18l95R8K9J01j78J6K68J32r0oj43J07k44J00j6R0qj6J27k44L6
3212h3J61Q9k84J50k14J21K04m8p7l53M49j91l6P0l1R5J8r6Qj30J98N8j85K34
3236A27l15L73j32j51l3P2Rp2K29m2M7k50K20n4p5j5j63J70J20m2L13m78J0R6
3260c6J9K31j00l08L91j85P8k22K15O3l5O7j11o9N1p2j30K37j87P7j25L32p2p5
3284C4O9k40K23p5q5J45Q7j10m5J76k11O0m5j61J07Q5j37K67r8o1K10ll07R9M0
3309B4j83p3J33j18K03J00Op1j01J75j39j32K80J56k00k23P4K20k58P6j6M2J42
3332A17o4k7K34j17k75o5K77k32Q5L6k0J97n0j73R5k67N03k01J9j00K43j97j44
$$ y = [332, -123, -230, -83, 329, 145, 247, -96, 120, 210, 51, -57, 49, -154, 38, 284, 0, 0, -41, -110, -57, -11, 89, -260, -65, 153, -242, -144, -115, -14, -192, -176, 92, 224, 134, 128, -15, 92, -152, -52, -68, 22, 14, -2, 125, -119, -83, 78, 167, -117, 33, -181, -60, 144, 96, 19, -334, 115, -76, -112, -42, -73, 22, 40, -56, -48, -178, 20, 78, -107, 127, -188, 185, 53, -98, -131, -59, -50, -122, 107, 65, 112, -138, 82, 28, -47, -62, -225, -55, 65, 23, 336, -142, -132, -36, -17, 214, 114, -194, 197, 12, 90, -132, 83, 146, 111, 178, 67, -2, 49, -23, -153, 84, -103, -26, -151, 181, 109, 34, 103, -137, 86, 11, -74, 71, 158, 48, 3, 179, -32, 28, -17, -178, -71, 14, -123, 144, 46, -15, 195, 192, -115, -16, 24, -159, -232, -99, -217, -14, 86, 92, 21, -80, 95, -44, -176, 104, 260, 60, -163, -89, 131, -127, -51, -67, -25, 117, 53, 26, 260, 143, -132, -197, 80, -152, -67, -31, -51, 146, 96, -77, 18, -249, 254, 53, 72, -28, 215, 18, -126]
3355a26L28o0p4R8L2pj21k07K85k99L06j70J20J09j16k04j94J63P3K08j57l1N0
3378FJ1j15%j33O7K18l7O9q3j72M5MJ97k90J35K26m8k85K35q8O5O5q7K2P8k11
3404a06kM1M1J78k3o5q7l8J47p0k51M92l22p4K44J52j56j17Q6m8j61L27j55J91
3428B24j40j22J52o9j71L6N6j45j77M78j24o6J07j17K83j56o8k2O7J29j19L1k48
3451a81J71j57K85q4Rj63L5J1N4J03j75P3J7O4o5N9k4j6L0Q2Q2j17M1j17p9N7
3477eLk6JJ37k17P9j3P2k0R3j88k5j12L72j25P5R8k84k2k8K22m0j03P8j4l1O4
3504D1j87N4m0J78K16l28J72j79p2l8K79nq5j47N2o5MJ43k6Q0J7j20N7K8oR2j12
3531CL65l84M5l66M50k13J06j64oJ65k04L13k29J50q1L88k57j94J69k4l2j29K9
$$ y = [-126, 202, 142, 68, 166, 198, 191, 70, -137, 148, -151, 155, -15, 105, 214, 98, -106, -300, -137, -64, 144, -13, -44, 6, 17, -98, -98, -231, -164, 54, 17, 86, 3, -169, -124, -120, 77, -213, -78, 148, 100, -185, 50, -38, 27, 92, 5, 27, 105, -106, -108, -67, -26, 152, 129, 64, -23, -61, 86, 16, -235, 257, -65, -139, 105, 257, 101, -16, 70, 22, -139, 188, 33, 224, 84, -38, 114, 45, -126, -90, -34, -179, -356, 122, -2, -68, 39, -78, 205, 49, -19, -41, 26, 155, 36, 67, -181, -10, -167, 118, 34, 43, -120, -85, -74, -20, 83, -92, -19, -2, 62, -3, 56, 32, 16, 46, 128, 210, 93, 134, 17, -62, -5, -2, -28, -27, 110, -107, -28, -41, 31, 11, 104, -84, -109, -221, 151, 26, 101, 199, -85, -107, -135, 87, 47, -56, 22, 8, -23, 41, -146, -92, -132, 46, 262, -66, 106, -73, -145, -183, 96, 91, 6, -141, -89, -154, -150, -7, -33, 47, 64, -56, 1, 29, 23, 115, 3, 368, -16, 29, -337, 113, -100, 6, -158, -164, 1, -203, 110, -119, 31, -50, 338, 81, -113, 56, 32, 0, -129, -100]
3554a00K00j74R8j3r8j04K27n7j0J74k11o0K4J29j7j19K7Q6NRR5j33p8M76m27
3579e1j02R9J8J31o9l8K04k30p5J13j73J36L31M5m07L34l61K0K43k29l8K63j19
3602D5k69K61k40J82j01J70K0j51Q9K78l23P0q7nJ10R6l2o6o2N8K39j98l2o3j55
3627a66J89j69K22j23j6j47K62M1J7N6l16J55k97J46J52m8M9n3J40j04J1Ok61
3650b54M25k13J01j39J32n6R3j09K0K8J58j0k92pk84J96J41RJ63m25L49j7q3o6
3674a40j72L4J56L1K2N5k14j2L72j25J03l3n7k2j67J04j7O5J06M8k03Q4j16K47
3698A49l56N9J64j57M14l25M4J97k90k32K27K59jl29J22M12k87Npl47P8p6J97
3721h0JJ66q0N8L0j24K6j37j57L64pj47Q3m3Q3nj41k0P2n4J14P0J62k14J1J27
$$ y = [-100, 100, -74, 24, 11, -87, -191, 36, -21, -31, 143, -68, -128, -104, 25, 8, -111, -84, 2, 7, 16, 111, -22, -100, 376, -51, -153, -54, -36, 95, 26, -12, 192, -38, -113, 0, -173, -37, 294, 339, -68, 266, -95, -75, 168, -61, -99, 164, 45, -224, 37, -203, -21, -122, 48, 68, -83, 6, 284, -39, 31, -56, -61, 49, 145, 113, 47, -15, 43, 282, 84, 52, -11, -166, 23, -146, 76, -47, -63, -210, 52, 93, 110, 166, -150, 5, -292, -146, 6, -42, 7, -46, 94, -10, 1, 7, -254, 171, -42, 59, -80, 52, -4, 89, -20, 0, 28, 186, 176, -116, -123, -407, -211, -70, -61, 102, -323, 26, 9, -74, -140, -312, -278, -122, -91, -69, -14, -228, -240, 132, 7, 110, 77, 20, -2, -169, -65, -82, -17, 89, 137, -66, 18, -98, 149, -207, -148, 16, -141, 273, -52, -8, 189, -101, -333, -106, 153, 152, -177, -55, 357, 70, 75, 68, -279, -201, -277, -80, -79, 87, 7, 65, 95, -29, -3, -140, -297, 67, 60, -87, -4, -47, 36, 31, -110, -130, -58, -112, 2, 72, 234, 20, 31, 158]
3747A58p0j58J40k96J36L31m40R8k2K00o0j56K11L7k1j5k33N2l6n1J22L92l28
3770iP9j17M2P2o1Q4k7m0P7j78K11J10l36p1K69k31QR3J80j69Jm1r0L40l44J41
3796gj67k9N70m93R5NR5k42n2L98j26L03m57K49k15R2l3O4j02p4P6M03k20j17
3820A6J56m81K66l9J53l3j50K38k32N7p4J07o5M3j83K52r8Q2m0j21J21k0M9k24
3844b20L26k58L65m39J91p4L41j24r8J30Jj54j35O4mp3M27k65n9k4J86K6k66K50
3868A14k72L18k79J74q8J57j74J8j35J07l6K6J28o7k0J3J03N9r8L5J82j97p6J16
3892A08k78J58J02l2k36J40j9j36J28M2K29j40K21l88J36j69R1j5J90j03j68J62
$$ y = [158, 88, -70, 70, -226, -90, 241, -199, -101, -123, 77, 17, -139, 72, 109, 88, 73, -160, -108, -144, -195, -73, 319, -9, 70, -47, -5, 67, 6, 90, 63, 23, 100, -78, 133, 243, -93, -164, 105, -126, -118, -25, 155, -14, -13, -54, -144, 196, -148, -7, -174, -203, 367, -126, -31, -26, 69, -173, -225, 173, 47, 350, -107, 142, -73, 19, -14, 50, -52, -126, -50, 353, 133, 16, 172, -309, -43, -82, 71, 38, -112, 126, -106, -49, -123, -16, -81, -38, -221, 31, -67, 15, -25, -146, -25, -45, 4, -220, 106, -152, 213, -226, -35, -109, 232, 108, 10, 140, 141, -13, -148, -84, -88, -161, 266, 1, -58, -82, 104, 130, -136, 114, -158, 160, -119, 55, -33, 124, -50, -32, -167, -60, -96, -70, 58, -9, -29, -16, 87, 146, 48, 83, 265, 68, -8, 108, -170, -12, 90, 58, -178, -38, -57, -193, -65, -23, 206, 66, 287, -101, 35, -134, -43, -58, 132, 29, -139, 23]
$$ [...]
8191I5
##END NTUPLES=NMR FID
##END=
