##TITLE=1H_Pr Q-13_2
 D2O
 8sc, 
 16.2.2024
##JCAMPDX= 6.0         $$ Bruker NMR JCAMP-DX V2.0
##DATA TYPE= NMR FID
##DATA CLASS= NTUPLES
##ORIGIN= UXNMR, Bruker Analytische Messtechnik GmbH
##OWNER= root
$$ XWIN-NMR		Version 3.5
$$ Fri Feb 16 16:15:07 2024 Russian Standard Time (UT+4h)  she@DPX200
##.OBSERVE FREQUENCY= 200.1313
##.OBSERVE NUCLEUS= ^1H
##.DELAY= (6, 6)
##.ACQUISITION MODE= SIMULTANEOUS
##.ACQUISITION SCHEME= undefined
##.AVERAGES= 8
##.DIGITISER RES= 18
##SPECTROMETER/DATA SYSTEM= spect
##.PULSE SEQUENCE= zg30
##.SOLVENT NAME= D2O
##.SHIFT REFERENCE= (INTERNAL, D2O, 0, 15.7039)
##AUDIT TRAIL= $$ (NUMBER, WHEN, WHO, WHERE, WHAT)
$$ ##TITLE= Audit trail, XWIN-NMR		Version 3.5
$$ ##JCAMPDX= 5.01
$$ ##ORIGIN= Bruker BioSpin GmbH
$$ ##OWNER= she
$$ F:/spectra/data/she/nmr/H-F/1/audita.txt
$$ ##AUDIT TRAIL=  $$ (NUMBER, WHEN, WHO, WHERE, WHAT)
(   1,<2024-02-16 16:14:04.15 +0400>,<she>,<DPX200>,
      <created by zg, POWCHK disabled, PULCHK disabled
       configuration hash MD5:
       00 E9 B6 7A A2 85 ED C7 34 08 36 98 17 FE 4E 26
       data hash MD5: 16K
       92 D7 B7 70 97 DE 03 C3 E7 4C 77 42 E6 00 2C 98>)
$$ ##END=
$$ 
$$ hash MD5
$$ 24 EB 4D 35 56 E2 0A 5B CC E8 C2 CF 93 47 AD 42
##$RELAX= 
##$RELAX= 
##$RELAX= 
##$RELAX= 
##$RELAX= 
##$RELAX= 
$$ Bruker specific parameters
$$ --------------------------
##$DU= <F:/spectra>
##$EXPNO= 1
##$NAME= <H-F>
##$PROCNO= 1
##$TYPE= <nmr>
##$USER= <she>
##$AMP= (0..31)
100 100 100 100 100 100 100 100 100 100 100 100 100 100 100 100 100 100 
100 100 100 100 100 100 100 100 100 100 100 100 100 100 
##$AQSEQ= 0
##$AQ_mod= 1
##$AUNM= <au_zg>
##$AUTOPOS= <>
##$BF1= 200.13
##$BF2= 200.13
##$BF3= 200.13
##$BF4= 200.13
##$BF5= 200.13
##$BF6= 200.13
##$BF7= 200.13
##$BF8= 200.13
##$BYTORDA= 1
##$CFDGTYP= 0
##$CFRGTYP= 5
##$CHEMSTR= <none>
##$CNST= (0..31)
1 1 145 1 1 1 1 1 1 1 1 1 1 1 1 1 1 1 1 1 1 1 1 1 1 1 1 1 1 1 1 1 
##$CPDPRG= <>
##$CPDPRG1= <>
##$CPDPRG2= <>
##$CPDPRG3= <>
##$CPDPRG4= <mlev>
##$CPDPRG5= <mlev>
##$CPDPRG6= <mlev>
##$CPDPRG7= <mlev>
##$CPDPRG8= <mlev>
##$CPDPRGB= <>
##$CPDPRGT= <>
##$D= (0..31)
0 1.2 0 0 0 0 0 0 0 0.06 0 0.03 0 0 0 0 0.0002 0 0 0 0 0 0 0 0 0 0 0 0 
0 0 0 
##$DATE= 1708085643
##$DBL= (0..7)
120 120 120 120 120 120 120 120 
##$DBP= (0..7)
150 150 150 150 150 150 150 150 
##$DBP07= 0
##$DBPNAM0= <>
##$DBPNAM1= <>
##$DBPNAM2= <>
##$DBPNAM3= <>
##$DBPNAM4= <>
##$DBPNAM5= <>
##$DBPNAM6= <>
##$DBPNAM7= <>
##$DBPOAL= (0..7)
0.5 0.5 0.5 0.5 0.5 0.5 0.5 0.5 
##$DBPOFFS= (0..7)
0 0 0 0 0 0 0 0 
##$DE= 6
##$DECBNUC= <off>
##$DECIM= 32
##$DECNUC= <off>
##$DECSTAT= 4
##$DIGMOD= 1
##$DIGTYP= 9
##$DL= (0..7)
0 120 120 120 120 120 120 120 
##$DP= (0..7)
150 150 150 150 150 150 150 150 
##$DP07= 0
##$DPNAME0= <>
##$DPNAME1= <>
##$DPNAME2= <>
##$DPNAME3= <>
##$DPNAME4= <>
##$DPNAME5= <>
##$DPNAME6= <>
##$DPNAME7= <>
##$DPOAL= (0..7)
0.5 0.5 0.5 0.5 0.5 0.5 0.5 0.5 
##$DPOFFS= (0..7)
0 0 0 0 0 0 0 0 
##$DQDMODE= 0
##$DR= 18
##$DS= 0
##$DSLIST= <SSSSSSSSSSSSSSS>
##$DSPFIRM= 0
$$ [...]
##$SUBNAM2= <"">
##$SUBNAM3= <"">
##$SUBNAM4= <"">
##$SUBNAM5= <"">
##$SUBNAM6= <"">
##$SUBNAM7= <"">
##$SUBNAM8= <"">
##$SUBNAM9= <"">
##$SW= 18.0517328524113
##$SWIBOX= (0..15)
0 0 2 0 0 0 0 0 0 0 0 0 0 0 0 0 
##$SW_h= 3612.71676300578
##$TD= 16384
##$TD0= 1
##$TE= 0
##$TE2= 300
##$TE3= 300
##$TEG= 300
##$TL= (0..7)
0 120 120 120 120 120 120 120 
##$TP= (0..7)
150 150 150 150 150 150 150 150 
##$TP07= 0
##$TPNAME0= <>
##$TPNAME1= <>
##$TPNAME2= <>
##$TPNAME3= <>
##$TPNAME4= <>
##$TPNAME5= <>
##$TPNAME6= <>
##$TPNAME7= <>
##$TPOAL= (0..7)
0.5 0.5 0.5 0.5 0.5 0.5 0.5 0.5 
##$TPOFFS= (0..7)
0 0 0 0 0 0 0 0 
##$TUNHIN= 0
##$TUNHOUT= 0
##$TUNXOUT= 0
##$USERA1= <user>
##$USERA2= <user>
##$USERA3= <user>
##$USERA4= <user>
##$USERA5= <user>
##$V9= 5
##$VALIST= <valist>
##$VCLIST= <CCCCCCCCCCCCCCC>
##$VD= 0
##$VDLIST= <DDDDDDDDDDDDDDD>
##$VPLIST= <PPPPPPPPPPPPPPP>
##$VTLIST= <TTTTTTTTTTTTTTT>
##$WBST= 1024
##$WBSW= 4
##$XGAIN= (0..3)
0 0 0 0 
##$XL= 0
##$YL= 0
##$YMAX_a= 228737
##$YMIN_a= -146948
##$ZGOPTNS= <>
##$ZL1= 120
##$ZL2= 120
##$ZL3= 120
##$ZL4= 120
##$ABSF1= 10
##$ABSF2= 0
##$ABSG= 5
##$ABSL= 3
##$ALPHA= 0
##$AQORDER= 0
##$ASSFAC= 0
##$ASSFACI= 0
##$ASSFACX= 0
##$ASSWID= 0
##$AUNMP= <proc_1d>
##$AZFE= 0.1
##$AZFW= 0.1
##$BCFW= 1
##$BC_mod= 2
##$BYTORDP= 1
##$COROFFS= 0
##$CY= 11.3945322036743
##$DATMOD= 1
##$DC= 2
##$DFILT= <>
##$DTYPP= 0
##$F1P= 15.7292609196834
##$F2P= 12.9074282941183
##$FCOR= 0.5
##$FTSIZE= 0
##$FT_mod= 4
##$GAMMA= 1
##$GB= 0.15
##$INTBC= 1
##$INTSCL= 1
##$ISEN= 128
##$LB= 0.24
##$LEV0= 0
##$LPBIN= 0
##$MAXI= 10000
##$MC2= 0
##$MEAN= 0
##$ME_mod= 0
##$MI= 1.114404
##$NCOEF= 0
##$NC_proc= 0
##$NLEV= 6
##$NOISF1= 3.799351
##$NOISF2= 2.8
##$NSP= 1
##$NTH_PI= 0
##$NZP= 0
##$OFFSET= 15.70392
##$PC= 1
##$PHC0= -25122.78
##$PHC1= 9.85264
##$PH_mod= 1
##$PKNL= yes
##$PPARMOD= 0
##$PSCAL= 0
##$PSIGN= 0
##$REVERSE= no
##$SF= 200.130013532006
##$SI= 16384
##$SIGF1= 3
##$SIGF2= 2
##$SINO= 400
##$SIOLD= 16384
##$SREGLST= <1H.CDCl3>
##$SSB= 0
##$STSI= 0
##$STSR= 0
##$SW_p= 3612.71676300578
##$SYMM= 0
##$S_DEV= 0
##$TDeff= 0
##$TDoff= 0
##$TI= <>
##$TILT= no
##$TM1= 0
##$TM2= 0
##$TOPLEV= 0
##$USERP1= <user>
##$USERP2= <user>
##$USERP3= <user>
##$USERP4= <user>
##$USERP5= <user>
##$WDW= 1
##$XDIM= 8192
##$YMAX_p= 0
##$YMIN_p= 0
$$ End of Bruker specific parameters
$$ ---------------------------------
##NTUPLES= NMR FID
##VAR_NAME=  TIME,          FID/REAL,        FID/IMAG
##SYMBOL=    X,             R,               I
##VAR_TYPE=  INDEPENDENT,   DEPENDENT,       DEPENDENT
##VAR_FORM=  AFFN,          ASDF,            ASDF
##VAR_DIM=   8192,          8192,            8192
##UNITS=     SECONDS,       ARBITRARY UNITS, ARBITRARY UNITS
##FACTOR=    0.0002768,     1,               1
##FIRST=     0,             0,               0
##LAST=      2.2672688,     0,               0
##MIN=       0,             -146948,         0
##MAX=       2.2672688,     228737,          0
$$ Real data points
##PAGE= N=1
##DATA TABLE= (X++(R..R)), XYDATA
0 0 0 0 0 0 0 0 0 0 0 0 0 0 0 0 0 0 0 0 0 0 0 0 0 4 -5 8 -8 8 -8 8 -9 12 -13 16 -16 20 -21 23 -28 28 -34 36 -40 45 -49
45 -49 55 -60 66 -74 80 -88 98 -108 119 -132 147 -164 184 -206 234 -268 313 -371 449 -564 744
66 744 -1059 1739 -3825 24606 137295 143510 46642 -62161 -112841 -121966 -133160 -146948 -110804
79 -110804 -4263 116973 170702 141011 80053 40051 17378 -17057 -61365 -70770 -20010 50961
91 50961 74020 31677 -30658 -64896 -72602 -84160 -102589 -87545 -12386 84764 130821 101120
103 101120 44845 22361 34436 30075 -20636 -79027 -80615 -16795 51102 62496 20482 -25548
115 -25548 -43407 -46349 -59327 -72272 -49897 15145 81334 102529 76250 37389 11887 -7829
127 -7829 -38376 -67604 -61888 -12649 42513 60096 36493 4443 -11493 -21407 -45920 -74941 -69527
140 -69527 -12362 60201 91905 65816 17413 -9981 -10631 -13283 -33680 -49817 -31373 16762 56860
153 56860 60054 32775 1614 -20173 -39641 -60574 -65554 -36438 15865 56388 61218 38949 13977
166 13977 -2939 -20671 -42913 -51139 -25025 25805 64009 62950 32026 937 -15928 -30454
178 -30454 -53828 -71053 -53856 -363 54536 71942 46088 5289 -20999 -28516 -29193 -26002 -9133
191 -9133 22658 50238 51904 27470 -2820 -21372 -30124 -39246 -46252 -35860 -4124 29441 40342
204 40342 25990 6444 -1005 -891 -8170 -22100 -22954 1178 33736 45564 27250 -1000 -14708
217 -14708 -13079 -15067 -29893 -41747 -30115 2202 30857 36686 24401 10910 2665 -8060 -24200
230 -24200 -31784 -15871 16805 41022 39112 18532 -383 -9973 -19561 -35406 -45106 -30656 4720
243 4720 35208 38563 19469 1130 -3640 -4918 -15542 -28531 -23192 6208 38330 45974 25469
256 25469 -1267 -14294 -16134 -21116 -30789 -29891 -8970 19401 32084 21771 4018 -4289 -4720 -10244
270 -10244 -22054 -23979 -3717 27271 43269 32403 8844 -6542 -10757 -16798 -30068 -36646 -20631
283 -20631 11677 34391 29702 6941 -10372 -12263 -9753 -14050 -18342 -7125 20311 42990 40333
296 40333 15338 -9829 -19767 -19459 -21401 -24982 -17884 3425 23740 24359 5695 -12382 -14364 -5493
310 -5493 -1302 -5052 -4352 10097 28471 31471 14299 -6796 -14461 -9937 -8608 -17037 -23740 -14942
324 -14942 5472 18965 14173 440 -5525 -604 3189 -2729 -10441 -5639 12448 27703 25551 9313
338 9313 -5510 -10896 -13441 -20728 -27594 -21542 -428 20835 25499 13235 -1309 -6550 -5745 -7470
352 -7470 -11159 -6662 10122 27940 30346 14402 -6153 -17270 -18366 -18135 -19434 -15310 -387 17466
366 17466 23884 13707 -2313 -10493 -8551 -5038 -5144 -3853 5655 19063 24168 14332 -2526 -13527
380 -13527 -14644 -12286 -12733 -12572 -5047 8733 17958 14434 2134 -7404 -8529 -5719 -4887 -4704 847
395 847 12162 20332 17034 4282 -7645 -12032 -11430 -11280 -11228 -6058 4951 14371 13348 3041 -6980
410 -6980 -9329 -6090 -3565 -3181 -135 8140 16320 16146 6603 -4211 -8785 -7630 -6687 -8133 -7697 -1669
426 -1669 6507 9322 4414 -2537 -5176 -3459 -2648 -4042 -3887 2126 11060 15381 11156 2907 -2631 -4622
442 -4622 -7091 -11506 -13332 -7292 4096 11985 10343 2403 -4039 -5800 -5789 -7005 -6481 -5 11223
457 11223 19000 16371 5789 -4296 -9080 -10298 -11287 -10647 -4868 5364 12881 10872 1413 -6908 -8804
472 -8804 -6343 -4375 -3116 1314 9729 16097 13559 3177 -6441 -8969 -6249 -4509 -5416 -4833 707
487 707 7696 8759 2339 -5171 -7079 -3825 -929 -1557 -2045 2034 8884 11629 6619 -1325 -5360 -4258
503 -4258 -3066 -4684 -6301 -2854 4939 9706 6452 -1283 -6093 -5274 -2783 -3165 -4580 -1741 6147 12208
519 12208 10142 1715 -5207 -5838 -2929 -2001 -3470 -2701 2744 8414 7635 544 -6461 -7589 -4476 -2232
535 -2232 -2933 -2690 2065 8398 9750 4523 -1914 -3871 -1583 -20 -1775 -3570 -811 4986 7559 3425
551 3425 -3636 -7404 -6064 -3686 -3852 -4518 -1117 6055 11280 9426 2614 -2940 -3704 -2091 -1910 -2913
567 -2913 -1192 3943 7740 5358 -2084 -8495 -9466 -6351 -3463 -2041 639 6071 10634 9645 3106 -3402
583 -3402 -5190 -2590 63 213 -91 1767 4130 3214 -1954 -7444 -8680 -5284 -1144 606 1138 3174
599 3174 6329 7194 4135 -532 -2802 -1593 219 -161 -1681 -1382 1099 2572 740 -3298 -5549 -4373
615 -4373 -1703 -515 -467 952 4363 7190 6171 2098 -2000 -3144 -2210 -1663 -1998 -1352 1092 3274 2630
632 2630 -795 -4126 -4829 -3138 -1321 -320 1267 3879 6131 5466 1820 -2029 -3488 -2534 -1403 -1311
648 -1311 -965 865 3037 3184 500 -2920 -4228 -3067 -1254 -413 313 2068 4257 4846 2740 -795
664 -795 -2956 -2929 -2003 -1422 -670 1146 3346 3806 1541 -1869 -3978 -3678 -2275 -1215 -298 1680 4102
681 4102 4969 2744 -1085 -3628 -3282 -1452 -158 461 1309 2819 3272 1506 -1865 -4151 -3886 -1799 -137
698 -137 597 1258 2351 2946 1818 -650 -2353 -1839 -163 787 363 153 1053 2023 1546 -756 -2676 -2499
716 -2499 -976 -66 -652 -1064 186 2359 3204 1788 -647 -1699 -973 -167 -351 -777 86 1965 2855 1503
734 1503 -1190 -2837 -2748 -1655 -1071 -680 674 2711 3707 2318 -539 -2426 -2149 -823 -90 -17 678 2225
752 2225 3144 1713 -1404 -3691 -3375 -1416 154 355 466 1437 2549 2180 -69 -2217 -2382 -775 687
769 687 971 749 1073 1833 1571 -356 -2359 -2836 -1664 -314 56 20 627 1802 2123 699 -1338 -2075
787 -2075 -982 535 1072 609 635 1529 1914 684 -1703 -3107 -2422 -752 313 330 320 880 1562 1095 -401
806 -401 -1619 -1273 98 1244 1170 870 896 1195 572 -1002 -2231 -2085 -932 28 2 -171 288 1214 1473
825 1473 450 -855 -1095 -104 788 825 356 354 1014 1217 268 -1404 -2353 -1961 -942 -206 101 571 1282 1640
845 1640 975 -359 -1277 -1028 -125 582 908 1054 1367 1200 133 -1507 -2546 -2161 -907 109 614 822
863 822 1127 1284 718 -523 -1393 -1150 -97 975 1260 995 760 562 -9 -955 -1717 -1648 -807 46 497 546
883 546 673 736 506 -219 -835 -766 -161 495 668 577 638 729 519 -360 -1215 -1423 -891 -190 215 278 404 732
905 732 652 142 -691 -986 -539 165 594 789 794 795 626 -75 -857 -1266 -879 -235 162 240 208 477 583 80 -642
928 -642 -903 -557 130 556 532 477 635 808 429 -336 -997 -961 -478 -69 54 10 343 627 444 -215 -801 -904
950 -904 -380 181 469 638 826 1106 784 -119 -986 -1318 -766 -155 207 250 421 627 460 -282 -1053 -1206 -562
971 -562 386 889 885 785 792 499 -172 -947 -1232 -721 74 517 356 140 91 130 -207 -750 -901 -373 385 837
993 837 696 369 355 412 228 -350 -750 -628 -178 224 164 -48 -30 201 244 -161 -599 -584 -74 365 529 341
1015 341 351 516 491 -25 -610 -819 -562 -5 277 174 133 279 324 5 -583 -817 -465 180 538 552 449 413
1037 413 395 91 -450 -839 -628 -51 290 395 224 194 169 3 -406 -688 -578 -77 468 520 391 347 435 168
1059 168 -262 -656 -611 -202 247 448 300 131 150 1 -372 -717 -699 -236 300 595 553 407 228 100 -192
1080 -192 -516 -566 -152 207 457 382 146 -62 -140 -360 -499 -533 -210 249 508 456 255 191 135 52 -177 -345 -200
1103 -200 87 275 135 -10 -101 -74 -118 -256 -394 -325 -22 211 272 315 346 305 220 -66 -327 -373 -118 68 113 136
1127 136 144 153 -27 -220 -494 -478 -178 174 342 439 424 321 176 -74 -387 -441 -221 117 302 285 176 13 -69
1150 -69 -277 -468 -415 -110 167 336 367 329 217 84 -64 -314 -367 -179 33 237 188 90 33 -12 -146 -252 -422
1173 -422 -210 122 219 329 296 205 198 -17 -195 -311 -240 -15 191 250 148 64 14 -100 -271 -383 -231 -20 217
1196 217 276 233 183 172 22 -156 -285 -203 3 172 199 102 -15 9 -44 -114 -232 -308 -93 103 181 157 149 139 174 56
1222 56 -169 -196 -141 51 163 72 70 74 59 -53 -252 -336 -305 -64 121 202 170 146 157 65 -133 -319 -265 -32 227 265
1248 265 203 118 64 -105 -224 -297 -269 -95 146 229 243 138 61 3 -121 -205 -226 -2 133 205 178 78 -24 -109 -143
1273 -143 -213 -303 -118 93 139 167 41 -34 -8 -65 -117 -150 -86 49 166 157 95 81 -55 -69 -163 -225 -175 -28 103 171
1299 171 105 68 47 -47 -45 -120 -85 11 128 173 51 44 20 2 -90 -214 -179 -96 21 64 110 76 60 -27 -12 -98 -97 -84 81
1328 81 130 117 115 101 20 -47 -168 -159 -181 -26 87 110 136 60 59 12 -77 -149 -102 86 135 210 176 154 19 -59 -186 -225 -178
1357 -178 -100 21 118 145 43 14 -63 -126 -87 -9 102 221 175 83 42 -18 -94 -149 -89 -87 -43 60 94 87 40 32 -13 -11 11
1386 11 -11 50 134 130 84 94 26 -5 -53 -101 -90 -141 -43 -12 69 94 57 88 -1 -58 -86 -29 33 81 95 66 61 85 -49 -97 -99
1417 -99 -152 -58 23 123 56 26 72 45 -90 -45 -39 14 45 80 102 42 91 -19 -88 -133 -116 -49 27 37 71 47 74 -28 -30
1446 -30 -134 -180 -100 39 75 117 44 64 111 -26 -40 -154 -94 41 86 67 113 60 73 -21 -39 -103 -10 50 141 88 85 50
1474 50 50 34 -35 -72 -74 -13 11 35 26 -5 17 -29 -26 -105 -120 -2 13 65 77 61 34 78 -11 -45 -108 -85 -18 29 10 56 58 56 -16
1507 -16 -61 -90 -29 9 56 62 58 112 52 -1 -31 -158 -70 -55 -22 12 69 69 26 42 -17 -109 -82 22 33 105 112 68 99 18 -23
1538 -23 -106 -114 -67 -30 25 53 101 75 2 -31 18 -79 -81 53 31 65 83 143 85 -28 -68 -49 -99 -26 -12 56 69 39 -52 -65
1568 -65 -73 -52 -72 23 3 46 36 42 40 -16 -42 -99 -78 -19 44 62 36 14 8 -22 15 -9 -23 -62 44 101 103 43 48 31 -11 -81 -32
1601 -32 -38 -5 73 9 44 -22 44 5 -69 -87 -40 -19 64 52 69 50 69 -22 -38 -90 -59 5 -25 62 62 61 3 -53 -10 -61 -64 -46
1633 -46 8 90 112 57 50 28 -39 -106 -71 29 -29 50 -13 102 5 -4 -54 -35 -67 -31 35 61 63 50 0 70 17 -72 -66 -30 -21 -18
1665 -18 45 6 71 55 -10 -77 -63 1 -16 45 35 60 79 45 -11 6 -40 -39 -25 18 8 18 89 50 -2 -74 -51 -83 -31 13 20
1696 20 61 23 57 75 -143 -99 -39 -5 27 20 50 -14 21 13 -32 -44 -82 -54 31 52 60 48 33 -5 -58 -69 -80 -90 31 15 64
1727 64 74 28 77 6 -41 -82 -33 10 -8 59 31 14 18 7 -22 -69 -14 -22 -4 28 7 43 -25 11 -37 -92 -94 27 -8 42 64
1758 64 39 28 -8 -19 -45 -15 -30 7 67 53 62 14 59 -20 -25 -51 -42 31 16 74 25 26 -5 -10 -88 -59 -62 22 54 38 37 24 6 -25
1792 -25 -26 -39 -30 -57 11 -1 46 -7 54 31 -38 -68 -5 25 16 14 76 118 46 23 -49 -67 2 -72 7 35 58 73 9 -23 -22 -32 -36
1825 -36 -45 4 41 19 0 -4 1 -49 -12 -62 -40 -39 -13 35 43 -15 43 -17 -54 -19 -54 -10 95 74 30 20 0 -72 -73 -28 -22 -4 20
1858 20 -25 21 -20 27 -36 -46 -67 -14 -24 -6 38 71 47 58 -71 12 -70 -14 4 -23 -28 56 3 70 33 -42 -8 -26 -28 -49 17
1889 17 103 109 4 -22 -27 -52 -38 -39 25 10 33 50 36 6 -33 -56 -38 -45 34 -26 -13 -36 48 -17 -58 -27 -99 -69 38 58 38
1920 38 56 36 -27 4 -16 -76 -50 23 47 47 34 11 -41 -1 -38 -46 47 -41 33 66 54 -47 24 -42 11 10 8 22 2 46 -15 62
1952 62 -20 -57 -28 -92 -120 6 17 -1 47 17 26 -19 17 -19 22 -64 10 50 48 35 39 28 -5 -29 -25 -22 44 27 46 17 28 0
1984 0 -57 -39 -16 36 13 80 16 59 17 -28 -4 -53 -40 -81 -19 5 2 20 59 32 34 -29 -33 -53 -4 30 36 -15 57 23 -13 1 -23
2017 -23 -12 30 1 39 -16 35 25 -18 43 -53 12 -84 -16 40 22 32 9 -38 -10 -56 -41 6 -35 21 12 37 -6 -59 -37 -51 8
2048 8 -24 16 70 -23 0 -27 26 -19 -82 4 -6 7 -33 40 64 18 -8 -17 -15 -26 -9 51 31 -15 -9 -34 -41 -43 -23 -44 -17 -10 6 36
2082 36 20 -10 9 1 -35 -21 -37 25 33 52 52 43 35 13 -3 -28 8 32 -12 14 44 15 20 14 17 -24 -11 -20 -5 -39 -60 8 24 3 -16
2117 -16 -30 -80 28 -4 1 -3 -4 -34 28 -36 -2 -40 -20 -53 -13 40 6 40 -3 24 -37 -45 6 -10 -12 18 25 -4 5 28 -35 11 -18
2150 -18 -41 4 -65 39 41 38 -40 -3 -64 -42 -6 -30 26 9 -29 29 37 -7 -49 -37 -12 82 -26 -4 4 1 -10 -10 4 -34 0 -32
2182 -32 12 22 -15 46 23 -12 -19 -12 29 35 -5 52 68 -43 -23 -41 29 -53 27 -34 22 22 -46 14 -20 0 -22 -36 -16 24 -15 31
2214 31 23 30 23 28 -36 -28 -55 -23 -4 38 54 14 0 -24 -37 0 -31 31 18 20 11 21 -10 -40 -28 -75 0 -29 4 -20 7 4 2 -35 -35
2249 -35 -18 -16 23 -27 13 41 40 -25 20 -77 37 30 12 -18 0 49 21 -8 48 -45 -48 44 18 16 -35 66 47 -3 36 -11 -11 64
2281 64 10 -8 -33 -56 37 -13 -77 2 -44 -28 30 -6 50 18 -10 76 57 -3 -27 -21 -65 -18 15 -5 4 16 21 -11 -35 25 -25 -23
2313 -23 1 9 -35 14 -47 11 36 -30 -13 -3 4 34 -4 35 -8 -29 -14 -16 -24 -7 2 33 32 -1 -8 49 -39 -48 2 -26 -12 6 29 -13
2347 -13 -18 -31 -37 -4 41 49 29 21 -22 22 69 13 -8 -23 -7 18 -16 12 -13 -29 9 2 -13 -27 11 -49 -1 26 -22 -62 -3 -12 -45
2380 -45 -5 -23 10 -8 36 5 -27 13 -1 -29 -27 -37 1 26 -1 -10 6 -6 2 38 46 -28 -4 -20 -7 -21 6 31 -46 -36 -47 -34
2412 -34 -18 1 -37 27 20 -6 -2 22 -9 -19 38 26 -25 -1 -23 16 40 -37 -59 -1 -10 17 -12 -40 12 50 5 -8 3 -62 -45 14
2444 14 -19 16 -22 -6 -48 34 11 23 -22 -44 29 -3 -12 11 23 4 -17 21 -28 -19 -37 -4 7 -4 9 41 -30 6 -2 2 -8 70
2476 70 -22 -40 17 -6 34 -31 10 -31 10 8 24 38 -11 40 19 -34 -20 26 -10 55 106 -6 39 -2 -32 -13 2 29 57 11
2506 11 -19 1 16 30 0 -10 -17 23 26 -8 1 40 -6 31 -19 -2 3 -22 -7 43 21 32 -3 22 2 -30 -22 -1 -12 5 -28 42 57
2539 57 -28 -19 -26 -62 -16 33 7 4 -37 2 -15 -56 12 -26 -20 36 26 49 19 0 22 -2 29 -24 -17 14 -2 -3 -9 60 -2 -28 28 28
2573 28 -30 0 -32 11 -35 -31 25 -18 19 9 -46 -29 -6 -25 -27 -26 -44 15 -7 -25 24 32 42 14 -16 -30 29 33 -20 -1 -63 -3 13
2606 13 -30 -6 -8 52 11 -40 -13 48 41 0 21 16 58 9 10 -1 -2 -40 13 -31 -13 -26 15 14 -59 56 70 -66 -45 -49 -62 -48 17
2639 17 6 27 48 3 39 -47 -20 8 13 28 15 -7 -8 36 -22 -52 -23 -14 75 11 -39 -6 2 -25 -8 -33 -59 68 -26 28 10 -35
2671 -35 -29 19 -8 -48 -29 -34 42 4 -5 18 -51 -21 44 21 11 9 -19 -38 25 -20 24 -29 29 31 -20 3 16 22 1 14 14 3 5 -6
2705 -6 -20 -12 9 -5 -67 11 7 5 -34 -2 -14 25 11 -9 27 -7 -14 9 14 9 15 -14 -50 11 -17 17 -3 7 -21 4 14 -36 -12 -16 16
2740 16 3 14 9 -26 -17 -29 -27 -8 -37 -2 52 23 -2 -50 -9 3 -27 46 58 22 55 0 -13 -4 22 -31 50 -25 -24 30 -6 -8 -25
2773 -25 -11 -5 39 -1 -6 -51 -9 -19 49 -47 -44 -13 17 23 -48 0 14 18 19 27 11 -12 7 -4 -7 1 -40 21 11 -37 -21 6 19 -26 28
2808 28 -3 -2 7 -34 28 -21 -22 -30 20 -6 18 -8 3 5 -6 96 28 -39 -38 -36 -46 28 38 -10 -30 -18 28 2 -36 -59 -41 -27 -9
2841 -9 -18 -22 5 -18 4 22 -34 -11 -29 1 13 2 28 10 -8 -17 9 22 -61 -67 -23 -34 29 44 36 -40 -28 14 57 4 -4 34 -80
2874 -80 -1 -13 -19 25 -15 14 -11 49 -46 -18 -29 57 -15 28 35 0 23 -9 12 -57 21 8 -40 -41 44 15 -12 -18 -55 1 42 -25
2906 -25 6 -20 -15 -8 10 4 20 0 9 -6 -4 -11 34 -25 -22 -38 -31 12 -18 -32 -19 -21 27 1 1 -36 -3 39 -11 2 -18 -30 -78 -35 4
2941 4 16 6 26 -10 10 26 12 -3 -24 38 38 18 6 -3 -9 20 -42 -20 50 -8 13 -20 -21 -17 4 -39 -9 -17 -6 -13 22 18 -26 34 19
2976 19 65 -15 -10 23 -7 11 20 -41 28 32 -21 5 -6 10 32 -3 -1 -7 -11 -88 39 21 12 7 3 -47 -4 66 37 -44 -58 -8 -13 5 -12
3011 -12 -2 -50 18 -34 -8 52 22 -5 -61 -51 22 17 3 5 23 -35 -68 7 61 21 48 -25 11 21 0 14 -14 0 43 -31 -31 -21
3043 -21 33 48 -27 -11 30 -5 3 -21 -57 11 0 -43 21 24 -4 -14 -16 13 -23 7 -50 15 0 31 -8 -1 -2 -13 -29 6 -51 -17 32
3076 32 0 -5 14 15 29 -10 -3 6 40 21 -46 -35 -13 20 -9 15 -44 18 7 8 0 73 29 13 -14 11 32 -53 38 16 17 -14 -5 -9 24
3111 24 -28 -9 -1 -11 29 0 48 -13 -62 12 14 -17 31 23 7 -16 41 13 -5 -39 11 9 -9 9 14 -16 31 -2 28 24 -6 -46 24
3144 24 -20 -6 -24 21 -47 -20 -39 30 11 13 -1 11 34 9 92 -3 41 10 5 24 11 -43 28 -36 7 41 24 -16 0 5 36 37
3176 37 -50 19 15 5 -22 -1 -14 -20 -9 -19 41 30 -32 25 9 -2 -42 -5 -50 -18 -4 24 5 37 49 12 -5 -3 8 -30 -5 16
3208 16 -10 -16 -44 20 17 -11 30 30 -44 -13 20 -17 -11 -23 11 -26 -1 -20 -23 23 -3 -17 23 16 -7 -1 -16 58 86 21 -21 -34 -18 88
3242 88 23 -13 -23 35 60 32 -29 -31 2 -6 11 25 -42 31 -2 -7 16 -23 21 35 42 -14 -24 -29 2 85 -5 7 14 45 21 12 12 0
3276 0 -34 -20 17 24 37 -17 22 19 40 17 30 47 20 6 -33 -6 -1 -9 -7 11 3 -24 22 -21 -11 -19 -12 -35 34 -18 -52 -9 -15 -5 -29
3311 -29 -49 -3 -33 -7 7 16 56 44 -22 27 56 -50 2 11 1 12 12 60 -38 1 53 -48 -50 -27 -22 17 21 0 48 15 6 -32 36
3344 36 -15 -31 -20 -44 -23 -17 -56 -14 38 -21 39 3 14 1 -12 16 -4 -21 14 1 50 48 26 -19 18 39 11 32 -4 55 -20
3375 -20 41 8 45 -46 -20 0 16 30 12 -13 0 3 37 25 -19 53 -3 5 20 -14 17 37 -34 -9 -7 11 -57 -6 17 10 -11 11
3407 11 27 -22 -7 51 -5 -1 -18 16 52 24 -3 67 -8 -13 49 -11 24 -14 38 20 49 30 13 32 -23 -3 35 -22 -24 17 -8 4
3439 4 2 -6 31 -11 12 45 1 37 7 34 -8 27 16 4 19 16 -100 -22 11 -41 41 64 9 -7 -10 18 18 7 19 44 -11 80 25
3472 25 -22 41 -15 -33 -5 -21 -22 -41 32 8 14 -9 8 -8 17 -6 -6 12 26 -21 11 16 33 36 27 0 15 17 -29 -31 6 -17 31 -37
3506 -37 39 -3 12 -2 39 34 24 27 -6 -18 3 -12 -9 -7 -12 31 -32 21 42 39 -28 -49 29 31 -31 7 7 31 -3 -35 2 26 41 18
3540 18 40 -9 5 43 33 23 14 -37 19 -29 -4 18 -36 -24 -8 26 48 9 35 38 -5 33 -29 9 -2 -10 -18 -2 21 14 -20 -5 -20
3573 -20 12 33 2 50 -44 0 37 -1 -22 -26 16 -18 53 12 -30 11 -2 1 0 30 45 -23 -25 8 -27 78 -12 -59 -33 -41 43 -51
3605 -51 53 1 47 -16 -8 -15 -34 29 6 -23 2 16 4 46 -27 10 12 28 52 12 -3 -2 -17 -26 12 24 22 39 20 44 14 -4 0
3638 0 3 21 -29 8 8 -50 -14 16 -38 18 -19 30 61 -11 -9 -12 31 -36 20 38 24 -52 -37 -4 45 -20 -20 -55 -6 37 -9 5 13 9
3672 9 25 -3 -22 27 19 17 -19 -7 0 45 31 -8 -24 7 9 22 -15 37 12 -39 -23 -88 -10 -77 8 17 -29 -44 42 2 12 18 -33 34
3706 34 -1 7 -50 44 -6 -5 -26 -57 40 2 -14 -1 25 -1 44 22 -1 -39 33 3 -29 -34 26 2 -34 -25 8 -24 31 -29 44 -12
3738 -12 6 60 27 -20 -1 2 -23 -44 9 30 -21 10 -6 39 21 31 14 -58 -18 20 27 23 8 -25 4 -3 -11 18 3 -21 -12 18 -22
3771 -22 4 -3 -9 36 41 13 -63 10 -24 45 54 -36 23 -6 -11 -12 -30 -12 33 -10 -49 1 18 13 4 -42 -27 -5 19 -23 5 25 23 -20 -17
3806 -17 6 -6 27 -1 -14 46 36 -9 29 -49 47 11 -37 5 5 22 -3 -13 32 40 -50 -24 -55 -8 -9 31 7 -21 26 10 -3 11
3838 11 -3 24 -5 5 59 40 -2 24 -1 -13 -23 -19 30 -41 40 -9 -37 -21 -6 -12 -27 26 1 -48 -58 -38 46 48 -9 -27 -26 7
3870 7 7 60 1 -21 -10 -21 0 -20 2 -63 6 -38 -6 39 -5 11 -9 20 26 42 24 12 -13 20 -17 -15 15 -31 52 -30 5 0 -14
3903 -14 -23 64 19 46 26 -35 -12 -10 -8 1 -33 12 25 -15 14 -28 -44 2 52 12 4 4 30 -16 30 3 13 4 6 0 11 36 5 4 -54
3938 -54 5 16 33 79 -1 23 -36 -64 -1 23 -35 39 -11 35 54 -35 12 18 20 30 -25 -67 -4 12 6 37 46 21 -54 26 0 -1 3
3971 3 7 -20 -23 61 -42 -45 -16 -14 30 22 37 3 -55 23 26 11 28 -7 -30 0 47 12 39 17 22 -11 22 18 -15 22 -14 -7 22 16 -58
4006 -58 -5 40 -20 -18 1 25 -4 41 79 -37 11 25 13 17 -45 39 0 41 11 -32 8 -29 9 -12 23 13 -18 12 -69 5 48
4037 48 32 36 -3 -35 -18 -44 0 -2 13 12 -1 1 -7 -36 -17 -24 -68 3 24 -64 -18 31 -51 -19 -13 13 -25 -11 6 -6 -30 -42 -7 -35
4071 -35 -49 -44 14 7 -21 -55 19 56 42 -5 -1 17 -23 -3 36 12 4 9 -17 0 17 19 -13 16 25 -28 -28 -1 18 -53 26 24 29 -22 -33
4106 -33 -16 29 -8 -57 -45 -22 28 -10 -21 -44 -30 -5 19 -19 -1 15 -25 56 -50 58 30 7 32 -14 13 -21 30 32 25 4
4136 4 -21 10 6 25 40 31 -1 30 21 25 -29 -21 30 -14 -5 30 -58 -4 24 -11 15 -51 -5 -32 -21 -12 11 1 -47 -44 0 -14 30 -20 -21
4171 -21 -5 2 27 -12 -22 17 55 -16 -16 18 -33 29 10 -16 18 12 5 -19 39 -30 24 -9 -21 -22 -28 -28 1 41 8 -9 -7 24 -4 1 -24
4206 -24 -5 46 -16 -5 16 23 11 10 -26 7 -12 3 19 20 15 33 6 26 19 -15 -4 -12 0 22 4 5 19 -19 -25 30 -23 -1 17 39
4240 39 8 -14 -52 -21 -23 -31 -68 32 -19 -31 13 21 13 22 -23 -2 36 -13 -2 -35 -60 -45 -6 11 -15 -11 -7 -50 16 13 21 38 -53 24
4274 24 -28 23 49 29 -42 -24 -28 -10 32 -42 -20 -19 -56 31 -7 20 9 -10 -9 -42 -32 -25 -17 -7 15 21 -35 -7 7 -2 57 14 13 -20
4308 -20 16 -4 37 -11 9 -1 -22 -30 -9 -5 -1 -13 4 30 -30 -6 5 -1 11 -42 -2 21 -17 0 4 13 17 -26 -33 -23 7 22 6 8 10
4343 10 41 7 -1 8 -9 -2 -10 10 -45 6 0 -10 12 -8 60 31 3 -5 -29 -8 -59 -39 7 10 4 47 30 16 20 -5 29 1 34 -28 38
4378 38 24 11 -1 -41 -39 -41 59 -15 -19 -27 -28 -9 -20 24 7 50 45 -9 16 29 -7 -9 -36 -13 -18 48 -37 4 0 22 -53 33 -34 -23
4412 -23 -17 3 -33 13 8 -19 17 -9 -4 27 24 54 -3 45 17 16 -6 16 -32 -21 51 -50 -22 -1 17 -27 -1 6 20 47 37 70 -21
4445 -21 1 24 -6 -17 -69 9 -10 24 -16 26 -32 21 -29 -7 -13 -42 -54 27 -31 29 47 -1 -9 -48 -37 67 18 -32 -35 0 -1 65
4477 65 -43 8 12 -1 27 7 -22 28 19 17 51 -23 27 -17 -36 14 -13 40 -49 -39 -61 -43 -37 -5 16 23 7 -13 -35 9 21 -3
4509 -3 -9 -12 -25 52 -4 -1 25 -14 -1 -21 -3 21 -30 20 2 -27 26 46 -30 9 -7 -25 31 57 -28 34 -36 25 -35 -16 12 -3
4541 -3 0 26 -6 -16 1 2 3 58 -12 13 16 5 -12 -7 14 65 22 -3 -16 37 -25 -49 44 -27 5 -39 4 35 2 -14 -10 25 -38 27
4575 27 22 -3 6 -11 -1 27 -33 -31 -4 -34 13 -17 19 3 -20 -17 -38 -3 3 15 -3 3 -2 34 -30 39 40 60 13 51 24 22 -4 7 31
4610 31 -46 15 -7 -6 0 -16 28 -11 -20 -21 20 -8 0 -14 3 -3 -4 1 20 5 -4 51 28 46 -32 -5 -25 -34 -3 -15 -39 -37 -57 22 -44 -6
4646 -6 40 -45 13 24 -51 -4 -1 30 -14 -9 26 -14 18 -45 -22 -23 16 -2 -20 7 -49 84 -10 4 17 34 35 -27 -20 -12 2 29 -34
4679 -34 -26 1 -18 -33 -4 37 -9 73 -21 -21 6 45 89 18 4 -8 -36 -50 -6 19 16 -22 -15 -25 0 -21 5 2 -43 11 50 42 48 -14
4713 -14 -8 -1 -10 12 -3 3 -70 -20 -30 -28 10 29 -8 24 23 -14 -48 27 -18 -47 27 -40 -13 -32 27 -22 -19 7 18 -64 -56 -49 3 -44 -35
4748 -35 -6 -47 -4 7 -19 32 -31 3 -37 3 -31 -5 -32 2 7 2 31 24 44 -19 59 0 -53 23 34 -21 -24 -24 -7 -28 30 53 50
4781 50 -35 -5 8 -16 -32 3 -21 -6 -47 18 9 -31 -4 2 -23 -22 -13 41 -39 28 10 23 -59 -42 25 15 16 33 -37 -75 30 -13
4813 -13 22 18 -50 -2 -10 -17 -14 -5 -16 41 56 1 -22 9 -7 -8 -19 -1 -1 28 28 -17 -7 -27 -18 8 -39 -22 -2 -1 -9 7 -16 -20 -23 -15 -29
4850 -29 -12 -17 44 11 13 12 -15 -89 -23 -9 -20 3 -3 -7 -4 -64 9 10 -17 16 -7 0 40 3 10 25 33 32 19 -18 -14 -25 18 2 -9 16
4886 16 -37 33 -12 19 26 -4 13 -49 31 58 42 0 71 -4 -24 -15 -28 47 -49 18 18 5 -31 32 -32 29 -6 -11 7 25 -37 -20
4918 -20 -28 -29 -8 5 52 5 -26 9 11 6 -32 10 9 -32 29 9 -52 -35 8 -24 -65 7 8 28 16 23 13 -28 4 -25 -17 -30 -9 -65
4952 -65 -30 55 22 12 9 3 7 65 27 -29 -16 -7 -64 31 5 -8 2 23 20 12 -10 13 38 14 47 7 -17 -65 40 18 -1 81 40
4985 40 -45 50 9 -28 -30 13 -3 -4 -12 6 72 -53 -8 11 -11 11 10 47 -32 -8 -9 -19 -45 70 -42 48 -55 15 -37 -38 31
5016 31 -27 -58 -25 -34 -2 6 26 1 -27 -20 -42 57 -26 26 31 2 34 4 9 21 -46 44 -69 -19 78 -7 -12 -16 -40 -15 -23 28 67 -25
5050 -25 -30 -12 3 -54 14 67 -5 14 -22 -1 98 -21 -42 40 -15 24 -4 5 -5 -35 25 29 2 -59 -8 -54 8 0 27 3 4 -19
5082 -19 -32 3 59 3 14 7 9 -4 -1 -5 -25 -9 -16 9 32 -19 -19 -49 27 9 -46 50 -26 76 -35 -5 22 -41 -22 -55 36 -22
5114 -22 23 24 9 -49 30 7 47 54 -13 -32 16 -48 -22 -13 -1 -45 -59 0 -36 35 -31 69 14 2 -10 -68 -25 -56 -14 33 -10
5145 -10 -52 -31 45 -1 -44 23 -26 43 -22 22 -45 -28 -5 20 13 10 -30 14 -6 -37 -20 14 -59 15 -35 1 -40 44 3 -1 38 -38
5177 -38 -1 2 24 -18 28 14 -16 33 -20 -56 -17 29 -46 24 11 15 -11 20 -18 3 3 -6 -10 12 13 17 -28 -26 8 -36 -45 6 -13 -60 2
5212 2 -10 -39 -57 18 2 9 32 -4 15 -13 -11 -46 26 25 -24 8 -17 -42 50 -16 -4 12 2 44 -19 3 5 -23 -5 37 -29 6 -11
5245 -11 -46 0 16 6 16 13 76 37 -7 -21 -38 22 -66 3 45 -100 -2 -11 -19 -4 26 40 37 33 5 44 -6 -2 4 -29 -14 12 -8
5278 -8 -44 8 6 40 -43 40 19 -43 -26 -7 -33 -5 3 32 -23 11 -35 7 -53 15 23 12 73 37 50 -17 6 -27 18 -50 8 61
5310 61 -5 -53 26 -21 -10 -34 10 -15 6 88 -16 33 53 33 23 20 10 13 57 60 5 38 -36 19 -15 15 -97 7 -16 20
5340 20 29 -12 -43 -11 -55 -29 0 -11 39 -3 -54 27 40 -2 -42 -11 16 11 21 1 -26 -38 20 -4 19 -24 51 3 4 7 7 -33 11
5373 11 -8 -9 -50 -10 26 13 -11 -41 5 -15 16 16 20 -25 -37 -32 -46 -44 16 -27 27 11 -40 6 52 -5 5 24 22 -4 -24 -37 -83
5406 -83 31 -23 -16 -20 17 28 -3 21 39 11 22 22 -53 23 18 9 55 -27 3 -28 -36 10 -54 -20 4 -17 -9 31 -18 23 -55 17 -15
5439 -15 -4 24 -1 2 35 -75 5 15 -22 19 27 -7 15 30 39 -12 -20 -5 2 1 11 5 -30 -1 9 -35 11 4 0 15 68 -40 17 49
5473 49 -12 27 -43 -20 15 3 -4 39 -96 51 10 -12 -10 44 1 36 -40 -16 -20 4 -3 40 20 -1 -55 -6 -9 26 11 -30 22 6
5505 6 32 58 8 6 6 -29 -14 -23 25 -2 21 22 -17 10 22 9 4 -43 3 -14 11 12 -27 -26 -13 -53 -28 46 28 76 21 -6 1 7 -24
5540 -24 -42 9 6 3 14 56 -24 -3 33 36 23 16 34 -45 18 -22 -12 -23 -8 27 2 -8 -17 52 -33 -10 49 -15 -25 18 -64 22 9
5573 9 24 -8 24 25 20 -7 13 14 -20 -67 -2 52 1 15 20 -14 -21 -17 -5 58 -10 -11 -20 -3 2 -47 26 -25 22 50 22 -33 -15 16 2
5608 2 24 -37 4 -23 41 -17 30 14 -2 30 20 -26 -2 -5 17 15 -91 44 -49 38 7 41 19 13 -22 54 2 27 -49 -13 -12 22
5640 22 -2 -15 8 4 -25 -9 26 54 14 -22 -27 -4 53 -18 3 -34 -1 24 7 31 31 18 -21 -8 21 -26 38 -14 13 -47 -9 -11
5672 -11 28 -48 -3 -31 28 24 -2 -21 -40 1 -3 -14 15 -5 -22 -1 3 -24 25 21 0 6 9 -31 27 -32 -3 17 22 8 -24 -63 -72 -7
5706 -7 -33 -37 9 -2 -1 -27 9 6 -12 -28 15 -34 -12 2 -13 -13 -6 -13 -12 -23 13 19 -7 15 12 25 -52 -19 -5 -42 26 14 1 53 24
5741 24 -32 15 35 22 -33 19 43 47 11 -3 -9 11 22 19 29 11 7 -32 30 -20 14 -30 26 9 -28 3 28 -15 -10 13 -46 -21 -37
5774 -37 8 -10 5 -28 -14 19 4 -4 14 -47 12 25 -42 19 -9 -7 10 26 -24 62 30 33 -5 10 -67 -21 -36 -9 -4 21 30 -34 -18
5807 -18 41 -29 -24 -27 -47 -51 9 15 6 11 32 -54 -34 -46 -4 1 2 19 -54 51 70 2 6 -16 2 3 14 30 -7 9 29 -18 31 38 -26
5842 -26 33 -25 -16 -28 36 34 12 -13 20 18 3 -31 -26 -20 28 -24 2 -65 2 18 -38 -29 19 9 -28 1 -7 -20 -12 15 19 0 32 8 55
5877 55 9 8 4 11 31 -27 -29 8 5 -13 8 -34 26 38 -21 -7 -49 -18 45 -27 -15 1 -37 48 39 -5 -5 25 0 -35 -20 -14 39 -1
5911 -1 -31 -9 24 8 -7 34 -11 32 22 1 53 46 28 -35 -8 -22 -54 -9 3 -7 0 21 17 -51 -26 -13 -67 0 3 -2 9 23 38
5944 38 29 -17 1 -6 -32 -21 -3 18 -13 -8 -57 9 50 24 25 -15 18 10 -15 0 19 -38 23 -10 55 -13 -7 0 16 -15 -21 -59 14 -26
5978 -26 46 3 -26 -52 22 13 -57 -6 -13 3 -28 -14 27 17 -7 68 -31 -8 -42 32 -5 -16 31 -9 -28 -33 -7 -34 -44 -18 -11 -31
6010 -31 -28 -17 -27 -21 13 -24 20 -4 0 -17 9 2 -14 -30 17 19 28 9 -51 -19 7 -6 -16 -27 -18 -14 -30 14 -37 -45 19 -15 -18 -42 -11
6045 -11 2 -21 17 6 44 -4 4 20 -31 18 0 -7 -16 7 34 7 9 -39 24 -8 3 7 14 -14 2 -12 -11 -19 -27 19 -36 24 -28 6 0
6080 0 -2 -18 29 7 33 35 8 -63 23 -21 32 11 3 10 -56 -21 21 7 3 10 -35 16 -32 -14 -15 -25 5 25 -24 -14 -31 28 -4 -44
6114 -44 -35 -17 -7 34 -24 35 5 21 -2 -23 -14 -20 12 -13 -1 -7 26 -27 -25 -6 50 7 -28 -29 -1 -11 6 -5 35 16 -26 13 -39
6147 -39 -63 8 -5 -19 -16 -16 -15 -6 5 -50 -14 12 -69 -31 -33 0 -20 11 15 55 87 -20 -7 20 8 18 31 3 -1 -3 -6 0 -17 -58 -29
6182 -29 -5 -12 -29 28 -1 0 -3 -29 -22 -7 21 13 -13 -14 44 -4 35 -3 0 -10 2 31 -11 -23 3 2 18 23 -2 24 -19 4 -33 -55 -20
6217 -20 -7 -24 35 -51 -9 -26 -5 -10 -53 2 43 76 -10 -6 7 -12 39 39 -35 -2 25 -16 -13 18 -40 -14 32 -19 -4 53 9 -1
6249 -1 14 28 -59 18 78 22 13 -10 -8 -52 -2 -15 4 12 8 -1 47 41 -19 -28 -73 42 -24 -8 -50 -20 9 8 1 -24 -5 -46 -5 3 -35
6284 -35 -35 -71 -45 -39 -40 36 5 -66 -39 -4 31 -40 6 23 -38 17 -5 9 39 -20 30 -41 -31 -32 -43 16 -7 -4 14 11 1 -35 -20
6317 -20 24 -18 -67 10 -61 -77 -34 -24 -32 37 -7 -19 -44 31 22 15 -16 -23 33 -3 28 50 3 -21 -43 7 -9 -34 -13 4 18 -7
6349 -7 1 -38 15 -1 18 -3 -51 7 -1 -7 -41 38 -22 30 -15 -41 36 6 -63 -13 14 -7 26 -30 49 -14 -25 -21 -8 -7 1 -64 -19 -45
6383 -45 7 39 -34 27 7 15 -9 -29 19 28 36 13 -8 1 -3 -2 -17 -20 -3 5 -7 7 -49 -1 -3 -35 -10 9 -42 12 18 -8 -11 -7 -8 19 -20
6420 -20 -12 17 4 15 6 -26 -35 -36 39 -17 17 -1 18 24 -2 -35 -56 39 20 29 11 -24 -4 -14 -14 23 24 4 12 -15 15 48 36 38 3
6455 3 7 77 -4 -8 -26 -20 -59 -17 4 48 -23 42 -18 -63 -1 -10 27 14 -49 5 27 -10 13 -27 17 13 -18 10 -34 32 -13 -43 -1
6488 -1 16 38 13 6 -5 -5 -13 6 16 -10 -33 27 -40 28 35 44 10 13 34 31 31 18 20 12 -16 50 9 -7 -15 10 -11 10 1 -30 -41 22 15
6525 15 -16 10 -8 0 2 -21 24 9 3 16 -18 -29 -11 12 21 -11 0 -27 -5 1 -16 25 -36 21 -6 -74 16 22 23 27 35 48 -23 -55 -33
6560 -33 -30 8 83 -19 -26 -12 -7 28 -19 -35 -14 -1 0 2 -26 22 -17 -8 19 -4 15 5 26 -1 14 18 10 -18 -33 14 32 -9 20 18
6594 18 -18 -5 14 10 -6 -44 -52 -28 -25 3 -22 -34 -43 -12 -14 5 1 35 -12 -52 5 -46 -62 2 -30 46 0 8 -33 -43 26 21 -32 -2
6628 -2 33 -35 -5 5 60 -14 -4 8 -39 27 17 6 3 -9 -50 6 -16 42 -13 -7 0 -35 -26 28 10 24 -44 -66 9 13 -20 8 -3
6661 -3 -4 32 -19 -20 -2 -17 45 13 -1 -39 -20 51 48 12 38 -24 -7 21 -2 -40 -31 -17 39 30 -50 29 45 1 -1 6 -1 3 -40 -44 8 -8
6697 -8 -32 -29 4 31 15 -19 23 3 -23 -9 -40 37 12 15 -1 -23 21 -32 32 -23 -26 -22 10 27 -19 2 73 22 -38 -47 13 -35 37
6730 37 -44 28 -32 8 -29 -9 34 26 24 8 23 46 -15 7 27 -1 -55 -19 -15 4 -38 27 -6 4 -17 23 1 -59 -8 -19 34 26
6762 26 -40 -29 -3 12 -1 -10 -8 -6 -21 -38 -9 -28 -26 41 83 42 45 20 45 -6 -64 6 26 26 11 -17 -9 -10 2 -49 -2 38 -36 11
6796 11 -4 -27 7 17 10 47 19 -14 9 6 -17 5 42 39 48 -60 23 -12 -25 -32 15 -17 16 -13 -15 18 -32 -13 -11 -63 1 53 -58
6829 -58 -48 9 -18 -25 60 11 -8 37 -33 -40 -23 36 -13 32 -31 7 15 -33 -11 19 6 -18 9 10 39 40 33 -23 5 -32 15 22 24 1
6863 1 -25 16 -45 -67 -1 9 -40 -1 11 -12 -3 -68 7 35 13 76 7 -41 -15 7 -33 -7 52 -48 -50 -26 21 -10 -2 -13 -2 -8
6895 -8 -22 18 6 26 62 -11 51 -28 21 -62 10 9 3 -5 56 43 27 16 -58 -61 -7 22 -33 4 -17 23 -16 -1 1 -20 20 -20 23
6928 23 -42 -8 -15 21 -11 40 24 25 -44 -26 11 30 -5 34 -15 18 -31 -33 15 23 8 23 59 -1 34 -35 29 -15 -85 -56 -50 43 88
6961 88 -59 -61 -2 27 -5 -37 16 -16 -10 28 -6 -11 3 -30 -38 -18 -18 13 -4 -31 -5 -33 31 -24 -37 -8 -13 15 7 -28 -10 25 9
6994 9 -69 -64 -36 38 -42 4 4 -42 1 7 -18 -38 -33 10 -6 17 -4 39 70 -1 35 18 -31 16 20 -4 -17 -10 -9 -29 -11 -24 -2 22
7028 22 71 -1 6 15 -38 0 13 4 -43 9 -33 -46 -35 -19 15 2 9 -18 24 -2 -66 9 -3 -25 8 -28 67 26 5 -33 -31 -24 2
7061 2 -17 37 6 28 45 0 -16 45 14 -39 -2 58 -16 65 28 -22 13 -33 13 -38 27 1 -38 -32 -55 -25 29 10 33 -20 -52
7092 -52 -60 1 37 43 17 -33 28 -22 -44 -25 -18 -46 9 -9 -11 18 10 13 14 -14 -49 11 -19 -24 -21 -13 -13 -26 20 -57 -24 42 -29 -30 -4 41
7128 41 0 9 -9 -8 -11 -22 -29 -3 -46 -23 -33 -42 -11 -13 24 -34 37 -36 8 -29 21 -18 12 -28 24 39 -15 41 16 17 -45 17 -11 -5
7162 -5 -34 -34 -37 -6 26 16 -12 28 -9 -28 -25 9 58 59 1 -20 -26 5 -7 -8 -24 -39 20 30 0 10 7 14 26 -20 -33 16 -8 7 -36
7197 -36 -35 55 4 -35 19 36 -6 8 -28 14 44 7 -1 -2 -17 -40 -16 -16 -47 -6 1 -24 -9 -20 10 -28 23 47 22 -8 33 -27 -25
7230 -25 17 -2 36 11 23 4 26 -26 7 -56 26 14 -52 14 12 31 30 35 -48 -10 5 -1 46 35 -32 12 -16 28 -7 -6 -18 -39 25
7263 25 5 -21 -10 35 54 13 -29 9 -34 23 49 30 -33 31 -1 28 6 25 -13 50 16 19 15 17 -5 6 -13 -5 2 -1 -40 -3 -15
7296 -15 -8 14 -74 0 -29 -18 27 -39 13 -35 -15 -48 6 -43 -71 0 -37 -14 -24 19 2 14 -40 16 -1 -31 34 22 -28 33 55
7327 55 -12 -33 -19 -17 -35 -6 -9 -10 -39 -25 -24 19 3 32 -15 12 -25 -69 -37 -16 -11 -28 -15 -31 -12 -2 5 14 -45 -3 24 -9 2 -36
7361 -36 -3 -30 -50 -17 -24 -1 -21 -8 -22 41 -7 -14 -25 13 -11 2 -15 -6 10 -28 0 -3 48 -60 41 40 -10 15 22 26 8 4 -56
7394 -56 3 30 -5 27 -21 9 -2 -32 -12 -18 29 -55 -38 11 -19 49 4 0 -21 -42 -3 57 22 72 -31 39 11 -31 -17 32 1
7425 1 8 -16 14 -25 4 -24 2 -35 23 64 -9 20 14 0 -14 -16 3 24 39 42 -10 -1 31 -17 -45 -25 -10 -32 -16 -12 4 75 -25
7458 -25 -43 29 -7 6 -29 34 21 -16 6 11 -6 -57 3 -9 20 -12 -6 6 -3 13 10 51 -4 -9 10 7 -48 -26 -24 -37 -15 11 -17 43
7492 43 32 16 15 -13 52 16 -10 16 17 -39 21 5 4 -5 -6 11 -46 -55 -15 26 44 19 13 -63 0 -2 6 12 -39 16 33 -31 53 -13 50
7527 50 -41 -7 -19 -48 9 -74 18 20 4 -17 11 18 11 18 -18 -9 -4 -15 21 -11 11 -9 13 -18 18 -11 22 18 15 -28 -7 30 21 -27 -16
7562 -16 5 -23 29 58 -68 -38 9 -41 -65 0 37 28 34 51 -57 -54 -31 44 -19 4 18 -28 -20 -24 -64 -15 -5 6 49 61 -34 -35
7594 -35 -40 22 10 0 -1 -7 20 -57 67 -24 14 30 14 24 55 5 49 31 26 3 5 19 5 -50 -91 12 -6 -30 17 -7 -26 -35
7626 -35 -22 46 -20 -4 -26 -2 -3 3 -11 -59 45 -34 0 -33 3 -39 5 19 -18 -25 -9 -1 9 18 -14 11 -36 -66 -14 28 2 27
7658 27 22 44 -49 63 -28 -23 -12 -33 11 -38 20 49 -34 11 9 -50 -17 8 44 -46 -39 39 43 -17 -28 -20 5 -44 -8 7 -13 -1 60
7691 60 13 -41 70 -59 -23 28 30 -43 -58 0 -6 10 -24 31 -32 -25 -6 -9 -22 -6 -3 13 1 -6 -17 49 -23 -26 -7 -63 -9 21 15
7724 15 -25 -24 18 17 -39 -26 1 -10 -23 30 6 -8 -30 -47 -4 12 6 -2 -23 -26 -8 -51 37 -28 -21 -27 -24 25 -31 14 35 16 15 -6 -54
7759 -54 -40 -1 17 -5 -14 -1 -31 23 -26 -39 49 2 17 -36 -7 19 -17 28 83 -28 16 0 36 14 18 13 -16 13 -10 -25 22
7790 22 7 8 20 -32 -12 13 -22 -39 -10 18 9 -10 29 16 13 24 -67 6 -13 2 12 -72 17 -8 -2 -10 -57 -8 -26 4 -6 -24 22
7823 22 -24 -50 -11 -14 -17 41 -15 42 29 -31 6 -8 -45 -24 -33 -19 -16 -67 -15 -32 7 -22 -25 2 -20 13 36 -57 -47 -61 -64 35 -2
7856 -2 -22 -28 -8 0 11 -23 33 17 7 23 3 -13 25 -9 8 12 -65 -37 -23 70 32 59 13 -39 12 3 -27 -36 -22 -18 -25 -10 -13 10 12
7891 12 -27 -38 -31 -41 -20 47 -2 -76 4 -7 15 -3 13 -23 52 2 -15 24 -31 -32 1 -7 21 19 -10 7 23 -29 0 8 -23 1 -10
7924 -10 -27 14 54 29 -11 -17 23 9 -8 -37 -33 25 -13 -40 7 -1 33 7 30 -4 -28 13 38 7 18 -11 4 -46 17 56 -1 -64
7956 -64 -65 -57 -10 43 13 -14 -45 18 2 -11 1 -14 44 -36 -13 33 20 -17 -11 42 -10 -30 -24 -28 10 -8 -11 39 -4 -56 -37 -15 -26
7989 -26 12 -19 39 14 -38 -7 2 21 -8 -9 -16 11 62 29 18 56 15 1 0 34 16 1 -26 13 -25 -42 20 -19 26 -6 19 12 15
8022 15 -2 -23 8 12 -7 -11 12 -12 36 -7 29 7 -7 -21 4 19 59 14 22 -39 13 13 14 -20 -2 -18 -35 55 2 51 42 -20 28
8055 28 -65 -18 -13 28 -18 -7 -21 -41 -22 39 26 18 -46 -2 53 -37 -46 -29 50 57 3 -37 5 -3 6 -7 -1 7 -47 -34 20 13 3 -10 -28
8090 -28 3 -40 49 -7 -18 -36 -35 36 -18 49 2 -28 -15 -22 50 12 -4 18 37 45 -62 11 -24 0 -42 -14 -34 -11 61 30 -21
8121 -21 1 -8 38 16 -3 13 -68 5 11 23 -28 -49 -29 10 24 -13 21 16 16 8 -2 -11 -53 -15 -7 -12 -4 -6 -28 -15 35 -17 -17 3 -36 39
8157 39 12 29 6 14 14 18 7 12 42 3 18 -2 44 32 -29 34 19 -6 -1 37 -91 -30 28 -7 25 21 -3 -7 20 -13 1 -3 -14 39
8191C9
$$ Imaginary data points
##PAGE= N=2
##DATA TABLE= (X++(I..I)), XYDATA
0 0 0 0 0 0 0 0 0 0 0 0 0 0 -8 8 -8 8 -8 16 -16 24 -24 32 -40 40 -48 56 -72 80 -88 104 -120 136 -152 176
34 176 -198 224 -248 280 -312 347 -384 430 -476 528 -584 644 -712 784 -864 952 -1049 1156
52 1156 -1275 1405 -1553 1720 -1911 2129 -2383 2682 -3043 3485 -4046 4779 -5787 7265 -9658
67 -9658 14169 -25802 124218 228737 31447 -59219 -100925 -68904 -74296 -69645 -46570 29544
79 29544 70525 43867 -46951 -106845 -109204 -64924 -31101 711 49299 127271 174345 147462
91 147462 54974 -28452 -64554 -64087 -68644 -75113 -54446 6117 56528 44892 -22252 -74289 -64885
104 -64885 -16478 9325 -4022 -13058 29770 103106 136897 92035 6278 -55605 -68814 -60614
116 -60614 -59185 -55214 -21896 33508 65953 44894 -7397 -44789 -47420 -33949 -25726 -14858 20104
129 20104 71951 99215 73308 14250 -32557 -46737 -45689 -50606 -51733 -21571 37349 80152 64982
142 64982 3835 -49983 -58955 -35238 -16568 -15888 -9972 22264 63538 75353 44160 -4260 -36461
155 -36461 -43661 -39937 -33987 -15960 20795 56990 61351 27429 -18902 -47411 -52081 -47190 -39907
168 -39907 -19035 23195 66455 76752 44846 -2117 -29991 -31900 -26616 -27085 -20926 9037 51371
181 51371 69153 39995 -17414 -61846 -68991 -48638 -23466 -1657 22976 48394 57208 37903
193 37903 2807 -22807 -26459 -17714 -11154 -6175 7976 29562 38648 20610 -13586 -37778 -38677
206 -38677 -27527 -21249 -18268 -2993 27229 50744 44542 13386 -14464 -18587 -7330 -3009 -11118
219 -11118 -14211 2093 26546 34033 15148 -13447 -30505 -32110 -29159 -26230 -13743 14226 43569
232 43569 50571 29271 -1319 -18528 -19029 -16689 -18186 -13361 7894 34591 41737 19085 -15005
245 -15005 -33954 -30856 -21492 -19383 -16938 982 30897 48324 34973 1630 -23147 -24185 -12341
258 -12341 -5813 -5515 2115 20829 34599 25758 -1519 -24980 -29714 -22692 -18849 -18484 -8348 16355
272 16355 38431 36961 11813 -13951 -20886 -12853 -6698 -7632 -3003 15977 36840 36292 9072 -23948
286 -23948 -37940 -30162 -17878 -13100 -8462 7723 29916 37570 19615 -9609 -25199 -18619 -3443
299 -3443 4631 6499 13374 25157 27181 8726 -19628 -35453 -28998 -13154 -5111 -5317 -753 13825
313 13825 25789 20009 72 -14237 -10264 3146 8682 2718 -1359 6703 18270 16421 -2128
326 -2128 -21600 -25734 -16647 -9151 -10044 -9748 2507 21383 29560 18545 -540 -10720 -7930 -2753
340 -2753 -3314 -4085 4145 18634 23874 10170 -13490 -28533 -26892 -16877 -9674 -4727 5803 21908
354 21908 30823 21654 37 -16261 -16687 -6915 479 2804 6516 14815 19445 10175 -9891 -25897
368 -25897 -26360 -15124 -4408 397 4834 13710 21371 17905 2870 -11939 -14812 -6821 1298 3424
382 3424 3936 8416 14163 11843 -1291 -16356 -21656 -15508 -6486 -1264 1837 7901 15458 16494 6873
397 6873 -6663 -13265 -9425 -1832 2686 4457 8074 13262 12800 2670 -11517 -19022 -15437 -6928 -1423
412 -1423 485 3781 9710 12700 7271 -3478 -10154 -7699 -558 3799 4024 4524 8052 10439 5946
427 5946 -4078 -12117 -12560 -8203 -4979 -4191 -1707 4823 11099 10662 3123 -4513 -6140 -3074 -892 -790
443 -790 1165 7420 13819 12634 2375 -9816 -15428 -13419 -9020 -5839 -1959 5518 13372 14431 6001
458 6001 -5503 -11028 -8221 -2381 1747 4789 9281 13624 11932 1665 -10974 -16890 -13510 -6393
472 -6393 -1608 1059 4942 9959 10878 3902 -6348 -10870 -6479 1231 5019 4359 4155 6975 8590 3741
488 3741 -5851 -12198 -10431 -4102 -40 -99 -40 3615 7866 6681 -426 -6979 -6818 -1863 1801 1654 1194
505 1194 4391 8902 8211 372 -8181 -10333 -5946 -1291 -478 -821 2055 7323 8527 2096 -6953 -10283
521 -10283 -5831 556 3134 2489 3389 7148 8807 3898 -4619 -9374 -6850 -1252 1387 265 -125 2903
537 2903 5478 2806 -4169 -8725 -6741 -1048 2499 2142 1871 5096 8868 7675 805 -6132 -7387 -3687
553 -3687 -431 -671 -1641 653 4702 5057 -521 -7493 -9466 -5190 493 3365 4153 6167 9307 9151
569 9151 2981 -5313 -9322 -6912 -1799 923 769 1084 3016 3317 -968 -7093 -9618 -5633 1436 6016
585 6016 6541 5679 6163 6095 2629 -3428 -7388 -6259 -1654 1440 989 -679 -524 661 -86 -3086 -5373
602 -5373 -3795 788 4407 4690 3515 3635 4790 4006 66 -4470 -5815 -3725 -1021 -527 -1248 -532 1804
619 1804 2668 339 -3263 -4551 -2216 1501 3518 3607 3747 4612 4198 968 -3566 -6154 -5104 -2207 -22
636 -22 586 1087 2243 2589 531 -2788 -4459 -2860 548 2805 3068 2925 3401 3449 1394 -2378 -5019 -4648
654 -4648 -2011 314 995 968 1780 2430 1388 -1422 -3757 -3694 -1347 1076 2270 2689 3355 3625 2061 -1375
672 -1375 -4246 -4537 -2322 135 1259 1632 2324 2707 1469 -1739 -4593 -4645 -1877 1447 2866 2790 2663
689 2663 2713 1682 -894 -3535 -3929 -1856 977 2214 1713 1068 838 286 -1433 -3226 -3322 -1187 1286
706 1286 2123 1470 1071 1551 1878 597 -1539 -2514 -1361 553 1046 15 -563 267 1496 1075 -1151 -2992
724 -2992 -2596 -634 965 1121 987 1705 2729 2365 1 -2459 -3038 -1589 128 737 757 1238 1912 1267
742 1267 -1103 -3411 -3658 -1591 879 1881 1743 1892 2355 2038 -243 -2862 -3514 -1538 1077 2076 1348
759 1348 507 525 631 -580 -2564 -3347 -1878 685 2149 1917 1169 1076 1224 400 -1259 -2335 -1501 346
777 346 1601 1301 483 291 522 -49 -1752 -2989 -2378 -188 1532 1692 969 799 1301 1217 -211 -1875
795 -1875 -2063 -406 1500 1940 890 -23 -180 -168 -1054 -2260 -2451 -1029 880 1793 1409 782 769 866 172
814 172 -890 -1292 -454 897 1360 626 -227 -320 -37 -395 -1565 -2241 -1458 116 1242 1220 736 753 1272 1111
834 1111 -20 -1266 -1390 -354 710 1000 522 164 68 -293 -1243 -2129 -2028 -760 790 1609 1573 1357 1187
853 1187 690 -473 -1528 -1502 -373 923 1340 934 240 -136 -532 -1269 -1971 -1890 -588 1003 1818 1530 822
872 822 352 152 -298 -818 -934 -339 674 1068 878 217 -242 -499 -856 -1244 -1333 -629 362 1022 964 639 496
893 496 430 124 -584 -956 -598 282 898 764 434 46 -48 -353 -927 -1350 -1041 -120 725 994 781 438 281
914 281 21 -456 -797 -597 170 757 859 561 223 31 -212 -690 -1219 -1021 -274 478 696 402 201 250 309
935 309 -44 -536 -669 -170 586 876 628 316 235 144 -349 -952 -1254 -906 -42 537 599 516 419 358 -20 -707
957 -707 -959 -514 417 1107 1026 613 358 63 -450 -1109 -1397 -1011 5 865 922 495 65 0 -245 -543 -756
978 -756 -382 518 1142 1135 576 -47 -297 -411 -616 -887 -777 -62 610 675 210 -176 -142 35 -87 -316 -374 105
1000 105 701 802 471 7 -72 -43 -212 -620 -800 -549 80 474 358 91 34 164 75 -324 -543 -323 253
1021 253 762 708 352 16 -13 -127 -498 -795 -669 -98 442 609 311 42 -70 -45 -317 -475 -379 77 594
1042 594 795 451 112 -68 -161 -314 -597 -601 -206 328 588 366 43 -75 -92 -287 -489 -518 -105 479 831 625
1064 625 269 -9 -183 -335 -572 -569 -332 207 546 488 171 -211 -355 -344 -425 -357 -82 408 770 695 323 -71
1086 -71 -246 -308 -322 -380 -162 121 406 329 45 -289 -258 -231 -177 -184 -73 192 454 514 281 -19 -72 -106 -191 -230 -377
1111 -377 -193 61 254 169 -3 -52 -128 -149 -232 -289 -56 245 542 458 262 103 -35 -195 -402 -523 -341 20
1133 20 304 272 143 -54 -129 -199 -355 -293 -72 321 533 534 316 76 -125 -281 -366 -324 -241 81 303 309 145 -44
1157 -44 -102 -217 -248 -216 -64 224 445 436 257 50 -87 -130 -265 -367 -255 -33 246 314 148 -28 -106 -150 -206 -264
1181 -264 -97 91 350 425 258 97 -46 -178 -240 -238 -238 -44 246 338 166 -19 -100 -146 -159 -190 -192 24 238 355
1205 355 252 55 -104 -67 -71 -118 -182 -87 27 216 162 64 -86 -65 -58 -161 -165 -181 86 246 279 220 76 39 50 -104
1231 -104 -277 -231 -36 171 241 145 41 -95 -132 -149 -257 -196 -6 256 368 265 107 15 -133 -164 -182 -178 -53 159
1255 159 286 185 33 -137 -229 -176 -210 -200 -83 241 386 234 98 -63 -115 -98 -125 -152 -93 55 258 176 13
1278 13 -135 -176 -105 -59 -132 -56 76 260 172 142 -2 -17 -38 -75 -115 -100 0 121 197 92 -52 -132 -120 -98 -123 -141
1304 -141 -40 84 206 175 18 -29 -81 -13 -32 -42 -18 91 154 124 62 -98 -113 -84 -103 -142 -94 12 136 182 105 34
1330 34 -10 33 -77 -108 -51 18 131 177 95 -7 -87 -185 -168 -193 -134 -17 137 257 157 63 -6 -73 -130 -78 -20 38 174
1357 174 236 79 12 -106 -203 -174 -131 -131 45 162 160 184 8 0 -23 -5 -8 21 53 103 80 38 -30 -119 -137 -160 -75 -101 -25
1386 -25 98 142 120 23 63 -1 47 -79 -70 -54 39 78 6 -1 -10 -3 -38 -90 -149 -34 -3 88 149 154 35 47 -24 -90 -70 -94 -75
1417 -75 41 146 87 12 -14 -99 -88 -150 -88 -19 57 162 120 14 20 -45 -15 -54 -27 -81 25 113 118 72 31 -12 -60 -99 -114
1446 -114 -49 25 109 122 55 71 14 -1 -67 -58 -4 18 78 158 99 -42 -9 -80 -76 -160 -68 -18 64 154 93 39 -20 -38 -7 -70
1476 -70 -41 -21 107 123 96 32 12 21 -59 -80 -25 -51 12 65 41 18 11 18 -19 8 -46 -28 -9 81 51 57 33 -9 -45 -64 -153 -133
1508 -133 -124 59 42 28 14 -2 -7 -67 -59 -84 25 77 148 85 45 -63 3 -75 -71 -63 -58 30 113 67 44 13 -29 -7 -69 -45 -28
1539 -28 55 83 83 92 4 -31 -57 -72 -88 -58 -1 78 30 55 -13 31 -69 -44 -53 -37 -19 73 59 48 49 -73 -66 -80 -75 -69 2 21 99
1572 99 58 77 64 -21 -35 -15 -14 38 3 88 64 35 29 -31 -28 -92 -50 -28 12 1 71 61 5 25 17 -41 -65 -42 -39 73 92 83 -12
1605 -12 22 -78 -53 -138 -53 -24 52 100 9 17 5 -55 -63 -111 -88 18 22 40 55 -7 3 -6 -80 -81 -9 4 15 19 73 -6 60 -16
1637 -16 -51 -83 -34 -32 45 101 52 10 7 -79 -115 -34 -47 -22 14 44 78 81 -11 12 0 -58 -49 -15 31 -8 45 61 -7 -8 -5 -34 -76
1670 -76 -41 33 4 60 15 19 16 -4 -91 -98 -9 -36 71 24 69 -5 6 2 -37 -9 -59 -1 -4 67 52 80 22 22 -70 -42 -49 24 89
1703 89 61 69 14 -12 9 7 -69 -48 -37 40 25 56 51 30 28 -62 -93 -72 -17 -21 50 54 59 -30 49 -22 -37 -61 -73 47 14 75 29
1736 29 2 -32 6 -16 -22 -14 57 13 88 21 56 12 -3 -100 -36 -64 6 6 26 55 9 28 -42 -19 -51 -60 0 55 61 16 47 -14 -26
1769 -26 -38 -86 -5 -23 -15 51 55 8 -23 6 -36 -61 -71 -13 69 9 76 49 -1 -27 14 -21 -9 -63 -77 23 18 15 63 -9 -90 -25
1801 -25 -24 -57 10 38 90 25 14 2 -70 -66 -88 -87 -31 67 -17 82 25 9 -1 -37 -10 -68 -29 33 78 118 65 2 -43 -71 -67 -13
1833 -13 17 48 14 12 73 3 -46 -39 -91 -55 -9 2 84 43 48 45 -52 -51 -37 -55 22 -6 58 34 -21 -2 -41 -34 31 -29 -28 59 73 103
1867 103 32 39 -13 4 8 -48 0 -18 35 48 23 -34 -13 -54 -99 -10 -7 36 3 82 34 43 13 -33 -6 -74 7 -8 -7 -6 55 29 -9
1900 -9 -9 -34 -39 -56 -26 28 34 14 37 29 12 -19 9 -47 -44 51 72 52 39 29 -61 15 -20 -50 -2 23 9 16 11 -7 14 -32 3 -73
1934 -73 37 15 13 -3 16 -22 -35 -39 -37 -26 -31 -40 7 62 4 29 58 -20 -39 6 -68 24 -15 16 27 25 18 45 -1 8 -10 20 33 -20
1968 -20 14 -11 12 -4 -17 -39 -6 -13 4 16 14 42 -7 -9 -34 -47 -2 7 15 17 -8 -5 20 18 -13 -30 -32 -30 1 49 16 35 28 15 -41 -16
2004 -16 -89 -54 -60 65 29 1 -16 -64 -27 -11 -17 -31 -14 55 38 24 57 16 7 -46 -7 -60 -22 -14 50 29 25 18 -33 -3 20 -3 30
2037 30 -35 17 51 55 -30 -20 -9 17 -21 -4 40 35 -9 31 17 17 46 -26 21 -49 -17 -8 -15 7 60 -4 9 -38 -19 8 -63 -11 53
2070 53 -2 -1 -29 -55 -27 0 -75 -37 25 23 51 -13 15 -16 6 -27 -14 -27 87 -16 46 9 11 23 -10 -2 -7 3 8 56 40 -27
2102 -27 48 17 -47 -16 -17 2 24 37 10 23 -42 -25 -20 8 -35 56 12 68 8 -8 38 -24 -42 -25 -34 -28 -6 17 58 4 -8 -35
2134 -35 -67 -27 -16 -27 -30 53 43 27 33 -33 -15 13 -36 -85 7 29 41 -1 -9 -72 49 -3 14 -52 5 15 -74 9 2 37 -43 22
2166 22 -55 -70 16 37 22 33 62 -27 16 -54 -4 -8 -60 -41 -11 50 18 -4 53 -8 -51 -46 0 -2 58 16 -6 54 48 -24 -66 10
2198 10 30 -37 4 -20 60 -1 26 4 -4 16 26 37 -2 2 4 44 17 49 -26 -5 33 21 22 -11 16 29 47 25 25 1 10 -5 -7 26
2232 26 15 21 0 -14 -57 -56 -28 5 -26 1 8 55 51 15 -38 -48 -19 11 29 -22 35 -21 10 -33 5 -19 22 -18 11 49 -24 -24 25
2265 25 9 -1 10 28 0 -4 36 35 -8 -17 21 -21 -8 -36 1 46 45 -10 -10 -18 -12 24 -29 -43 15 -14 12 39 25 16 40 -12 58 13
2299 13 29 13 32 82 -8 38 4 -18 -27 -41 -60 12 19 -51 60 -10 18 -20 -1 21 35 9 61 -15 -32 0 -29 59 -7 -13 -36
2330 -36 31 -40 19 -56 22 -3 42 -31 -37 4 -16 50 73 32 -22 51 -7 -43 -1 -26 -67 65 53 -3 32 -14 -5 -24 -3 -14 9
2361 9 10 2 -23 17 -37 -13 -61 -44 23 -66 -8 28 21 -27 11 -61 -22 4 4 22 29 33 -37 -11 33 -54 19 -24 -8 -44 -14 -14 27 5
2395 5 -80 -28 26 0 -15 13 -44 -10 34 16 26 -64 15 28 -53 14 36 52 -16 15 30 41 -6 -19 20 18 25 5 -35 19 17 68
2427 68 -25 -45 -53 -26 -6 -16 -38 -12 -4 11 31 -55 -1 -39 15 14 -9 -52 13 20 -22 2 -47 -9 28 26 -18 44 33 6 -20 11 27
2460 27 37 7 -39 42 58 1 39 27 -45 -43 -11 -25 19 18 10 -35 17 39 -8 -17 -26 -24 19 41 10 11 -16 -75 -73 -51 42 34 31 -14 -11 2
2496 2 -30 14 -28 16 -39 -16 18 22 79 4 16 11 -19 -30 -33 18 25 6 -7 47 47 -14 -1 67 23 -42 -13 2 25 -9 17 -4 -27
2529 -27 -15 -30 -23 15 -21 2 -33 25 -32 62 -2 32 -3 -47 -30 71 44 17 17 56 13 -29 -28 -6 -43 16 31 2 -15 -46 -5
2560 -5 14 -25 -58 10 45 -55 30 -47 -18 8 -3 8 -28 -4 -17 2 -45 16 -10 6 -51 -31 24 -15 -33 -23 14 23 30 -40 18
2591 18 47 3 -21 -36 -23 -32 -34 -10 2 -16 -15 -39 68 10 -4 -6 3 -26 22 -8 19 -22 7 -5 -61 -11 41 -21 3 24 -21 -16 -7
2624 -7 -4 2 18 -22 -65 61 18 -8 -20 22 -18 54 54 30 78 35 -39 -13 -5 41 43 -47 16 28 16 1 59 -25 -50 6 18 -47 40
2657 40 26 15 -51 -6 -65 -39 -18 -8 -40 41 47 36 -17 11 4 71 -27 17 -10 20 86 -40 23 16 -2 1 51 42 37 41 -49 69 20
2690 20 -50 -45 4 5 18 -8 -50 -61 -11 -69 17 31 -28 14 -7 -1 -9 7 -15 15 -15 -3 21 2 13 -19 -19 -8 -23 -15 23 2 -47
2723 -47 -6 24 -56 -33 -41 -15 16 -10 -8 0 32 38 -8 -9 9 -20 -16 -30 -37 57 -46 -24 -31 -4 -2 34 -10 6 -14 -22 37 15 -26 7 -9
2758 -9 13 66 -43 -44 -6 -33 17 -11 -10 27 -26 23 -26 16 0 -67 7 7 -9 -39 27 -3 -10 13 -25 5 -33 -1 41 -24 -22 4 -8
2791 -8 10 -57 23 34 -49 -5 -28 -48 34 -29 -17 4 -19 -39 21 -7 22 -8 -5 -14 -34 24 34 32 -5 -45 -10 -43 -30 -5 -5 -23 -76
2824 -76 -28 20 -33 8 61 -7 68 -14 -23 -13 22 -1 -11 13 -46 -20 -21 39 30 -12 -8 16 -30 -33 -13 9 45 38 -9 -4 26 -28 19 45
2858 45 37 35 54 -27 -37 -7 1 -35 -6 4 -30 34 -61 -24 -21 -51 20 29 38 14 -43 -28 -30 6 -17 -13 35 -45 -3 1 44 -59 20 -60
2892 -60 45 1 14 31 3 25 38 45 57 -15 -11 -36 -26 -28 39 42 -34 -36 -19 7 21 34 -27 8 -40 37 10 -20 13 -40 -31 -11 41
2925 41 -21 -23 -9 7 19 11 34 14 18 17 6 -11 -42 -3 -47 -32 -22 -19 7 -25 -10 71 -28 -16 -5 17 9 51 57 -11 -5 -21 -50 -41 5
2960 5 19 -44 -13 -3 68 18 2 -2 4 27 0 3 1 -34 -28 38 14 30 35 72 22 45 -45 -24 6 -62 -2 -59 16 -18 -1 -61 15 -23
2994 -23 -17 17 -37 -20 19 -40 33 37 40 10 18 -26 31 5 -18 43 -5 23 26 -23 9 34 60 -27 8 -3 3 -58 -1 -6 16 -29 -30 39
3028 39 -28 -33 -60 -8 -1 1 1 15 -55 -11 -17 -26 18 6 -1 17 32 -16 31 -23 1 2 -21 0 -5 31 -11 -9 -12 1 27 25 -26 35 53 -18
3064 -18 16 -9 -7 17 -65 -3 21 -41 -32 57 -31 16 -55 -23 67 11 -5 -8 27 -4 5 -47 -22 -64 10 -40 -41 -19 2 30 16 -11 11
3097 11 -1 -57 -19 -8 -20 29 5 -22 -35 33 -2 -74 8 3 -48 -6 -53 -41 14 -13 -36 -8 -24 32 -33 13 -25 17 -18 10 -13
3128 -13 11 -17 -46 -16 -47 13 -17 7 35 20 50 7 35 64 8 -10 37 26 5 28 -3 7 34 -32 -7 62 -31 54 -16 0
3158 0 -7 9 1 -27 -4 21 34 -11 5 26 -34 -35 -23 -17 0 34 38 47 -8 47 -45 12 -23 16 33 8 12 -57 18 -23 -14 6 -30 8 -33
3193 -33 -8 -32 -24 2 9 26 -26 -24 13 50 -3 3 -45 -8 47 -11 -15 -10 15 32 -21 21 -13 17 -21 -3 13 7 0 2 -18 21 19 46 55 -18
3229 -18 17 46 4 -12 -13 -67 -20 11 -23 -57 -34 -32 -12 7 2 67 -45 -19 -27 -6 15 -46 8 3 -4 -1 -27 34 -42 -3 -27 0 -25
3262 -25 -59 -11 51 -37 -15 10 30 -12 14 -50 10 -6 7 -4 -38 -5 -26 -21 -14 43 -32 6 2 -6 -2 36 9 28 -15 13 4 51 19
3295 19 16 15 -27 -11 30 -16 8 -1 8 16 43 15 70 68 31 -16 46 -9 13 -5 18 43 17 55 -44 8 -4 7 -44 8 -11 10 21
3328 21 -6 12 -29 -2 68 21 -24 51 -4 -23 -43 -35 0 -27 -23 -49 14 -16 39 -16 1 -11 -9 -6 -38 1 59 -26 -32 -34 -16 13 11 13
3362 13 80 -6 -1 8 58 3 -51 32 -13 -27 25 14 4 -22 33 -46 -33 -14 38 8 4 50 0 -1 -28 15 17 -5 33 17 15 -45 -20
3395 -20 41 -41 -49 33 50 -9 23 37 -41 -19 7 19 0 -44 -25 68 14 -37 6 31 65 -36 -29 26 41 56 18 30 10 7 -28
3426 -28 -2 22 11 -7 14 -5 -41 8 27 -19 29 19 -22 -42 8 -14 18 4 40 -11 -32 -31 6 14 29 -9 39 -28 -9 6 -19
3457 -19 23 -12 8 -11 32 -41 33 -33 17 -1 -14 -16 12 0 17 -39 13 -5 -38 -53 25 34 -6 45 -14 31 62 -36 6 15 -19 -5
3489 -5 40 2 5 40 -21 -25 19 2 -14 -15 36 -2 21 46 43 -15 -13 19 15 17 -18 -21 28 1 -12 -13 6 -7 20 29 28 57 19 35 -10 12
3525 12 12 -11 11 -1 32 -15 31 38 11 9 -11 0 6 -11 13 2 -22 -35 -62 -3 25 -72 -30 -20 34 31 -6 2 1 42 45 45 3 -28 4
3560 4 -12 24 7 -22 -3 10 -8 4 50 -57 -49 18 32 -8 0 -14 8 -6 30 27 -6 50 -28 -50 -32 27 24 3 -15 7 -23 -3
3592 -3 -10 58 20 -6 -8 -26 49 4 40 -29 33 19 34 41 -15 51 32 8 25 -30 17 -30 -1 27 -20 65 33 -13 27 -13 -7 -19 -6
3625 -6 2 23 24 15 50 -11 -19 -13 -35 -16 34 1 -16 31 -51 28 48 21 17 4 2 27 -8 -3 27 -25 61 54 -15 -11 96 -25 4 20 72
3660 72 24 7 11 -9 -50 -33 7 4 -9 18 -15 -16 -2 34 54 9 -15 41 36 -18 30 -39 10 -9 -28 21 -47 31 40 11 20 -18 37
3693 37 -5 -4 34 38 69 -9 27 23 -6 9 -37 -26 -22 11 15 11 -11 -37 30 -23 -67 -43 -2 -23 -42 10 19 -15 -11 36 54 -18 21 9
3727 9 -3 2 15 12 19 7 -20 -4 0 22 18 20 -2 -17 22 39 49 -27 60 14 -24 -13 10 32 -6 54 -37 8 2 -9 -29 -28 8 48 26
3762 26 2 0 -43 8 36 -26 27 -10 -4 -6 26 -20 -4 23 3 -4 29 -16 32 36 74 26 40 18 5 12 -6 4 8 12 5 -4 89 -18 -52
3797 -52 2 -30 33 16 -40 63 -43 30 35 66 59 -24 8 -6 28 -49 33 -33 40 16 23 -2 -3 38 15 6 41 20 -2 12 -29 9
3829 9 50 17 5 10 8 8 23 -25 10 2 -1 -2 0 -25 12 -6 55 16 54 15 -19 -17 19 -69 0 33 32 -30 38 12 -27 33 42 -8 -32 18
3865 18 14 -4 14 8 11 12 16 16 8 46 33 -60 15 43 -11 7 28 -22 -2 0 6 4 -26 -12 51 -16 -44 35 52 1 -60 30 25 -17 23 -52
3901 -52 0 42 -64 38 23 -54 -8 16 -15 5 13 41 -5 68 -7 54 -19 28 -2 24 23 6 -1 40 0 23 19 41 10 4 28 -4
3933 -4 56 -16 -18 12 9 24 -4 -2 -60 13 67 -30 9 -35 -32 -23 39 -4 1 58 10 12 -6 8 -20 -12 39 -47 16 13 -37 -13 -48 -3 15
3968 15 24 -10 3 35 -16 32 -31 -68 6 -10 -34 21 -16 16 -13 68 22 14 7 22 33 -27 -7 62 -39 -21 -29 -2 -14 -24 -14 15
4000 15 21 -2 42 27 43 3 -1 35 -5 46 -45 -53 -1 21 21 -12 -22 0 -29 -46 8 -49 24 28 -22 9 -18 7 -15 25 32 23 10 82
4034 82 76 53 71 4 -1 16 -7 -47 -7 18 35 30 0 -26 67 -5 3 -16 -12 -21 33 16 9 -18 2 89 19 -14 40 20 24 -2 26 -7
4068 -7 -15 21 -1 39 4 0 -12 -8 31 56 25 -10 53 -20 5 17 -21 -41 -17 2 -4 53 0 -44 26 -29 -14 4 35 62 18 32 49
4101 49 -34 -7 -38 34 1 0 -30 38 -27 -40 18 -12 -6 50 -6 24 8 -17 -43 -39 5 -27 -14 -40 -12 -24 -5 -44 37 -21 16 6
4133 6 -67 -25 -47 -1 -33 16 -16 19 4 -19 -5 -3 25 61 -91 -49 35 1 -14 17 -7 2 -21 18 61 -12 -27 6 -11 6 49
4164 49 0 44 8 -2 7 3 -27 20 -25 8 45 -8 18 -7 -28 -40 -32 1 -36 -15 40 -52 -3 -51 7 -41 27 14 39 -7 23 -7
4196 -7 61 7 -27 36 2 32 -12 7 -30 17 -13 -1 39 -19 45 15 26 56 57 -31 -30 5 -33 -14 -10 5 -14 42 -27 -3 15 27
4228 27 -13 6 -16 -30 -2 -14 49 -3 11 -17 46 44 87 3 18 22 43 -10 3 10 22 39 -26 -17 18 36 48 -49 -19 35 -1 53
4260 53 -3 18 -30 -7 10 -44 2 -28 -10 -26 -57 24 -46 -5 -21 29 -51 -19 9 -3 10 -27 0 0 16 -11 18 12 -4 6 -22
4291 -22 -53 -75 4 44 -15 4 -10 9 1 -14 -6 -22 15 -59 -32 17 -34 -30 -36 -31 -37 3 -8 52 -19 -72 68 33 -31 21 -12 -26 -61
4324 -61 -41 -28 -19 -17 28 -1 19 -28 17 -55 1 25 -42 13 -51 1 -37 -45 1 -20 10 -19 25 -21 7 8 -3 -34 -43 14 9 27 18 -13
4358 -13 8 73 31 -71 -15 1 -53 46 -18 -3 28 10 6 26 9 6 -15 61 68 -45 9 -3 16 -4 12 28 35 51 2 34 7
4389 7 8 23 32 -61 -7 -41 62 -34 7 -46 42 20 -14 13 18 6 -2 21 49 -33 -23 2 2 5 9 40 9 13 -6 13 -31 25 10 36
4423 36 15 47 -7 1 19 -23 -23 -45 -23 7 -10 9 -9 4 -39 13 -20 -3 -4 14 -6 4 -6 10 22 -24 1 28 -9 12 -33 7
4455 7 19 57 42 25 -10 -29 -12 -36 -46 53 -18 -18 60 3 25 24 43 -8 24 1 -25 -21 27 -6 22 -15 -4 -3 -4 4 27 3 -8 30
4489 30 -46 13 -23 -28 -34 -29 58 42 66 14 -31 8 32 -38 8 0 7 70 -19 12 31 0 16 -16 40 19 -45 25 48 -3 3 39 -33
4522 -33 -5 -25 17 41 29 18 17 32 -9 -66 30 -19 27 11 18 -28 -2 3 24 -15 5 33 58 5 -50 -11 -15 -24 19 28 -60 -7 -21
4555 -21 -66 34 4 20 -19 16 -6 -31 2 -7 -23 24 -23 -12 39 -23 63 0 -26 -15 -32 -26 14 -6 14 -20 -19 -5 10 -15 -41
4586 -41 36 -65 34 32 -26 48 39 46 8 -12 -46 -29 17 29 -1 0 43 -11 2 13 -34 -4 28 29 53 47 -51 10 53 16 -20 -44 5
4619 5 -62 -8 25 -12 27 19 23 -5 21 10 -10 52 -4 25 9 49 -17 -3 15 8 11 46 4 5 27 -51 13 -24 42 17 -21 -9 -1 9
4653 9 37 26 36 -45 -37 -11 -15 -27 -35 -28 2 -7 -66 -17 9 10 11 6 -1 40 -14 -7 -15 24 -11 -18 -21 -39 43 -22 30 25 39 -4 -4 -1 36 -23 -19
4692 -19 9 21 -16 -12 34 44 26 -21 28 -14 -30 -72 30 43 -39 -34 67 -33 10 68 5 -4 14 29 -18 -13 16 43 -8 52 19
4723 19 0 6 -3 -45 -8 -1 7 11 39 -17 -39 72 -20 -18 3 -1 -9 -18 -6 -15 1 15 12 -3 23 -49 25 40 34 8 -1 4 0 23 8 36 53
4760 53 29 -1 -33 35 28 11 -5 -6 26 -47 -4 21 0 -25 6 46 10 -60 -15 12 -26 30 12 22 20 -11 4 -49 -18 15 -47 13
4792 13 38 -16 -2 -35 12 13 -28 -56 27 -1 37 -14 -4 -7 -62 30 -41 -22 12 -23 15 -9 -23 14 -18 -22 -30 31 -34 -8 -20 7
4824 7 -7 -3 7 -44 30 9 -10 3 -10 -26 -9 10 1 -11 -19 26 32 -57 20 20 -16 -22 -31 -18 -30 -14 -22 -37 2 -5 -67 -14 71 -25 54
4859 54 -11 7 41 -11 40 -13 -22 10 3 -11 -30 -20 7 8 6 27 -2 -3 -38 1 24 12 -29 8 21 9 -1 -12 50 9 2 49 14
4892 14 4 10 50 16 -21 -13 -25 -6 -26 -27 -64 -21 -6 73 -49 -18 -47 1 26 22 -18 -22 -22 -3 -39 25 35 16 29 -7 20 0 57
4925 57 -26 13 47 35 -22 -64 17 11 -40 -12 -10 -34 -19 0 22 8 46 -12 -36 -31 -23 44 -24 -28 -23 27 -9 -59 30 -11 -7 11 12 -43
4959 -43 -56 24 -17 31 -47 -4 -44 -14 20 35 35 -14 53 29 -41 -13 9 -26 25 18 40 -2 -20 20 -57 4 -38 -9 26 9 -9
4990 -9 -35 -5 32 -2 60 -23 15 27 41 34 -5 13 22 25 26 41 -4 38 -23 -7 50 3 -24 -57 41 3 13 25 -31 18 -9 15 -11
5023 -11 -43 13 25 52 24 -18 40 22 -49 -14 46 20 -32 42 29 -15 44 -52 34 29 47 20 -26 18 5 20 -20 -12 -5 -33 14 39
5055 39 -21 -10 -4 -7 16 5 30 -9 15 15 4 12 -11 -25 16 2 -2 22 -42 -6 23 4 39 -45 20 -27 16 -11 48 37 2 -50 45
5088 45 19 -2 18 -1 -5 0 -4 25 -38 -35 -33 36 49 -31 29 20 -4 -1 12 -21 -58 30 -44 -6 28 -8 -16 -8 -3 8 1 6 -24 -5 -7 15 8
5125 8 29 20 -5 29 43 60 -11 13 74 -18 6 6 28 64 13 -4 11 55 3 4 58 7 44 13 -5 -34 -21 3 -26 -19 -3 -3 -23
5158 -23 20 40 31 -16 -39 12 34 -23 3 22 22 1 -15 -31 34 52 -4 56 -36 0 30 -32 -24 -21 46 2 -30 31 19 10 2 -4 62 15
5192 15 12 5 22 14 -27 -53 20 60 2 -7 -33 21 -21 -18 -12 -24 29 11 -17 -63 22 0 15 -9 0 -5 75 29 4 5 9 28 17 -36 -73
5227 -73 -5 -13 18 -16 -38 2 6 52 16 8 22 9 8 -19 -38 -62 48 18 11 -2 -8 9 -14 3 -3 20 -8 -20 55 -5 4 -10 24 43
5261 43 -38 11 25 -3 40 43 5 14 -20 28 12 -3 -47 20 16 -34 65 19 12 50 5 23 -4 21 14 9 41 -7 56 -13 10 -1 66
5294 66 9 -45 -56 37 5 60 25 -12 7 -10 23 6 24 3 -27 -8 10 -8 -52 -14 -16 -24 -13 9 50 -14 -32 -19 0 9 18 14 14
5327 14 -26 18 43 -1 -6 -38 25 -23 -66 10 34 13 17 -14 72 -19 -39 -30 -18 9 23 10 58 60 56 51 -27 -42 5 -2 15 -44 56
5360 56 4 -22 -5 -34 -8 -28 45 -6 46 -27 8 43 -16 -3 8 -15 -3 1 3 46 -38 -7 -21 -4 14 10 28 18 -10 18 -37 -28
5392 -28 -20 21 8 -13 36 -38 4 -13 -70 -32 24 -13 -63 -56 -33 4 1 4 -4 -24 -42 19 -19 -27 68 16 26 33 41 20 2 3 33 -45 6
5427 6 -23 -18 26 38 43 -19 42 43 22 17 32 -36 11 11 51 16 -23 9 0 -7 -5 24 -12 23 -19 44 17 21 28 -5 -22 35 -35 -36 17 -10
5463 -10 18 -15 -4 2 39 -29 -10 2 -4 -37 62 -21 -23 19 -6 36 32 14 -20 -62 -42 36 3 2 -7 11 -1 20 22 -11 18 -14 2 0
5497 0 20 -28 32 44 68 -29 30 -20 37 0 33 50 11 -27 18 -45 -15 21 1 -14 1 13 -23 -12 5 1 -15 23 -12 39 -17
5528 -17 -6 -12 -44 -16 1 -8 -63 -73 36 8 -10 -1 -73 -25 54 11 27 -13 13 19 15 10 25 32 5 15 11 31 -6 -10 -1 -1 33 0 7 46
5564 46 -35 -46 -14 15 -25 37 14 7 11 26 0 6 3 0 -38 -46 -14 -26 19 7 44 -27 9 52 -7 14 53 -27 4 30 -11 19 9
5597 9 44 14 -30 12 -21 -46 -7 -65 43 -28 -36 -3 -40 8 -11 -33 -9 -34 -21 -32 -30 -39 -13 47 -83 -12 -24 -34 20 -13 -2
5628 -2 11 65 -16 -22 -3 22 -7 -52 -41 20 -6 -36 -6 -68 18 -18 -33 -23 -28 -13 25 -20 17 -8 -9 5 34 9 -38 -31 26 17 -28
5661 -28 17 -15 -10 12 -26 31 14 25 -35 25 -15 -26 3 -13 11 -73 -50 -20 19 -13 -44 19 47 -16 18 8 84 6 19 -11 30
5692 30 -51 -11 -17 30 24 -48 -7 10 -37 -12 -13 24 -10 -46 -18 14 -49 -36 -4 12 -17 6 8 13 12 -49 -38 -4 19 16 -2 16 16 6
5726 6 25 20 -6 12 39 7 31 -31 17 -25 41 -2 93 65 -20 14 -17 -51 27 -49 -27 54 0 3 -12 -29 43 -26 1 7 3 3 31
5759 31 15 81 -41 -40 -26 39 8 41 39 2 -9 -42 -8 -37 -11 17 -13 -20 23 -11 3 -9 -21 -16 1 -9 -42 -8 -39 9 -24 44
5791 44 -36 -17 3 -19 -79 -3 33 14 -79 -35 -16 21 51 -26 -14 -10 5 30 -4 39 31 34 33 -9 43 26 -9 -24 30 -25 11 35
5823 35 2 34 -52 0 20 6 -48 -17 17 -6 -44 -10 42 34 20 -31 40 -29 45 3 -4 -28 -28 -3 -5 -23 -9 -28 -44 41 -4 35
5855 35 29 -24 13 1 -28 -11 20 36 -8 19 12 -21 47 21 -12 -24 -16 -11 -25 -12 -39 7 -5 0 -9 39 -16 -40 4 2 25 -36 -15 -12
5889 -12 -19 -26 41 40 32 -7 2 14 5 -4 -32 -17 -7 3 -13 -17 19 38 -12 -24 -52 -19 -19 -32 -18 21 -9 -3 -43 -39 40 -6 -64 14 29 10
5925 10 9 -37 32 -11 30 -5 25 -62 -66 14 -44 14 37 5 -9 -8 15 42 28 -10 15 -5 -15 -20 13 32 -4 -2 9 -17 16 -27 -5
5958 -5 -20 31 7 16 -43 4 -14 -49 29 -4 6 10 7 19 3 28 -2 52 -19 42 21 -13 11 6 25 36 4 35 -11 -14 1 -24 50
5991 50 7 0 -13 -32 -10 10 29 16 28 17 17 -9 18 5 7 -58 34 17 -9 -17 -35 24 6 -20 0 -7 20 -15 30 25 18 -19 15 12
6025 12 -20 -38 -27 17 -41 -42 -27 6 5 21 -19 -9 -54 -80 19 -10 -7 39 9 7 26 8 -73 -46 19 -20 -13 -66 -26 28 -12 12 6
6058 6 10 -26 75 33 22 27 -5 -20 16 29 -10 5 -29 -64 -44 40 29 -14 13 36 32 -24 6 -16 -28 5 -51 -10 16 -16 -19 -52
6090 -52 -27 -23 -7 4 -6 13 7 -45 12 62 72 10 -8 70 -13 -20 13 22 26 -37 10 1 26 -31 23 -7 35 -37 -32 38 -16 -10 -1 19 -38
6125 -38 -7 -6 -30 -9 -6 15 -66 -42 -54 -72 -4 12 -10 17 55 26 -12 -3 4 5 49 67 -4 -12 6 -3 -6 7 12 32 25 -17 -32 -22 8
6160 8 -16 -6 -30 13 -15 10 -18 -1 31 42 36 -6 11 -10 -7 24 35 -16 -24 -23 46 30 -39 29 93 18 8 -15 35 27 20 24 12 5 31
6195 31 10 -46 12 -15 17 20 6 4 -24 8 -10 67 -11 -8 -7 16 -90 11 14 -39 14 1 36 -7 -15 -61 -24 66 66 -3 4 36 9
6228 9 55 24 4 -49 -3 0 -12 29 1 38 -6 39 -25 3 6 -1 26 10 -44 6 -20 -40 55 -9 -6 1 -49 18 12 -20 37 7 -7 -29
6262 -29 32 1 -6 45 1 62 -30 3 35 -3 -17 2 -38 -4 42 2 -49 37 26 -1 2 28 59 8 33 3 3 -6 10 14 13 -21 8
6295 8 -21 31 -65 -15 -24 -25 -15 -9 14 23 22 -27 35 -4 50 3 -5 27 -5 -31 -15 53 22 -11 31 24 50 20 31 -64 13 31 5 -18
6329 -18 6 -33 18 -32 42 13 4 14 -1 -20 -82 -12 -8 61 67 4 24 20 45 -20 54 -9 -4 -42 -37 -7 -3 12 12 -6 53 63 59 33 -48
6364 -48 -18 23 19 5 -12 -15 52 -37 -1 30 -9 5 -35 -11 23 40 -33 0 16 -8 9 22 13 -7 43 12 -22 -19 -26 -22 -3 -11 42 28
6398 28 -19 60 -17 8 62 47 82 25 31 -23 -38 10 37 31 5 -3 6 -17 -18 4 -31 18 19 -15 2 36 -13 -44 -9 -10 10 -89 -59 -11
6432 -11 -18 -5 22 -51 -10 -32 -26 23 6 1 17 23 -38 46 -35 -2 20 8 -24 -18 -44 1 18 7 10 22 39 -12 -16 -34 -12 -27 -13 25
6466 25 -44 -35 18 -1 -45 -6 2 45 -7 -29 26 6 10 -29 2 21 -49 50 15 2 6 -40 -4 1 -7 42 28 -36 -13 11 -1 -14 -60
6499 -60 -3 -5 18 43 5 -18 17 16 -2 -28 4 4 -46 -30 -4 38 -14 -2 -18 -28 32 22 17 -8 19 -9 12 11 1 40 20 3 33
6532 33 -3 16 77 -6 -13 -5 5 25 8 -22 -24 6 -4 -38 34 -33 -18 -34 -2 -5 27 18 -15 13 -15 -43 -45 17 19 12 -29 37 -6 -24
6566 -24 -19 5 -23 -2 9 -26 9 25 -14 4 44 21 -42 -31 2 9 -7 33 8 5 7 41 23 16 21 -1 -51 -1 12 -17 0 4 -21 -26
6600 -26 -9 -2 8 40 44 10 21 36 33 40 -23 20 -7 53 29 8 50 -11 -16 26 -14 -4 24 36 -22 22 -37 46 20 10 10 1 38 8
6634 8 -36 -23 13 0 -56 -3 1 -87 12 4 8 -25 -46 -14 3 9 -15 3 -21 8 -35 26 -22 -16 10 -7 29 34 2 -8 -16 32 34 10 -10
6669 -10 -18 -41 -4 9 25 31 21 -25 -6 -33 -47 22 34 9 -33 -8 29 -41 -53 7 32 -6 -14 3 38 10 -20 -33 -6 23 40 2
6701 2 21 9 22 47 -9 80 -37 -5 -71 -52 -20 -22 -8 -43 -23 -23 3 23 26 10 26 -47 -6 -6 -28 -2 -49 0 -11 28 -3 -9 -6
6734 -6 5 6 -1 -11 -31 -20 -5 -28 0 45 76 3 -10 30 32 -5 5 3 -39 -32 9 -14 -25 -45 1 -9 -44 12 -61 -25 1 -15 26
6767 26 -29 -4 -9 -7 55 61 -20 -30 -52 -2 29 -16 16 -11 -24 1 -11 37 -31 -18 18 -43 4 19 19 21 5 71 59 -53 -17 39
6799 39 12 -16 -39 -28 16 6 34 14 -34 -23 -22 11 -61 26 3 23 47 -12 -38 33 -1 10 -41 20 -21 22 30 -20 15 -13 33
6830 33 -18 12 7 32 44 20 -35 -18 13 -23 -10 -24 -76 -30 -49 -27 21 4 58 -35 -15 -60 44 -11 -75 7 -28 -13 2 -26
6860 -26 7 -12 0 -35 19 17 2 -38 3 69 -91 45 -22 48 -2 5 13 -45 19 -4 -10 0 31 -43 -4 10 9 -1 52 -8 3 10
6892 10 -31 10 -76 11 8 42 -11 7 55 6 -18 74 -22 -38 28 -29 4 18 -10 42 14 9 6 3 -5 56 -47 12 14 8 -13 -6 66 -31
6926 -31 -4 -2 31 -11 29 -24 -17 8 -34 -55 21 -28 15 21 -2 -54 -48 -31 -24 8 9 32 -22 49 1 -33 42 -26 -21 48 12 10 26 43
6960 43 15 22 19 -15 -5 -41 2 -2 -2 -60 -33 -18 -24 -25 2 -11 -38 2 -29 -24 -103 -22 11 29 8 1 -35 -5 -31 42 -57 29 29 40 -23
6995 -23 -25 12 -15 20 -3 -3 -40 53 17 -53 -39 -31 -7 42 37 -10 -10 9 -13 -26 37 12 -8 31 6 6 -17 -25 82 25 46 10 -43
7028 -43 49 -41 35 37 67 15 11 -7 -1 -18 -8 25 -14 14 -28 16 52 6 -46 30 -4 -8 18 -34 -17 -7 15 -20 -6 -23 4 -16
7060 -16 52 -32 -21 16 29 -31 -12 -23 8 16 -38 -4 -15 57 -58 73 -27 -23 17 56 28 45 5 -41 -37 -27 16 -7 35 -31
7090 -31 32 1 8 -20 10 -1 29 5 6 -4 15 -26 -10 30 -18 36 -11 29 -46 -58 -26 20 23 10 -34 -6 -6 2 28 -20 -53 5 13
7123 13 34 -12 7 -32 2 2 31 2 -42 -21 16 -13 41 41 23 1 22 0 -39 23 -17 -8 45 58 19 -4 1 21 27 22 -28 26 -58
7156 -58 0 -17 -14 -2 -27 -22 65 19 12 6 -1 8 -5 -14 -5 45 -38 -5 17 5 17 -30 27 11 -11 -15 -11 -42 11 37 -24 -1 0 5 -32 -16
7192 -16 -13 -15 13 -8 -23 21 -29 3 30 0 -38 2 11 -21 -25 0 55 18 -43 34 36 18 -5 9 -27 -9 -42 13 4 -46 -33 16 -32
7225 -32 11 -45 -9 -6 -42 25 22 14 20 42 33 29 -10 32 -14 -23 21 -72 34 -24 -27 39 -45 18 1 -14 -55 -33 -36 -7 31 32 -12 11 -21
7260 -21 57 -44 -5 2 13 1 7 -4 -2 -37 -14 0 -6 31 -39 -20 -28 -19 31 -27 -47 -46 16 31 -1 18 -16 15 -34 -2 3 14 -13 7
7294 7 -47 -74 -64 14 -16 -12 -41 1 -30 12 6 11 1 -34 -7 10 -14 -22 4 5 20 -38 12 -50 57 -10 -33 36 26 -42 19 -11 27
7327 27 7 -13 28 -11 32 79 25 -6 -9 38 0 26 30 -20 23 25 1 -48 44 10 -8 17 33 -1 -56 31 14 -3 -32 -27 43 -7
7359 -7 -22 25 -40 -33 -47 32 18 -38 -73 14 -26 16 -85 -33 5 -20 -20 -4 -33 33 -9 27 26 -17 17 13 -20 -83 15 54 42 4
7391 4 3 -15 12 12 -14 7 -5 30 -38 -51 -24 1 -17 -26 0 -7 -3 -1 16 -40 -13 -26 -62 39 33 -15 15 -18 4 3 -8 60 54 -4 9
7426 9 52 -8 -45 -50 10 -13 -36 -17 1 -36 -4 9 -52 -26 -17 -40 -23 -10 1 21 -23 6 9 -24 -10 13 55 -30 18 -13 32 25 8
7459 8 -51 21 24 9 20 24 34 -19 15 -3 8 -70 16 -12 -14 -13 20 -12 -11 28 10 -18 14 19 30 -26 24 32 -26 -8 -1 -61 10 10 -1
7494 -1 -15 29 -12 2 -25 -31 6 -60 15 -24 -11 -15 -63 -7 -9 -23 12 -5 -14 -80 9 -14 1 -36 55 5 -1 3 -28 -17 -77 -31 12 28
7528 28 0 -24 -50 -25 -34 -24 26 -20 -79 62 41 8 33 -24 0 -11 -12 -14 39 -33 24 33 35 28 -22 13 5 -2 -12 25 -8 10 -22 -97
7562 -97 30 57 14 -36 -1 11 29 35 13 8 10 20 37 70 47 -48 16 8 6 40 -29 34 20 56 12 33 40 -37 15 -9 -16 -19 -22 49
7596 49 8 12 -52 -21 -55 26 -34 -63 49 -23 -34 3 -25 -10 -81 23 -35 13 -9 -39 7 -35 -31 6 15 -3 34 9 -6 -4 6
7627 6 -38 19 -49 2 35 13 15 -33 -22 -6 7 57 26 -45 -5 -21 -46 -28 -31 -2 -8 -46 5 -9 22 16 23 -8 32 4 18 28 0
7660 0 20 -40 17 17 -38 57 -40 29 7 -12 36 1 -24 7 27 -40 -9 27 38 7 27 11 -58 -30 -5 45 0 -29 -4 -58 -12
7691 -12 -47 -44 -23 -17 -11 -30 -10 -18 17 27 -45 -27 17 -34 -23 -54 -9 -8 20 -27 -32 35 -5 1 -12 -27 20 2 -16 42 33 78 5 -2 15
7726 15 3 -6 4 -2 -52 17 -14 25 -6 -18 -22 16 -55 -16 -47 -30 -57 -34 7 -36 -7 64 27 -16 2 -56 -30 44 33 17 -20 -4
7758 -4 13 -35 51 23 -7 18 29 19 -13 22 19 -18 -7 12 3 19 10 -3 0 -42 -19 -16 27 -29 -6 -37 -18 -5 32 -28 -48 33 16
7791 16 20 30 36 5 30 24 47 -20 -9 21 18 9 30 35 11 -16 -12 11 25 -45 -18 -29 16 19 29 -25 13 -38 -45 8 -14 13 -7 9 -36
7826 -36 -30 10 6 19 29 58 -9 -41 46 27 25 -12 -22 1 15 12 2 -14 -43 -1 -30 -16 -5 9 25 71 4 6 -3 -7 -39 -57 24 -34
7860 -34 -42 -66 -17 10 2 -1 -36 -21 -13 15 -3 20 9 -12 -7 29 11 1 26 -33 9 -10 32 -20 30 75 -40 -13 2 -10 -26 -12
7892 -12 -68 -32 -21 -78 1 7 0 21 -44 -57 19 -11 6 32 28 -72 -21 13 11 -35 48 1 -24 10 -44 60 -16 24 5 27 -13
7923 -13 2 18 19 38 -19 6 7 -3 -61 34 -56 -12 11 -4 -11 -10 -32 4 -38 15 57 21 9 -55 38 -1 -20 -17 53 -23 23 33 20
7956 20 19 -17 -13 -31 -8 22 7 16 13 -33 -41 -41 -17 -39 -8 6 -12 32 -8 -1 -1 -26 -10 -72 -63 9 -14 -65 -72 -25 -4 29 66 -14 -45
7991 -45 -5 -22 -12 38 43 -4 17 18 -58 -28 -48 31 -14 -39 -7 16 30 -2 28 3 -8 -6 12 -59 5 24 25 1 20 37 21 71
8023 71 8 15 -20 53 30 -16 -41 -36 -17 3 -6 -12 3 -61 -27 -10 -49 -26 -34 -9 -41 -25 13 36 40 -30 -34 -6 0 -33 45 2 0 29 -7
8058 -7 27 -18 28 -1 33 10 -12 31 -9 -41 24 15 20 -4 -8 -49 12 -6 -50 15 10 37 -13 -50 3 33 51 -45 -37 -28 19 5 -41 0
8092 0 46 19 7 -29 10 -2 -16 37 -27 3 -32 -15 37 -8 19 -24 18 -27 -20 12 -35 6 -20 5 -26 1 -60 1 -14 -3 -14
8123 -14 8 0 14 -13 -8 49 11 4 -62 57 2 12 18 10 21 14 23 -10 71 2 25 -11 -19 0 30 5 -32 -2 -8 -2 -41 -63 -35 0 -22
8158 -22 -14 5 -8 -31 -45 -5 -14 -59 25 30 16 14 4 0 41 13 66 -41 -4 47 57 55 -9 -13 -16 -6 -44 0 -2 36 3 20 11
8191A1
##END NTUPLES=NMR FID
##END=
