##TITLE=1H_Pr Q-13
 CD3OD
 8 sc, 
 13.2.2024
##JCAMPDX= 6.0         $$ Bruker NMR JCAMP-DX V2.0
##DATA TYPE= NMR FID
##DATA CLASS= NTUPLES
##ORIGIN= UXNMR, Bruker Analytische Messtechnik GmbH
##OWNER= root
$$ XWIN-NMR		Version 3.5
$$ Tue Feb 13 16:21:48 2024 Russian Standard Time (UT+4h)  she@DPX200
##.OBSERVE FREQUENCY= 200.1313
##.OBSERVE NUCLEUS= ^1H
##.DELAY= (6, 6)
##.ACQUISITION MODE= SIMULTANEOUS
##.ACQUISITION SCHEME= undefined
##.AVERAGES= 8
##.DIGITISER RES= 18
##SPECTROMETER/DATA SYSTEM= spect
##.PULSE SEQUENCE= zg30
##.SOLVENT NAME= DMSO
##.SHIFT REFERENCE= (INTERNAL, DMSO, 0, 15.7039)
##AUDIT TRAIL= $$ (NUMBER, WHEN, WHO, WHERE, WHAT)
$$ ##TITLE= Audit trail, XWIN-NMR		Version 3.5
$$ ##JCAMPDX= 5.01
$$ ##ORIGIN= Bruker BioSpin GmbH
$$ ##OWNER= she
$$ F:/spectra/data/she/nmr/H-F/1/audita.txt
$$ ##AUDIT TRAIL=  $$ (NUMBER, WHEN, WHO, WHERE, WHAT)
(   1,<2024-02-13 16:20:40.21 +0400>,<she>,<DPX200>,
      <created by zg, POWCHK disabled, PULCHK disabled
       configuration hash MD5:
       00 E9 B6 7A A2 85 ED C7 34 08 36 98 17 FE 4E 26
       data hash MD5: 16K
       69 96 4A D8 27 E3 6E F1 96 B5 24 DC BF 34 65 26>)
$$ ##END=
$$ 
$$ hash MD5
$$ 1F 3C A9 52 7E 98 58 27 74 E2 7A 2D 81 DC 2A 4C
##$RELAX= 
##$RELAX= 
##$RELAX= 
##$RELAX= 
##$RELAX= 
##$RELAX= 
$$ Bruker specific parameters
$$ --------------------------
##$DU= <F:/spectra>
##$EXPNO= 1
##$NAME= <H-F>
##$PROCNO= 1
##$TYPE= <nmr>
##$USER= <she>
##$AMP= (0..31)
100 100 100 100 100 100 100 100 100 100 100 100 100 100 100 100 100 100 
100 100 100 100 100 100 100 100 100 100 100 100 100 100 
##$AQSEQ= 0
##$AQ_mod= 1
##$AUNM= <au_zg>
##$AUTOPOS= <>
##$BF1= 200.13
##$BF2= 200.13
##$BF3= 200.13
##$BF4= 200.13
##$BF5= 200.13
##$BF6= 200.13
##$BF7= 200.13
##$BF8= 200.13
##$BYTORDA= 1
##$CFDGTYP= 0
##$CFRGTYP= 5
##$CHEMSTR= <none>
##$CNST= (0..31)
1 1 145 1 1 1 1 1 1 1 1 1 1 1 1 1 1 1 1 1 1 1 1 1 1 1 1 1 1 1 1 1 
##$CPDPRG= <>
##$CPDPRG1= <>
##$CPDPRG2= <>
##$CPDPRG3= <>
##$CPDPRG4= <mlev>
##$CPDPRG5= <mlev>
##$CPDPRG6= <mlev>
##$CPDPRG7= <mlev>
##$CPDPRG8= <mlev>
##$CPDPRGB= <>
##$CPDPRGT= <>
##$D= (0..31)
0 1.2 0 0 0 0 0 0 0 0.06 0 0.03 0 0 0 0 0.0002 0 0 0 0 0 0 0 0 0 0 0 0 
0 0 0 
##$DATE= 1707826839
##$DBL= (0..7)
120 120 120 120 120 120 120 120 
##$DBP= (0..7)
150 150 150 150 150 150 150 150 
##$DBP07= 0
##$DBPNAM0= <>
##$DBPNAM1= <>
##$DBPNAM2= <>
##$DBPNAM3= <>
##$DBPNAM4= <>
##$DBPNAM5= <>
##$DBPNAM6= <>
##$DBPNAM7= <>
##$DBPOAL= (0..7)
0.5 0.5 0.5 0.5 0.5 0.5 0.5 0.5 
##$DBPOFFS= (0..7)
0 0 0 0 0 0 0 0 
##$DE= 6
##$DECBNUC= <off>
##$DECIM= 32
##$DECNUC= <off>
##$DECSTAT= 4
##$DIGMOD= 1
##$DIGTYP= 9
##$DL= (0..7)
0 120 120 120 120 120 120 120 
##$DP= (0..7)
150 150 150 150 150 150 150 150 
##$DP07= 0
##$DPNAME0= <>
##$DPNAME1= <>
##$DPNAME2= <>
##$DPNAME3= <>
##$DPNAME4= <>
##$DPNAME5= <>
##$DPNAME6= <>
##$DPNAME7= <>
##$DPOAL= (0..7)
0.5 0.5 0.5 0.5 0.5 0.5 0.5 0.5 
##$DPOFFS= (0..7)
0 0 0 0 0 0 0 0 
##$DQDMODE= 0
##$DR= 18
##$DS= 0
##$DSLIST= <SSSSSSSSSSSSSSS>
$$ [...]
##$SUBNAM2= <"">
##$SUBNAM3= <"">
##$SUBNAM4= <"">
##$SUBNAM5= <"">
##$SUBNAM6= <"">
##$SUBNAM7= <"">
##$SUBNAM8= <"">
##$SUBNAM9= <"">
##$SW= 18.0517328524113
##$SWIBOX= (0..15)
0 0 2 0 0 0 0 0 0 0 0 0 0 0 0 0 
##$SW_h= 3612.71676300578
##$TD= 16384
##$TD0= 1
##$TE= 0
##$TE2= 300
##$TE3= 300
##$TEG= 300
##$TL= (0..7)
0 120 120 120 120 120 120 120 
##$TP= (0..7)
150 150 150 150 150 150 150 150 
##$TP07= 0
##$TPNAME0= <>
##$TPNAME1= <>
##$TPNAME2= <>
##$TPNAME3= <>
##$TPNAME4= <>
##$TPNAME5= <>
##$TPNAME6= <>
##$TPNAME7= <>
##$TPOAL= (0..7)
0.5 0.5 0.5 0.5 0.5 0.5 0.5 0.5 
##$TPOFFS= (0..7)
0 0 0 0 0 0 0 0 
##$TUNHIN= 0
##$TUNHOUT= 0
##$TUNXOUT= 0
##$USERA1= <user>
##$USERA2= <user>
##$USERA3= <user>
##$USERA4= <user>
##$USERA5= <user>
##$V9= 5
##$VALIST= <valist>
##$VCLIST= <CCCCCCCCCCCCCCC>
##$VD= 0
##$VDLIST= <DDDDDDDDDDDDDDD>
##$VPLIST= <PPPPPPPPPPPPPPP>
##$VTLIST= <TTTTTTTTTTTTTTT>
##$WBST= 1024
##$WBSW= 4
##$XGAIN= (0..3)
0 0 0 0 
##$XL= 0
##$YL= 0
##$YMAX_a= 519896
##$YMIN_a= -778828
##$ZGOPTNS= <>
##$ZL1= 120
##$ZL2= 120
##$ZL3= 120
##$ZL4= 120
##$ABSF1= 10
##$ABSF2= 0
##$ABSG= 5
##$ABSL= 3
##$ALPHA= 0
##$AQORDER= 0
##$ASSFAC= 0
##$ASSFACI= 0
##$ASSFACX= 0
##$ASSWID= 0
##$AUNMP= <proc_1d>
##$AZFE= 0.1
##$AZFW= 0.1
##$BCFW= 1
##$BC_mod= 2
##$BYTORDP= 1
##$COROFFS= 0
##$CY= 11.3945322036743
##$DATMOD= 1
##$DC= 2
##$DFILT= <>
##$DTYPP= 0
##$F1P= 15.7292609196834
##$F2P= 12.9074282941183
##$FCOR= 0.5
##$FTSIZE= 0
##$FT_mod= 4
##$GAMMA= 1
##$GB= 0.15
##$INTBC= 1
##$INTSCL= 1
##$ISEN= 128
##$LB= 0.24
##$LEV0= 0
##$LPBIN= 0
##$MAXI= 10000
##$MC2= 0
##$MEAN= 0
##$ME_mod= 0
##$MI= 1.114404
##$NCOEF= 0
##$NC_proc= 0
##$NLEV= 6
##$NOISF1= 3.799351
##$NOISF2= 2.8
##$NSP= 1
##$NTH_PI= 0
##$NZP= 0
##$OFFSET= 15.70392
##$PC= 1
##$PHC0= -24949.13
##$PHC1= 11.25264
##$PH_mod= 1
##$PKNL= yes
##$PPARMOD= 0
##$PSCAL= 0
##$PSIGN= 0
##$REVERSE= no
##$SF= 200.130013532006
##$SI= 16384
##$SIGF1= 3
##$SIGF2= 2
##$SINO= 400
##$SIOLD= 16384
##$SREGLST= <1H.CDCl3>
##$SSB= 0
##$STSI= 0
##$STSR= 0
##$SW_p= 3612.71676300578
##$SYMM= 0
##$S_DEV= 0
##$TDeff= 0
##$TDoff= 0
##$TI= <>
##$TILT= no
##$TM1= 0
##$TM2= 0
##$TOPLEV= 0
##$USERP1= <user>
##$USERP2= <user>
##$USERP3= <user>
##$USERP4= <user>
##$USERP5= <user>
##$WDW= 1
##$XDIM= 8192
##$YMAX_p= 0
##$YMIN_p= 0
$$ End of Bruker specific parameters
$$ ---------------------------------
##NTUPLES= NMR FID
##VAR_NAME=  TIME,          FID/REAL,        FID/IMAG
##SYMBOL=    X,             R,               I
##VAR_TYPE=  INDEPENDENT,   DEPENDENT,       DEPENDENT
##VAR_FORM=  AFFN,          ASDF,            ASDF
##VAR_DIM=   8192,          8192,            8192
##UNITS=     SECONDS,       ARBITRARY UNITS, ARBITRARY UNITS
##FACTOR=    0.0002768,     1,               1
##FIRST=     0,             0,               0
##LAST=      2.2672688,     0,               0
##MIN=       0,             -778828,         0
##MAX=       2.2672688,     519896,          0
$$ Real data points
##PAGE= N=1
##DATA TABLE= (X++(R..R)), XYDATA
0@%%%%%%%%%%%kKqJ6j6J6j6K4l2L4m2M9n7O8p9R1j04J20j38J58j81K05k31K62
35A39k94L29l70M16m62N14n72O33p00P76q58R44j043J150j266J395j537J694j868
54i80K064k285K540k833L172l572M054m647N396o383P741r732J2963j9073L4659
69B3084j51655l74899J32846M25406L90659P4455j38045j18485N4987M0577j93284
80A65646l93761k96699k9563J66404J48224L6481K3944J77539K79726J45761j27644
91B96058k49520j23707R1091J53429J0537j60568j37267M0831J33225Q392j67406
102a04905j66482L8681K33706J96670n4400k43606j51350J13512K51193J34065
112B47084q4494j69428n1921J05501R4587p1884j72422q3673P7336J33354N2630
$$ y = [0, 0, 0, 0, 0, 0, 0, 0, 0, 0, 0, 0, -2, 0, -8, 8, -8, 8, -8, 16, -16, 18, -24, 25, -32, 36, -43, 48, -56, 64, -74, 84, -97, 108, -123, 139, -155, 174, -196, 220, -242, 272, -300, 333, -367, 409, -449, 495, -548, 602, -664, 731, -806, 888, -980, 1084, -1201, 1339, -1494, 1678, -1894, 2160, -2487, 2909, -3474, 4267, -5465, 7498, -11575, 23084, -128571, -503470, -370624, 54782, 445441, 519896, 381851, 263366, 318353, 358930, 165646, -228115, -524814, -554377, -387973, -239749, -203268, -179324, -1785, 277941, 423702, 296058, 46538, -77169, 13922, 167351, 177888, 17320, -119947, -79116, 54109, 62501, -104905, -271387, -232706, 1000, 197670, 143270, -100336, -251686, -138174, 113019, 247084, 162590, -6838, -58759, 46742, 141329, 69445, -102977, -186650, -109314, 24040, 76670]
123G6670m4543k3725Q7256J02003o6634k54340k43397k6947K02792K50272J05835
134A65242l9116j7805R5382R5200o6338k28641k23225m2935J36955J40736K042
145A7497p9940q285J02380R2667m8504j75077j34022M9645J87696J48566J2493
156A65116n1723K94N7369M498j31254j96205r3091Q0490J36745K9268r2654p2558
168a63705P6003J85537J22072n9490j62334q1219P1784J16153J2752j10362j13254
179a06063M603J05088P3744l6277q2300k2602M7474L3724m9984r5140k2981J06266
191d4448J50211O5257m2840o2749m387L1835k5814j27262j41729k1976J18506
202a05396J42102M7463m5301l8549M0207P2154j0675j26313j32542q731J22343
$$ y = [76670, 32127, 8402, 95658, 197661, 131027, -123313, -366710, -393657, -190865, 59407, 165242, 126126, 108321, 203703, 298903, 232565, 3924, -219301, -262236, -125281, 15455, 17497, -62443, -70728, 31652, 124319, 75815, -99262, -233284, -183639, 4057, 152623, 165116, 113393, 113687, 171056, 175554, 44300, -151905, -244996, -164506, -27761, 1507, -91147, -163705, -87702, 97835, 219907, 160417, -1917, -83136, -11352, 104801, 117553, 7191, -106063, -101460, 3628, 77372, 41095, -41205, -63807, -16333, 17391, -32593, -127733, -150714, -44448, 105763, 171020, 128180, 65431, 61044, 92879, 67065, -60197, -201926, -223902, -105396, 36706, 84169, 38868, 319, 40526, 112680, 102005, -24308, -156850, -165581, -43238]
213d3238J38984M3838n5150o2182k548K1019l5621r5984p0679K5539R7861Q0920
225D2759J0530k1774K0451O4534K4948p7346j31570p5276L7082R2238M2647m2125
237a2902n1799K6584R3191O2246l6479r4908n5647L1395O3745O748o0796m6412
249g5034L8427R3208N3861m0171r0733n1795K2009M0985p238m3501r476O3441
261f017R1256L8210m3059o9804k6254J7181k768n8469o8545K872R4604J14965
273H4172M3680m4531o4843j7155K0875k832n5905o5031n104O6787P9221K6173
285F5507k6845k4914J3183K2723j8532o4324n4102J1340O7487N7828K614l2782
297A9183j3185K2082J5925l3827p1341m6624K1378O5834M8432J960j1596K1385
$$ y = [-43238, 95746, 139584, 84434, 22252, 19704, 40723, 5102, -90882, -161561, -136022, -38161, 42759, 53289, 31515, 51966, 116500, 141448, 64102, -67468, -142744, -105662, -13424, 29223, -12902, -64701, -38117, 55074, 117320, 80841, -14067, -69714, -38319, 25426, 32174, -28622, -75034, -36607, 56601, 110462, 70291, -20442, -72237, -50228, -9243, -16481, -59982, -69458, -6017, 85239, 123449, 80390, 10586, -15668, 1513, -1255, -59724, -128269, -125397, -30793, 84172, 127852, 83321, 18478, 1323, 22198, 19366, -36539, -101570, -106674, -39887, 39334, 65507, 38662, 13748, 26931, 49654, 31122, -33202, -87304, -75964, -8477, 49351, 51965, 19183, 5998, 28080, 44005, 10178, -61163, -107787, -86409, -20575, 27857, 29817, 18221, 39606]
309C9606M9740K2693m5743q9785o4906j27L8169K2330q405l243L5924N8266K7035
322H1554l1126n7935k8348J6656K6396l435k4545r40M2799N2237O295n3067o7847
335d1306k8580J7511K0463q470j9648J4026O0525O6406K0711l4438m7440j8144
347A616O350n638l7082l9422J030M8309N5282J7400k1240k3304K511J2703j0161
360H354l8651l2548J0230M8525M5524R446j7494j0709R546M530k8214n3041l7833
373h2335J0226M6369M1532J1438m329O474J8945K344l3903n4349l4287R263L5870
386b6742K8204P943P256K3320K6090m82l8812n4825l0735O977K2337R848j181
399b0802R664L0505L2697L519l3838m2355j6606J2904J5989j66n448J1123L2236
$$ y = [39606, 89346, 112039, 66296, -23489, -88395, -88522, -50353, -28023, -36428, -39671, -3747, 54519, 81554, 50428, -7507, -35855, -19199, 7197, 3762, -20783, -21723, 21076, 73313, 79608, 26541, -41306, -69886, -52375, -31912, -40382, -60030, -46004, 14521, 80927, 101638, 67200, 19760, 1616, 7966, 2328, -34754, -74176, -73146, -24837, 30445, 47845, 26605, 3301, 5812, 18515, 8354, -30297, -62845, -52615, -4090, 41434, 50880, 33386, 22677, 32223, 36753, 8539, -44502, -82335, -72109, -25740, 15792, 27230, 22901, 29375, 48320, 50664, 16761, -37588, -71875, -62612, -26742, 1462, 9405, 16661, 39981, 66071, 65589, 26777, -28048, -58783, -51806, -29469, -19621, -20802, -11138, 19367, 52064, 55583, 21745, -20610, -37216, -24312, -8323, -8489, -13937, -2814, 29422]
412B9422K8626m366l7331l8489j3068N875J170j1528q554J8648M4002L8950N798
425E9155k2061k0039l232M25j5239l1500k3776Q869L6323L1067O015r966m729
438A1312O095J965j7960l3201j9691J4062L5345K8230Q075l240m06L385r156l3989
452i174m2778j9069J6640L4375K9111J4499Q274J2401J0492j1963l9129m2978
464c9299j9256R852K3789J9339R873J0679J8849J3096j2132l2145k9238r362J0367
477b5588J4701N064O13J2567K2144J0731j4067k8456k2936l667J0915N358o278
490a8899k209J7774K8663J8523l960k1225j9368m022P27j2138k0294p495J5893
503b8030L0045K5000O730q322o393Pr107k4094k4860p188J7166L0451K3337M284
$$ y = [29422, 58048, 53682, 16351, -22138, -35206, -29331, -28161, -39689, -48243, -29595, 14407, 53357, 59155, 37094, 17055, 13823, 14248, -991, -32491, -56267, -47398, -11075, 19992, 26007, 16041, 11312, 17407, 19372, 1412, -31789, -51480, -37418, -2073, 26157, 34232, 30992, 30586, 33971, 24815, -9174, -51952, -71021, -54381, -20006, 9105, 23604, 31878, 44279, 54771, 42808, 3679, -39299, -58555, -48703, -24914, -5575, 4298, 14977, 33826, 46922, 34790, 2645, -26593, -35955, -25588, -10887, -5823, -5210, 7357, 29501, 40232, 26165, -2291, -25227, -28894, -17979, -12621, -18899, -21108, -3334, 25329, 43852, 39892, 18667, -701, -4723, -3996, -16134, -36428, -43923, -28030, 2015, 27015, 33745, 25423, 19030, 19037, 9930, -14164, -39024, -46212, -29046, 1405, 24742, 29026]
517B9026l786K774M24j6874l2236k9222o596K2640L5235K1454L877J288N844n39
531C3309j7749l1966l0734o535K2167K9808J5953N901O717P462m8j5774l0466
544a1955k7083k756J6351J4933O536N566J0465J3922Q469j0901k5562j6976K322
557a6669R045K357m097j912R848J9522J1548j0354j9754j0740O9j37o647r661
571b7582o70J9299L0202J7053l967r923o708n839j1057k1221k3548l662K3030
584b4593L1138J6658Q67m476l445k711j0696k3889k2147L823K7730L0738J7510
597C6507J746p749p671p422j9527l0477j9663N491K4217K6378J6736L523M88N085
611B7662o76j7681k4851j3042N861J7340J4532R16o503K092R493J269j4456j9219
$$ y = [29026, 25240, 28014, 28438, 11564, -20672, -49894, -56490, -33850, 1385, 22839, 26716, 28004, 33848, 33309, 15560, -16406, -47140, -53675, -31508, -1700, 14253, 20154, 26871, 34333, 34285, 18511, -11955, -39038, -41794, -25443, -10510, -3974, 1592, 12057, 25979, 34448, 23547, -2015, -18991, -16669, -7624, -5267, -9364, -11276, -1428, 18094, 29642, 19288, -466, -11206, -11137, -11274, -17921, -27582, -28252, -8953, 21249, 38302, 34335, 24412, 17704, 11865, 808, -20413, -43961, -47623, -24593, 6545, 23203, 24070, 19594, 16149, 13438, 2742, -21147, -43294, -39471, -11741, 18997, 36507, 38253, 30504, 22833, 15411, -4116, -34593, -54256, -48765, -24548, 1830, 18566, 22089, 22577, 27662, 26986, 9305, -15546, -28588, -22727, -5387, 9145, 10061, 3558, 5650, 15143, 16412, 1956, -17263]
625a7263j0524N572J5485P964m884k962J1875J8508R115p612j8060j5190k363
638a0339J187p749j1356J152J8309K4595J5726j871j4798j2068m291p451j5612
651b4566j0888O212K3592K9232J6463n763j6139j0445p606j3714j8125r431R120
664c2058K7436K9413J0647q873j2085p444o741j2407j5363q377J1242K7129K2706
677B5225M008q802p967k440l343j1167j7822j0855Q629J9884J2615L82m689J391
691E049Q811P069o693j7488j2071K435Q816L168m053l498O901J5608Q978q511
705A4521j8266j1869j288L563Q30j424N072J8297K2591Q410j2321k1504j6563
718i951p972l403n549m059Q894K4476K5317Q797j0697j8106j2745l854k685o881
$$ y = [-17263, -27787, -22215, -6730, 1234, -3650, -6612, 5263, 23771, 32886, 25274, 7214, -7976, -10339, -9152, -16901, -28257, -27105, -8796, 15799, 31525, 29654, 14856, 2788, -1503, -8954, -24566, -35454, -29242, -5650, 23582, 40045, 34282, 18143, 7698, 92, -13622, -31747, -41178, -32058, -4622, 24791, 35438, 26565, 14480, 7036, 295, -12112, -27475, -35852, -24610, 2519, 25225, 29233, 20431, 12464, 10024, 6681, -4486, -22308, -33163, -24534, -4650, 7965, 8347, 3658, 5049, 13860, 20929, 14236, -3252, -15323, -12888, -4072, -904, -4957, -8455, -1554, 14054, 23032, 14521, -3745, -15614, -16902, -13339, -12509, -13933, -8861, 9436, 32027, 40437, 28116, 6612, -9951, -17923, -21326, -26875, -30934, -22040, 2436, 27753, 36550, 25853, 7747, -4998, -8852, -11537, -18418]
732a8418m327R513K2113J9632L027j3448j8321r747j696l439p788l177J0969K1217
746F110J7857L162r776j0982k008M00o337j2709q195M625J4335J1751N01n747
760B987r86P020M452o396j4878j0561J461J1080P739l59j120O585J1896M604j0123
775A3401j9034j4510j028P311N417R60M488J2623J5177M621j2554k1061j5191
788a9380k172N133L838K624Q119J5858J5603K485j4191k0953j3241k973K402L38
802a6510Q37P957J6426J4741J847j2187j5259o812J566J231l112k375N719J3517
816G586J1886q50j1136j0768l101K294j528p563n620M791J3688J2925L126m704
830A1026l093J979J475o556j4096j1130Q08J0586J0414L519n5K725N780J599r420
$$ y = [-18418, -22745, -13232, 8881, 28513, 31540, 18092, -229, -9976, -11672, -15111, -22899, -26076, -15107, 6110, 23967, 27129, 17353, 6371, 4363, 4763, -1574, -14283, -22478, -17853, -3518, 8233, 8734, 2987, 2001, 9021, 13473, 7077, -7801, -18362, -16901, -5821, 1918, 1559, 439, 7024, 18920, 23524, 13401, -5633, -20143, -21171, -13860, -8443, -7483, -2995, 9628, 24805, 29426, 16872, -4189, -19380, -21552, -16419, -12581, -9957, -1838, 14020, 29623, 32108, 17917, -3036, -16277, -19250, -16848, -16510, -15673, -7716, 8710, 23451, 25298, 13111, -2148, -8960, -7394, -6163, -9275, -11650, -5931, 7586, 19472, 18622, 7486, -3282, -6383, -4089, -5617, -13180, -18800, -14009, -321, 12604, 15730, 11026, 7933, 9912, 11387, 4831, -9265, -20395, -19587, -9001, 1413, 4932, 4877, 7602, 13382, 14981, 5561]
845E561j5759j0954J453J0705J0138M639K300N737O301r65j2527j8068j1321J327
859b1433R272Q403L353M006P965Q130r71j1878j6112q488K321O956M496R69M018
874A007R090Q853R8j0616j3504o743J315K651q61j893L861J0230J0932K358o920
889I858q952l716k2j363n306m020L467J1100J1503L584n332o424k552j807n328
904e310q354n377M219J2747J2534M019k513l012j042k466p245j0888o949M117
918a5520J1605J0587L293p32p77Q70j843p738j1423o365L678R575P868K777J113
933F968J986L502j083q372j1484o544J811N980M742J612K169N913O679O59p800
948F738j0827o569K24L135J732K95K894Q228Q608J064o982r583o625j726J171
$$ y = [5561, -10198, -21152, -19699, -8994, 1144, 5783, 8083, 13820, 20121, 19156, 6629, -11439, -22760, -21433, -12161, -3758, -405, 3601, 11566, 19696, 18725, 6847, -9265, -17753, -15432, -8476, -3980, -3011, 1007, 10097, 18950, 19048, 8432, -5072, -11815, -10500, -7849, -8710, -10603, -6742, 3488, 14420, 16778, 9858, 906, -2810, -2832, -4195, -9501, -13521, -10054, 1046, 12549, 16133, 10801, 4377, 1825, 18, -5310, -13664, -19041, -14822, -2075, 10459, 14478, 11965, 8953, 7911, 5445, -1800, -12688, -19637, -15520, -3915, 6672, 9965, 9233, 8456, 9326, 7483, -255, -11678, -18043, -14365, -4790, 3078, 5855, 6968, 8954, 12456, 11373, 3001, -8483, -15027, -13216, -7236, -2494, -882, 1287, 7200, 13879, 14538, 6738, -4089, -10658, -10434, -7299, -5567, -5272, -2378, 5850, 14458, 15522, 8540, -1043, -7668, -9394, -8223]
963h223r59k28M784R849R098K073n626q341n858k338j874l635j606N058R857R139
979A1170L152l832o342l396j779m406n879k095M249Q962Q930L282k992l269j106
994D649k199n726o497l549K740Q219P570K520j144MM17j717n504p642n228J933
1010a1154P244N624K312J490K895J915o51n880r050o587M82L812K592K636L915
1025A595M703M902J136n724q564n001q73O18J431J809L891N832O398K89o384p919
1041a861n021k060r14J147J246M510Q672P917L97n028n970n529l085j303k092
1056h974r65M074Q611O385J021k443m698m102j256j886l694j557L907O604N021
1071F048K947j033l170j964j059m198n294j766J794M402N089L151M98j59J261
$$ y = [-8223, -9182, -9410, -4626, 5223, 14321, 16394, 10768, 2427, -3431, -5769, -7643, -11278, -12884, -7826, 2031, 11170, 14322, 10490, 4148, 752, -1027, -5433, -11312, -13407, -9158, -196, 8734, 12016, 9024, 5755, 4649, 2450, -3276, -9773, -13322, -10582, -2363, 5207, 7727, 6583, 6587, 7004, 5287, -217, -7859, -13087, -11154, -3910, 1714, 4026, 5516, 8411, 10326, 9675, 3795, -5255, -11842, -11360, -7548, -4956, -2320, 1595, 6298, 11200, 12336, 6612, -1952, -6953, -7826, -7208, -5777, -3968, -77, 5755, 12153, 12442, 6058, -1861, -6882, -8942, -9856, -8709, -7463, -2953, 5719, 13636, 14033, 9005, 3035, -2494, -5579, -6882, -8974, -9939, -5865, 2746, 9131, 10152, 7709, 3011, -1091, -2347, -4233, -7927, -9484, -5577, 1027, 6048, 8995, 7962, 4792, 2828, 1769, -2429, -7723, -9489, -7695, -3293, 1796, 4947, 5445, 5286, 6547]
1086F547j596n443n566k867k9L581N272K702J951L611K341k175n377o739n354
1101i141j310L135L099J975L785M896L127q26l921o901n384q07J916J453K770
1116b134M834M078L339L02m731p200m710j654j030Q89K704M664N088M325J078
1131I842l312m359l197k988k310m59R56L197N343M347O00k783k399k194k677k516
1147d909j865r04L146N277M393J002l68r54j694j767k615m071k611J674L687L214
1163F35K760J576N30j22j168l793m905l059mJ420L651M177L055K356J296j619
1179F786m387n399l438j818N49L557M054L523L886K174k509m937m858l928j741
1194h486J089K710L662M289M680J910k170l935m986m067j321L71P88K464M002
$$ y = [6547, 4951, -492, -6058, -8925, -8954, -5373, -101, 2601, 4552, 8163, 10504, 8329, 2952, -3787, -9141, -10451, -7316, -4217, -2242, 1543, 6439, 9566, 8740, 4819, -2082, -7466, -8273, -6357, -4904, -2134, 2700, 6778, 10117, 10419, 5688, -1512, -6222, -7876, -8906, -8017, -5313, -649, 4439, 8764, 9842, 6530, 2171, -1026, -4014, -6324, -6783, -5827, -2630, 2713, 7060, 7660, 4877, 2478, 284, -2393, -4909, -6774, -7678, -4532, 745, 5138, 6140, 5772, 4818, 3124, 1357, -1258, -5329, -7940, -6266, -2579, 635, 3395, 4971, 5501, 5379, 4211, 418, -4487, -7546, -7550, -6130, -2479, 1698, 4753, 7109, 8405, 6786, 2399, -3000, -6438, -8256, -7707, -4150, -96, 3427, 7313, 9487, 6978, 2041, -2817, -6745, -8486, -7397, -4687, -1025, 3264, 7944, 9854, 7684, 3749, -1237, -5304, -6625, -6254, -5466, -3002, 1000]
1209A000L332J999j23k968l124k227j207l58n68J306K341K233K002J040r09j478
1225B291r76j597k809k305p9J113K372L492K148J293Q56l75k818l840l700k290
1241g224J77L098L410L285K617K109n77l196m312m529k880L36K740M062L813L381
1257F310J673j039k875m584m663k369O97J961L333L859K909J249k74k286l739
1272A62l542j541m64P20K048K647K382J643P85q05k184k329j501r29o07J25P43
1289b647K155K451J579K05n98q20j838k285k328j177O24K129L003K582K093L78
1305E506m60k077l254l190k731l16K232K598L527K544J481j21k149l357l970k515
1321f252j19J820L239L217K751J511N3j934l630l610k649l32J486K223K664K217
$$ y = [1000, 4332, 6331, 6208, 3240, 116, -2111, -3318, -3676, -4244, -2938, -597, 1636, 3638, 4678, 3769, 2291, 1315, -282, -3091, -5396, -5475, -4362, -1990, 1502, 3650, 4943, 5799, 5424, 2606, -1234, -4934, -7224, -7047, -3949, -539, 2746, 5363, 7472, 6895, 3699, -613, -5142, -8022, -7686, -4946, -884, 2929, 6310, 7983, 6944, 4069, -515, -5178, -7547, -6850, -4889, -1556, 2303, 5212, 6461, 6187, 3901, 162, -3380, -4921, -5385, -4665, -2617, 30, 2412, 4055, 4840, 4035, 1851, -478, -1979, -2908, -3515, -3390, -2647, -492, 1959, 3538, 3743, 3145, 2325, 487, -1798, -4126, -5303, -4679, -2550, 453, 3035, 5128, 5506, 5046, 2969, -285, -3475, -6206, -6522, -4290, -1692, 1835, 4379, 5860, 5739, 3590, 233, -3737, -6252, -6371, -4551, -1312, 1905, 4656, 6167, 6220, 4286, 656, -2954, -5603, -5935, -4449, -2226, 438, 2655]
1337B655J883O6o66k325k740k133q69N82J263J530J906J919J075j58j544j704
1353G40j910j342j029m46O19J086K600K085J258J46n51j529k220j610j669m93
1369d265J139K618K732J920O58q79j430k715l135k407o49J379L172L449K625J315
1385E527K3j372k705l128k732r82Q04K610K820K002R99L9q24k091k855k013q23
1402d701Q29K255K108J509J242N44j27p31k345k166j554L2K34Q91R92J246J665
1419A923J441k16j126j661j799q87q10J47O69J725K422K231N94q06j869k509k344
1436b875j311r75R25K050L323K498J210o42j642k357k000j828r73O89K543K796
1452A431K185Q64o25j721j923j855j829j229M78K092K577J636R45pl32n50j423
$$ y = [2655, 4538, 4604, 3938, 1613, -1127, -3260, -4129, -3547, -2284, -754, 1152, 3071, 4146, 3988, 2444, 740, -1170, -2512, -3541, -3987, -3368, -2282, 318, 2403, 3661, 3807, 3256, 1727, -493, -2103, -3772, -4265, -3126, -508, 2224, 4144, 4802, 3923, 2493, -222, -3357, -5764, -6413, -5034, -1862, 1587, 4212, 5527, 5550, 4178, 1473, -1655, -4387, -5369, -4565, -1955, 865, 2867, 3866, 3905, 3081, 990, -1865, -3878, -4701, -3872, -1617, 491, 2000, 3242, 3786, 3659, 2928, 583, -1583, -3137, -3105, -2871, -1980, -988, 258, 1923, 3364, 3148, 2022, 361, -1438, -2325, -3135, -2988, -2319, -594, 1828, 4059, 4653, 3847, 1978, -531, -2875, -4186, -5161, -4236, -2186, 1137, 3635, 4845, 4203, 2561, 204, -1796, -3624, -4597, -3908, -1365, 1431, 3616, 4480, 3855, 2134, 211, -1644, -3473, -4702, -4224, -2132, 445, 2081, 3026, 3019, 2687, 2137, 714]
1469G14j702j384n93O44R84J449P16Q18M49K68r22j685j294j304j18O50J469O40
1487b01K064J648O99p84k030k046k140q12k07R75J349K573K121Q94j62j780k706
1504e45j950n83m80K92J789K376K397R57j36j951k235j762n62r98J56J416J371
1521d48J980J692K9j368j007q47j441p67j87N30P66J949J372K32l66k88j140j190
1539d99j316r77o41J143J773J128R56J063M98o32j101j736k169p95R12Q58J121
1556d14J676R46N68L5o01k910j923p47lJ286J644J392J150J164M83j300k296j383
1574a233j630o17Q48J427P47J500J685M98j086j560j358j439o92O51O41N31K040
1591I53J512L79k90q49j533j220n55m83l90O76J325J617R26K28n24r98o00o91
$$ y = [714, -988, -2372, -2965, -2321, -1337, 112, 828, 1646, 2095, 2363, 1441, -244, -1538, -2842, -2960, -2310, -841, -201, 1863, 3511, 4210, 3426, 1396, -650, -2790, -3602, -3809, -2834, -1485, 1088, 3209, 4103, 3941, 2161, -545, -2495, -3078, -3558, -3266, -1477, 899, 3296, 4253, 4117, 2166, -69, -1831, -2393, -3391, -3235, -1819, -448, 1532, 3224, 3253, 1885, 878, 31, -1410, -2177, -2364, -1834, -1068, 881, 2253, 2485, 2119, 1831, 691, -499, -1815, -2792, -3433, -2290, -517, 611, 1567, 2630, 3128, 2496, 1395, -341, -2510, -3305, -2393, -1535, -414, 1262, 2208, 2776, 2811, 2210, -700, -2623, -3370, -3373, -2087, -443, 949, 2099, 3263, 3746, 2446, 150, -1233, -2863, -3480, -2632, -1205, -458, 1042, 2727, 3225, 2139, 579, -779, -2218, -2910, -2259, -1618, -1087, 953, 2465, 2844, 2554, 1705, 172, -1048, -1603, -2086, -2476, -1800, -475, 1142, 2068, 2296, 1772, 774, 174, -517]
1609e17j322p27L75J054J014J973R99o24k91o68j167j673r16o59M35J922J812
1626A020Q53m8M83p72j152j218r45j259P62K216Q14N11J213L37j069j183j427
1643h64j551o30P13P37Q79J237J175O20O5n10j414j771m52J99mO81O33Q87Q18
1662A448R38n22j659q77o34p17O6N70J74Q84J941R84rq02j248j188r61l13j42
1681b067J71J259J427J078M85m09j060j307p35o68q65N74J576J036R79R63q2p38
1699A617q92j095j135q11K39O27J204J269N60l4P6m42q81j384j107M2K28J425
1717d94J075M11P46L99j11j152j112j177q66j0P07J132R61P74Q70l3p13r39j475
1736a007n07k17J26N66Q44J278P39K90k39j397j337n33k39j29K18P79J381Q72
$$ y = [-517, -1839, -2566, -2191, -1137, -123, 1850, 2849, 2225, 1934, 1266, 99, -1574, -2490, -3149, -2714, -792, 1020, 1873, 1825, 2308, 1536, 384, -834, -1779, -3038, -2276, -60, 754, 1265, 2478, 2815, 1746, 563, -864, -2415, -3045, -2332, -1595, -716, 521, 1696, 2316, 2381, 1871, 457, -1314, -1766, -1567, -1571, -890, -257, 630, 1448, 2386, 1864, 205, -672, -1306, -2023, -1957, -1387, -1213, -329, 1612, 2596, 2587, 1785, 537, -651, -1612, -1925, -2067, -1896, -637, 790, 1868, 2353, 1944, 884, -423, -1158, -1826, -2691, -2117, -541, 495, 1474, 2437, 2355, 1617, 725, -370, -1505, -2316, -2077, -1450, -246, 1023, 1583, 1549, 1625, 1183, 302, -1082, -2189, -2147, -1919, -494, 581, 992, 1738, 2137, 2026, 874, -238, -1415, -2281, -2291, -1584, -452, 509, 1283, 2153, 2120, 1407, 468, -1007, -1514, -1731, -1605, -1039, -195, 1083, 1822, 2112, 1873, 476, -861, -1394, -1633, -1762, -1544, -765, 616, 1488]
1754A488P59l80q23r52l61j020j79k82L72J032J174P02M23o71n91p20n00p67l41
1773a637j93O84J699O23P21j52n03p32r71q22o94k06Q98J021R54J090L55n40m16
1792A179j060j076q65k24L90J059J116Q04M05l54k02p05r27j046jL87O1J050O75
1811F66O17L57lq04o84p90m42k1NK89O88P27P44J47m68n81l12r44n67m54O62L53
1833h15R02J167N35J21n89j005p92n93p26j1L38J285J059J296k54n93p45o44p16
1852g80o93o9J09J111J175P28K24n53o10n72n45q90j13K6R10P42Q59K76l20p1
1872I44k82r20j12p24j89q9P98R15L61K22L17k80p66k08n83m29j33LP07J025L51
1893I28N8L38l75m86q84n19l85k86P07Q73P14P55K60l30n90q68p85n38k11N32
$$ y = [1488, 2247, 1867, 1044, 92, -269, -1289, -1468, -1750, -1378, -346, 828, 1530, 1953, 1282, 691, -29, -529, -1296, -1637, -1830, -1146, 553, 1176, 1897, 1745, 1242, 510, -461, -1283, -1977, -2183, -1285, -264, 690, 1780, 2135, 1595, 1179, 119, -957, -1822, -2046, -1656, -597, 519, 1323, 1728, 1374, 1172, 467, -460, -1506, -1507, -1120, -1059, -9, 666, 1283, 1640, 1637, 833, 149, -641, -1083, -1104, -1099, -810, -122, 605, 1349, 1496, 1028, 447, 135, -809, -1376, -1830, -1168, -815, 87, 1254, 1789, 1910, 1321, 316, -476, -1069, -1795, -1806, -1468, -183, 876, 2172, 1918, 1325, 580, -64, -780, -1473, -1542, -1433, -322, 853, 1581, 1805, 1252, 642, 70, -475, -1365, -1478, -1452, -542, 200, 1059, 1335, 1015, 944, 662, -258, -370, -1094, -1283, -1372, -574, 341, 702, 924, 1241, 961, 195, -13, -596, -1025, -1158, -1155, -448, 577, 928, 986, 1324, 949, 463, -421, -940, -1325, -1611, -904, -31, 683, 1438, 1698, 1368, 778, -90, -875, -1413, -1624, -1092]
1913a092P17J074O46K66k57m94q39q61p63K45l4P52Q64O71O60j42l12o95n09p26
1933h29l95O7N26N07N27N07N7l84k53k25j20o43n17n9N53O63O00R8O2j6O1n45
1955B42m19m88o77N5P73P02K21L94K61l4m73l81q40j002m5N80N35J031Q55j50
1975A140J72m78o54q63n90j74L96P78P55O14J28j55l54n97o34m70n64L12M94Q81
1995A37M50J33L0j21l52l9m42m07m40L15M63N74L68k15J43J49j97n09k19o22l08
2016a109K71Q01J49J99M66K20j95j36n83q27p40N16M41M30O15L75R1j45P1q42
2036F8q91m44J70l3P51R07M10K1J40k59m93p37m34l16j2P93N17L09K24J41k42
2057E90n30k15q4q02M1N19L08M25L88R0m13N30j73o24n80m57j41L76P20L30N4
$$ y = [-1092, -375, 699, 1345, 1611, 1354, 860, 21, -840, -1603, -1358, -1392, -640, 224, 895, 1555, 1413, 1101, 406, -103, -829, -1224, -1157, -631, -124, 403, 910, 967, 583, 330, 105, -15, -658, -1175, -1234, -681, -18, 582, 680, 742, 726, 787, 242, -177, -665, -1342, -1287, -514, 188, 409, 803, 1064, 1030, 557, 176, -664, -1666, -1711, -1131, -596, 435, 1290, 1140, 1312, 834, 180, -683, -1273, -1447, -1051, -273, 482, 1096, 1224, 1069, 715, 118, -516, -986, -1550, -1238, -744, 137, 587, 720, 750, 629, 277, 238, -204, -611, -1051, -736, -273, 301, 669, 454, 597, 746, 549, 40, -179, -801, -1109, -838, -37, 112, 311, 777, 997, 802, 666, 83, -744, -1484, -968, -527, -97, 518, 893, 984, 839, 910, 68, -823, -1267, -1097, -1130, -379, 528, 938, 959, 1099, 840, 347, -390, -824, -1140, -1152, -359, 158, 467, 691, 832, 590, 60, -155, -239, -1041, -1000, -481, -173, 252, 640, 730, 317, 847, 674, 50, -530, -987, -1128, -752, -32, 298, 352]
2078C52K05K46r7k17o47m75m24K05K82N88N50K92k7j1R8j254o23j84K8K22N32
2099c59O49N24R0J83l53n24q44p4j30M1P58M50M2Q4M21m30k98k17m92m20K89N09
2121a01M2K04L48J67o0J86n40p57j92m6o3O74J08j8L5M88M65m66k41n34n65J15
2143g51K33L12L11J94J98J88J68l66m43r16pJ25K91M64L52M5P2N61J40j096n24
2164d49m01m49Q09N25K25M4L60J87l02j24r75j40j52K56L14Q3L15L91j1O1J82
2185G49q34k03k34j13L51p4L51L09K41j80M72l74n86k35P4l44L26L5J78K52O01
2206G62j06k74r0m86m55j67L60m4K85K73N65J99l8l36l38q12j22K22RK37N32K16
2228C92K15L09n07l59k71j35m94N19O0L94j61N64J92m18j5l92n90K76J80J28J27
$$ y = [352, 557, 803, 706, 489, -158, -633, -1057, -852, -570, 18, 568, 860, 833, 822, 920, -334, -957, -1141, -1113, -891, -359, 290, 814, 904, 1087, 734, 210, -634, -708, -838, -797, -39, 411, 453, 537, 958, 528, 230, 13, -479, -899, -610, -101, -59, 145, 493, 660, 600, 786, 246, -511, -703, -749, -812, -138, -30, -48, -13, 475, 940, 474, 233, -301, -866, -751, -518, -206, 105, 299, 497, 685, 853, 487, 44, -872, -879, -754, -463, 1, 353, 398, 470, 1031, 1171, 75, -449, -850, -1299, -490, 35, 260, 304, 664, 851, 549, 425, -550, -690, -842, -586, -272, -189, 126, 517, 506, 567, 749, -85, -288, -522, -635, -284, -358, -7, 302, 543, 363, 835, 461, -125, -360, -286, -630, -304, -269, -91, 161, 762, 656, 382, 292, -194, -649, -816, -456, -500, -215, 58, 623, 822, 784, 448, 110, -702, -824, -602, -593, -356, 176, 392, 607, 916, 409, 50, -221, -356, -850, -331, -271, 123, -38, 526, 718, 300, 285, -107, -697, -421, -241, -113, 14]
2249A4j72K57J49M57j54k53p53R8k59PK36K19J00K05L09M79m86j89q19k01K55
2270e01L69j85K17K87L43PL13l33o88m84J72k4J79Q4K34M59K16R6n9o94m68j53
2292f13n2M04Q7J77M1M15P2O2o50j68j74l2O9j7J46K99J51M68r5l11k83l25l1
2315c60J78l07l6K83J63N49P9J78l35o00K0k76K3k47M89P1K85K65L47m13k83k66
2337a93r7k89K41R7N6N14j14L34j55p6m08k38l6J63k91K46J24K79L02K38l47q4
2359B66o36kl0R0K6NL76J77K58R1k34k74m98R5o3j45P1K97K62K44J57j95j1n15
2383a88J24k27j81J23O7L35L54J74j48k39l02k23J11k92O2J11K79L52J70p6k19
2404A67K5l63K0J14k02n6J61L36Q5K38L0m77k6o0k52j56K4J77k12M77K64K30r4
$$ y = [14, -158, 99, 248, 705, 551, 298, -455, -357, -616, -609, -373, -154, -54, 151, 460, 939, 453, 264, -555, -756, -501, -132, -317, -100, 187, 530, 537, 850, 517, -171, -655, -483, -507, -328, -244, -10, 449, 665, 761, 702, 8, -460, -613, -665, -261, -174, 3, 44, 459, 531, 593, -57, -225, -399, -431, -362, -379, -233, 66, 217, 685, 590, 279, -4, -329, -360, -182, -489, -525, -242, -79, 470, 549, 727, 392, -208, -188, -464, -441, -688, -199, -128, 157, 422, 769, 356, 73, -193, -290, -579, -338, -241, -185, 329, 215, 549, 394, 318, -90, -328, -364, -201, -492, -246, -122, 157, 459, 697, 350, 266, -370, -372, -402, -312, -286, -281, 95, 272, 530, 621, 387, 113, -385, -290, -353, -498, -427, -130, 132, 376, 533, 338, 327, -188, -64, -291, -472, -349, -282, 53, 407, 581, 433, 194, -108, -331, -220, -512, -450, -339, -60, 292, 462, 386, 167, 192, -171, -151, -37, -239, -295, -134, 202, 287, 525, 555, 78, 52, -8, -260, -416, -392, -215, -427, 50, 314, 544, 450]
2427D50l86K40m42j26o0Q6j08K89K70J71J13j86k65l73J94p7q8j48J62L28N07
2448E51k11K36m21j54j92j24j11k6j16O90o4O46l99k36q3k19P4q6j55n3M34K12
2470A93J04J56Qm94j07r3K70k98m5J07J95K53Q8J02k73k99K20j69j95k0P5j85
2492d07M14L46o3J10o3l00n5k34J9k67N80k87K79Q0J82r1k88N0p4k77j43K62j71
2515c98O16J09o4NK1j33j55p9k73K0J73J64P2L82k85K36o97O9L48j11l10J52j80
2538c18K54J70P5r2M7j71R3o8j44J00l51L07J04K57J23l00J83j24l61K27n04R4
2560c99J42J79J32K08J73r6m4l76k13k12L0l5N53r7N62j33o5r7l12k90o5Kj58
2583f11M36L95J41j60J85j86k59J0n4k7l39K59P4J81O1J89l2k75J07k06L7j95
$$ y = [450, 64, 304, -138, -264, -324, -238, -346, -57, 213, 384, 497, 311, 46, -327, -133, -210, -298, -446, -284, 44, 551, 340, 576, 155, 1, -191, -315, -426, -452, -568, 122, 58, 704, 305, 69, -14, -233, -159, -245, -400, -453, -19, 193, 297, 453, 461, -33, -140, -233, 37, -261, -306, -199, -4, 249, 337, 439, 166, -133, 87, -82, -277, -297, -222, -407, 7, 353, 290, 400, 337, 37, -18, -252, -233, -500, 80, -207, 72, 152, 334, 243, -45, 5, -69, -346, -489, -227, -398, 218, 327, 263, 268, 289, 156, 1, -78, -351, -331, -158, 6, 78, 460, 175, 411, -286, -217, 131, 20, -290, -138, -318, -64, 106, 181, 89, 136, -35, 58, -10, -154, -54, -405, -98, 6, 263, 386, 86, 269, 145, -216, 11, -493, -399, -257, -78, 54, 262, 435, 339, 295, -81, -294, -506, -476, -511, 42, -55, 507, 374, 309, 212, -100, -390, -455, -453, -611, -175, 220, 361, 201, 386, 200, -59, -49, -103, -130, -469, -210, -136, 45, 106, 295, 263, -12, 95, -111, -74, -269]
2605b69%K49j01M44k57J07L02j71m1j84j4m03M5K2M10k79L92q8mJ39j86k38J06
2628a9m0j70O9L66k7L4P9q2l9j15l46j94J76R1L88j99K45J88k42j18k39J52k42
2651b84R8M6Q6L48Q1j80l84L14k03K12m04j15J30J21J01L11k87J4J59k1j53O5
2673E5k36j39l9J64j1M00KJ21o6n35L84k34J07j35O1j82L17Q0RR3j34K13m42j70
2697c17R9j36L17O7K39k88L16j13l75R5l42L00r0J04N7Q5J88j83J32j47j10N3
2719d9k68L01l28K98m6L85l02J20j69Q0N3j43L6j83p5L36p1K03k7m1kL97m26l16
2743b37K2r2m7K02O3N00j01j08J3l18J08j13o3P9R6k6J63M6P6n4k06q1l24J23
2767b79J15k1K05o5L22q0l06K61k9m2m6l13J67J45L3J94o3l93L13m2j64j96J00
$$ y = [-269, -269, -20, -121, 323, 66, 173, 475, 304, 263, 79, 65, -338, -293, -271, 139, -140, 252, 164, 160, 299, 113, -125, -19, -59, -229, -160, 206, 179, 213, 292, 210, 171, 56, -290, -484, -308, -217, 171, -28, 217, 405, 163, 45, -194, -42, -284, -186, -140, -54, 294, 375, 195, -189, 125, -78, 134, -270, -385, -255, -134, -33, 278, -9, 5, 164, 143, -10, 55, -181, -320, -359, -195, -206, 194, 196, 317, 251, -284, 100, -134, -27, -162, -101, -283, 34, 114, 123, 216, 82, 295, -147, -317, -218, -354, -37, 30, 269, -19, 297, 184, -191, -96, -438, -138, -228, -124, -67, 18, 206, 23, 155, 8, -102, -49, -317, -16, -344, -46, -92, 293, -9, 111, -58, 22, 75, -68, -32, -215, -290, 46, -25, 178, 151, 110, 108, 505, 79, -237, -215, -307, -354, -152, -89, 411, 310, 202, 215, -103, 5, -108, -171, -92, 4, -22, 141, 187, 263, 209, 3, -78, -402, -279, -164, -185, 20, -45, 277, 197, -109, 152, 123, 81, 35, -278, -111, 34, 67, 261, 198, -195, 118, 76, -88, -284, -184]
2790a84j61J83J45j46M08j66J46j57K16l40j43N3l6L87m19J84L97Rk06p8N7k22
2812g3K5j30Q8k09L03K02J43j37j63l5l44L93l50K71O5n2J9K44j18P5j85k88K50
2835fj78NL48l09K30K17j6k45M08k95l01P8MJ85l79K82l5K77k06J19qlm27k7J51
2860a31o5N6K6P2K08J35k4m14J43p0o1k1pJ29J69K1N1k53lO1k6l53O3K75j54J23
2886e0j9J62j10k24J29Q6J5k54k4L70M8m8k71K23p1K61j27j06k39L52l19L55j61
2909b2K18n7n3q5M0j23p4N4k67K4L18m1K89K3Pj00j81j75L4n1J03n6N5K21k91
2934a90K65K52j05k22k0k71P4P1Q8J22j11m4K47Q7j06m04K22j56O6L19j24J12
2956A72m7K0J07m13M5M3lk57L37O6k46L09j86K33o9p4o3M6q9j62N9J20k7J71L
$$ y = [-184, -345, -162, -17, -163, 245, 79, 225, 68, 284, -56, -199, -146, -182, 205, -214, -30, 367, 376, 170, 92, 149, -73, -48, -178, -90, -299, 4, 206, 349, 212, 49, 14, -330, 63, -287, -16, 49, -3, 16, 260, 142, 217, 32, -256, -6, -184, -179, 169, -140, 90, 307, 291, 46, 454, 159, -142, -64, -60, 125, -254, 28, -7, 270, 64, 183, 175, 172, -255, -282, -131, -196, -140, -114, -42, 166, 301, 277, -137, 6, -64, -125, -146, -153, -24, 145, 166, 217, -36, -39, 22, -4, -357, -294, -19, -173, -50, -69, 93, -17, -241, -112, -26, -11, -265, -289, 81, 129, 81, -190, 33, -38, 223, 96, -10, -249, 103, -216, 139, -22, 196, 139, 86, 1, 41, -82, -156, -102, -369, -345, -27, -68, 221, 244, 251, 151, -30, -205, -171, -222, -119, -175, -120, 101, -190, 75, 327, 222, 0, -20, -291, -217, -146, -58, 64, -47, -91, 156, 243, 137, -267, -45, -201, -135, 184, 60, 172, 125, 145, 252, -161, -116, -73, -76, -333, 4, 70, -176, 133, -53, 180, 111, 37, -26, 20, -69, -231, -172, -52, -79, 92, 95]
2981I5J19k56K43k59l5J83o6o7N8Q8K28k32j44K13j18k8l95L71Nj48K2Q1p7J28
3005Ik21L75J5l38J72l78K06J90j02K68lk14M7p3Q5k27K66n5L36n69K93j29J12
3028F5K37k52M2k17M05l86j05J4P4J56N7L41n22M6j18M6o6J88j69K7O7J22J49
3051B01k93J38j58N1j46K6K41j6k3p0J05j1J27j45j75q8R9K25j21J47K05k79k7
3074A3K48j70P6k79J84k34P6Q6QJ02j80L7K05lm8j00m7j76R4N9j99J67Q0J28l21
3099a94J94n8k14J03L70k17j19L34k51J6J6q4M5NL8j25M9M2Q0K25O3j99%r4K1
3124D6j49R6k29%M37j82J88J29m9m25J33K35k02n6k06L71l03L4K59l22J9L61m90
3147c05P6J58r6L3K2K38J19k21k44N05m10J61N1j58K7P8j79J47J77j09j96L19
$$ y = [95, 214, -42, 201, -58, -93, 90, 24, -43, 15, 103, 331, 99, -45, 168, 50, 22, -373, -2, 3, -145, -123, -42, -119, 9, -212, 163, 178, -160, 12, -366, -160, 30, -72, 196, 193, -21, 26, -47, 38, -189, 77, 22, 358, -211, 82, -47, 65, 302, 50, 92, -125, 280, -106, -211, -197, -123, 33, 90, 431, -91, -45, -163, -117, -183, 5, -164, -137, -70, 52, 201, -92, 46, -112, -61, -207, -181, 60, 44, 21, -49, 56, 45, 172, 27, -148, -236, -137, 88, -33, 114, 319, 40, 13, 261, 91, 167, -112, 72, -162, -86, 0, 8, 110, -70, -33, 172, 169, 121, 21, -26, -202, -108, -49, -248, -81, -1, 127, -194, 0, -58, -272, -169, 201, -16, -135, 199, -52, -36, -20, -104, -59, -54, -16, -141, -92, -50, 30, 255, 318, 119, 119, 25, 46, -103, -7, -236, -236, 201, 19, 207, 336, 287, -138, -5, 230, 28, -28, -234, 137, -166, -132, 127, -195, -176, 185, -305, -229, -71, -167, -134, -112, 126, 245, 24, -220, 285, -125, 36, 87, -71, -44, 34, -145, 2, 179, 70, -126, 193]
3169A93j44K89l45N0m7OJ72j12q0J27q9l03J21J32q9q1L18j63p6K6J02j19L03
3192A91m14J23K45o9p7J06J28r9r8L06k72j7rp4j41k1Q9L60k81J89j12Q2M9n24
3216c40J13J2J16K51l14O1K17J27l58J16J58j43L0o1m3L9R4k5n9J04J55l20n0
3239a20j86L49j62n9K50r2ro0J70R0k77K37q7N6l8P4L6j83K27k88r8J96kk7l76
3264c79K44L35n8j63P4O9j32npr9R6K35j63n5Q8j51J8J33j43j12L24k52M4j04
3288a63j97J98J31L6J23r9J31o9k07K51JP3m02M16j54M1j6nj03J76j49k96K77
3311fM6J37k46K2o3J29K7K56O8j84m30K41p9K0Q8K05q8k40K3K72k04k9J9j86L49
3336A47n5l24J68J36Jj20K93k99o0j41P1R1M3P1P4L6j76K7R5j10J0j25Q5q5L02
$$ y = [193, 49, 338, -7, 43, -4, 2, 174, 62, -18, 109, 20, -283, -162, -30, -119, -200, 118, -45, -121, -95, 7, -112, 191, -223, -100, 145, 76, -1, 105, 233, 134, 36, 342, 70, 53, 44, -30, -171, -192, -103, 257, -24, 165, 53, 135, 184, -340, -227, -215, -99, 152, -162, -101, 116, 243, -115, 1, 159, 16, 46, -15, -58, -19, 75, 50, -9, 95, 250, -70, -120, -306, 43, -119, -178, 72, -20, -29, -89, 81, 171, -106, 131, 44, 100, 62, 136, 172, -11, 216, -72, -170, 26, 24, -3, -379, -135, 200, 142, -21, 53, 122, -10, -15, -22, -121, -25, 210, 47, -8, 80, -71, -53, 80, -63, -175, 149, -103, -59, -163, -360, -162, -31, 5, 128, 29, 160, 91, -116, 135, 136, 209, -193, 223, 69, 110, 94, 89, -14, 162, 13, -283, -6, 40, 177, -69, -47, -110, 19, 46, 302, 370, 186, -244, -3, -82, -62, 26, 231, 143, -97, -74, 198, -6, -35, -16, -202, 147, 92, -232, -64, 72, 73, -47, 246, -53, -113, -254, -183, -92, -49, 22, 96, 132, -44, -17, 78, -32, -22, -147, -62, -147, 155]
3361A55O7p2OJ06m18J37o4j77l1M44Q2j80R5j01N6J6j27j16J31j71q3K88K0j01
3385c8p7J38q2K80Q3l96o8j06L49R5k62J06m9K36m8J0K3n9q5m2J56l35L28m4l89
3410b76M06k44J19k4J77l64L16k10K90j84j40J57pL7j05L1j57L62k02O3P0j08
3432GK20Kk27j1O7o9K5l2K39j17k60K35j65K60k02J81k51K41j27k01K84n5J50
3455A94j88K3J39J05j95q9L7q8K80n8m6j12Q9P2k43j26O5L28j41M3r7q9NJ69k98
3480b21MJ19L07r3j02J12j4l9j11J35p7l1QqP7j11K57K6k43m4J0J53j69K3n7m
3506i3J96j48j9O9k21J31K62o2r5k8J60j15KK7j97RK74j18k27K63r6O5M9j31J27
3531H4k70j90N49k74n4K03q1rJ87j61j07K8Nl4n9J90N4q9j02K72k66N6ML61k73
$$ y = [155, 222, 150, 156, 262, -156, -19, -83, -260, -291, 153, 235, 55, 150, 49, 105, 121, -6, -122, 9, -162, -245, 43, 63, -38, -115, 23, -59, 221, 304, -92, -160, -266, 83, 178, -84, 22, -27, 209, 161, 171, 194, 135, 50, 8, 164, -171, 157, 113, -276, 130, -114, 5, -19, 158, -206, 110, -100, 190, 6, -134, 23, 16, 53, -52, -21, -178, 184, -18, 45, 115, 7, 227, 229, 2, -9, 58, -11, 14, -18, 221, 104, -156, 79, -86, 174, -28, 153, -98, 143, 16, -185, 99, 44, 194, 6, 29, 168, 273, 78, -11, 26, -62, 218, 160, 114, 2, 91, 163, -80, -206, -141, 187, 46, 89, -8, -97, -92, 77, -221, -217, -98, 209, 116, 14, 126, 112, 73, -38, 97, 20, -11, -3, -11, 66, -45, 212, 238, -5, -49, -39, 114, -55, -32, -89, -93, 103, -45, -64, 5, -216, -85, 177, 115, 20, -8, 152, 37, 39, 66, -131, -122, 152, 34, -193, 70, -26, 39, 88, -43, 84, -186, -376, 173, -101, -155, 48, -33, -42, 145, -16, -123, -95, -90, -124, -183, 7, 61, -28, -130, 142, -124, -68, -64, 297, 24]
3556B4k63L96j07mm8j70K8l0K29J13k90P8J87j90Q0J01j75K36m17K48k26K63j32
3579f9J76l59K76j08J89N1j66J51l37K56l8j57K20O4l1j29K41k19r9O3j91l7K90
3602C7j3j20M13m40KP7j75L35r1J68l91K50p6J29j29Q6m7J94m05L08j11L27p4
3625B54j47k63K16m5L7K2M0q7j40M8J84k65K37j41o5K47m7K68j65k03q3O2j40
3648a76L40K6j02j74k0K79k81K80P8l33l7n6L90L1n7k56J7L68l95L08k16j82J44
3671b4Q3n5L0k7Q9j29Q9pJ79j73m2l5N9q6J5K11r1J44l90R6J21n0p4J10l1N4r2
3698b6J58%k78K43k83P5K94l05K15r1Q1j23J56k59K65O4nM9l80j06N91k25p4j53
3722a17J24j04L91k06k83k6K75L6l8n7N4j5J0j10j97J72J55o0J6j32QK72l4L0
$$ y = [24, -239, 157, 50, 46, -2, -172, -144, -174, 55, 168, -122, -44, 143, -47, 33, 134, -41, 195, -222, 26, -200, 63, -69, 107, -252, 24, -84, 105, 156, -10, 141, -196, 60, 22, -135, 85, 149, 118, -11, 230, 11, -88, -25, -216, -253, 37, 24, -96, 317, -123, -121, -44, -219, 116, 25, 193, -198, 52, -24, 105, -24, 62, 15, 209, -196, 112, 1, 328, 254, 107, -156, 60, 15, 52, 74, 114, 27, -113, -65, 119, -146, 91, -50, -115, 132, 85, 353, 188, -15, -98, -36, -176, 164, 190, 88, -86, -106, 173, -108, 172, 250, -83, -120, -176, 214, 245, 188, -68, -51, 317, -78, 230, 14, -168, -24, 59, 4, 34, 7, 96, -33, 56, 49, 228, 55, 13, -22, 37, -49, -34, 177, 86, 230, -160, -64, 57, 7, -67, 43, 12, 66, -26, 132, 132, -146, 97, -186, -111, 183, -122, 93, 2, 83, -40, 116, -143, 122, 186, 181, 230, -150, -256, 335, 110, 36, -117, 7, -97, 294, 88, -195, -221, 54, 90, 52, -5, 49, 34, 44, -66, -263, -91, 64, 4, 20, -112, -104, 168, 134, 164]
3746A64j33j87J26NK2k28Q2L36j67R1N8j24k09k7P4J88K1k05K49l3j55M0j02L04
3770A90k49K24l92L15l22K34m01M11J1R3n6k14R4L7k09L35K4p5j6j02K33k72K49
3793A42j54L2L0o4l1JJ53r7L2J35k51J53k38K61j97J87j36o2L8J51r3J6l0j64
3817a86L37l38J96k3n1J87j47r5q0K00L9j04L07j70%K6k26LK58J38k98J53j18
3840HP5R3j44q1r9K78j55K73j40k98J59rK40k29q2J77n0o6J02p8K15p9q2j17K3
3865f6M6o9J21k54L04j95o3J65M1Q5J35p7j74m2rk8j04K26J33m77K04P2K26k74
3889g4OK05k46J68k66K92j75Q4J32j09k55J88j75K21j40J64k15KL02o7j41J00
3911AK08m19L93j50j52j26K9P0J03J34j5j69J39l09K4K3J22K85k13p7R6k4J39
$$ y = [164, 31, -156, -30, -25, -3, -231, -149, 187, 20, 111, 169, 45, -164, -191, -117, 71, 92, -113, 136, 103, -52, -12, -114, 190, -59, 165, -227, 88, -234, 0, -401, 10, 21, 114, 58, -156, -62, -25, -234, 101, 125, 50, 34, -68, 165, -107, 142, -12, 20, 50, -14, -45, -44, 109, 12, 44, 179, -72, 81, -157, 104, -93, 94, -42, -104, -66, 85, -8, 8, -22, -186, 151, -187, 9, -14, -65, 122, -25, -120, -200, 0, 39, -65, 242, 72, 72, 98, -128, -125, 133, 271, -27, 126, 8, 83, 176, 32, -49, -148, 130, -25, 248, 108, -190, -31, -40, 200, -29, -111, 66, 16, -50, 52, -26, 189, 110, 28, -89, -66, -20, -89, 32, -222, 82, -113, -176, -11, 30, 115, 250, 173, -1, -43, -52, -80, -184, 42, 175, -302, -98, -26, 200, -74, -68, 137, -109, 59, -207, 85, -90, -6, 126, 17, -238, -50, -225, -4, -144, 20, -195, -193, 109, 42, -99, 1, 209, -210, 183, 33, -119, -245, -216, -146, -43, 91, 76, -93, 46, -263, -239, -216, -94, 191, -22, -99, -3, -27, 112]
3934A12l43J91K32o3m6J26m88N2J11j0J40j45l9K31Q9j47o8J81j06J69j02j03
3956b6K10k6k1j70M3M1j08J27mk46L37j1r3k67K58j05o5J30J61k08j02L8J77j90
3980a20l4P7K07J5k55j19M07j53o3kj1L3N4l01L82O1j55J25k71K32k06K77k98
4003a18lk2J73k32Q1o7K04K66j27k0k73K47j34K70l33Q2l4J07k49P4J12O4l03
4026b35J37K4J53k24J79n2L83j31k05J34k18K28o4j06r3k5K09j54K93k84K54j30
4048G3O0j10q1K96n14K99J08l0l13K57J65j45j06p2J97k37J54O7j11r3J40J18
4070A22J64m4q7j15J38q7qk41K59k02L93j72l49K69K0k45M5R1RJ15j36M3j00K18
4094A00o9L5o8K4k15L14p0r1K9j14K7J29J53P4k38k8r5OL0k31J79O1J1L54m76
$$ y = [112, -231, -40, 192, 129, 83, 209, -279, -227, -116, -126, 14, -131, -170, 61, 150, 3, -65, 116, 10, 179, 77, -26, 184, 158, 137, -33, 10, 51, -57, 70, 66, -180, 157, 146, 53, -214, 44, -61, -126, 4, 165, -43, -145, -107, 70, -120, -154, -77, 130, 145, -110, -229, 178, 25, -38, -40, -51, -18, 36, -265, 117, 178, 23, 148, -123, 109, -97, 180, -118, -121, -143, 30, -202, -121, -188, 16, 282, 155, 135, -138, 109, -25, 245, -88, -6, -40, 67, -182, -108, 4, 68, -235, -98, -74, 79, -145, 34, -18, 365, 234, 29, 163, -55, 173, 109, 3, -90, -115, 94, -60, 233, -51, 203, 73, 133, 23, -58, 238, -276, 23, 131, 101, -212, 45, 210, 65, -41, -113, 84, -153, 1, 68, -43, -136, 4, 122, 286, 242, 155, 40, 178, 91, 83, -158, 101, -101, 292, 120, -229, 40, 60, -185, -140, -49, -40, 75, -61, -18, -118, 100, 31, 66, -2, 22, -193, 121, 51, -40, -11, -125, -98, 31, 184, 258, 20, -8, -103, -97, -67, -298, -119, -58, -47, 307, -169]
4119a69J47j6p0J69r6L8n3R3R3j55j36K64k72j28L05lJ75r8p4J2j51l0J5L57l25
4144a08O3J19o5O4k06JK65r7j84K55%k96N6o3J34L35n59K95j44M3J5Q1J13j61
4168d4N8k66K95j71J00J44k34m3K90o9j04k32L25J60j27j91J31l7n6KP4J12q3
4191C4j01J4j10K38K0k20o8J80j13K90j89j1R7k63M57j42j12n6J92j94J7j00J15
4214b5l3K25K2j37j70J06q3j14J18J51j43K33j88kJ67l16J09J86p1j1r0N0j4j26
4238a56K70N1Pj45O5J41l49L26k15k44J01J13J00O4k13N0M0j18K09k83M01l13
4260i8j00K22j77L54m14K46j38O2j45J98P8k25Q5J60m4Rl21J56pr5J27j1P9k19
4284b18K01n3L5QqO1m5O9p4k66J82J58k30L19k7m7j75K51P6k79K5R5j1K28k48
$$ y = [-169, -22, -38, -108, 61, -35, 3, -50, 43, 136, -19, -155, 109, -163, -291, 14, 11, 186, 88, 14, 26, -125, -155, -140, 217, -108, -45, 74, 9, 73, -133, -132, 133, 36, -148, 107, 107, -189, -133, -196, -62, 273, -286, 9, -135, -92, -77, 4, 117, -44, 14, -252, 43, -128, -28, 116, -118, -161, 129, 60, -44, -276, 49, 209, 82, -109, 22, -15, -71, -69, 5, 117, 34, -67, -53, -163, 75, 95, -125, -193, -13, -126, 164, -25, -36, 61, -202, 255, 113, 1, -55, 137, -57, -40, -140, -25, -58, 167, 189, 52, -118, -12, -95, -209, -91, 60, -83, 150, -38, -40, 127, -189, -80, 106, 35, 24, -66, -16, -30, -156, 114, 165, 172, 27, 92, 233, -116, 210, -5, -249, -148, -35, 65, 129, -84, -34, 6, -112, 97, -186, 215, -98, -198, 24, -153, 201, -213, 33, -105, -43, -188, 10, 88, -137, -52, 108, 64, 73, -248, -92, -99, -194, -67, -78, 1, -218, -17, -70, -35, -27, -35, 26, -19, 50, -24, -290, -108, 50, -180, 139, 112, 65, -110, 141, 217, -62, -37, 58, 47, 275, 27]
4309B7m1O2K05mm01o9K22J03j36J22j39j3K49l5J4j42M7k52K58j21M2N3p9j67
4333a95k4K09j01m9K5K74j81j22K37n4n2k30N2L58k9p0j70J84M1r6K4o8j67L60
4357A56m5j13L05l57o6J57J30k35L0j05J46M2j6j10r4J66K31l05j68K04N2m4j1
4380e0qr5J69K42l21N0m2J22J19l04J13R1r1j39J05J75j91k3R0k06L26j55J29
4403A06o1j64J26N3l5J21k83K48R4j97P2j54L5N6k2R4m9j2k28R4n1J90J06R6l32
4428i7O2K27j64j48L1Q7j05L4K35j81j17Q1qj26J03NP8j82J99L09l46J58q8lP1
4453A15k00Q2Q3J4j66O9J7%j53L01j56l22L05m6J02K5P2j51j20l2K61oM6j26j38
4478a24J18k23K28p0L1O6Q0r4J07j41p9p2J54j10J71jJ76j41j55K8q2P1j69K68
$$ y = [27, -14, 48, 253, 249, -152, -221, 1, 104, -32, 90, -49, -62, 187, 152, 166, 24, 71, -181, 77, -44, -2, 51, -28, -195, -219, -10, -111, -160, -135, 139, -42, -164, 73, 19, -33, -263, -211, 147, 118, 48, -122, 62, 103, 7, 31, -37, -204, 156, 111, -2, 303, -54, -120, 37, 167, -68, -38, -143, 3, 45, 29, -81, -175, -9, 222, -83, -251, -47, 5, -39, -50, -58, -153, 16, 258, -63, -13, -55, 67, 186, -118, -5, 86, -5, -144, -39, 136, -55, -78, 12, -194, 132, -23, 106, 45, -119, 7, 60, 25, 146, -137, 111, 205, 8, 80, -74, -39, 17, -5, 89, 40, 28, -200, -106, -157, 33, 139, 235, -97, -35, 192, 28, -120, -89, -2, -107, -73, 162, -19, -136, -55, -63, -189, -86, -81, -3, -185, 14, 323, -23, 135, 47, 44, 115, -85, -3, 80, 94, -72, -3, 14, 14, -139, 162, 6, -316, -11, -57, 45, 70, 142, -9, -129, -161, 100, 94, 140, 14, -124, -6, -229, -1, -71, -40, 26, 106, 12, 119, -22, -101, -173, -19, -129, 42, 41, 217, 76, -79, -51, -133, -62, -231, 37]
4502C7n1po8J3K14q5j7j35J42k0J49j94j72j14K39J30n1Kj28k3M9O3j73K01K09
4527B10k25j2q6o8Q0j48K41lo3L05l87L5K82j38r8J28Q7j76J21R1l27J77M6N2
4551A24j86J98j23j58j4L15r3Mk03J66q3J33j43Q7Q2o0J42k73K33l7j13R0R2k69
4575h9j6J14J44k03k1J23j94k4J83n6r1L4K00j19J08k44L08j57R3k17K30p8r0
4598f2j99J70J46N9n1k61mL74l93L57j14j49l0M1R7J11l6j54pm9K25l13L75l57
4622b24J20L62l59J14j27J96n4J4p8K43j71k48M86j45Oo7r2M5j19K68k22J92l29
4645a89P5L04k63J19j14j7L00k74r2L30k39k40M08p3j66K69j22O2r0l9nl7K31
4668A38j46k8Q5L5N4J9O1l16K0N5q7N4Q4J38K1l63o1K75m2M8k41J69K1mk35M15
$$ y = [37, -14, -21, -89, -76, 138, 53, 36, -99, 43, 23, 172, -22, -194, -308, -69, 61, 10, 12, -116, -139, -90, -27, -200, 1, 210, -15, -27, -113, -181, -101, -249, -8, -11, -74, 231, -156, -121, 161, 23, -75, 53, 140, -36, 85, 176, -151, 26, 72, 124, -62, 136, 13, -145, -159, 156, 63, 67, -136, 30, -53, 80, -63, 24, 106, 46, 188, -85, 148, 111, -2, 88, 180, -89, -105, 9, 153, -50, -71, 52, -142, -166, 17, -39, -130, -96, 104, -15, 93, -151, 157, 0, 93, -124, 106, 28, -62, -261, -91, 55, 114, 63, -198, -202, 172, -221, 136, 22, -127, -157, -116, -19, 92, 56, -98, -105, -154, 71, -242, 133, -224, -104, 258, -101, 13, -114, 82, 28, 42, -36, 207, 36, -212, 274, 129, 135, 68, -24, 21, -98, 170, -52, 140, -189, -114, 190, -73, 46, -68, -85, 215, -59, -151, 179, -60, -300, 108, 35, -131, 138, 16, 78, -12, -51, -56, -93, 138, -8, -36, 49, 84, 138, 157, 218, -98, -78, -23, -110, -56, 28, 166, 187, -176, -237, 38, -4, 44, -197, -28, -7, -11, -246, 169]
4694A69M9k22M3K13l71J69K36m27O6Q2j1n2Q2N5J39k82N1L91j65k72R2N9k81K10
4718B3j96L0K0J01R1o2Q9m5j86M6j2j6K60l06P5L51j81j02K8J09j81L62l01n7
4742f0n6J22J04j31q6j43N3l9K07nJ0k02K17K06j71k27K36J15q0J7k28J73q2L4
4766a6l2L8J56l89L65p1J23k30K91j89l18K83j42J66J86l50j42K26J25k0j43N8
4788b5J28j09j3K2O7k37J67q6j45n3K27P6l23M79j08Q8k04J10p6J52m3k26O9J75
4812A12n9j33M2k3K88j67M8j16N2j59P9j20O1J83k58J63J26r3J7k30K33k31J60
4835b5J38p5M4l7P4M0p2j5k9j6p1J58j0M3j39k66M62k48j70K71j9M4ml03NK49
4861B9M2l1r8R1K0j10J26m9n0o2K41j03N7k78K31j36j70K03J74k62L8J75J0k30
$$ y = [169, 218, -4, 39, 252, -119, 50, 286, -141, -75, 7, -4, -56, 26, 81, 220, -62, -11, 380, 215, -57, 35, 94, -187, 23, -173, -143, -123, -22, 69, 7, 96, 51, -135, -89, -101, -117, 143, -163, -88, 263, 82, -20, 8, 117, -64, 298, -3, -60, -116, 6, 110, -21, -107, -250, -197, -236, -29, -34, -24, -226, -9, 197, 26, -201, 35, 150, 70, 87, -141, 32, -50, -16, -48, -10, 146, -243, 122, 51, 174, -56, 235, 46, -272, 11, -131, 35, 221, -129, -271, -45, 80, 60, -83, -25, 103, -6, -19, 3, 70, -167, 0, -86, -231, -284, -57, 19, -304, 175, 67, 155, -49, 61, -15, 137, 94, -132, -63, 112, 53, -80, -38, -61, 227, 60, 108, -8, 44, -115, -36, -156, -95, 88, -170, -7, 119, 26, 43, -187, 46, -185, -25, 113, 38, 82, 45, 119, 159, 87, 72, 43, 27, -44, 114, 104, 147, 8, -258, 204, -44, -214, 57, 38, 82, 78, -225, -220, 29, 71, 40, -58, 33, 53, -57, 69, 20, -30, -92, 149, 46, 103, -175, 56, -80, -250, -47, 127, -135, -97, 78, 88, -142]
4885a42J29Q7j16j37O1J96j01o3K83J17m60K42k37j8P1R1O1R4k47R0n1M4J02o0
4909C6K27k94J3o4J59J89m85K00J17L0N1k61J88Ol85K74J20k48KK97l08l3L00
4932A31k99L18k30P9r8K20k90J31K09j03n5k05K84j0j29K53k57N4J49j29L13k44
4954I2O3o34P95k88j99L38k61K67l25M12o3k60J87k88Q4K62o4L0l5j70J0L36k52
4977C7p2K67j45l02M01k89J24P5k19J91j85j4K51m7J11m8O3j37L9r9J3n3N8K50
5001B70l52K97p7o1J48j97j11q4J90O5k12K04o8j00J56o3L9o1j18L13j03k78L42
5024A39l9j88K03j65R7j77K1J09O0o3j62K53N7k54l0J47L3j04K25J0n8N1k04J13
5048G4n2L3k04M2K38j90k05K75O0j1Q1j86q7M52j78r6k54M24O2m43K64r4j81L06
$$ y = [-142, -13, 74, -42, -179, -118, 78, -23, -86, 197, 314, -146, 96, -141, -159, -88, 3, 64, 158, -89, 1, -50, -6, 96, 36, 263, -31, -18, -82, 77, 266, -219, -19, 98, 128, 179, -82, 106, 112, -273, 1, 121, -127, -125, 172, -136, -169, 131, -168, 150, -80, -1, -99, 121, -169, -38, 171, 68, 13, -192, 92, 82, -47, 206, -51, 3, 152, 23, 336, 92, 155, -479, 316, 28, -171, 167, -94, 173, -152, 260, 197, -63, 124, -164, -80, 182, 118, 148, 113, -57, -47, 289, 37, -35, 232, 87, -215, 186, -103, 21, 96, -123, 68, -117, -131, 120, 73, 184, 136, 199, 62, 101, 2, 15, -38, 20, 270, -82, 215, 138, 77, 225, 28, -83, -167, 23, 88, -124, 80, 12, -88, 68, 5, 44, -17, -135, 178, 75, -203, 139, 100, -88, 115, -50, 47, -130, -109, 0, 60, -3, -165, 88, 145, -109, -139, 8, 41, -63, 162, 172, 114, 165, -39, 74, 22, 55, -149, -107, 131, -59, -264, 11, 71, 60, 141, -45, -132, 320, 142, 46, -208, 216, 278, -165, 99, 5, -176, 130]
5072A30p2j02J11j37l6J93J8j32l5l0K28o1j46M3J97j59P4P9o1J6k05M6q7K26
5096I8K42n78J11J0K28l55J77%J29j75J37J20j84M0J03j3j39OP3k90L45j1l8K37
5120B73l37J05j9k35J62M0j2J21k94N8K2O3K15k05J03k84K23N4q3k8k6J01Q0l60
5144b63K68j09J77l68J77j18L18J67p9j91Q9NK2L9j49J79j86n8J18N8k43K9N9
5167e9K23j86j17J77J3J4Q0j44m3j52N52k26j24j92J60j04J17Q4m35O74l12l4
5189c4k18K59K4N1j75n0K93j12j08L41j79j99K25l03J37N5J73k0j4jk09K00k34
5212i8J35m3J26j52Q1J50k53O8m0J14j16p1K14j57j21J71J20j10j43K27n9p5N
5235b7O5J11K5k17J4n2N9lN7Mr5j06L39k16k4M9K43K57n70J40L5m7m2M4j69J91
$$ y = [130, 58, -44, 67, -70, -106, 87, 105, -27, -62, -92, 136, 75, -71, -28, 169, 10, 84, 163, 102, 118, -87, -41, -128, 98, 340, -238, -127, -117, 111, -244, -67, -67, 62, -113, 24, 144, -40, 0, 103, 90, -49, -43, 30, -260, 85, 74, 36, 273, -64, 41, 22, -213, -51, -11, -23, 98, -196, -138, -116, -53, 162, -43, 60, -224, -1, 53, -30, -58, -84, 17, 97, -263, 5, -104, 73, -295, -118, -236, 82, 249, 170, -21, 68, 73, 95, 134, -15, 164, -22, -80, 38, 96, -147, -118, -59, 164, -22, -139, 38, 51, 65, 145, 1, -42, -194, 358, 132, 8, -184, -24, -128, -11, 73, -362, 312, 0, -34, -252, 7, 31, 82, -93, -143, 150, 38, -70, 271, 92, -107, 118, -185, -48, 7, 180, 160, 146, 145, -64, 136, -98, 37, -6, 120, -32, 49, 199, -54, 14, -26, 88, -28, -99, 115, -42, -163, 8, 128, 18, -125, 102, 43, -32, -27, 38, 149, 174, -43, -29, -81, -22, -25, 32, 36, -59, -165, 174, -42, -66, -17, 226, 483, -87, 53, 88, 41, -1, 43, -126, 65]
5261F5j78J41n8L1l6j28K35J11j31j41R5K11j57P5q6j66K71l14L9J45P8k13j6
5284a27K94k00j04L9l4R7L9M8J7j66R7J5N8Op8l9L80k63OJ0n7j18j24J50P5o1
5310d0K7q8r1J5J34N8o7O3M3ron9j03O6J11RmNj49J00K15k44j97J13N4j92K74
5337C8j84J73k02m1K94k2k18J00J48j49J63j0k69K58O2j11j53L58j66N8k79J11
5359d1L61j66Q0k14j45L0Q5K02k32MK38k2j76l41L00P7R6k34J54j20n3q0J5K34
5383E2n5l31K05O9m7Qq5L53l54O6K70j36j7p5J09N4j73m7p7J26K8j1m3R5J59N2
5409A95m44K29m5j35N9K17l01L45l59o2J87j88L37OP9j10j96M7J62O8j52J40k1
5432E8r5o4R7J4j26J02j20J67j75K50M4j57j17K45j81l6J97j15N0p9M8K36j95
$$ y = [65, -113, 28, -30, 1, -35, -163, 72, 183, 52, -89, 6, 217, 60, 135, 49, -117, 154, -160, -121, 24, 102, -111, -127, 167, -33, -137, -98, -132, -35, 4, 52, 69, -97, 0, 15, 73, 79, 1, -38, 342, 79, 85, 95, 38, -80, -204, -54, 21, -40, -13, -101, -192, -177, -43, 15, -52, 11, 54, 45, 39, -20, -123, -57, 54, 63, 59, 64, -85, 15, 230, -14, -211, -98, -44, -236, 38, -146, 27, -175, -216, 78, 56, -162, -62, 86, -63, 100, 90, -179, 79, 141, 30, -123, 235, 69, 127, -152, -41, 320, 154, 234, 20, -125, -95, -10, 192, -40, -36, 202, 180, 4, -337, -37, 40, 136, -98, 56, -64, -117, -197, -182, 52, -3, -334, -129, -60, -107, -99, -184, 169, -185, -119, 151, 15, -2, -77, 32, 86, -87, -134, -211, -85, -57, -68, -111, -16, 143, 195, -249, -20, -65, -200, -141, 76, -225, 120, -239, -301, -114, -302, 35, 41, 120, 10, -186, -139, 23, 91, -61, 79, 58, -37, -101, -4, 10, -116, -14, -134, 33, -142, 108, 152, -5, -122, 123, -58, -94, 103, -12, 38, -41, 7, 243, 48]
5455D8j85K05j51J10K1P6j14j0j62K43n4k44K65J4j60lp6J45K16N0m6k43L79N4
5479C78j51j18q9M4Ok17j4K11J26N0l00J46p4L8R2j67J22P8o9k18J78J32k31l
5503e0K82j83k01J77k6n7m6K58k60J18j96J15j5K4R0J50k26j1P2M3J46j95p1n
5527f7K46k18j0J89j01K64n77Q7L41j39o5J77j19k52M20J28l50o2J8M7R0l2j17
5550a02K6J06j76K51o9R8Pj08j82N6o5k0K19o0R5j91J42k02J66Jm5J24r8k23M28
5575A78j79K7J84j17K23n06P5J02O5J18m6O9q8k42K33J10j85l10N60J16k15N73
5597G45o30n7n4n3P7k38K53p2p0P8j0Q2j42L39n21J09J2K5O6O9M3k18L4k55L48
5622d0L33k19p7j00K5J12j14K3M0p9J03J37n2j83N7R6k60L75k15K03k80L35l14
$$ y = [48, -137, 68, -83, 27, 48, 124, 10, 0, -162, 81, 27, -217, 48, 62, -98, -101, -177, -32, 184, 234, 188, -55, 324, 378, 227, 109, 20, 64, 70, -147, -161, 50, 176, 226, -74, 72, -2, 36, 128, -39, 83, 161, 92, -126, 52, 184, -47, -50, 232, 49, -152, 25, -1, -58, -104, 154, -106, 12, -184, -69, -84, -60, 30, 180, -46, -57, 15, 58, 204, 9, -62, -67, 179, -39, -49, 140, 39, 303, -274, -187, 154, 15, -50, 127, 8, -244, 176, 304, -46, -108, -90, -43, 47, 15, -102, -76, 30, -146, 105, 36, 134, 141, 33, -149, -93, -158, -178, 41, -19, 76, -115, 27, -175, -9, -8, -53, 71, -27, -250, 178, -1, 26, 210, 93, 316, -190, -115, -13, 52, 170, 124, 193, 105, -137, 96, 206, 21, -289, 271, 387, 172, 745, 115, 58, 4, -49, 28, -210, 43, -29, -99, -21, -31, 51, -91, 248, -273, -164, -152, -127, -61, 8, 51, -167, -133, -388, -40, 293, 74, -3, -103, -78, 34, -80, -57, -17, -96, 7, 144, 92, -91, -34, 62, -198, 177, -38, 165, -115, 220, -94]
5645i4K33Kk84L30j09J28l84J95j30K26o5j03Q4L00kp7n49M06k6k02J51j26K50
5668A54l37K4R1M0P3N0j47J84k24O8J62k36J55k00L10j88l5O0K1j3J0K03k74J72
5692A23k95L17j85NN8J17Q6m92J66J84l59P3K49o2q8J67j54J58K25K7m13L81k70
5715A8j92L50Q2m36o9J88J65j24q2K74o5J15l75J4J13k3Q8p0L6Q2j03K44n82L47
5739eJ17Rk00p2J6K37j03p1J74j86Q5K10l28k4QJ56k91K51n2J33k3J28l21n5J59
5764d8J0j5n6J24J8J52k93j0K01pj68Q3J07j85K17K9k12K3lL5j98L34j22p6J79
5789A19l66K64j15L1J77k6lj01J4n7k80L29J00N1k87J73k7m15L22J92Qn8N1M7
5813A43j71P1K1n1o5P6L84m02O1j49n8K66q8j17K5p9O4J38J60m00K01n6J73j11
$$ y = [-94, 139, 141, -143, 187, 78, 206, -178, 17, -113, 113, 48, -55, 29, 329, 327, 250, -299, 107, 81, -121, 30, -96, 154, -183, -159, -68, -28, 45, 95, -52, 132, -92, -24, 138, -98, 57, -143, 167, -21, -56, 4, 25, 12, 22, 225, -49, 123, -172, 145, -40, -35, 23, 140, 226, -266, -100, 84, -275, -202, 47, -15, -103, 64, -90, 68, 293, 320, -93, 288, 18, -174, 176, 258, -178, -247, -59, 106, -18, -100, 174, 109, 224, -151, -137, -24, -47, 41, -29, 7, 89, -14, 230, -352, -5, 112, 121, -79, -151, -135, 102, -1, -72, 102, -84, 1, 211, -117, -141, -133, 23, -268, -17, -69, 64, 41, 169, -152, -207, -48, -38, -53, -109, 15, 33, 185, -108, -118, 83, 76, -92, -9, 98, -87, 130, 159, -53, -30, -33, 2, -196, 138, 16, -60, 119, -247, 17, -98, -67, 110, 84, 81, -20, -6, -63, -343, -14, 86, 137, -150, 23, -4, -419, -97, 95, 103, 45, 96, 143, -28, 43, 64, 13, -52, 24, 408, 6, 67, -82, -140, 126, 38, -79, -54, -133, -69, 69, 229, -171, 30, -26, 147, 36]
5837C6J5j31K9k6k09L80k95J06JK22L7l63K47k23O4J83k21k4J24m3r9K41L4k20
5861a35L36l05j92L50j46J59jk98l6L65j88n7J48l06K80P5r0M3J83l21K2L8P5
5884ao1K56j05j60L4O3o2p0K41o8N1m1l2j90J31o3J2k7J64k64l0R6JK51P4l12
5910a12J98P6m28J96k0K71n8j04O0J4j69J34kl1j39J76k0k58J83j49L01j20Q2
5933H1k55K21P5p1N1k37L42k29j93K12K31k09nj47K87J05m03Qr8j48M39k59L70
5956A68k53J8k1r0L02M2l92K19j14J09P9n7p5nN7o5k21K11J38q5K02k98J94k36
5980a73L24L9p2l53J90q0J52P8j5K6K21l24j60K73o9j72J68Qn6q4J80k90M7J91
6004D9J07k33K45m21K82J34k08j11R2J96o9j13J62k58J91k04K41r8L0j53J04k37
$$ y = [36, 51, -80, -51, -77, -286, 94, -201, -95, -94, 128, 165, -198, 49, -174, -110, 73, -148, -172, -48, -91, -190, 51, 85, -135, 201, -104, -296, 54, -92, 67, 66, -232, -268, 97, -91, -148, 0, -306, -26, 49, -41, 2, 185, -136, -114, -76, -1, -62, 194, 89, -71, -37, 26, -36, -106, 135, 67, 118, 77, 45, -145, -14, -77, -65, -92, 72, -192, -222, -126, -125, 126, 200, -112, 86, 162, -266, -70, -90, 181, 123, 19, 79, 93, -76, 58, 56, 25, -114, 62, 42, -216, -33, -182, 119, -1, 81, -174, 47, 122, 51, 102, -135, 207, -22, -215, -3, 228, 19, 14, -133, 154, 259, -144, -136, -234, -382, 57, -202, 168, -85, -67, -88, -178, 124, 166, -226, -7, -121, -12, 67, 10, -65, -70, -13, -78, -299, -88, 50, -35, 167, -131, 63, -173, 151, 190, 118, -235, -45, -125, 27, 105, 90, 116, 337, 13, -147, 126, 57, -115, 53, 61, 5, -79, 101, -189, -142, 49, 156, -77, 168, -253, 29, 163, -45, -156, -64, 132, 63, -50, 112, -146, 45, -159, 82, -16, 14, -139, -35, -272]
6026b72L32J99k06%L3k10K82k23P0R7Qk40J22k05M78k34j54K33K10jm96L61k93
6049a09J33k41J82j05Q2J48j03kq1J36q2p5j99L07J44j71j30J15j02J58j51J45
6071aL1j04K77n46N47l53K98J3l32L51j22J88k78q5L67k19q6K5J52RQ9J24l67
6094b2Q0o5K35m39Q9pK57l3K01r0k67J29J38q5k06J13Qk9O4k5j5j70Q2j48L77
6119A72r6k54K49l66K57j50j8J12K15o7J13k02j41K82J54m83K50o9P8j19n4J29
6141hN0k10J33L72l79J75R3m08J90Q8k54j11J51JL5L4J43l7Jk16J16p1N3j22J64
6166a7J67k25o2J56mk34L03n5J54j4k4o5l2R1j22J2k1k0J22k9k00Q2J2L8r3J27
6192D7J09k42J35j18M32m85L26j41j08j10J87k08N2O3J14J26j36J52l7j11n1n
$$ y = [-272, 60, 259, 53, 53, 86, -124, 158, -65, 5, 102, 110, -130, -8, -213, 265, 31, -123, 110, 320, 319, -177, 184, -109, 24, -217, -35, -140, -58, 90, -13, -15, -96, 40, -42, -117, -316, -9, 135, -36, -166, -51, -153, 5, -146, -1, 30, -74, 203, -343, 204, -149, 149, 162, -170, 181, 59, 247, -31, -116, 251, 32, -54, -29, 123, 132, 221, 345, -22, 58, -7, 228, -211, -122, -129, 128, 95, 296, 206, -61, 68, 206, 121, -85, 28, 36, 7, 71, 46, 31, -139, -57, -205, 172, 76, -178, 71, -295, -38, -188, -206, -94, 121, 54, 167, -35, -176, 106, 260, -223, 27, -42, 36, -83, -137, -8, 42, -168, -35, 337, -42, 133, 226, -182, 8, 96, -158, -269, -118, -117, -82, -48, 95, 58, 59, -157, -41, -112, -59, -181, -17, 150, -75, -137, 19, 15, -219, 84, 29, 183, 169, 145, 80, 48, 139, 17, 29, 8, -12, 110, 81, -119, -37, -25, 13, -80, 47, 156, -86, 49, -69, 363, -122, 204, 63, -45, -155, 32, -176, -124, -61, 53, 179, 43, 195, 158, 47, -4, -9]
6214iQ2k44L19k56K56J4J7j98Q9k19J41k19J83J36j02r4J7J2m1K66j35L19j65
6237A69Mj89o3R4K27k37j9Q3K66l94qJ54l2k3J44m3j0k63J43M8j22k18K45J6Q1
6262E3k47M6K67k00J24N4j74k2M4J14R1j96K02j51k85K95j00J69j50o0J64k3N7
6285G2Q0j11K7jL8l70kL54j12j86Q5J60n1j28J33J57j58lQ9o1pK25k41p3K63j79
6311@n8O5O5j84K98l7n9o4K1J22l75K0J29J05J94m52K22J1j31K50k5qk32K87j21
6336D3K06k83L20l17k4J15j80m1J83j31l2L05n33L81M1k34M23m34J81P2j88J75
6358D8Q1j15KN4Qj89L03m05N0R3LN3K9J92l27K75k95N4j1J02o0J78Kj69oJ48K05
6385C03l45K2R7o1l64N97j45k88J87NN3L6Q4l08j21K97Lj28j29R4J80l2J45Jj80
$$ y = [-9, 73, -171, 148, -108, 148, 162, 179, -19, 70, -149, -8, -227, -44, 92, -10, -104, -87, -75, -116, 150, 15, 334, 169, 173, -16, -79, 15, 242, 5, -14, 69, 335, -59, -67, 87, 55, 32, 176, 133, 123, -140, 3, 51, -71, -289, -44, -28, 53, -194, -148, 119, -81, 43, 97, -77, -99, -55, 59, 150, -46, 156, 5, -280, 15, -85, 84, -66, -126, 38, 15, 72, 152, 41, 68, 67, 105, -265, -267, 87, -25, -211, -126, 34, -17, -145, -12, 145, -13, -16, 73, 12, 5, 230, -11, -84, 179, 0, -58, 7, 72, -112, 186, 149, 90, 26, 47, 169, -206, -186, -57, 48, 242, -210, 12, 23, -108, 142, 117, 109, -123, 164, 43, 249, -34, 286, -31, -55, 60, -120, -161, 22, -109, -141, 164, -369, 12, 53, -181, 242, -192, -11, 61, -127, 48, 129, 14, 16, 70, 78, -111, 192, -213, -163, -70, -67, -14, 15, 207, -120, 155, -140, -86, -97, 5, -55, 123, 125, -44, -50, 98, 303, -42, -20, 77, 16, -348, 249, 104, -184, 3, 8, 61, 97, 181, -127, -248, 49, 52, -76, -205, -111, 69, 37, 182, 183, 3]
6410Cl4Q5j16k06K28J76j81l13L34k62K89j27J04j69N4J86k4o6j26K31l5k2K2
6433C1KJ06r6ml37L25l11K72J96J44m14R1o5J0J24J45l72K36p9J78j74j00N1N5
6457A4r6j36M00l15J44k04J51o8r0J49K22j24rOP6J32j82M1N3j83L7j66K23o2
6481A3OP2k09J6K21j45J42J9K0l46J70q6m8L00p2p9r2J95j28J29k2j95nJ08O3
6506D7j53k00M57k78J91R9l2j92lQ5r2m0J10jj52Q7n9L47k71n9M4J12J07j20J13
6531A47j38p6K48J85m75Q7J73m41J53J59K3k78PK30n8k5K38j10j94J77m8j27K46
6554A03k32K55j81q7K08q8J23J3l69K55q4L19j46k14L03K3j39n7j18L0o0m9J12
6577h0L14k32L4j29OnK54m8n9J15k51J25M8m5k43K53j31K3K03j53N7J11j60j7
$$ y = [3, -31, 54, -62, -268, -40, 136, -45, -358, -24, -286, 3, -124, -20, -189, -135, 51, 27, -39, -165, 66, 31, 9, 31, 33, 139, 43, 39, -298, 27, -284, -12, 184, 328, -86, 5, -60, -50, 74, 219, -153, 83, 4, 182, 8, -92, -41, 14, -82, -218, 182, -133, 11, -193, -42, -110, -200, -51, 171, 47, 38, 44, 120, 252, 70, 111, 164, -19, 18, -148, 75, 13, 19, 91, -118, -102, 119, -26, 116, 135, 155, -191, -21, -107, -155, 145, 73, -6, -98, 97, -31, 98, 76, -119, -124, -16, 47, -106, -306, 151, -127, 64, 163, 131, -61, -64, 21, -71, -111, -1, -2, -154, -67, -126, 221, -50, -109, -65, 47, 154, 34, 147, 9, -67, 181, 366, -109, -22, 151, -290, -137, 22, 45, -233, -226, 4, -54, -79, 159, 49, -145, 32, -16, -143, 103, -129, 126, -55, -142, 66, -22, 101, 114, -255, 0, -84, 235, 89, -125, 178, 201, 62, 5, -113, -83, -143, -192, -80, 234, 2, 36, -93, -87, -92, 162, 114, 55, 170, -81, 44, 92, 47, -196, 57, -74, -51, 152, -1, 56, 167, 7, -10]
6601a0n9Q7J09j1k55J15J42j99kq9L1KL54j74j98j01L37o2m6K10J14k28k39J32
6625d0q4PK29q2LJ84k06O1j98Q8K27n13M8K97l6J11l42M64l59M05k07k11R1K03
6649A40k99L24j78J29k82L15q3j18j13L22m4r0L15l23j88K01lJ44r1p1Q9m25L81
6672E2j9p7k00M12k41j06J23J3K52l69J49R1j62L26j17n44P59m87L85k98K09j03
6694D8p5N0J35j55n3O9j59L01j46J33m24L06O3j13k6J02N1j52N6Q9j29%m2J0M
6719e7o3K92j68n9K6J3%j3Q3J4M1j40Q1L27k80l48J99J38l8o6k49O0O8J93J49
6744B03k51J31k48L84j39l5K47j91j19NP5J30j29L3l13J23L21j11p3l1j21Q1L26
6767B98Rj36m29K53K03K0J3j93q7q2J07K65l31J17J14q2j64R8j53K29j3j65P2
$$ y = [-10, -69, 18, 127, 116, -139, -24, 118, -81, -83, -172, -141, -139, 215, 41, -157, -258, 79, 17, -29, 181, 295, 67, -172, -40, -124, -117, 112, 30, 33, 217, 11, 72, -126, -38, 189, -324, -276, 21, -15, 96, -246, 218, -141, 264, 57, -154, -63, 140, -159, 165, -13, 116, -166, 149, 66, -52, -165, 157, 113, 23, 338, 15, -173, 28, 25, 169, 78, 7, 96, -329, 52, 33, -44, -244, 168, -73, -179, -56, -43, 209, -160, -11, 80, -82, 244, 127, -417, 342, -145, 240, -58, 151, 48, -27, 23, 158, 3, -50, 19, -140, 161, 15, 148, -276, 30, 93, -20, -46, 56, 107, -45, 11, 100, -29, -29, -71, -61, -57, -120, 172, 4, -55, -29, -16, -16, -29, 54, 68, 109, -31, 50, 377, 97, -251, -52, 86, 48, -18, -267, -207, -139, 54, 203, -48, 83, -165, 219, 80, 45, 292, 101, -18, -13, 62, 192, 63, 96, -217, -94, 227, 116, 43, 12, -109, -28, 298, 307, 171, -258, -5, 198, 218, 231, 38, -49, -131, -24, 241, -90, 27, 141, 59, -105, -7, -160, 69, 56, -109, -37]
6790c7Q2o9N0O6k1j46L3rP5Q0r7L6j53J65k26J55K60m17K11K4j58Q1l8J46K3q5
6816C1j48J45L8K9L0K46m06J51q5l28J10J18q0L09k53L00k61j41K13J97k11j80
6838a76J64m1j00J19J54k00K72k8k45llJ58j64p3J57j16NJ7J36k38L78j05N9N1
6862A78k73k08J89o9K29j47K60k94L4J36r6J45r3j05K75j91M6l2J32Q6n31M77
6884A48j97J24j73J77n1O5k67J10M7J29r8o1l01J51J33N0r7J76j96L01o7j82M37
6907C58l82N0j23M36m99J82Q3k44J74K37k98J31P1j63j6k82L23J08m2j20L8L0
6929E2K5m6j96J32O4j20J2P1K5j11k6k9K63j92q8J43M1j9o0j92J91J0N0L34m68
6954a34K26n21L36J92j3K7j84J90N8k14r1p2J30J2l6Q7k49K13O3p3J97k04j20
$$ y = [-37, 45, -24, 26, 92, 71, -75, -42, -51, 24, 104, 7, 43, -110, 55, -171, -16, 244, -173, 38, 62, -96, -15, -53, 93, 116, 31, -117, 28, 66, 95, 125, 371, -35, 116, 31, -297, -187, -69, -149, 160, -93, 207, -54, -195, 18, 215, 4, -176, -12, -53, -153, -34, 120, -80, 192, 164, -81, -84, -87, 71, -93, -166, -9, -125, -120, -103, 33, -205, 173, 68, 127, 178, -95, -303, -114, -183, 46, -101, 159, -135, -101, 35, -61, 84, -9, -114, 161, -30, 16, -16, 116, 202, -329, 148, -49, 75, -98, 79, 28, 93, -174, -64, -17, 112, 14, -47, -348, -197, -64, -14, -111, 65, -131, 170, 103, -79, 358, -24, 26, -97, 339, -160, 22, 105, -139, 35, 272, -26, 105, 176, 13, -3, -285, 38, 146, 104, -16, 22, 52, 77, 31, -165, -33, 31, -89, -77, -6, 19, -92, -118, -147, 116, -76, -164, -21, 20, 1, -59, -251, -60, -50, 0, 334, -134, 92, -429, -93, 99, 86, 113, -71, 119, 177, -37, -128, -200, -70, -58, -94, -7, -256, -43, 20, -53, 144, -60, -180]
6977a80j9K16k97L35J37k24K85k13P2j38j46J11L2J13N0l50J48J65Oj82L9O5J12
7000A37j66o0J11J29L2q1J03j7k03N9k57K73M2r7j52j5K74j87J95j32J20l19L73
7023A62k53l0K86n71N43k08J04k8N4J18m84M07k86K39N8j70J22K57k66J63j37
7044H0Rr6L9j32n6l0J17L1P2J12j2k57j31K40L20m05N7j25K3j5J11nL46n12K01
7069a8L07k51Rj7r1K4J25j55K21L2r9j92q2K61J26o3j90j57M78j89j12q9K19q3
7093A4J64q1j67J2K42k74M8J67p9j39J07n1K2K8l50N03l39J49p2P7L33l45k21
7116b52L47M5j1j30J35m7J55k46k21K59l5J18j22l3j89L13o6j19K69r7o7j94J17
7139g1N6j15J93j68J37P5j32n3K59L7m6j26j35J24j35K70k48J57P7P4j75o9P0
$$ y = [-180, -199, 17, -280, 55, 192, -32, 253, 40, 112, -26, -172, -61, -29, 84, 134, -216, -68, 97, 103, -79, -40, 25, 137, -29, -89, 22, 151, 183, 102, 205, 188, -15, 44, -213, 60, 102, 5, -147, -162, 112, -75, 120, -12, 108, -211, 162, -91, -121, 165, -406, 137, -71, 33, 5, 59, 177, -307, 100, -186, 53, 111, -59, 63, 320, 54, 217, 80, 89, -7, 32, -100, -156, -186, -69, -38, 34, 146, 134, -123, -254, -14, 306, -99, -42, -167, -144, -159, -48, -53, 293, -219, -18, 289, 38, 47, 30, -61, -37, 88, -67, 154, 186, 87, -105, -187, 74, 200, 137, -53, -210, 268, 79, -33, -122, 97, 14, 178, 97, -70, -58, 184, -90, -42, 125, 46, -93, 14, -37, -15, 13, -337, 166, -173, -24, -96, -19, 314, -31, -252, 95, 140, 129, -1, 134, 87, 242, -4, -225, 34, -1, 117, -5, -38, -227, 86, 20, -99, 170, 73, 6, -188, -71, -15, -130, 63, -105, 32, 107, -25, -78, 181, 218, 172, 46, -89, 35, -100, 170, -78, 79, 156, 230, 55, -14, 56]
7162E6j65L4K67l78j40K26J71K52l52R3m0l2J04j2j84q4J83o8j4J05j67L89m2
7185B02j59q7J74k13J7P9j21J92nJ11o7j42j8L93m75K25n0r3Q8P0q2Rk20L04j76
7210d4M7m3J97j69M4Q8j29m1K31l04J46m3K4J10p6J45j42q0J44j02l35N01m7k03
7234h1K2n0P2N1j94R1j22J44J37l1j72J73J85l12j16K93j97R2R8q6J22o0q5j72
7258a98K71q9j51L77j88k38O2n7K52K89r5l69J80J47j05j9J8j30Q3O9l60K82j85
7281a54L62k54K75k89J67M1n0k19N2m9R6L3M3nj50R3n1J71j20K16k3k95J4q8P7
7306a07K64m01M92l14j12L42k04K9R6k94L04k53j06K37j1j5J22rm1J1P3q0j28
7329a05J36j46J02M5o5p8j7N7J72j12n3j23J95JJ16l4m6jk9o5J65k89R7K00j00
$$ y = [56, -109, -75, 192, -186, -326, -100, 71, 323, -29, 64, 24, -8, 96, 84, -100, -184, -1, -69, -83, 22, -145, 244, 202, 43, -44, 130, -83, -66, 13, -108, 84, 79, 190, 123, -19, -37, 356, -119, 106, 56, -37, 51, 121, 39, 48, -172, 132, -44, 3, -40, 157, -12, 32, 120, -9, -50, 181, -123, 23, -20, 4, 114, 38, 183, 41, -39, 105, 3, -332, 169, 122, -81, -59, -109, -37, 14, -180, -89, -211, -67, 70, 39, -133, 40, 225, -87, -203, 90, -107, -15, 83, -3, 119, 59, -26, -198, 73, -16, -167, 210, 22, -216, -154, -211, 41, 330, 235, -134, 46, 193, 88, 69, 87, -43, 40, 109, -251, 31, -154, 208, -46, 229, -60, 107, 148, 98, -121, -69, -118, -22, 11, 54, 49, -101, -8, -59, 112, -8, 208, 185, -110, -96, -184, -107, 157, -244, 248, -66, -178, 164, -40, -11, 85, -209, 95, -158, -264, -27, -38, -53, 69, 60, 19, 30, 103, 23, -105, 31, -115, -13, 32, -33, -111, -128, -71, 101, -11, -64, -187, 8, 9, 125, 91, 45, 44, 15, -50, 115, -174, -77, 123, 23]
7354B3O2l05R9J94k27J14J46j04L64n70K26Rj13K12Q3r6k19R6j29J20J49J7q2
7377F9k67j4K68Qj63R6P3l5j14J18M0o1k31J86p1K24k21K05k56J77J37j11j61
7400a04N5j39K12q7n2L66j34k87L48Kj67N1J00j34K2J8j42K5n6J80l2O8j41L13
7424B85l20M0j22R7j92L54j06j79P7k01L93k79J84j15K0j3J36k9k19M40k32O6
7446H5j75j72J12J50K66j36J5k57pJ03J71j05K40l01K43j93m6Q7J08r3p7N5L3
7469A06N2l07J05j07J93J0j74K85j54J33l3j98P0O0L1j39R9k14J44Q5L1Ok19k2
7493a57R7m6Q9P3L5j34j36J88P5m7n1o9p5K41J19k14m0J82k74rK45m9j5P4j06
7518dK47j79J48m59J38K99k4j00q9K16j73o3J91l44J34K10j02j67R5J43j92p6
$$ y = [23, 85, -220, -121, 73, -154, -40, 106, 2, 366, -204, 22, 31, -82, 130, 213, 117, -102, -6, -135, -15, 134, 151, 69, -198, -212, 56, 64, -99, -3, 70, 35, -79, 39, 79, 18, -213, -27, -98, 126, -95, 110, -146, 31, 168, 57, -104, -49, -188, 24, -63, -115, 251, 117, -170, 178, 180, 13, 64, 164, 30, 52, 70, -72, -47, -103, 77, 45, 113, -28, 285, -35, 5, -117, -20, -212, 142, 36, -143, -66, -267, 126, -153, 31, -84, -64, -77, 59, 30, -189, 251, 19, 85, -90, -262, -150, 0, 266, 130, 145, -112, -119, -16, 155, 50, 290, -11, 232, 39, -7, 80, 188, 95, 18, 73, 106, 158, -149, -44, -151, 42, 52, -122, 163, 9, 142, 109, -89, -19, 41, 72, -67, 32, -182, -38, 47, 78, 84, -135, -157, -60, -106, -17, 56, 91, -43, -179, 9, 84, 37, -14, -83, -158, 83, 202, -12, -52, 130, -144, -153, 92, 43, 28, 102, -4, 243, 64, 212, -247, -109, 190, 166, 66, -23, 193, 20, -43, 148, -196, -62, 148, 46, -121, -26, 117, -75, -151]
7540a51K97k75J13r4J08J23k36J63j28KJ35k78J83K20k50J80k42R8l3J40j69O2
7562c2q0L73j27j93q8K94j51j80J43N6J22j56l0o0K21k48K60q7J32j17j40jj00
7585a89M78k15J02k95r8O0L2J15J64j7k15K32q7J18k75K11j78p2MJ32q4K76l40
7608a41J24k2Q6j55lL12k48j78M05j50j22K96k38J18j65K47j28J39k73L88l38
7629d6J8K17k68K41j64j26Q9j55J54P4M2m4L4j45Ro9J54Kj24M5o6L26m11J72R
7654c2k1K7L11k51j73J17j52K54j04k7L18j86j46J34J27j04r6r4J43n1Rj48J48
7677Cj11m8R2N2P8k03J41L12o30L70R5j31j21p7J61J15j09o9K08l38K62K16l4
7700B34l21J40k7J8K01m31K56M0j76Mm4N6j11K79q8k33j80M14j12j7L85j76Jk8
$$ y = [-151, 146, -129, -16, -110, -2, 121, -115, 48, -80, -78, 57, -221, -38, 182, -68, 112, -130, -32, -65, 75, -94, -32, -112, 261, 134, -59, -147, 147, -4, -184, -41, 15, 137, -19, -49, -109, 112, -136, 124, 37, 169, 52, -88, -89, -189, 289, 74, 176, -119, -217, -157, -125, -10, 154, 137, -78, 154, 67, 185, -90, 121, -57, -129, -125, 7, -77, 199, -141, -17, -39, 47, -108, -111, 201, -47, -225, 180, 30, -92, 204, -34, 84, -81, 166, 38, 177, -96, 292, -46, -28, 189, -79, 162, -2, -128, -39, -194, -40, 34, 76, 32, 66, -79, -70, -139, 15, 17, -107, -62, -128, 198, -213, -41, -32, -53, -26, 285, 34, -139, -22, -174, 80, -24, -51, 267, 81, -65, 69, 196, 92, -4, -98, 45, -6, 3, -145, 3, -108, -156, -64, -12, 66, -137, 4, 316, -314, 56, 151, 20, -101, -178, -17, 98, -11, -80, 128, -210, 52, 268, 234, -87, 53, 26, 44, 245, -186, 70, 110, -66, -62, -106, -50, -161, 118, 30, -203, -383, 31, -81, -98, 287, 111, 112, 84]
7724H4j21o9J83j40J21j28m2l6K41m0Q2j92Q3O1Q4m6L6l5j12p8L5L8J10J69l57
7749f9K42j72l8K25l38Q6J19p7N4O5j4J02j28j19O5n7o5Q8l7L1j38J41N1j64R7
7774e0oR2Q9k99J90m7Q6k08N3M97k14j88r8L27r7j72J18j69j35L56j13J72j14
7797G0k79L34j80k3M8K1K49j74o3k38K91J13j63J5K8j19L02k48o9K6J19j20J43
7820H3o7j18K29j55J35k69J28J24J08k15L57l36k3k3k15M58k30Kj57R0K55j34
7842B7J78j90J10l62Q7K50Pk27P6J22j15j21r1L73l02J31j14N5J92j03Q6k0k98
7865b49L45J0l26L80j75J23j31J05P4l89L03j87L67k50J46j04l6k0R7P8k59K64
7887A66k21L43j31q2J2J4k11q2K29k01K53J50m03j2L76j37m5K31k38Q5r2m3Q2
$$ y = [84, -37, -106, 77, -63, 58, -70, -112, -148, 93, 53, 135, -57, 26, 87, 171, 125, 161, 126, 14, -64, -29, 9, 119, 288, -69, 173, 1, -37, 188, -150, -64, 55, -22, 32, 97, 83, 185, 57, -62, 3, -54, -119, -31, -68, -37, -175, -34, 17, -147, -50, -56, 36, 125, -174, 16, -31, 55, -153, -100, 397, 183, -5, -103, 224, 127, -45, 73, -96, -231, 125, 12, 184, 70, -209, 125, -55, -78, -30, -9, 240, 66, 3, -235, 56, 169, 6, 21, 49, -70, 232, -16, -85, -59, 60, -60, 83, 16, -102, 127, -28, 107, -162, -34, 90, 198, -17, 340, 4, -19, -42, -257, 201, -29, -27, -184, -94, 161, 27, 205, 15, 125, -237, -150, 100, 107, -120, -44, 78, -37, -158, -249, 124, -178, -47, -161, -106, 86, -17, 69, 49, -249, 96, 106, -220, 160, -15, 108, -23, 82, 156, -233, 70, -117, 250, 0, 146, 42, 6, -14, 83, 161, -98, 166, -55, 288, 157, 75, 87, 101, -110, -192, 37, -164, 89, 239, -164, -176, 200, 63, 18, 249, 11, 96, 4, -39, 43]
7910D3O9j34K38k59m9J91l62K84J9R3j24PJ15j36J85Rr4P0j7k45Pk83J42J8L29
7935A16k63J68J1Jj3r2K08l06J11J84R0l96J60R7J19k46L69l98n6o5Q8j7J90j07
7959d7RJ04q1n2LKj1l1J58l22K18j01J0L98p0j34j1j47j93M03j80J59q3k05M00
7984A96k83K3j9K79l18K8QJ86j64r5M8J60l8J00k2j07l2L92k91q9K27k82j11L14
8008A10J90m79L65l14K37K2k96Q1K52l62M12j42Rl39L33j69M4M0R1L8k58L31l70
8031a74JJ47L3k40K33J26j37j14P5j14L71k36p7K11j61O2q4Mj59L04L1k12L1p9
8055a58l0M84j70k83N1J14R8k82J77j70K30j32J85j63K40o9j29N6q5rN9Q0j85
8078i1k9l53L52L20p0j73K28j57J76k44J9j43J44jnn9J39P1j0J80k72q8k1M24
$$ y = [43, 112, -22, 216, -43, -92, 99, -263, 21, 40, 133, 9, 16, 131, -5, 180, 189, 95, 165, 148, -97, -90, -373, -231, -213, 116, -147, 21, 32, 33, 20, -72, 136, -170, -59, 125, 215, -181, -21, 76, 195, -51, 318, -80, -136, -201, -113, -130, 60, -47, -38, 66, -15, -67, -64, -62, -73, -104, 54, -268, -50, -151, -141, 257, 187, 53, 42, -105, -298, 105, -75, 84, 1, -204, 196, -87, -64, -83, 196, -122, -94, -86, 100, -64, -159, -111, 49, 11, 111, 89, -18, -50, 342, 51, -38, 189, -93, -204, 110, 300, -179, 186, -128, 109, 131, -165, -84, 168, -194, 218, 76, 85, -254, 79, -90, -46, -6, 85, 123, -135, 196, -174, -173, -26, 7, -233, 0, 126, -11, -125, -50, -164, 207, -29, -106, 105, -56, 6, -78, -74, -233, 71, 102, -110, -79, -158, -188, 296, 126, -157, -106, 8, 106, -176, 1, -169, 61, -71, 114, -49, 191, 122, -7, 49, -36, -45, 14, 94, -91, -120, -473, -121, 199, 129, -44, 184, 27, 203, -41, -22, -165, -21, -22, -27, -86, 53, 124, 114, 294, 22, -66, -87, 337]
8102C37k51l2j84M9J11K6n7j29P3M00k48J30j61j68Q4k9J1M8j7j1J09j17j50K78
8126A02p0q2M06o06K68k35O0J22J15J60m09j7L32m9j94J15lk34K42j56OL4J65
8149G2q7Q9J06L0j35o8j93K08O8j00J22j95rO9J77j87j87K15J16q0J47k31J83
8172A30j87n0n8K02Q8j98j38K58l35N34k43o5pR8m1j81K50j67R9
$$ y = [337, 86, 54, -130, -81, 30, 56, -1, -130, -57, 343, 95, 225, 64, -104, -20, -49, -38, 10, -7, -18, 91, -26, -176, 102, 32, -50, 356, -250, 18, -217, -157, -35, 80, 240, -169, -186, 146, 97, -97, 18, 15, -219, 23, -133, -127, -93, 72, -15, 74, 180, 210, 75, 7, -186, 22, 90, -10, 112, -83, -92, -23, 154, -33, -220, -5, 111, 31, 178, -53, 130, -57, -107, -165, 37, 125, -73, -211, 47, -288, 246, 3, -62, -69, 29, -12, -193, 57, -110, -11]
8191a1
$$ Imaginary data points
##PAGE= N=2
##DATA TABLE= (X++(I..I)), XYDATA
0@%%%%%%QqQj6J6k4L2m0M8n6P2q8J12j43J67j99K39k80L28l84M51n23O03o94P94
31D23r06J030j167J319j488J674j879K103k345K613k908L228l575L957m376M831
47B534n328N875o472P127p853Q655r546J0545j1666J2934j4387J6070j8044K0395
61A0839k3255K6825l1429L7624m6457O0185q4664J41752n29378l40870O89201
72h9627K47386O2124j63818O1479J59311J55837j53719k49063j36719J33052J50157
83A76400J9626j71374j44174j2282Q6083n5263k01357j62266J05528L01758K79214
94B21893N4570j01608o5205Q7446Q6457q8324k39220j56952O0723J83373O2111
105A05264j62830k27743j8041K42030K70493M8041j69849j78287j0008J17485
$$ y = [0, 0, 0, 0, 0, 0, 0, 8, 0, 8, -8, 8, -16, 16, -24, 24, -32, 40, -48, 64, -79, 88, -111, 128, -152, 176, -208, 243, -280, 323, -371, 423, -483, 547, -620, 699, -789, 885, -994, 1109, -1236, 1377, -1531, 1697, -1878, 2079, -2297, 2534, -2794, 3081, -3391, 3736, -4117, 4538, -5008, 5537, -6129, 6805, -7582, 8488, -9556, 10839, -12416, 14409, -17020, 20604, -25853, 34332, -50332, 91420, -437958, -778828, -89627, 157759, 219883, 56065, 117544, 276855, 432692, 278973, 29910, -106809, 26243, 176400, 196026, 24652, -119522, -131804, -45721, -100984, -302341, -464607, -359079, -57321, 221893, 276463, 174855, 109650, 197096, 283553, 195229, -43991, -200943, -140220, 43153, 105264, -57566, -285309, -303350, -61320, 209173, 257214, 87365, -90922, -100930, 16555]
115A6555N5102j09866j45141P601J65587J59921L2426o2584l0848N1836K2728
126A63317j41263k44184j26607J17328K55233J69062m0728j56629p6365O1753
136a9083N6352p6312j46311l7901J59828K51883J38571o4594j46422o5491J9326
147F9846k9528j54543j91874n7594J46273K25912J18212l3686o1932K0157O9318
158A20561J881j06315j13402J4768J39887J07040n1712j52147q2531O7458J21364
169F6852J0044j41218j51140N245J57982J45969P028r0788m6764P5010J21860
180A60080K8975r7575j18033l4344K9886l06o8193o6978L2073J35615J21763J287
192A24250r0364o5540J7263M5069j5575q3175n2094P1699J53278R1829m9546j27119
$$ y = [16555, 71657, -38209, -183350, -175749, -10162, 149759, 182185, 119601, 88753, 140589, 163317, 22054, -222130, -348737, -231409, 23824, 192886, 152158, -4471, -80836, -19083, 37269, -39043, -185354, -223255, -63427, 188456, 327027, 262433, 116011, 50520, 69846, 40318, -114225, -306099, -363693, -217420, 8492, 126704, 93018, 31086, 51243, 120561, 122442, 16127, -97275, -82507, 57380, 164420, 112708, -39439, -121970, -54512, 66852, 76896, -64322, -215462, -210217, -52235, 93734, 100762, 9974, -36790, 38220, 160080, 189055, 91480, -26553, -60897, -31011, -31317, -99510, -166488, -134415, 1200, 122963, 124250, 33886, -31654, -14391, 30678, 15103, -68072, -120166, -48467, 104811, 196640, 147094, 19975]
204A9975q0670J0422L0526m3117j03668m1819J04777J86199J21785j8834j03860
215H1716p5926j043J3559m3870p9778k5211O8275J00196M1626l6216m8667O269
227I30M2887l245p8591q0359J2590J06072J03047R017p6219o2228K0533O0089
239E4523J173q5033r2494q550Q0211Q4487R859m4938j1296O2845P4170m566r4025
252B6366j04612k9172M6818M7034p902l0113J7507P4991O7088r009p6354o8055
264d5413l465L5749O078m0960k8528M4564R8415O4589l1791r7799p2827L883M2747
277b4758J3084l0290j8292M3210Q3136N0213k7322p2284m8593l03R090k4137m3116
290i0362l343O3607R0524M6312k2844m8122j8342J2133m870n0092o2104j4071
$$ y = [19975, -60695, -50273, -19747, -62864, -166532, -208351, -103574, 82625, 204410, 185576, 81716, 5790, 4747, 18306, -25564, -105342, -130553, -62278, 37918, 79544, 43328, -5339, 930, 43817, 40572, -38019, -118378, -105788, 284, 103331, 112348, 36129, -26099, -5566, 54523, 55696, -29337, -121831, -130381, -50170, 34317, 44176, -762, -12058, 50787, 124957, 120391, 26366, -78246, -107418, -60600, -13566, -21468, -51581, -34074, 40917, 108005, 98996, 22642, -45413, -48878, -13129, -7051, -48011, -76539, -31975, 66440, 131029, 99238, 1439, -71388, -67505, -24758, -11674, -41964, -60256, -17046, 66090, 116303, 88981, 16697, -31896, -32199, -23109, -47246, -90362, -93705, -30098, 60426, 106738, 83894, 35772, 17430, 29563, 24693, -25399, -87503, -101574]
302a01574N0858O7805K5084k4120k3270J5679L5244K53n3041o0210o016N5739
314a7569O4949J8710k4625k1737R245J3152k6533o6154n5948J442N1243N0190
326c635J4650j502K2237M8251K9352l0103p4825o0961m775L3302K0313j3854j7839
339c9389J7930M9486L3224k0594n5602l8133R594L3511J4610j3745p902K8362
351A1352N0460K6251k6443n7270l9912l094Q758r975k2643K73M3177O0724L2216
364G3874j4983l5492j8803K826m573k9447l5407k161M2355N6206K7057j3539k5592
377B2321r059K061j3569l7390l5119J904M1942M8858K0645q112r523M068K712
390C1739k2170m2998l1922Q147M1588M0100J2184o571P5J0349l37l0224n0084
$$ y = [-101574, -50716, 17089, 42173, 18053, -5217, 10462, 45706, 45959, -7082, -67292, -73308, -17569, 47380, 66090, 41465, 19728, 28973, 42125, 15592, -50562, -106510, -105068, -53825, -3635, 11015, 9513, 31750, 80001, 109353, 79250, 4425, -56536, -61311, -28009, -7696, -21550, -39389, -21459, 28027, 61251, 40657, -14945, -53078, -43484, -9973, 4637, -9108, -17010, 11352, 61812, 88063, 61620, 4350, -35562, -38656, -29898, -39873, -62516, -62243, -19066, 41658, 73874, 58891, 23399, 4596, 7422, 2849, -26598, -62005, -64166, -21811, 34395, 61452, 47913, 22321, 13262, 15323, 1754, -35636, -70755, -68851, -26909, 21949, 42594, 34482, 24959, 29027, 31739, 9569, -33429, -65351, -57204, -15616, 24484, 36668, 30097, 30172, 40521, 40184, 9960, -40124]
403d0124l4709O696L5245K9553Q103L725J7803K7080R592k5275m4963k8957M317
416c1914J8373N533q922k305J9137L0273J1134k3029l5430j6310R670J3757j49
429a0182r373M705K9722L7079J1675k3063l4253j9921n212o250j7530j6012Q656
442d9959L9920M5190K0170q257j7253j1125p501j6858k9942k2797R460L7944L7053
455B6045J4329o789j2042o054n883k0481l0927j5751J6939L7472L3324J2565n619
468C7128r118m094j1160k7712l1922j1385J6763L1017K4812Q919Q18P157R113
481D0336q380k9101l0831j2486R825J8225Q417l895J871J8348K0122J565j9660
494A4356k5122j2084O659R734k883q161O554K3807K2373M591j6860k4575j4739
$$ y = [-40124, -74833, -68137, -32892, -3339, 4764, 8489, 26292, 53372, 62964, 37689, -7274, -36231, -31914, -13541, -8008, -16930, -19235, -98, 30175, 41309, 18280, -17150, -33460, -23790, -10033, -10182, -19555, -14850, 14872, 51951, 63626, 40563, 6310, -13611, -18823, -25073, -42603, -58615, -49959, -10039, 35151, 55321, 47064, 29811, 18686, 11185, -5673, -35615, -58412, -48952, -11008, 26045, 40374, 33585, 21543, 15489, 9606, -10875, -41802, -57553, -40614, -3142, 30182, 42747, 37128, 28010, 23916, 12756, -14956, -46878, -58263, -41500, -10483, 14329, 23248, 24066, 31223, 40336, 31956, 2855, -27976, -40462, -30637, -12412, -3995, -7890, -6019, 12329, 32451, 34016, 14356, -10766, -22850, -16191, -6457, -9340, -17501, -10947, 12860, 35233, 39824, 22964, -1611, -16350]
507a6350k626m589j1932k808J9014L2924K9134P998j5980k0872j1187q610j9415
520b5299k1314m399K1508L8766L2634N878j6104j5600p114j1326k1122k1300o009
533e0801J9954L7696K8746K740j1194q134n247j1109j8691k0119n048J9279K9564
546G636J5938j379m280q24j222q505k0217k2020l662J7729K0073P409Q70L460
560A1006J0777J1294k574k1904k4318o816N807K935l218j982P829K0936K0925
573C0697L5j9295j7607n609k85l033n506q05J6231L1753K2126m605k3122k1734
587g59j3887q945r401j2008k62K5938L8738K5010Q07j4892j8266j2085p057j1691
601a8760j4387K047K3530K8505J4471m845j7193j5688o361o560j4322j0792R482
$$ y = [-16350, -18976, -23565, -35497, -38305, -19291, 13633, 42767, 50765, 34785, 13913, 2726, -5884, -25299, -46613, -51012, -29504, 9262, 41896, 47774, 31670, 16070, 8956, -2370, -23492, -44792, -50801, -30847, 6849, 35595, 38335, 27141, 19007, 13760, 2651, -16040, -36159, -41207, -21928, 7636, 23574, 22195, 17915, 17091, 15869, 7364, -12853, -34873, -38535, -20806, -733, 6676, 7546, 11006, 21783, 33077, 30503, 8599, -15719, -22535, -16728, -13793, -17011, -18993, -11164, 9772, 30697, 30732, 11437, -6170, -11779, -12064, -15097, -20603, -21408, -5177, 26576, 48702, 44097, 20975, -759, -14646, -23591, -32992, -45000, -45262, -19324, 19414, 44424, 45231, 30339, 12073, -12, -7069, -18760, -33147, -31100, -7570, 20935, 35406, 30561, 13368, -2320, -8681, -15241, -29563, -40355, -30873]
614c0873K5850K6259J2138m785j1452l000K646q102j9933j6674n94J3527J5753
627G60M433o844k409J1779J3223j853j5610j6884o276P359R532k34l497Q160J8708
642B0347J2369l995k0079k2991j1664K043K731j777N159J9933K5740J5997n618
655C8195k4830k4846j0396o57k583j496R391K2892K6669J3984j0708k6443k0876
668a1704p116k472m915k155P900K1711K5485J0207j2370j9674j0177n76o05n563
682a2024p191L154J6928J9040L271j2008j2505k779M192j50r184j3370rJ4893
696g742J6129N420k639j321N642P315m055j9781k1289o613P045R775N551L128
710c435Q053J5014J1370o263k2299k0480n703O160Q853N178M009J1251J6219O659
$$ y = [-30873, -5023, 21236, 33374, 28589, 17137, 14137, 16783, 8681, -11252, -27926, -28520, -14993, 760, 5193, -1651, -4060, 7719, 20942, 19089, 3479, -13405, -19681, -12322, -2790, -3024, -6521, 1639, 20347, 32716, 28721, 8642, -14349, -26013, -23970, -21239, -23016, -17857, 2076, 27816, 43813, 38195, 13365, -11481, -21877, -22534, -25117, -26613, -17222, 5670, 32339, 46323, 35615, 9172, -11704, -18820, -21292, -26207, -28362, -20462, 1249, 26734, 36941, 24571, 4897, -5280, -5856, -6461, -12024, -19215, -16061, 867, 19907, 23178, 11170, -1335, -4114, 78, -72, -9256, -22626, -22635, -7742, 8387, 13807, 11168, 9847, 15489, 22804, 18749, -1032, -22321, -28934, -21889, -12114, -6563, -3435, 4618, 19632, 31002, 24739, 2440, -18040, -23743, -17583, -8730, -3552, 457, 11708, 27927, 34586]
724C4586j4270k7256k1289n707P784R843N962P544J6929J9762O052j3485k4184
737B271j8785m412N114L002j378L981J4019J5951M644j0402j7291j0047K461N467
751e405j344m310K086J2594J4299M309q507j2228m275K816l1r585j0919r30J2139
766i291J5487P520l044l307L222M439m919j6332j5822l998J1114J5399P787J160
780I415K336O621L063r111k0357j8603l681J1106J4436Q480L762O075Q241K282
794B4065j1309k0468j6346j157J1078J1818O089L174O794P948L19j3060k0168
807a1223j3635P73R772Q262K617L242R619J1561L445r588j6119r262J128M533
821d875m94m877p26Q332J2079N640n358r736m747K075J588m681p539l8J0833J4548
$$ y = [34586, 20316, -6940, -28229, -33936, -26152, -16309, -10347, -2803, 14126, 33888, 39940, 26455, 2271, -16514, -20926, -15812, -12810, -14188, -10207, 3812, 19763, 24407, 14005, -3286, -13333, -10872, -5405, -6749, -11059, -8973, 3621, 17920, 22229, 13722, 1494, -2781, 35, 4, -9581, -20500, -21430, -9291, 6196, 13716, 10672, 7365, 10587, 15026, 10107, -6225, -22047, -26045, -14931, 468, 8255, 9415, 11751, 18372, 21435, 12324, -8033, -26636, -30317, -19211, -4775, 3705, 7467, 13542, 21783, 24065, 12756, -7712, -24058, -25215, -14137, -2319, 3770, 6944, 13738, 21686, 22005, 8945, -11223, -24858, -24085, -14313, -6051, -3434, -192, 9427, 20988, 24433, 14845, -1274, -10536, -9408, -4875, -5369, -10246, -10972, -2640, 9439, 15079, 9721, -15, -4762, -2687, -1099, -5780, -13319, -13357, -2524, 12024]
837A2024P012l040p128m031j226n225j1668j0626j96J2933J6737R391M10l215
851A2152p20j361p492j4021j1591J226J2805J5018P565l72j378O81j291r219j4635
866a2633j0587J731J1942J2212M747j0J459M342Q20p670j3526r316J009Q902P212
881F34J031J67L657P235K670o788j2418r241l99M672K418k59J817Q222J0768N437
897A9623n392j1873p863k161O2j642l191K449J0100J2531N897n089r509o799k167
912e024k159m151l692L049J1359J3246N840l931p935m962k378l925o782n396K398
927a4443J1055J1605M899k131l849k050j061m465q335o591J511R228Q926M148
941H447m77q78J072M74n983j0165q176P33P061P668M290O87K885M602J418o438
$$ y = [12024, 19036, 15996, 8868, 4837, 3611, -1614, -13282, -23908, -24104, -11171, 5566, 14957, 15367, 12152, 11432, 10071, 2579, -11442, -23033, -21807, -9002, 6016, 13581, 13209, 11831, 12512, 11221, 2002, -12633, -23220, -21489, -9547, 2665, 7412, 7402, 8861, 13203, 14023, 6353, -7173, -16489, -15480, -6578, 634, 1665, 1832, 5489, 12724, 15394, 8606, -3812, -13053, -13452, -8780, -6362, -6621, -4804, 3418, 14186, 19623, 14231, 2358, -5505, -7666, -7604, -9246, -12437, -9988, 112, 12643, 18540, 13451, 3942, -2857, -5024, -7183, -11334, -15026, -11977, -618, 12628, 18468, 14537, 6602, 1640, -738, -4663, -11445, -16841, -14443, -3388, 8217, 13116, 10985, 7136, 5086, 4025, -440, -8775, -15366, -13855, -4627, 4299, 8447, 7970, 7092, 8164, 8638, 2655, -7510, -15686, -14953, -7892, -224, 4066, 4753, 7638, 12240, 13658, 7220]
957G220j1525q486j528M554N447L079J587N432P170K124o023j0579q070k380L269
972h709K960J254K807P424P331K375n408r466p819k460J069L75m81L947Q004Q444
988A1647K913l596q382n835j443j542k975j511L316P571Q870M417l156n396l284
1003A614j758l328n061l210P54O972R029M492j527k032o56j428l525o040n407
1018a1111Q5O490O945L630P52N27J96j378m719p788o764l49N639N894L993L646
1034E688L690K381K46n565r741p420p29K573L217L702L570L946M990J168o006
1049E710q675n500j289J520L761K684K499N447N912L73n345p222n930k540N70
1064h025J618L79K233O168O056J692k249m737m943k425j43j758j674K406N807
$$ y = [7220, -4305, -12791, -14319, -9765, -4318, -1239, 348, 5780, 12950, 15074, 9051, -1528, -9598, -11978, -8709, -5749, -4495, -1688, 5736, 13067, 15442, 10034, 568, -7251, -9711, -8642, -8267, -8748, -4801, 3203, 11647, 14560, 10964, 2582, -3253, -4696, -6238, -9213, -10724, -7408, 163, 9033, 13450, 10294, 4898, 1614, -144, -3472, -8533, -11743, -10989, -4017, 5012, 9504, 7977, 5945, 5289, 3861, 336, -5704, -11111, -11026, -4536, 2409, 6039, 6791, 7318, 7514, 6136, 1417, -6371, -13135, -13484, -7845, -1951, 2042, 5688, 9378, 11759, 12005, 6440, -3301, -10721, -11450, -8877, -5660, -1958, 1612, 5558, 10548, 11716, 5710, -2965, -8465, -9754, -8234, -4473, -1789, 710, 6157, 12069, 12442, 7097, -125, -6055, -8595, -8025, -6407, -6028, -3795, 2373, 8429, 10121, 7872, 3135, -1808, -4233, -4376, -6134, -7808, -5402, 405]
1079D05N013L028k76l081l254j408k965n061k412J954M475N543M428O51r25m04
1095E711j572m547n979l440M78M670O434M015J018N42R90k490n706o490m821q92
1111a2079M261O302L528L115L038J426j669l876o292n827j212K956L179L066L261
1126C177L124J688o72l854o326m605o15J403J339L231M069L834L064O67l858n658
1142Hl546j521r67R6J219K318M238M458J459k614k997k742k287j180p18j084J248
1159d612M328M754K104k18j119k842k598j930l446k268N51M098M485L253K229
1174F769J46j989k355l596n043k616N93L311M217M963L184J009n90k851n573n733
1190f154k926rK620M500M497K734K175L18k347n390m517k682m91K981L530K824
$$ y = [405, 5418, 8446, 8170, 5089, 1835, 427, -2538, -7599, -10011, -8057, -3582, 1961, 6389, 7040, 6115, 5711, 4139, -408, -6387, -9827, -9349, -4679, 1755, 5770, 6788, 7330, 8320, 5830, 124, -6366, -11187, -12079, -7818, -1516, 2012, 5127, 8165, 9591, 7922, 4046, -2246, -8073, -9285, -6329, -3150, -84, 3177, 6301, 7989, 7317, 3463, -2863, -7468, -8083, -6680, -5341, -2110, 1959, 5793, 8857, 9524, 5666, 8, -3538, -5059, -6026, -5930, -4711, -2393, 1845, 6303, 7762, 5148, 2151, -591, -2878, -4058, -4776, -5860, -4612, -284, 4470, 6574, 6356, 5237, 2395, -203, -2133, -5579, -7847, -7296, -3198, 1287, 4540, 6769, 6915, 4926, 2571, -1025, -6068, -8684, -8091, -4780, -563, 4400, 7584, 8593, 8003, 5152, -421, -6154, -9080, -9089, -6469, -1969, 2528, 5262, 7437, 7755, 5408, 18, -4499, -7181, -7672, -4691, -1161, 1663]
1206A663K496K255M32k324l630l510k892q31J706J440J849K376K623J573k32j294
1222C700k337k271j315r21j245J34K028K504K742K275m35j379j753k281l044k573
1238f171k95J752L509M444K912Q38r78k065l513m367l235j401J808M410M936L391
1254E975J621k32k652m028m039l608j026J776L885M174L011J669l4k195l157l435
1270b295l028j030J492K506K598K492J628M09p85j887k781k233j084O9P48J547
1286a634J377K136J757P88k03j866k115j843j594j101o9J002K105K999K514P49
1302E002p86j934k409k466k235o21R57K591L868L131J227l54k081k971l463l121
1318e665j380O73K981M406L352J606o6j642k750k899l001j746P07K522L376K851
$$ y = [1663, 4159, 6414, 6846, 4522, 892, -2618, -5510, -6341, -4635, -3195, -1346, 1030, 3653, 5226, 4994, 3700, 1363, -908, -2223, -3144, -4389, -4255, -2227, 277, 3019, 5294, 4859, 3480, 1727, -554, -3598, -6171, -6466, -4714, -1205, 3239, 6151, 6989, 6011, 3946, 433, -3934, -7169, -8570, -6762, -2352, 2584, 5975, 7596, 7364, 4712, 684, -3355, -6963, -7989, -6213, -2328, 1846, 4857, 6526, 6492, 4297, 1140, -2295, -5323, -6353, -4861, -2355, 243, 2735, 4363, 4772, 3987, 2100, -681, -2914, -3998, -3929, -3181, -1634, -257, 1879, 3636, 4424, 4221, 2355, 240, -1603, -3197, -4298, -4367, -3365, -1260, 1739, 4253, 5002, 4216, 2282, -127, -2593, -4828, -5449, -4492, -1901, 1967, 5098, 6325, 5971, 3890, 919, -2544, -5665, -7045, -6372, -3391, 1015, 4367, 5973, 5907, 4265, 1515, -1384, -4385, -6131, -5424, -2902, 474, 3325]
1334C325J442J00r00k071k469k890j553J76J543K258K161J499Q34O92j120j728
1350A299j980j875m94K83O25J003J493J864J404R7j292j939k128j756j014J8P24
1367c668J889L090K926J219k57j740k610k618j663j773K26J751L301L290J746
1382E109m45j739k464k525k148j151L96K302L538L060J743j03j609k076k679k377
1398c168j805j32J341K832K230J522K55j94p29j668j419j833o08R21J419J426
1414C90J318P70M07q7m08j761k279j480q36O57P84J480J921K209J138J85j609
1431B799k600k327j321m75Q30J494K527J937K208k29j884l123k400j681p82Q19
1447d208J678K774K604K128K50j729k646j961j524r53J83Q27J887K413J480L34
$$ y = [3325, 4767, 4867, 3967, 1896, -573, -3463, -5016, -4840, -3297, -1039, 1122, 2621, 3455, 4147, 3027, 1299, -681, -2556, -3050, -2767, -2142, -1139, 354, 2218, 3622, 3719, 2427, 488, -1640, -3396, -4410, -4392, -3668, -1779, 1311, 4237, 5456, 5199, 3459, 849, -1769, -3432, -5205, -4979, -3228, 73, 3363, 5109, 4664, 2925, 461, -2064, -4212, -5363, -4967, -2665, 873, 3933, 5676, 5573, 3964, 1888, -791, -3168, -4973, -5105, -3764, -932, 1298, 2820, 3075, 2881, 2152, 484, -935, -2768, -3376, -2455, -1036, 390, 1708, 2478, 2885, 2798, 2390, 629, -1650, -3130, -3966, -3309, -2525, -1045, 876, 3085, 4223, 4408, 2799, 199, -2128, -3449, -3924, -3094, -1600, 927, 2864, 5072, 4843, 2959, -164, -2564, -4245, -5027, -4208, -2530, 244, 2848, 4976, 5226, 3497, 851, -1110, -2634, -3587, -3404, -2577, -690, 1723, 3203, 3537]
1463C537j125j462j747r34r30m79L13J633J612J538J230l30n94p51j118j561j578
1480b746p56J46J464J641J706R27N77J57p72k569j760j346k60J123K142J329J519
1497B522J472J10j346k432k457k066j75J193J609J614K015J582N82j141j846k910
1513a674j657JQ35Q47J269J886J398M09k54j755k254j378n76L68N2J164J354J234
1531A269J808M33j357j385q45j131j288J60L03Q09J536J612M05l35j51j170j330
1548f57j361q57m87R64K374J685P37Q15l61r00j404j741j818j015R87J861J654
1565D76J249J060l88k45j001j585k521m70O60J101K126J429Q82j47J39p88k335
1582c58j742p19j68M32J967J059Q58J131P40j259j743j051r42p40N09P38P52J245
$$ y = [3537, 2412, 950, -797, -1731, -2661, -3140, -2827, -1194, 418, 1956, 3186, 2856, 2262, 1511, 393, -1168, -2746, -3502, -3356, -1892, -251, 1455, 2382, 2959, 3116, 2344, -225, -1985, -3331, -3591, -2468, -326, 1003, 2522, 3994, 4104, 2758, 326, -2131, -4197, -4372, -3179, -1570, 44, 2059, 3641, 4223, 3082, 1236, -1674, -3331, -3330, -2495, -1648, -379, 1507, 2905, 3314, 3060, 1305, -949, -2327, -2903, -2535, -2483, -1319, 35, 1269, 3077, 3510, 2153, 768, -77, -1208, -2496, -2336, -2033, -1224, 312, 1924, 2329, 1994, 1843, 673, -657, -2018, -2875, -3362, -2398, -24, 1661, 2398, 3213, 2852, 1952, 548, -1193, -3011, -4026, -3039, -1178, 476, 1725, 2785, 2397, 2152, 1151, -434, -2955, -3425, -2765, -1664, 462, 1891, 2773, 2626, 2765, 1977, -358, -2100, -2819, -2987, -2555, -588, 471, 1329, 2460, 3200, 1941, 198, -853, -1795, -2535, -2026, -1288, -536, 709]
1600G09J638M35n16r72j235j595n66M89p05L97J652J440J083L39n28j169j334
1617d38n58q40o06L72Q86J285K132R36n32j176j042j368j454n02p6J044J597K134
1635A794J236j035m4r49j248j258q81m9N77J793J146M79O03J31r54j171j289j267
1653b386n81R65J395Q04R24Q05K50l5k21j468k186m96K75K84Q92R25R28P44M69
1672B287l09j248j448j007l77J67N08J058R15J164J151l92j299p84j453j222P9
1689b210K66Q02O82J695J069k78m63j052r73j046l24m6J32J604J190O46P71m79
1707A986j049r57p73p40q79L64P52J368Q73P97N4m80k02q46j184j042N2K53J139
1726e14J507N43K47J59n58q55j402q95n58K13J292J043Q35P46K62p6r72j123j130
$$ y = [709, 2347, 2782, 2266, 1294, 59, -1536, -2102, -1613, -2318, -1921, -269, 1171, 2254, 2593, 2065, 896, -438, -996, -1836, -2442, -2070, -1184, 101, 2233, 3169, 2637, 1461, 419, -949, -2403, -2905, -2981, -1937, -340, 1794, 3030, 1995, 1951, 1002, -246, -1504, -2385, -2434, -1857, -64, 1082, 1561, 2164, 2295, 1341, 170, -1119, -2386, -2967, -2002, -607, 197, 1121, 1926, 2176, 2141, 1920, 452, -1734, -2230, -1955, -1671, -779, 146, 1074, 1818, 2287, 1978, 730, -718, -1725, -2102, -1935, -1427, -369, 546, 1710, 2861, 2469, 1170, 386, -1067, -2289, -2210, -1944, -1142, -460, 1235, 2304, 2026, 1563, 511, -462, -1508, -1832, -1878, -1746, -142, 1048, 1694, 2465, 1986, 937, -20, -793, -1533, -2412, -2048, -1296, 72, 945, 1742, 1796, 1316, 1114, 268, -916, -1958, -1906, -1653, -514, 993, 1536, 1783, 1942, 1384, 529, -873, -1768, -2326, -2113, -821, 222, 1057, 1803, 2065, 1989, 1017, -106, -1236]
1745a236p38l0O99P83N01Q63Q78K8j63j288j247o04Q6K81K76M77J191M58O68n7
1765A826o88j217r90k41m67L27K89J060Q44J107K57p30n95j141r21l73j81L93
1783a441O81J416R21N32o8r21j250p22q27j65J06R06J187J195N60j89m41j202
1801B78p99o88m80J07M96Q42P62P89J77j23p50j48j229m61k25K69P20N73N86K89
1821I85N27No68j070n31p67L83j25M89O76N53J027L25l79j044q26p15n76J28M65
1841a138P68Q13J055N07j84q72j452o15m05k68N84L15J225Q82Q55k05n70r61j219
1860h85l73j87J15L80R24O01R40J10n42r57l44m34k25k36QM30P08Q80L95k41l39
1881G28l72p48j85l78k23L19L02Q40N85J59M64m74r02k40q24l15k09M51P24J000
$$ y = [-1236, -1974, -2004, -1305, -522, -21, 842, 1720, 1748, 1585, 297, -950, -1554, -1468, -1187, -911, -434, 757, 1215, 1883, 1826, 1138, -79, -1069, -1310, -1777, -1450, -1161, -101, 743, 1850, 2107, 1377, 782, -359, -1280, -1653, -1834, -1441, -760, 656, 1577, 2109, 2041, 1120, -130, -852, -1679, -1844, -1738, -832, 355, 1550, 2110, 1921, 1480, 278, -521, -1209, -1689, -1582, -1086, -244, 518, 1307, 1484, 1361, 611, 463, -766, -1227, -1452, -1183, -463, 110, 696, 985, 1512, 1517, 849, -221, -752, -1519, -1136, -1261, -772, -96, 457, 1484, 1809, 1430, 386, -440, -1155, -1731, -1603, -1138, -370, 443, 1498, 2005, 1821, 949, -503, -1118, -1523, -1791, -1207, -892, 333, 1215, 2070, 1865, 1295, 334, -885, -1258, -1445, -1330, -950, -26, 575, 1515, 1625, 1083, 126, -218, -652, -877, -1113, -1105, -675, 33, 913, 1308, 1067, 728, 356, -392, -577, -955, -1178, -859, -557, 283, 868, 1027, 1491, 1017, 115, -125, -949, -1264, -1473, -1022, -298, 702]
1901G02N53M04j86o60j039o40n60k79M44N25Q86Q07O37n9k44q85r67q24j16L0
1921a471N06J041O41P38K48p43m77q81n49q2Q8L2N55O60R08J14k96m28o75n68
1941f39j74O3l43P05o9Q60O79j29r1m55m95k88k23m07%J87M26Q36N75o1o2l18
1963E77n26p44k98l90J90O46J132O13K32J1o95p40l34p96m86o0P95R64N90P84
1983A465k19k82n79m58p41n55L28M26O04P88M63j57n03k91o64k75k18N6p3M94
2003c91M62N52Q9P1j72j23m10k00l86k75j66J97J034K83K19j7k81j46k78m76o46
2024a060k60oJ209N10M63K12ql93o78J0j044m61J35Q30P05Q52O04n65m33k86n79
2045b43n90j35j21L47P23R42M59l36l83m41n44k15j45k01o3L73J068P5n9M12k81
$$ y = [702, 1255, 1659, 1473, 813, -226, -866, -1426, -1705, -1261, -736, 150, 957, 1594, 1535, 1291, 406, -561, -1385, -1501, -1471, -965, 76, 717, 1455, 1703, 960, 483, -398, -947, -1029, -941, -909, -354, 306, 1214, 1328, 1032, 604, -71, -639, -813, -750, -1093, -388, -457, 403, 1082, 953, 862, 407, -88, -376, -599, -1006, -1006, -819, -393, 443, 1018, 957, 895, 577, 51, -693, -991, -1381, -1191, -545, 587, 1200, 1432, 1443, 748, 8, -326, -1122, -1608, -1668, -873, 91, 681, 1465, 1246, 964, 385, -73, -814, -1369, -1041, -615, -11, 777, 1240, 1083, 580, 289, -375, -650, -868, -812, -885, -391, 71, 623, 712, 783, 611, 488, 78, -122, -508, -783, -949, -752, 282, 565, 784, 767, 486, 340, 62, -414, -1060, -1320, -1326, -117, 393, 856, 1068, 1060, 667, -11, -1, -1045, -1506, -1371, -541, 164, 1016, 1620, 1055, 622, 336, -243, -833, -968, -1089, -742, -19, 923, 1382, 1046, 663, 222, -322, -537, -682, -883, -946, -573, 495, 570, 511, 923, 642]
2066F42r41L06n8n59q0K15J65M75L51K99k38j02k14k75q69J00k46o4R97P23J86
2087H13M7J74k85m91p81k76m52L74P34M12L27N91k88l35m02m73o03l69N06M53
2107c24N35M37N12m56k72j15k41o21j18j75K80N16J58M77k14J68j93ol67j66p10
2128h95J86L43O56j04K45M0j94L1P0n29p02n9Q9J34P38L90J59j79L38j40o10l87
2150c80l66k23N1R11P40m07N09n4k03n82j01r00k13M14L14M94O26R8l13l2K1m75
2172g1l91n41K15J7R29M16m3J58k58m0m29k76k04l15J59M15L41K94r6J50Q6j46
2194C70l13n91k12K43K32J27M06k8K28o0J80j46n13n09k36l9O05J53K82K82L43
2215H04j64j29l62l94m52k51K66L95M78K72K59j08r6j0n24o22k71N50MN72J81
$$ y = [642, -299, 7, -51, -610, -690, -475, -310, 165, 516, 815, 577, 475, 261, -14, -883, -783, -1029, -1093, -96, 627, 813, 860, 1034, 749, 258, -523, -799, -1251, -877, -143, 269, 596, 1187, 899, 564, 162, -311, -914, -1283, -777, -324, 211, 648, 1160, 704, 432, 317, 76, -545, -663, -838, -558, -42, 116, 593, 379, 547, 354, 348, -19, -185, -895, -709, -366, 290, 186, 431, 471, 277, 308, 378, -151, -853, -912, -823, -689, 49, 439, 598, 419, 757, 617, 7, -380, -746, -969, -918, -7, 733, 326, 835, 781, 578, -4, -105, -1005, -1218, -804, -490, 4, 630, 728, 415, 383, 404, -71, -462, -1003, -788, -771, 158, 574, 531, 689, 431, 391, -38, -314, -518, -833, -674, -259, 82, 376, 280, 430, 516, 370, 57, -534, -746, -503, -271, -144, 262, 234, 462, 402, 582, 436, -77, -586, -822, -861, -256, -103, 179, 461, 804, 640, 511, 149, -245, -697, -948, -682, -287, 191, 463, 722, 614, 518, 508, -16, -638, -909, -359, -355, 217, 398]
2236C98J56k55K41k11l57l87j48k34M77L18K07N7J34j9k1r6jp06l5k19J70M36
2258i5R3J65o7M70l9l2o32n94k25N27J7L60K71K43k27M44k88j43n88n89L35N7
2280e37M18L69J00J35P3k30j80l51n96Q3L39K53J72J92n4R6K61k54k33m70k47
2301f61N8M31m7J59K88K08L7l6k62m07l07k09J66M08J40n5K49M88j5P4m64m00
2323a57l58J68K5lK30K43J61L40j75k8n22k52j76j15M42J46J69K72k38L97j16
2344D53j66n78l42oM18K13k36L51L69P1k10P0n37k5l67K34K1n1J80J3N14j19J00
2367C70Jo60O4j07l9m3L08o9N57P4K93m54k30m02k39m6L79M5l2M86R4N46k07l79
2391C10n88j6j67J57L69k26K93J12J38J4j40j98k97k61L66j11K42J78o1J62R3
$$ y = [398, 554, 299, 540, 329, -28, -415, -563, -797, -320, -2, 205, 262, 396, 377, 356, 260, 259, -447, -482, -701, -531, -95, -2, 163, 96, 566, 527, 495, -137, -731, -956, -429, -412, -52, 219, 462, 235, 679, 391, 248, -340, -929, -594, -537, -119, 250, 350, 485, 558, 328, 148, -203, -799, -716, -377, -124, 48, 240, 186, 282, 543, 289, 56, -414, -661, -603, -172, -219, -60, 228, 436, 473, 437, 175, -232, -539, -748, -582, -174, -34, -89, 160, 648, 633, 707, 243, -157, -515, -347, -322, -325, -95, 148, 309, 649, 474, 446, -76, -328, -504, -619, -177, -31, 138, 410, 172, 569, 453, 287, -291, -633, -639, -221, -8, -244, 107, 476, 547, 337, 407, -130, -155, -522, -288, -267, -318, -138, -125, 389, 270, 370, 371, -289, -225, -332, -371, -414, -106, -175, 382, 456, 749, 295, 65, -337, -576, -622, -243, -198, -230, 256, 350, 896, 689, 310, -278, -294, -461, -304, 65, -161, 132, 244, 382, 396, 256, 58, -239, -500, -134, -245, -3, 175, 114, 276, 369]
2412C69J78l05n82J41l59K44R0L35M4L4J65K76k80j69l80l6l04K47R4j34M46M05
2434E19p3m0j48l87o2q1q2N14o79N90L04k23M49k88r9l42k95J2J90l6J97J79Q9
2457B08K90J97n98n9l43n5p6K20J60M3L10j11K89m17M2l29j05N1J81p1K50L7L86
2480E00k05J24m36n8j81Pk4p0Q7q1K80O74k20j81j6l05j12k24K63l27J69N36J48
2503C48J82k76J9j81k99o3j09j56J86L74q5M66K57m62j36k65j42J2%J65Q5L19
2525B39%K45k01l32L4j48QQ0k04n7J80K65K14l43L25j93n29K74n1m5J25k21J76
2548a59K03L54k66J63k99n4k36l6O6K79l68O46r7R1N7k16j45j48k5j08q5K01K96
2571A14K04K8J77l02j07k86J39k10L6K05j39K58J81k56K36j32n65q4K03k0K25
$$ y = [369, 547, 242, -340, -199, -558, -314, -224, 111, 155, 189, 354, 630, 350, 181, -199, -235, -539, -292, -198, -332, 114, 519, 446, 406, 258, -129, -191, -272, -354, 160, -519, 71, 375, 152, 601, 313, 214, -128, -423, -411, -221, -257, -60, 119, 208, 498, 695, 97, 38, -305, -360, -436, -216, -56, -13, 297, 186, 475, 58, 100, -229, -334, -283, -102, -173, 77, 114, 500, 295, 419, -17, -75, -256, -249, -273, -343, -256, -337, -57, 617, 397, 216, 200, -105, -217, -441, -178, -505, -336, 200, 348, 530, 254, 273, 92, -207, -270, -379, -535, -349, 25, -60, 406, 663, 201, 65, -200, -342, -330, -330, -165, -80, 239, 239, 484, 283, -49, -15, -163, -155, -75, -279, -336, -156, 109, 323, -20, 305, 112, -417, -143, -194, -239, -114, -335, -159, 44, 398, 132, 295, -4, -58, -294, -330, -264, 15, -353, 293, 196, 287, 344, 128, -17, -165, -190, -298, -383, -182, 114, 318, 346, 523, 221, 114, -172, -33, -243, -207, -2, -141, 117, 298, 42, 278, 146, -419, -503, -300, -320, -95]
2592i5q8J39M24j67j39J18L9l59J40mj42l4J55Pj04L72p2j61j54P0o1j05J68r6
2616a49j07L86J73J58j32j5k74k94J53k45N0J83K28N5J33Kl6l61k5J02m66K03
2638b78L82j46K39J11J09l75j02Jk27J41J88l87J45K50K76k39K61k35j88L9l6
2659g1N9k01j25K42Q2J66j22J7Qj33oR7l61J88K82l70L84K7Pj30J17l43j69K72
2683h3j54j8K27nJ80%Lkk80K30m93O5J89J24O2k47M82l7j59j74J80k65j30q9J43
$$ y = [-95, -183, -44, 380, 213, 74, 192, 231, -128, 12, 8, -134, -168, -13, -6, -110, 262, 190, 29, -125, -55, -116, -221, -53, -149, -256, 130, 303, 461, 329, 314, 40, -254, -101, -346, -296, -113, 115, 170, 303, 305, 269, -92, -117, -15, -481, -278, 104, -42, 197, 308, 417, 42, -60, -59, -286, -145, 43, -344, -199, 51, 327, 88, 349, 114, -74, -35, -71, -12, -213, -338, -96, -14, 152, 30, 47, 55, -78, -84, 13, -348, -160, 122, -248, 136, 163, 170, 40, 157, -186, -355, -83, -237, -255, -28, -33, 147, 147, 150, 148, -132, 98, -395, -330, -141, -17, 45, -202, 280, 243, 84, -90, 90, -175, -305, -394, -251]
$$ [...]
8191b9
##END NTUPLES=NMR FID
##END=
