##TITLE=1H_Pr Q-11
 D2O
 8 sc, 
 11.3.2024
##JCAMPDX= 6.0         $$ Bruker NMR JCAMP-DX V2.0
##DATA TYPE= NMR FID
##DATA CLASS= NTUPLES
##ORIGIN= UXNMR, Bruker Analytische Messtechnik GmbH
##OWNER= root
$$ XWIN-NMR		Version 3.5
$$ Mon Mar 11 14:24:04 2024 Russian Standard Time (UT+4h)  she@DPX200
##.OBSERVE FREQUENCY= 200.1313
##.OBSERVE NUCLEUS= ^1H
##.DELAY= (6, 6)
##.ACQUISITION MODE= SIMULTANEOUS
##.ACQUISITION SCHEME= undefined
##.AVERAGES= 8
##.DIGITISER RES= 18
##SPECTROMETER/DATA SYSTEM= spect
##.PULSE SEQUENCE= zg30
##.SOLVENT NAME= D2O
##.SHIFT REFERENCE= (INTERNAL, D2O, 0, 15.7039)
##AUDIT TRAIL= $$ (NUMBER, WHEN, WHO, WHERE, WHAT)
$$ ##TITLE= Audit trail, XWIN-NMR		Version 3.5
$$ ##JCAMPDX= 5.01
$$ ##ORIGIN= Bruker BioSpin GmbH
$$ ##OWNER= she
$$ F:/spectra/data/she/nmr/H-F/1/audita.txt
$$ ##AUDIT TRAIL=  $$ (NUMBER, WHEN, WHO, WHERE, WHAT)
(   1,<2024-03-11 14:22:53.50 +0400>,<she>,<DPX200>,
      <created by zg, POWCHK disabled, PULCHK disabled
       configuration hash MD5:
       00 E9 B6 7A A2 85 ED C7 34 08 36 98 17 FE 4E 26
       data hash MD5: 16K
       89 37 A1 9F C2 B5 1D 2C 21 8C C8 5F 9E FF 3A 28>)
$$ ##END=
$$ 
$$ hash MD5
$$ 43 16 CE 68 C5 FD F1 11 4F 8A 39 15 1F 85 00 2E
##$RELAX= 
##$RELAX= 
##$RELAX= 
##$RELAX= 
##$RELAX= 
##$RELAX= 
$$ Bruker specific parameters
$$ --------------------------
##$DU= <F:/spectra>
##$EXPNO= 1
##$NAME= <H-F>
##$PROCNO= 1
##$TYPE= <nmr>
##$USER= <she>
##$AMP= (0..31)
100 100 100 100 100 100 100 100 100 100 100 100 100 100 100 100 100 100 
100 100 100 100 100 100 100 100 100 100 100 100 100 100 
##$AQSEQ= 0
##$AQ_mod= 1
##$AUNM= <au_zg>
##$AUTOPOS= <>
##$BF1= 200.13
##$BF2= 200.13
##$BF3= 200.13
##$BF4= 200.13
##$BF5= 200.13
##$BF6= 200.13
##$BF7= 200.13
##$BF8= 200.13
##$BYTORDA= 1
##$CFDGTYP= 0
##$CFRGTYP= 5
##$CHEMSTR= <none>
##$CNST= (0..31)
1 1 145 1 1 1 1 1 1 1 1 1 1 1 1 1 1 1 1 1 1 1 1 1 1 1 1 1 1 1 1 1 
##$CPDPRG= <>
##$CPDPRG1= <>
##$CPDPRG2= <>
##$CPDPRG3= <>
##$CPDPRG4= <mlev>
##$CPDPRG5= <mlev>
##$CPDPRG6= <mlev>
##$CPDPRG7= <mlev>
##$CPDPRG8= <mlev>
##$CPDPRGB= <>
##$CPDPRGT= <>
##$D= (0..31)
0 1.2 0 0 0 0 0 0 0 0.06 0 0.03 0 0 0 0 0.0002 0 0 0 0 0 0 0 0 0 0 0 0 
0 0 0 
##$DATE= 1710152573
##$DBL= (0..7)
120 120 120 120 120 120 120 120 
##$DBP= (0..7)
150 150 150 150 150 150 150 150 
##$DBP07= 0
##$DBPNAM0= <>
##$DBPNAM1= <>
##$DBPNAM2= <>
##$DBPNAM3= <>
##$DBPNAM4= <>
##$DBPNAM5= <>
##$DBPNAM6= <>
##$DBPNAM7= <>
##$DBPOAL= (0..7)
0.5 0.5 0.5 0.5 0.5 0.5 0.5 0.5 
##$DBPOFFS= (0..7)
0 0 0 0 0 0 0 0 
##$DE= 6
##$DECBNUC= <off>
##$DECIM= 32
##$DECNUC= <off>
##$DECSTAT= 4
##$DIGMOD= 1
##$DIGTYP= 9
##$DL= (0..7)
0 120 120 120 120 120 120 120 
##$DP= (0..7)
150 150 150 150 150 150 150 150 
##$DP07= 0
##$DPNAME0= <>
##$DPNAME1= <>
##$DPNAME2= <>
##$DPNAME3= <>
##$DPNAME4= <>
##$DPNAME5= <>
##$DPNAME6= <>
##$DPNAME7= <>
##$DPOAL= (0..7)
0.5 0.5 0.5 0.5 0.5 0.5 0.5 0.5 
##$DPOFFS= (0..7)
0 0 0 0 0 0 0 0 
##$DQDMODE= 0
##$DR= 18
##$DS= 0
##$DSLIST= <SSSSSSSSSSSSSSS>
##$DSPFIRM= 0
$$ [...]
##$SUBNAM2= <"">
##$SUBNAM3= <"">
##$SUBNAM4= <"">
##$SUBNAM5= <"">
##$SUBNAM6= <"">
##$SUBNAM7= <"">
##$SUBNAM8= <"">
##$SUBNAM9= <"">
##$SW= 18.0517328524113
##$SWIBOX= (0..15)
0 0 2 0 0 0 0 0 0 0 0 0 0 0 0 0 
##$SW_h= 3612.71676300578
##$TD= 16384
##$TD0= 1
##$TE= 0
##$TE2= 300
##$TE3= 300
##$TEG= 300
##$TL= (0..7)
0 120 120 120 120 120 120 120 
##$TP= (0..7)
150 150 150 150 150 150 150 150 
##$TP07= 0
##$TPNAME0= <>
##$TPNAME1= <>
##$TPNAME2= <>
##$TPNAME3= <>
##$TPNAME4= <>
##$TPNAME5= <>
##$TPNAME6= <>
##$TPNAME7= <>
##$TPOAL= (0..7)
0.5 0.5 0.5 0.5 0.5 0.5 0.5 0.5 
##$TPOFFS= (0..7)
0 0 0 0 0 0 0 0 
##$TUNHIN= 0
##$TUNHOUT= 0
##$TUNXOUT= 0
##$USERA1= <user>
##$USERA2= <user>
##$USERA3= <user>
##$USERA4= <user>
##$USERA5= <user>
##$V9= 5
##$VALIST= <valist>
##$VCLIST= <CCCCCCCCCCCCCCC>
##$VD= 0
##$VDLIST= <DDDDDDDDDDDDDDD>
##$VPLIST= <PPPPPPPPPPPPPPP>
##$VTLIST= <TTTTTTTTTTTTTTT>
##$WBST= 1024
##$WBSW= 4
##$XGAIN= (0..3)
0 0 0 0 
##$XL= 0
##$YL= 0
##$YMAX_a= 577963
##$YMIN_a= -835776
##$ZGOPTNS= <>
##$ZL1= 120
##$ZL2= 120
##$ZL3= 120
##$ZL4= 120
##$ABSF1= 10
##$ABSF2= 0
##$ABSG= 5
##$ABSL= 3
##$ALPHA= 0
##$AQORDER= 0
##$ASSFAC= 0
##$ASSFACI= 0
##$ASSFACX= 0
##$ASSWID= 0
##$AUNMP= <proc_1d>
##$AZFE= 0.1
##$AZFW= 0.1
##$BCFW= 1
##$BC_mod= 2
##$BYTORDP= 1
##$COROFFS= 0
##$CY= 11.3945322036743
##$DATMOD= 1
##$DC= 2
##$DFILT= <>
##$DTYPP= 0
##$F1P= 15.7292609196834
##$F2P= 12.9074282941183
##$FCOR= 0.5
##$FTSIZE= 0
##$FT_mod= 4
##$GAMMA= 1
##$GB= 0.15
##$INTBC= 1
##$INTSCL= 1
##$ISEN= 128
##$LB= 0.24
##$LEV0= 0
##$LPBIN= 0
##$MAXI= 10000
##$MC2= 0
##$MEAN= 0
##$ME_mod= 0
##$MI= 1.114404
##$NCOEF= 0
##$NC_proc= 0
##$NLEV= 6
##$NOISF1= 3.799351
##$NOISF2= 2.8
##$NSP= 1
##$NTH_PI= 0
##$NZP= 0
##$OFFSET= 15.70392
##$PC= 1
##$PHC0= -25307.17
##$PHC1= 8.58731
##$PH_mod= 1
##$PKNL= yes
##$PPARMOD= 0
##$PSCAL= 0
##$PSIGN= 0
##$REVERSE= no
##$SF= 200.130013532006
##$SI= 16384
##$SIGF1= 3
##$SIGF2= 2
##$SINO= 400
##$SIOLD= 16384
##$SREGLST= <1H.CDCl3>
##$SSB= 0
##$STSI= 0
##$STSR= 0
##$SW_p= 3612.71676300578
##$SYMM= 0
##$S_DEV= 0
##$TDeff= 0
##$TDoff= 0
##$TI= <>
##$TILT= no
##$TM1= 0
##$TM2= 0
##$TOPLEV= 0
##$USERP1= <user>
##$USERP2= <user>
##$USERP3= <user>
##$USERP4= <user>
##$USERP5= <user>
##$WDW= 1
##$XDIM= 8192
##$YMAX_p= 0
##$YMIN_p= 0
$$ End of Bruker specific parameters
$$ ---------------------------------
##NTUPLES= NMR FID
##VAR_NAME=  TIME,          FID/REAL,        FID/IMAG
##SYMBOL=    X,             R,               I
##VAR_TYPE=  INDEPENDENT,   DEPENDENT,       DEPENDENT
##VAR_FORM=  AFFN,          ASDF,            ASDF
##VAR_DIM=   8192,          8192,            8192
##UNITS=     SECONDS,       ARBITRARY UNITS, ARBITRARY UNITS
##FACTOR=    0.0002768,     1,               1
##FIRST=     0,             0,               0
##LAST=      2.2672688,     0,               0
##MIN=       0,             -835776,         0
##MAX=       2.2672688,     577963,          0
$$ Real data points
##PAGE= N=1
##DATA TABLE= (X++(R..R)), XYDATA
$$ plain form
0 0 0 0 0 0 0 0 0 0 0 0 0 -8 0 -8 8 -8 8 -8 16 -16 16 -24 24 -32 34 -42 48 -55 65 -74 84 -94 108 -124 136
35 136 -154 174 -192 217 -240 266 -297 327 -365 399 -443 489 -537 593 -651 718 -794 873 -966
54 -966 1068 -1184 1317 -1470 1652 -1867 2131 -2458 2878 -3447 4241 -5460 7532 -11750 23883
69 23883 -137804 -617229 -621305 -275174 166933 426908 528866 564305 566013 383561 -36909
80 -36909 -531930 -790459 -695182 -375431 -66464 140059 282828 406991 421863 225873 -115777
91 -115777 -357361 -322904 -66800 194398 315541 315901 286086 214438 -1738 -365504 -668166
102 -668166 -665997 -333386 96131 351716 366809 291465 269910 261690 126473 -141646 -362868
113 -362868 -353635 -124049 135757 245796 197020 103823 25650 -84145 -253476 -388183 -348983
$$ packed form
0@%%%%%%%%%%%qQqJ6j6J6j6K4l2L2m0M8n6O6p6R0j03J20j39J58j78K02k32K60
35A36k90L28l66M09m57N06n63O24o92P64q42R32j026J130j244J369j512J667j839
54i66K034k252K501k787L122l519L998m589N336o325P688r701J2992j9282L5633
69B3883j61687m79425m076L46131M42107K59975J01958L5439J708j82452m20470
80c6909m95021k58529R5277L19751L08967K06523J42769J24163J4872j95990l41650
91a15777k41584L4457K56104K61198J21143L60k9815p1648k16176l63766l02662
102f68166K169L32611M29517K55585J5093p5344k1555q220j35217k68119k21222
113c62868R233K29586K59806J10039m8776r3197p8173j09795j69331j34707L9200
$$ plain form
124 -348983 -109878 192079 373659 373491 275320 169414 44591 -139985 -330338 -388308 -237737
135 -237737 34587 237947 258057 155001 61967 14570 -61988 -206923 -328887 -282473 -34611
146 -34611 266910 414924 336725 137299 -39923 -148087 -219754 -263746 -229299 -75688 139943
157 139943 280890 259017 117653 -31572 -128604 -189880 -229427 -208267 -77043 135794 305405
168 305405 316968 180944 12959 -95478 -148619 -190327 -214061 -155515 11856 202431 273445
179 273445 167557 -23183 -155960 -172775 -124040 -79567 -43540 31452 151456 242504 223416
190 223416 98204 -50843 -148277 -183854 -186175 -161259 -79902 59570 187536 212685 118906
201 118906 -16654 -102549 -115378 -95410 -74652 -29455 70841 190669 234250 144351 -27387
$$ packed form
124c48983K39105L01957J81580j68r8171j05906j24823j84576j90353n7970J50571
135b37737K72324K03360K0110j03056r3034m7397p6558j44935j21964M6414K47862
146c4611L01521J48014p8199j99426j77222j08164p1667m3992L4447J53611K15631
157A39943J40947k1873j41364j49225r7032o1276l9547K1160J31224K12837J69611
168C05405J1563j36024j67985j08437n3141m1708k3734N8546J67371J90575P1014
179B73445j05888j90740j32777j6815M8735M4473L6027P4992J20004R1048j9088
190B23416j25212j49047r7434l5577k321K4916Q1357J39472J27966K5149r3779
201A18906j35560q5895j2829J9968K0758M5197J00296J19828M3581q9899j71738
$$ plain form
212 -27387 -166427 -203974 -167725 -122814 -85131 -12515 112846 227318 236746 119305 -46135
223 -46135 -154805 -166280 -115932 -49311 27813 121291 193795 178232 52918 -114670 -220798
234 -220798 -214918 -134399 -45556 31033 116005 202266 230054 145781 -20187 -163699 -197660 -128718
246 -128718 -35706 23841 63274 112231 150237 115210 -13925 -167098 -234831 -173529 -40225
257 -40225 72561 127341 149755 161304 136001 41243 -95378 -188511 -174210 -77159 21471 67166
269 67166 78003 90362 95437 47419 -63373 -170302 -184638 -89219 42167 123097 135064 122829
281 122829 115575 83747 -9225 -137352 -212733 -171660 -46002 68773 108991 91815 69930
292 69930 54140 10213 -76203 -153379 -144859 -37990 95227 167306 154512 101005 48273 -10607
$$ packed form
212b7387j39040l7547L6249M4911L7683P2616J25361J14472R428j17441j65440
223d6135j08670j1475N0348O6621P7124R3478P2504j5563j25314j67588j06128
234b20798N880Q0519Q8843P6589Q4972Q6261K7788q4273j65968j43512l3961O8942
246a28718R3012N9547L9433M8957L8006l5027j29135j53173o7733O1302J33304
257d0225J12786N4780K2414J1549k5303r4758j36621r3133J4301R7051R8630M5695
269F7166J0837J2359N075m8018j10792j06929j4336R5419J31386Q0930J1967j2235
281A22829p254l1828r2972j28127p5381M1073J25658J14775M0218j7176k1885
292F9930j5790m3927q6416p7176Q520J06869J33217P2079j2794n3507n2732n8880
$$ plain form
304 -10607 -98715 -189501 -212536 -124970 26796 142410 160666 107538 47628 6682 -38035 -100211
316 -100211 -137508 -91672 32775 153721 182982 110574 4125 -70712 -107935 -136885 -156427
327 -156427 -124115 -15192 122950 199778 168289 67281 -24142 -65346 -77191 -87471 -81998
338 -81998 -28034 66813 138235 122376 27315 -75063 -120455 -108028 -79675 -55567 -13656 65121
350 65121 148640 170797 104042 -6732 -85290 -98149 -74711 -56180 -42117 -4219 59498 104019
362 104019 80973 -1782 -79585 -98622 -64158 -21545 2945 26880 71562 117903 116177 46321
374 46321 -51877 -112047 -107497 -67227 -32068 -9410 24418 72778 100548 69949 -8304 -78785
386 -78785 -93185 -55230 -6257 25285 46501 72616 92176 71589 -34 -84273 -124924 -102056
$$ packed form
304a0607q8108r0786k3035Q7566J51766J15614J8256n3128n9910m0946m4717o2176
316a00211l7297M5836J24447J20946K9261p2408j06449p4837l7223k8950j9542
327a56427L2312J08923J38142P6828l1489j01008r1423m1204j1845j0280N473
338h1998N3964R4847P1422j5859r5061j02378m5392J2427K8353K4108M1911P8777
350F5121Q3519K2157o6755j10774p8558j2859K3438J8531J4063L7898O3717M4521
362A04019k3046q2755p7803j9037L4464M2613K4490K3935M4682M6341j726o9856
374D6321r8198o0170M550M0270L5159K2658L3828M8360K7770l0599p8253p0481
386g8785j4400L7955M8973L1542K1216K6115J9560k0587p1623q4239m0651K2868
$$ plain form
398 -102056 -43958 7727 38944 63085 84329 80944 32651 -43796 -97348 -91075 -35609 23763
410 23763 55624 63321 64180 56363 21185 -42697 -102102 -113435 -67880 1075 51198 68252 67089
423 67089 59904 38288 -7289 -61167 -86339 -61959 -5111 45080 62374 53770 37799 17691
435 17691 -16720 -62354 -92350 -79592 -27127 33531 68129 69865 55906 39703 15227 -24658
447 -24658 -64599 -76624 -46715 6273 48071 57057 41823 20775 -1798 -31056 -63016 -76299
459 -76299 -52370 1988 56661 81408 73419 48360 18449 -16354 -55153 -81099 -74159 -29702
471 -29702 27121 62996 62489 38273 8990 -18206 -45471 -66113 -61387 -21581 37815 82481 86829
484 86829 55147 11358 -26273 -55217 -74248 -73974 -44089 10281 61088 78931 57663 17170
$$ packed form
398a02056N8098N1685L1217K4141K1244l385m8293p6447n3552O273N5466N9372
410B3763L1861P697Q59p817l5178o3882n9405j1333M5555O8955N0123J7054j163
423F7089p185k1616m5577n3878k5172K4380N6848N0191J7294q604j5971k0108
435A7691l4411m5634k9996J2758N2465O0658L4598J736j3959j6203k4476l9885
447b4658l9941j2025K9909N2988M1798Q986j5234k1048k2573k9258l1960j3283
459g6299K3929N4358N4673K4747p989k5059k9911l4803l8799k5946O940M4457
471b9702N6823L5875n07k4216k9283k7196k7265k0642M726L9806N9396M4666M348
484H6829l1682m3789l7631k8944j9031K74K9885N4370N0807J7843k1268m0493
$$ plain form
496 17170 -19147 -42248 -54070 -52510 -30104 14216 61421 81646 60904 14933 -28550 -53682
508 -53682 -61478 -57989 -40505 -3914 43010 74730 68950 30080 -15041 -42115 -47817 -41160 -28360
521 -28360 -4873 30555 61881 65843 35054 -11581 -47223 -58174 -49906 -33924 -12470 18701
533 18701 52114 67702 49919 8033 -32402 -50793 -44869 -28216 -9299 13453 41005 59629
545 59629 51045 12906 -33545 -61770 -59875 -38296 -12362 11844 36821 58490 60461 33079 -12411
558 -12411 -49683 -57912 -39003 -10536 12958 31110 44784 45988 25354 -14794 -53902 -67537
570 -67537 -48719 -12642 20054 40575 51340 52942 37365 3283 -37179 -60957 -53205 -22094
582 -22094 11111 30329 35756 33332 21898 -502 -30991 -52774 -49370 -19389 18292 43016 48760
$$ packed form
496A7170l6317k3101j1822J560K2406M4320M7205K0225k0742m5971m3483k5132
508e3682p796L489J7484L6591M6924L1720n780l8870m5121k7074n702O657J2800
521b8360K3487L5428L1326L962l0789m6635l5642j0951Q268J5982K1454L1171
533A8701L3413J5588j7783m1886m0435j8391N924J6653J8917K2752K7552J8624
545E9629q584l8139m6451k8225J895K1579K5934K4206K4977K1669J971k7382m5490
558a2411l7272q229J8909K8467K3494J8152J3674J204k0634m0148l9108j3635
570f7537J8818L6077L2696K0521J0765J602j5577l4082m0462k3778P752L1111
582b2094L3205J9218N427k424j1434k2400l0489k1783L404K9981L7681K4724N744
$$ plain form
595 48760 40831 26199 5083 -22410 -48034 -55464 -37130 -3082 25559 37063 32328 20763 6537
608 6537 -10616 -29116 -38292 -28231 -461 28433 42244 36975 20445 2159 -15297 -32417 -44152
621 -44152 -40857 -17931 13437 36508 40715 29461 12586 -3621 -17962 -30174 -32882 -19299 6177
634 6177 29726 38126 27481 7879 -11507 -24936 -33430 -34926 -23304 1173 27869 43357 38995
647 38995 20012 -2820 -19929 -29803 -32214 -24604 -6074 17752 34587 35048 19033 -3512 -21745
660 -21745 -30142 -30354 -21765 -4461 17641 35541 38928 25591 2077 -19376 -30133 -30629 -23080 -8839
674 -8839 10360 27560 34416 26161 5877 -15880 -28506 -29452 -21379 -6804 9344 24764 32993
687 32993 27911 10642 -10840 -26622 -30861 -24290 -11087 5279 20359 29419 27495 13582 -6963
$$ packed form
595D8760p929j4632k1116k7493k5624p430J8334L4048K8641J1504m735j1565j4226
608F537j7153j8500r176J0061K7770K8894J3811n269j6530j8286j7456j7120j1735
621d4152L295K2926L1368K3071M207j1254j6875j6207j4341j2212k708J3583K5476
634F177K3549Q400j0645j9602j9386j3429q494j496J1622K4477K6696J5488m362
647C8995j8983k2832j7109r874k411P610J8530K3826J6835M61j6015k2545j8233
660b1745q397k12Q589J7304K2102J7900L387j3337k3514k1453j0757m96P549J4241
674h839J9199J7200O856q255k0284k1757j2626r46Q073J4575J6148J5420Q229
687C2993n082j7269k1482j5782m239O571J3203J6366J5080R060j924j3913k0545
$$ plain form
700 -6963 -23216 -29253 -23998 -11098 4203 18788 28288 28538 17433 -2289 -20716 -30600 -27348 -15160
714 -15160 790 15545 25273 26906 18782 2168 -16395 -27681 -27381 -16410 -34 15445 25693
727 25693 27115 19577 3666 -14796 -27634 -29174 -19799 -3454 12396 23579 26884 20871 6971
740 6971 -10546 -23928 -27645 -19497 -4380 11517 22533 25061 19533 7157 -9015 -22606 -27967
753 -27967 -21919 -7275 9067 21507 25412 20773 9386 -5347 -18647 -25125 -21317 -9311 6256
766 6256 18469 23045 19636 9476 -3993 -16766 -24166 -22125 -10919 4637 17526 23224 20644
779 20644 11226 -1223 -13197 -21617 -21842 -13505 617 13727 21331 20357 11982 119 -11910 -20033
793 -20033 -21140 -13983 -1316 11985 20764 21339 13951 2258 -9924 -18664 -21169 -16035 -4494 9146
$$ packed form
700f963j6253o037N255J2900J5301J4585R500K50j1105j9722j8427r884L252J2188
714a5160J5950J4755R728J633q124j6614j8563j1286L00J0971J6376J5479J0248
727B5693J422p538j5911j8462j2838j540R375J6345J5850J1183L305o013j3900
740F971j7517j3382l717Q148J5117J5897J1016K528n528j2376j6172j3591n361
753b7967O048J4644J6342J2440L905m639j1387j4733j3300o478L808J2006J5567
766F256J2213M576l409j0160j3469j2773p400K041J1206J5556J2889N698k580
779B0644r418j2449j1974q420k25Q337J4122J3110P604r74q375j1863j2029q123
793b0033j107P157J2667J3301Q779N75p388j1693j2182q740k505N134J1541J3640
$$ plain form
807 9146 18905 20762 14516 3633 -7944 -16408 -19645 -15380 -5607 7251 17708 20897 16032 5153
821 5153 -7059 -16136 -19109 -16313 -7125 4785 15245 19820 16884 7208 -4682 -14350 -17975 -15861
835 -15861 -7653 3293 13159 18596 16710 8044 -3244 -13214 -17664 -16238 -9026 1515 11267 17633
849 17633 16877 9940 -725 -11040 -16695 -15771 -9808 -187 9400 15778 16254 10618 774 -9310 -15584
864 -15584 -16139 -10685 -1409 7998 14646 16025 11613 2596 -7233 -14208 -15855 -11452 -3031 6406 13165
879 13165 15673 12146 3882 -5659 -12930 -15670 -12137 -3861 4988 12289 15180 12183 5321 -3946 -11830
894 -11830 -15188 -12666 -5585 3409 11123 14604 12841 6156 -2785 -10221 -14489 -12942 -6413 1853 9898
909 9898 13811 13046 7085 -1212 -9015 -13473 -12716 -7596 466 8394 12854 12376 8026 -71 -7581 -12685
$$ packed form
807I146R759J857o246j0883j1577q464l237M265R773J2858J0457L189m865j0879
821E153j2212r077k973K796R188J1910J0460M575k936r676j1890r668l625K114
835a5861Q208J0946R866N437j886q666j1288r970m450J426P212J0541R752O366
849A7633p56o937j0665j0315n655R24N963R621R587O378M76n636r844j0084o274
864a5584n55N454R276R407O648J379m412r017r829o975j647M403Q421R437O759
879A3165K508l527q264r541p271k740L533Q276Q849P301K891k997o862r267p884
894a1830l358K522P081Q994P714L481j763o685q941p436m268J547O529Q266Q045
909I898L913p65n961q297p803m458P57N120Q062P928M460m78m350q097p510n104
$$ plain form
925 -12685 -12569 -8162 -488 6973 12180 12577 8652 1195 -6368 -11501 -12625 -8872 -2004 6045 11109
940 11109 12654 8859 2597 -4823 -10437 -12057 -9518 -3150 4551 10361 11982 9576 3375 -3907 -9612
955 -9612 -11853 -9993 -3933 3269 9076 11434 9619 4434 -2534 -8598 -11503 -9950 -4795 2060 8089
970 8089 11092 9895 5019 -1686 -7735 -10708 -10009 -5598 1130 7420 10345 10045 5499 -273 -6636 -10164
986 -10164 -9917 -5982 310 5983 9860 9687 6234 661 -5617 -9614 -9941 -6534 -806 5214 9113 9975
1002 9975 7169 1419 -4288 -8761 -9728 -6986 -1650 4182 8377 9680 7278 2328 -3850 -8177 -9360
1017 -9360 -7238 -2513 2957 7755 8961 7216 2894 -2736 -7418 -9125 -7512 -3275 2428 6842 8896
1032 8896 7679 3706 -1532 -6456 -8576 -7624 -3635 1568 6060 8372 7541 4032 -987 -5786 -8370
$$ packed form
925a2685J16M407P674P461N207L97l925p457p563n133j124L753O868Q049N064
940A1109J545l795o262p420n614j620K539O368P701N810J621k406o201p282n705
955i612k241J860O060P202N807K358j815n185o968o064k905J553N155O855O029
970H089L003j197m876o705o049k973O99M411O728O290K925l00m546n772o363l528
986a0164K47L935O292N673L877j73l453n573o278l997l27L407N728O020L899Q62
1002I975k806n750n707m473r67K742N336N832M195J303k402m950o178m327j183
1017i360K122M725N470M798J206j745m322n630m682j707J613M237N703M414K054
1032H896j217l973n238m924k120R52L989N203M492K312q31l509n019m799k584
$$ plain form
1047 -8370 -7633 -4176 764 5477 7977 7681 4755 86 -4926 -7780 -7950 -4780 -182 4603 7529 7399
1063 7399 5057 602 -3974 -7348 -7442 -5183 -903 4176 7107 7666 5322 1301 -2959 -6597 -7557 -5721
1079 -5721 -1460 3172 6482 7337 5355 1757 -2547 -6087 -7096 -5940 -1885 2573 6143 7543 5757
1094 5757 2059 -1847 -5399 -6781 -6012 -2573 1531 5256 6863 5515 2519 -1671 -4504 -6388 -5993
1109 -5993 -2942 1027 5035 6674 6114 2946 -1209 -4364 -5881 -5736 -3268 -166 3863 6069 5900 3396
1125 3396 -88 -3568 -5706 -5290 -3442 -227 3230 5570 6025 3932 278 -3434 -5340 -5435 -4038 -1060
1141 -1060 2615 5145 6009 4425 1134 -2375 -4683 -5258 -3871 -1248 1817 4168 5702 4587 1579
1156 1579 -2217 -4881 -5564 -4181 -1493 1316 4015 5079 4939 2484 -1160 -4374 -5549 -4672 -2090 937
$$ packed form
1047h370P37L457M940M713K500k96k926m669n012k854j70L170M598M785K926j30
1063G399k342m455m576l374r4K259M280N079K931N59k344m021m260l638r60J836
1079e721M261M632L310Q55j982l598m304l540j009J156M055M458L570J400j786
1094E757l698l906l552j382P69L439M104L725J607j348k996m190k833j884L95
1109e993L051L969M008J639n60l168m155l155j517J45K468L102M029K206j69k504
1125C396l484l480k138M16J848L215L457K340M55k093l654l712j906r5J397K978
1141a060L675K530Q64j584l291l509k308n75J387K623L065K351J534j115l008
1156A579l796k664o83J383K688K809K699J064j40k455l644l214j175Q77K582L027
$$ plain form
1172 937 3369 4827 4498 2435 -638 -3973 -5171 -4462 -2410 992 3657 4932 4872 2908 -299 -3223
1188 -3223 -5447 -4899 -2753 177 2803 4269 4298 2967 347 -2460 -4662 -4781 -2792 -24 2870 4187
1204 4187 4263 3025 837 -1813 -4163 -4812 -3416 -682 2156 4083 4082 3039 1386 -1443 -3415 -4789
1220 -4789 -3508 -1082 2040 3634 4234 3198 1230 -1063 -3658 -4616 -3774 -1669 1283 3774 4286 3612
1236 3612 1403 -668 -2993 -3989 -3705 -2079 856 3121 4425 3486 1767 -782 -2780 -4346 -3983 -2281
1252 -2281 691 3034 4146 3907 1748 -204 -2397 -3551 -3548 -2294 -33 2799 4163 3657 1723 -892
1268 -892 -2517 -3632 -3670 -2193 -281 2090 3908 3845 2257 322 -2153 -3048 -3584 -2330 -480 1478 3199
1285 3199 3412 1912 -186 -2041 -2965 -3159 -1875 -668 1348 2980 3630 2943 624 -1382 -2945 -2930 -2210
$$ packed form
1172I37K432J458l29k063l073l335j198P09K052L402K665J275o0j964l207k924
1188c223k224N48K146K930K626J466K9j331k620k807k202j19J989K768K894J317
1204D187P6j238k188k650k350o49J396K734K838J927jj043j653k829j972j374
1220d789J281K426L122J594O00j036j968k293k595r58Q42K105K952K491N12o74
1236C612k209k071k325r96K84J626K935K265J304r39j719k549j998j566L63J702
1252b281K972K343J112k39k159j952k193j154LJ254K261K832J364n06j934k615
1268h92j625j115l8J477J912K371J818o3j588j935k475q95n36J254J850J958J721
1285C199K13j500k098j855r24j94J284J207K016J632O50o87k319k006j563J5P20
$$ plain form
1302 -2210 -1148 543 2276 2980 2516 1106 -1164 -2430 -2846 -1894 -701 607 2337 3180 2946 1414
1318 1414 -932 -2620 -3099 -2265 -1358 117 1609 2467 2955 1814 -314 -2031 -2617 -2295 -746 576 1537
1335 1537 2731 2451 1554 -259 -2066 -3349 -3155 -1552 -34 1446 2231 2574 2011 526 -1205 -2354
1351 -2354 -2618 -1402 408 1457 2009 2035 1317 594 -1461 -2578 -2990 -1916 -220 1326 1909 2091 1751
1368 1751 851 -451 -1575 -2391 -1453 -277 867 1680 1659 1206 283 -311 -1450 -2248 -2314 -748 881 2021
1386 2021 2357 1642 856 230 -828 -1719 -2505 -1526 63 1322 1787 1482 807 -85 -1039 -1484 -1572 -1408 -113
1405 -113 1592 2505 2310 1155 -8 -1149 -1582 -2006 -2109 -591 762 1850 2128 1154 395 -627 -1174
1422 -1174 -1551 -1430 -332 780 1980 2388 1607 -57 -1126 -1753 -1889 -1751 -731 318 1605 2255 1784
$$ packed form
1302b210J062J691J733P04m64j410k270j266m16R52J193J308J730Q43k34j532
1318A414k346j688m79Q34R07J475J492Q58M88j141k128j717n86L22J549J322R61
1335A537J194k80q97j813j807j283J94J603J518J480P85L43n63j485j731j149
1351b354k64J216J810J049N52K6p18p23k055j117m12J074J696J546N83J82l40
1368A751r00j302j124q16R38J176J144Q13k1m53r23n94j139p98o6J566J629J140
1386B021L36p15p86o26j058q91p86R79J589J259M65l05o75q92r54m45q8J64J295
1405a13J705R13j95j155j163j141m33m24j03J518J353J088K78r74p59j022n47
1422a174l77J21J098J112J200M08p81j664j069o27j36J38J020J049J287O50m71
$$ plain form
1439 1784 413 -843 -1430 -1430 -1352 -495 159 1433 2214 1613 507 -891 -1781 -1764 -1276 -584 -236 1237 2042
1458 2042 2031 1075 -342 -1513 -1548 -1557 -358 267 753 1593 1551 1070 -174 -1075 -1753 -1516 -668 186 989 1454
1478 1454 1917 1372 31 -1137 -1905 -1574 -827 233 757 1490 1531 1156 77 -1271 -2031 -1864 -1050 123
1496 123 704 1443 1517 1220 743 -699 -1586 -1963 -947 -135 983 1371 1394 946 227 -785 -1794 -2041 -1076
1515 -1076 128 992 1476 1548 994 435 -542 -1306 -1608 -1091 -234 507 1289 895 788 67 -506 -1124 -1562 -1018
1535 -1018 -272 946 1529 1456 791 256 -326 -781 -1218 -1559 -711 280 614 1023 641 624 29 -669 -847 -779
1555 -779 -364 465 1086 1032 895 558 -279 -1067 -959 -1241 -1108 -560 607 993 1052 581 296 -424 -539 -636 -761
1576 -761 32 553 955 1126 550 -173 -588 -1104 -1143 -822 -368 375 1213 1257 665 226 -294 -585 -940 -846 -495
$$ packed form
1439A784j371j256n87%P8Q57O54J274P81o01j106j398q90J7M88O92L48J473Q05
1458B042j1r56j417j171l5rJ199O25M86Q40m2m81j244r01o78K37Q48Q54Q03M65
1478A454M63n45j341j168p68L31P47J060N24P33M1l75j079j348p60J67Q14J173
1496A23N81P39P4k97m77j442q87l77J016Q12J118L88K3m48p19j012j009k47R65
1515a076J204Q64M84P2n54n59r77p64l02N17Q57P41P82l94j07p21n73o18m38N44
1535a018P46J218N83p3o65n35n82m55m37l41Q48R91L34M09l82j7n95o98j78O8
1555g79M15Q29O21n4j37l37q37p88J08k82J33N48J167L86N9m71k85p20j15r7j25
1576g61P93N21M02J71n76p23m15n16l9L21M54P43Q38M4n92m39n20k91l55R4L51
$$ plain form
1597 -495 358 970 1007 564 268 -708 -839 -859 -659 -281 224 643 1054 1166 189 -218 -957 -804 -737 -448 -54
1618 -54 507 885 859 238 -206 -687 -888 -676 -161 120 448 972 967 710 -28 -435 -1063 -817 -238 -229 132 396
1640 396 877 411 142 -271 -885 -696 -307 101 531 710 703 914 361 -600 -986 -1215 -647 -213 38 890 909
1661 909 479 451 -65 -873 -719 -712 30 484 584 820 854 410 -69 -677 -1246 -783 -452 139 894 811 834 334
1683 334 -52 -436 -863 -686 -278 268 809 966 667 137 -252 -694 -868 -941 -364 150 837 818 788 548 -50
1704 -50 -191 -568 -618 -418 147 553 968 730 27 -73 -603 -482 -754 -207 172 572 1100 738 439 147 -530
1725 -530 -551 -532 -568 -20 425 629 916 398 -210 -410 -596 -585 -502 16 187 900 1057 312 279 -470 -548 -699
1747 -699 -669 -143 373 460 591 595 83 -115 -527 -804 -553 -256 122 607 701 429 213 -232 -700 -787 -633 -186
$$ packed form
1597d95Q53O12L7m43k96r76j31k0K00L78N05M19M11J12r77m07p39J53O7K89L94
1618e4N61L78k6o21m44m81k01K12N15K81L28N24nk57p38m07o28K46N79RL61K64
1640C96M81m66k69m13o14J89L89M08M30J79pK11n53r61l86k29N68M34K51Q52J9
1661I09m30k8n16q08J54PP42M54J00K36L4m44m79o08n69M63L31N91P55q3K3n00
1683C34l86l84m27J77M08N46N41J57k99n30l89m42j74p3N77N14O87j9l0k40n98
1704e0j41l77n0K00N65M06M15k38p03j00n30J21k72N47L79M00N28l62k99k92o77
1725e30k1J9l6N48M45K04K87n18o08k00j86J1Q3N18J71P13J57p45l3p49p8j51
1747f99L0N26N16Q7J31Mn12j98m12k77K51K97L78M85R4k72k16m45m68q7J54M47
$$ plain form
1769 -186 72 378 642 562 428 10 -712 -739 -626 -187 217 262 588 599 250 -272 -509 -651 -494 -320 -39
1790 -39 275 518 500 538 -44 -435 -445 -360 -298 55 362 590 544 526 -243 -514 -491 -512 -595 -118 -127 391 697 459
1814 459 -86 -240 -302 -183 -220 -234 328 260 534 398 -172 -116 -439 -471 -199 -73 279 394 268 357 198 -304
1836 -304 -340 -616 -299 -321 215 260 378 416 199 -165 -593 -607 -488 -64 84 385 471 473 35 -42 -166 -435 -440 29
1860 29 -91 614 533 323 267 27 -285 -625 -486 -215 -61 137 607 445 200 185 -290 -525 -421 -253 -8
1881 -8 536 266 509 449 -101 -237 -326 -346 -283 108 226 354 325 264 151 -354 -299 -440 -422 -61 -149 598 524 382
1905 382 210 -195 -403 -342 -302 48 181 347 382 467 113 -193 -374 -328 -456 52 39 97 318 166 167 -241 -312
1928 -312 -90 -264 -167 56 244 417 541 347 -52 -67 -238 -132 -228 97 364 327 364 197 239 -154 -264 -39
$$ packed form
1769a86K58L06K64q0j34m18p22k7J13M39M04M5L26J1l49n22k37j42J57J74K81
1790c9L14K43j8L8n82l91j0Q5O2L53L07K28m6j8p69k71K3k1q3M77rN18L06k38
1814D59n45j54o2J19l7j4N62o8K74j36n70N6l23l2K72J26L52J15j26Q9j59n02
1836c04l6k76L17k2N36M5J18L8k17l64m28j4J19M24J48L01Q6Km38p7j24k69nM69
1860B9j20P05q1k10n6k40l12l40J39K71J54J98M70j62k45j5m75k35J04J68K45
1881hN44k70K43o0n50j36q9k0O3L91J18J28k9o1j13n05N5j41J8L61q8P47p4j42
1905C82j72m05k08O1M0L50J33J66L5Q5l54l06j81M6j28N08j3N8K21j52Jm08p1
1928c12K22j74R7K23J88J73J24j94l99j5j71J06r6L25K67l7L7j67M2l93j10K25
$$ plain form
1950 -39 -50 3 189 243 226 244 -34 -230 -487 -249 -279 -24 -58 258 362 162 248 -298 -130 -98 -220 50 281
1973 281 438 539 217 -75 -304 -132 -200 -17 105 212 417 295 196 -32 -95 -329 -238 -404 -169 265 264 339
1995 339 608 60 -172 -139 -288 -306 -200 173 75 494 167 233 -239 -56 -383 -62 91 -218 171 9 191
2016 191 199 219 -172 -249 -374 -359 98 181 317 374 403 27 -202 -310 -228 -74 -80 195 200 374 153 -264 -191 -640 -398
2041 -398 -266 -210 77 383 370 402 299 59 -138 -269 -61 -311 -112 180 224 125 44 319 -348 -387 -515 -239
2063 -239 313 218 232 254 22 -99 -57 -406 -278 -240 83 270 246 122 -144 -32 -194 -330 -162 154 -80 416
2085 416 536 67 90 77 -339 -140 -488 -270 -90 165 215 446 -142 -121 -24 56 -76 25 -114 307 357 252
2107 252 17 131 -191 -374 -246 -467 -130 70 347 156 107 240 -338 -193 -68 -180 136 94 222 218 227 -4
$$ packed form
1950c9j1N3J86N4j7J8k78j96k57K38l0K55l4L16J04k00Q6n46J68L2j22K70K31
1973B81J57J01l22k92k29J72o8J83J22J07K05j22r9k28o3k34R1j66K35M34jP5
1995C39K69n48k32L3j49j8J06L73r8M19l27O6m72J83l27L21J53l09L89j62J82
2016A91QK0l91p7j25J5M57Q3J36N7K9l76k29j08Q2J54oK75NJ74k21m17P3m49K42
2041c98J32N6K87L06j3L2j03k40j97j31K08k50J99K92M4r9q1K75o67l9j28K76
2063b39N52r5J4K2k32j21M2l49J28L8L23J87k4j24k66J12j62j36J68L16k34M96
2085D16J20m69K3j3m16J99l48K18J80K55N0K31n88K1R7Q0j32J01j39M21N0j05
2107B52k35J14l22j83J28k21L37K00K77j91m9J33n78J45J25j12L16m2J28mRk31
$$ plain form
2129 -4 -156 -251 -178 -225 -110 160 63 355 -20 -281 -191 -166 -149 -333 -221 65 14 235 350 100 185 -277 -249 -116
2153 -116 123 -67 -51 51 185 84 -164 -189 -227 -77 -42 -120 -121 74 260 -30 -213 -268 -286 -308 -54 296 238 290
2177 290 -4 -13 156 -144 -251 -478 -69 263 165 256 24 -126 -44 -144 -72 -40 44 149 142 -46 48 82 124 155 -156
2202 -156 -326 -329 81 -57 175 181 72 -9 -96 -22 -128 -192 -96 136 116 107 501 -43 -172 -55 -383 -237 32 26 136
2227 136 225 311 -32 -223 -196 -275 46 -150 -102 326 144 94 121 155 -37 -282 -187 -140 -38 138 37 -21 25 84
2251 84 -40 -5 -142 -47 -23 205 89 387 33 -94 -296 -363 -284 -22 -95 54 141 -94 -121 55 165 -217 -77
2274 -77 27 -264 -4 30 -52 303 -52 -108 -3 -229 99 -13 29 42 138 105 -292 -60 -153 -303 -177 -144 238
2297 238 119 254 136 157 -117 -195 -57 -105 130 -91 62 303 376 391 -94 -212 -232 -242 118 98 45 46 410 109
$$ packed form
2129dj52r5P3m7J15K70r7K92l75k61R0K5J7j84J12K86n1K21J15k50Q5m62K8J33
2153a16K39j90J6J02J34j01k48k5l8J50L5p8jJ95J86k90j83n5j8k2K54L50n8N2
2177B90k94rJ69l00j07k27M09L32r8R1k32j50Q2j00P2L2Q4J05pj88R4L4M2L1l11
2202a56j70lM10j38K32Oj09q1q7P4j06o4R6K32k0rL94n44j29J17l28J46K69oJ10
2227A36Q9Q6l43j91K7p9L21j96M8M28j82n0K7L4j92k45R5M7J02J76j01n8M6N9
2251H4j24L5j37R5K4K28j16K98l54j27k02o7P9K62p3J49Q7k35k7J76J10l82J40
2274g7J04k91K60L4q2L55l55n6J05k26L28j12M2J3R6l3l97K32r3j50J26L3L82
2297B38j19J35j18K1k74p8J38m8K35k21J53K41P3J5m85j18k0j0L60k0n3JL64l01
$$ plain form
2321 109 -103 -252 -45 -255 48 -68 31 102 97 34 186 114 -133 -43 -25 -108 164 119 272 250 85 91 -190 67
2345 67 100 413 311 272 23 15 -48 304 -83 -210 125 -14 52 302 182 -31 -126 -187 -4 -133 -111 -235 -90
2368 -90 -160 21 128 -263 66 -256 -176 -261 -191 55 245 206 16 231 -50 -160 -86 -95 -235 -264 141 -133 -117 255
2392 255 -160 -75 -351 -199 -215 -219 127 542 -108 171 123 42 -113 -261 -59 129 219 106 -13 -145 21 -184
2414 -184 11 -189 25 37 168 38 -21 270 -230 -50 118 -16 -200 134 28 43 -24 95 207 -48 -2 -132
2436 -132 -111 73 12 -40 -40 -24 -117 -81 142 -249 81 21 -280 32 -70 221 -166 -127 100 -194 -223 109 -10 -218
2460 -218 -189 33 36 -55 -165 -182 -204 -156 -96 -102 307 173 -151 -72 -217 -140 -88 38 -73 -38 -130 -118 100 53 -35 -217
2486 -217 -279 -153 257 -4 17 109 261 106 119 -141 -170 -52 140 -2 3 104 50 -71 33 -135 -260 -71 235
$$ packed form
2321A09k12j49K07k10L03j16R9P1no3J52p2k47R0J8q3K72m5J53k2j65Ok81K57
2345F7L3L13j02l9k49qo3L52l87j27L35j39O6K50j20k13r5o1J83j29K2j24J45
2368i0p0J81J07l91L29l22Q0q5P0K46J90l9j90K15k81j10P4rj40k9M05k74J6L72
2392B55m15Q5k76J52j6mL46M15o50K79m8q1j55j48K02J88R0j13j19j32J66k05
2414a84J95k00K14J2J31j30n9K91n00J80J68j34j84L34j06J5o7J19J12k55M6j30
2436a32K1J84o1n2%J6r3L6K23l91L30o0l01L12j02K91l87L9K27k94k9L32j19k08
2460b18K9K22Lr1j10j7k2M8O0oM09j34l24P9j45P7N2J26j11L5r2J2K18m7q8j82
2486b17o2J26M10k61K1R2J52j55J3k60k9J18J92j42NJ01n4j21J04j68j25J89L06
$$ plain form
2509 235 187 -161 98 256 84 -23 -74 -91 -194 145 -86 169 -30 -153 -148 -132 152 -227 58 154 96 162 401
2532 401 316 -19 -38 -87 -162 -87 -18 24 145 306 292 -7 -32 -236 -255 -72 44 52 64 70 199 -206 135 -10 -26
2557 -26 133 -77 -125 128 -227 226 150 -54 -179 -90 164 -189 21 35 313 -86 140 -146 -174 -79 -123 145 -93
2580 -93 225 -203 258 201 81 163 -76 -86 -195 -23 -79 -24 88 -143 -79 -205 -40 8 -102 198 -1 97 91 55
2604 55 -89 49 66 -79 -72 71 -61 -41 38 218 135 0 -65 -170 0 -88 24 -73 -71 167 136 59 -191 -205 80
2629 80 16 -78 -85 93 321 -112 142 131 119 -215 -98 -44 184 243 -6 -51 14 18 5 -55 239 68 -105 17 39
2654 39 -137 106 -178 -18 -199 -38 161 -239 -258 48 -3 125 63 -78 -2 -65 113 -75 80 -25 34 -3 -103
2677 -103 72 -26 -260 56 174 -24 31 14 4 -105 -53 -112 -40 -15 -82 -153 117 115 -43 -137 76 -92 30 132
$$ packed form
2509B35m8l48K59J58j72j07n1j7j03L39k31K55j99j23NJ6K84l79K85R6n8O6K39
2532D01q5l35j9m9p5P5O9M2J21J61j4k99k5k04j9J83J16QJ2OJ29m05L41j45j6
2557b6J59k10m8K53l55M53p6k04j25Q9K54l53K10J4K78l99K26k86k8R5m4K68k38
2580i3L18m28M61n7j20Q2k39j0j09J72n6N5J12k31O4j26J65M8j10L00j99R8ol6
2604E5j44J38J7j45PJ43j32K0P9J80q3j35o5j05J70q8J12r7KK38l1p7k50j4K85
2629H0o4r4pJ78K28m33K54j1j2l34J17N4K28N9k49m5O5Mj3o0K94j71j73J22K2
2654C9j76K43k84J60j81J61J99m00j9L06n1J28o2j41P6o3J78j88J55j05N9l7j00
2677a03J75r8k34L16J18j98N5j7j0j09N2n9P2K5o7p1K70kj58r4K13j68J22J02
$$ plain form
2701 132 -37 78 19 142 -88 37 -82 129 -198 -21 10 -280 74 46 255 -17 -125 -85 -213 -73 245
2722 245 82 17 168 -29 34 -268 91 210 -43 103 -107 90 262 -42 -41 -42 -222 -148 93 176 84 -144 33
2745 33 114 -229 19 -36 207 -43 -173 262 -105 -69 -258 -195 14 20 -396 -116 93 -62 138 -30 15 80 285
2768 285 10 44 -119 -128 2 -242 -115 25 164 -37 96 -246 107 -43 124 -2 -116 35 208 60 -80
2789 -80 -128 31 49 -24 251 -13 -147 -47 -99 55 147 -54 46 -33 317 -140 -100 98 -124 -46 -69 137 5
2812 5 64 -149 -185 242 -52 141 -17 -18 -9 -268 -51 -107 -305 0 119 -9 89 -240 -98 -106 -53 -142 192 -104 89
2837 89 -144 46 108 -58 -84 115 -10 -119 42 -217 310 -79 161 205 -155 -91 242 178 -15 -32 231 -206
2859 -206 -72 34 -181 35 -120 172 -161 -54 38 64 -5 -126 -281 -197 -29 -72 102 131 -15 -27 -79 -262 31
$$ packed form
2701A32j69J15n9J23k30J25j19K11l27J77L1k90L54k8K09k72j08M0j28J40L18
2722B45j63o5J51j97O3l02L59J19k53J46k10J97J72l04Jjj80P4K41Q3r2k28J77
2745C3Q1l43K48n5K43k50j30M35l67L6j89O3K09Om16K80K09j55K00j68M5O5K05
2768B85k75L4j63rJ30k44J27J40J39k01J33l42L53j50J67j26j14J51J73j48j40
2789h0m8J59J8p3K75k64j34J00n2J54R2k01J00p9L50m57M0J98k22P8k3K06j32
2812EN9k13l6M27k94J93j58jRk59K17n6j98L05J19j28R8l29J42qN3q9L34k96J93
2837H9k33J90O2j66k6J99j25j09J61k59N27l89K40M4l60O4L33o4j93j7K63m37
2859b06J34J06k15K16j55K92l33J07R2K6o9j21j55Q4J68m3J74K9j46j2n2j83K93
$$ plain form
2882 31 -33 195 213 -63 234 321 -62 -60 134 -192 -14 33 36 -43 -161 -20 95 -187 -113 19 -68 65 -86 -102
2906 -102 214 -39 -129 -160 -44 41 64 102 5 24 73 30 -45 144 -95 -24 -61 2 -189 28 452 -95 52 57 192
2931 192 -57 -137 51 295 28 -184 153 224 -103 230 -146 -119 34 123 -200 167 341 -20 -132 -145 -245 -46
2953 -46 -213 -219 20 -154 -74 -113 -174 38 20 -17 -117 110 125 398 52 231 -14 -210 -249 -79 11 -80 114 1
2977 1 45 -74 -257 -181 -160 29 -173 24 238 127 191 -87 -83 -10 -137 135 127 67 -85 160 75 -211 -36 -191
3001 -191 144 -251 101 -136 26 -68 -120 274 -39 171 -175 -3 167 -102 -98 -193 167 -76 49 -83 -28 -148
3023 -148 50 100 95 182 53 -193 -3 -204 -149 -78 14 17 58 85 27 121 -17 241 61 119 78 10 108 -135 52 198
3049 198 84 -115 -27 155 42 -158 295 176 -225 -65 132 -151 -31 -132 -19 34 9 101 12 130 108 -60
$$ packed form
2882C1o4K28J8k76K97Q7l83KJ94l26J78M7Lp9j18J41J15k82P4J32q7J33j51j6
2906a02L16k53r0l1J16Q5K3L8r7J9M9m3p5J89k39P1l7O3j91K17M24n47J47NJ35
2931A92k49q0J88K44k67k12L37P1l27L33l76K7J53Q9l23L67J74l61j12j3j00J99
2953d6j67oK39j74Q0l9o1K12j8l7j00K27J5K73l46J79k45j96l9J70R0r1J94j13
2977AM4j19j83P6K1J89k02J97K14j11O4k78MP3j27K72qo0j52K45q5k86J75j55
3001a91L35l95L52k37J62r4n2L94l13K10l46J72J70k69Mr5L60k43J25j32N5j20
3023a48J98N0nQ7j29k46J90k01N5P1R2LM1K7n8R4j38K58j80N8m1o8R8k43J87J46
3049A98j14j99Q8J82j13k00M53j19m01J60J97k83J20j01J13N3k5R2q9J18k2j68
$$ plain form
3071 -60 4 7 161 -306 -65 166 117 -16 76 129 174 148 -72 150 340 73 102 118 169 -69 -144 29 -132 -286
3095 -286 -130 -173 216 185 154 112 -144 81 -239 -51 -203 14 71 6 -40 103 41 -93 167 -44 -130 3 203
3118 203 -108 214 144 146 -158 -41 146 -230 21 142 -11 -46 -126 -78 58 235 28 118 -123 61 101 -82 -4
3141 -4 -73 69 -270 79 -281 235 -110 102 79 49 119 -151 -193 149 170 -24 86 23 -15 -100 -64 93 -42 -113
3165 -113 239 181 37 70 -159 -2 -384 -68 -315 169 35 -137 -36 0 -78 54 130 76 -84 -276 -118 22
3187 22 -16 -65 254 -54 65 243 46 -178 106 55 89 -56 -166 -156 -3 -252 -230 -137 -220 -56 -35 -37 226 -176
3211 -176 77 145 121 101 -352 -112 48 -108 91 10 -125 -73 163 -48 98 89 -223 -84 -305 51 -22 31 -19
3234 -19 122 -175 -205 -176 -199 -16 -3 144 107 113 -104 -20 29 -208 -94 136 167 -22 16 8 -182 -68 -279 76 -51
$$ packed form
3071f0O4LJ54m67K41K31m9j33R2N3M5k6k20K22J90k67K9J6N1k38p5J73j61j54
3095b86J56m3L89l1l1m2k56K25l20J88j52K17N7o5m6J43o2j34K60k11q6J33K00
3118B03l11L22p0Kl04J17J87l76K51J21j53l5q0M8J36J77k07R0k41J84M0j83P8
3141do9J42l39L49l60N16l45K12k3l0P0k70m2L42K1j94J10o3l8q5L6J57j35p1
3165a13L52n8j44L3k29J57l82L16k47M84j34j72J01L6p8J32P6n4j60j92J58J40
3187B2l8m9L19l08J19J78j97k24K84n1L4j45j10J0J53k49K2R3q3J64K1kK63m02
3211a76K53O8k4k0m53K40J60j56J99q1j35N2K36k11J46rl12J39k21L56p3N3n0
3234a9J41k97l0K9k3J83J3J47l7Ok17Q4M9k37J14K30L1j89L8qj90J14k11L55j27
$$ plain form
3259 -51 137 29 23 25 161 -24 -157 -64 -109 -208 -118 -76 -152 118 105 94 -88 -140 31 5 -41 -149 74 251 -136
3284 -136 70 46 44 -190 58 57 -45 -197 -123 -31 25 -301 0 -136 27 227 0 -132 -39 -126 -225 31 -233 -25
3308 -25 -41 -11 -68 381 82 -40 -128 28 -69 140 2 -52 -72 -160 -266 -133 74 -298 -43 163 -138 -43 51 82
3332 82 132 83 32 -198 152 162 93 -235 -25 -34 -272 -355 -13 59 -237 211 -33 -66 32 139 11 -138 67 -166
3356 -166 -159 60 235 159 44 -111 -38 73 11 -62 -50 -281 139 39 111 -105 29 -116 -116 -30 53 282 -109 102
3380 102 -204 -162 -93 -183 82 -9 -225 -26 0 -161 -137 -68 -90 -46 246 46 1 -148 -122 120 -44 55 49 -68 -167
3405 -167 -131 -95 -10 -53 -214 85 69 -59 -189 -124 89 -66 104 131 -44 -78 -65 -150 10 67 -55 176 -197 228
3429 228 52 38 -36 -134 96 -20 41 139 64 1 159 373 -47 -3 52 139 -24 -53 -129 65 -113 92 -253 -236
$$ packed form
3259e1J88j08oKJ36j85j33R3m5r9R0M2p6K70j3j1j82n2J71k6m6j08K23J77l87
3284a36K06k4kk34K48jj02j52P4R2N6l26L01j36J63K00k27j32R3q7r9K56k64K08
3308b5j6L0n7M49k99j22q8J56r7K09j38n4k0q8j06J33K07l72K55K06l01R5R4L1
3332H2N0m9n1k30L50J0o9l28K10rk38q3L42P2k96M48k44l3R8J07j28j49K05k33
3356a66PK19J75p6j15j55P3J11o2p3J2k31M20j00P2k16J34j45%Q6Q3K29l91K11
3380A02l06M2O9r0K65r1k16J99K6j61K4O9k2M4K92k00m5j49K6K42j64R9oj17r9
3405a67L6L6Q5m3j61K99j6j28j30O5K13j55J70K7j75l4J3q5J60N7j22K31l73M25
3429B28j76j4p4r8K30j16O1R8p5o3J58K14m20M4N5Q7j63k9p6J94j78K05l45J7
$$ plain form
3453 -236 117 124 -91 150 -60 -234 -38 -26 -64 -136 175 29 -125 -4 49 -27 208 -43 -119 -128 16 21 -58 -33 -116
3478 -116 -48 25 246 -10 -81 -9 -45 -31 -209 73 -193 150 -62 78 -29 94 -55 -206 131 209 234 102 -48
3501 -48 -262 -17 55 -197 20 322 81 168 78 -35 -171 -50 -44 243 -30 54 253 118 102 -176 -234 61 -27
3524 -27 -72 152 19 118 -73 74 -230 -76 -100 -133 227 8 -209 -270 204 -71 7 -67 55 21 -8 -98 242 -69
3548 -69 157 71 -250 39 95 -106 130 26 17 14 -248 -97 52 -21 79 305 -5 103 -80 -78 -34 -82 -84 270 -9
3573 -9 -64 -207 -47 35 124 7 386 -118 -7 -20 302 -168 -161 141 -194 22 -237 -128 92 200 44 178 -373
3596 -373 11 107 -159 -178 17 -45 -11 28 -70 -52 153 145 -62 266 338 -47 -27 -184 -39 -60 148 46 48 -178 -135
3621 -135 138 -59 -11 0 109 33 -140 171 178 80 29 17 184 -103 -42 158 40 66 67 -135 114 127 42 -173 90
$$ packed form
3453b36L53Pk15K41k10j74J96J2l8p2L11j46j54J21N3p6K35k51p6rJ44Np9K5q3
3478a16O8P3K21k56p1P2l6J4j78K82k66L43k12J40j07J23j49j51L37P8K5j32j50
3501d8k14K45P2k52K17L02k41Q7r0j13j36J21OK87k73Q4J99j35j6k78n8K95q8
3524b7m5K24j33R9j91J47l04J54k4l3L60k19k17o1M74k75P8p4J22l4k9r0L40l11
3548f9K26q6l21K89N6k01K36j04rlk62J51J49p3J00K26l10J08j83KM4m8kL54k79
3573in5j43J60Q2Q9j17L79n04J11j3L22m70PL02l35K16k59J09K20J08j56J34n51
3596c73L84R6k66j9J95o2L4L9r8J8K05qk07L28P2l85K0j57J45k1K08j02Kk26M3
3621a35K73j97M8J1J09p6j73L11Pr8n1j2J67k87O1K00j18K6Jk02K49J3q5k15K63
$$ plain form
3646 90 -228 116 62 -10 -9 -180 155 151 70 10 103 -81 -10 16 -99 -48 56 -38 81 195 -27 183 96 -19 118
3671 118 -45 -67 62 -81 -409 123 -156 -78 38 126 8 -53 -42 -151 433 44 186 10 21 -114 -53 -8 -117
3694 -117 -104 40 27 -273 -58 96 -171 91 -128 -65 -136 -90 24 153 -14 -238 -2 -74 45 -24 194 -2
3716 -2 -69 10 -37 242 -97 147 189 119 -253 -140 -83 7 153 2 -1 164 -106 37 -2 -68 118 203 -122 -30 62
3741 62 -170 203 -82 135 106 -267 -102 -52 103 193 115 -81 -59 215 40 164 -202 -81 139 -47 -45 327 148
3764 148 114 -199 142 191 -4 75 -44 -65 17 -91 108 21 -344 -144 -31 87 -103 -181 107 25 19 -98 -22 171
3788 171 49 188 35 38 -258 -82 44 52 360 -152 -96 54 -18 107 -96 217 28 -7 69 42 94 98 -38 287
3812 287 124 108 52 -162 -246 -9 14 241 131 -183 130 -109 -26 73 17 -50 -41 -242 -143 37 18 -185 -86 66
$$ packed form
3646I0l18L44n4p2Jj71L35mq1o0R3j84P1K6j15N1J04r4J19J14k22K10q7j15J37
3671A18j63k2J29j43l28N32k79P8J16Q8j18o1J1j09N84l89J42j76J1j35O1M5j09
3694a17J3J44j3l00K15J54k67K62k19O3p1M6J14J29j67k24K36p2J19o9K18j96
3716bo7P9m7K79l39K44M2p0l72J13N7R0J46j51lJ65k70J43l9o6J86Q5l25R2R2
3741F2k32L73k85K17k9l73J65N0J55R0p8j96K2K74j75J24l66J21K20j86KL72j79
3764A48l4l13L41M9j95P9j19k1Q2j08J99q7l65K00J13J18j90p8K88q2oj17P6J93
3788A71j22J39j53Lk96J76J26QL08n12N6J50p2J25k03L13j89l5P6k7N2Mj36L25
3812B87j63j6n6k14q4K37K3K27j10l14L13k39Q3R9n6o7Rk01R9J80j9k03R9J52
$$ plain form
3836 66 25 -108 -274 2 -41 -29 -173 99 110 -187 15 127 -42 11 -301 35 -187 98 367 -154 -106 47
3858 47 21 365 -120 104 60 5 185 -16 64 -370 189 622 -565 379 439 142 -186 -429 101 -92 -8 366
3880 366 -257 -580 -191 364 -55 -482 -86 133 399 -474 -133 77 102 123 -13 14 164 147 -43 -2 -59 -194
3902 -194 -311 -6 164 -172 140 -171 9 -4 44 -64 -215 180 27 -177 4 46 28 110 -21 -244 127 -157
3924 -157 252 1 29 51 -129 139 125 -221 -197 344 200 -274 189 24 138 -114 114 -116 -7 138 158 -80
3946 -80 289 98 -123 20 86 174 -217 67 99 86 -84 -34 233 158 -59 -68 149 42 -2 259 -187 -131 -23 -177
3970 -177 -219 212 73 -20 102 -154 -155 66 106 89 45 34 -15 -170 64 -182 29 -109 92 39 118 92 161 160 -1
3995 -1 -112 -245 223 -239 -69 61 -92 123 180 -15 38 -151 -126 66 -11 98 -157 113 -42 -49 -217 37 4
$$ packed form
3836F6m1j33j66K76m3J2j44K72J1k97K02J12j69N3l12L36k22K85K69n21M8J53
3858D7k6L44m85K24m4n5J80k01Q0m34N59M33j187R44O0k97l28k43N30j93Q4L74
3880C66o23l23L89N55m19m27L96K19K66q73L41K10K5K1j36K7J50j7j90M1n7j35
3902a94j17L05J70l36L12l11J80j3M8j08j51L95j53k04J81M2j8Q2j31k23L71k84
3924a57M09k51K8K2j80K68j4l46K4N41j44m74M63j65J14k52K28k30J09J45K0k38
3946h0L69j91k21J43O6Q8l91K84L2j3j70N0K67p5k17rK17j07m4K61m46N6J08j54
3970a77m2M31j39r3J22k56jK21M0j7m4j1m9j55K34k46K11j38K01n3P9k6O9jj61
3995aj11j33M68m62J70J30j53K15N7j95N3j89K5J92p7J09k55K70j55pj68K54l3
$$ plain form
4018 4 111 78 4 82 46 -31 -26 -134 -175 -17 -3 -2 43 158 110 -43 40 19 -1 38 -40 102 144 0 -136 -55 -166
4045 -166 166 12 -162 -206 -1 -197 52 104 -122 -113 -35 14 140 147 38 -49 -23 190 96 -15 120 71 -254 -58
4069 -58 47 -11 49 -80 166 99 152 -135 -24 130 -21 55 64 -99 100 -195 180 -245 14 -125 54 -129 20
4092 20 -27 -188 -69 -230 -284 -110 203 88 0 -25 56 45 52 11 26 194 88 100 49 96 335 -31 -226 120 -46
4117 -46 323 159 -38 76 -128 -7 -155 -126 -211 23 7 -95 -440 308 -199 74 100 -374 -479 732 -469
4138 -469 266 188 -24 -468 -373 64 60 -287 424 315 398 -254 -380 -130 65 288 -49 5 183 232 258 308 168
4161 168 657 -1185 401 441 -203 -716 160 497 -467 228 -579 300 -734 -133 815 -75 -312 -458 -346
4180 -346 -98 165 -123 -139 -36 179 -290 210 223 30 207 243 -105 44 -229 -254 48 150 -411 280 8
$$ packed form
4018DJ07l3p4P8l6p7Nj08m1J58J4JM5J15m8j53Q3k1k0L9p8J42M2j44j36Q1j11
4045a66L32j54j74m4K05j96K49N2k26RP8M9J26Pj09q7K6K13r4j11J35m9l25J96
4069e8J05n8O0j29K46o7N3k87J11J54j51P6Rj63J99k95L75m25K59j39J79j83J49
4092B0m7j61J19j61n4J74L13j15q8k5Q1j1Pm1J5J68j06J2n1M7K39l66j95L46j66
4117d6L69j64j97J14k04J21j48K9q5K34j6j02l45P48n07K73K6m74j05J211j201
4138d69P35p8k12m44R5M37ml47P11j09Q3o52j26K50J95K23l37N4J78M9K6N0j40
4161A68M89j842J586M0o44n13Q76L37r64O95q07Q79j034O01R48q90k37j46J12
4180c46K48K63k88j6J03K15m69N00J3j93J77L6l48J49k73k5L02J02n61O91k72
$$ plain form
4201 8 -246 -498 -86 75 393 -400 358 -111 39 315 126 -359 542 457 -291 783 -354 -11 -257 -182 328
4222 328 -245 112 186 -172 -3 183 250 39 -118 -154 166 -237 -106 -208 -229 -92 42 -242 137 -141 2
4243 2 -69 332 394 50 -587 328 89 -118 468 413 7 196 438 365 291 187 -225 -155 65 -210 208 -40 188
4266 188 140 161 64 310 -9 158 482 289 -194 -138 -37 165 125 463 -128 -205 -184 -293 324 513 395 145
4288 145 -370 32 -289 224 77 101 57 -329 -282 -6 -328 455 214 120 -173 200 -13 -790 -44 105 254
4309 254 607 -589 211 -275 107 -99 -86 34 -1111 478 -158 -508 -435 -879 -247 -91 -282 349 141 313
4329 313 172 -1038 508 713 336 67 -393 -312 -442 209 18 646 -425 -167 414 -254 -386 -660 539
4348 539 -30 359 407 -49 497 -487 413 -580 -22 -261 -433 -54 94 191 743 262 -536 67 -69 -273 100
$$ packed form
4201Hk54k52M12J61L18p93P58m69J50K76j89m85R01q5p48J074j137L43k46P5N10
4222C28n73L57P4l58J69J86O7k11j57l6L20m03J31j02k1J37J34k84L79k78J43
4243Bp1M01O2l44o37R15k39k07N86n5m06J89K42p3p4j04m12P0K20k75M18k48K28
4266A88m8K1r7K46l19J67L24j93m83N6J01K02m0L38n91p7K1j09O17J89j18k50
4288A45n15M02l21N13j47K4m4l86M7K76l22P83k41r4k93L73k13p77P46J49J49
4309B54L53j196Q00m86L82k06J3J20j145J589o36l50P3m44O32J56j91O31k08J72
4329C13j41j210J546K05l77k69m60Q1j30O51j91O28j071K58N81o68j32k74J199
4348E39n69L89M8m56N46r84R00r93N58k39j72L79J48R7N52m81p98O03j36k04L73
$$ plain form
4369 100 -40 -9 273 -188 -21 -136 -113 24 -101 31 -189 -224 -83 -265 -431 233 -154 164 -172 -423 301
4390 301 -15 88 -401 -445 432 134 -517 148 -424 120 156 153 447 -114 569 81 22 253 -43 513 8 -60
4412 -60 73 -287 -115 270 69 244 -118 199 169 -112 70 -150 175 47 -70 -130 0 6 132 91 64 146 113
4435 113 -102 130 98 -191 15 31 66 125 45 211 215 -2 -6 -40 111 30 -61 160 49 113 40 253 140 188 -71
4460 -71 -134 87 75 47 -132 -279 133 -170 83 108 238 66 -24 -19 242 155 -87 206 6 364 277 130 194 107
4484 107 5 90 26 230 34 40 -45 -62 -151 105 278 -5 -11 -55 46 -102 71 -175 -93 321 243 -21 138 54
4508 54 168 81 7 6 -77 225 88 -303 -104 -129 -168 54 -91 -155 22 103 2 193 71 118 -148 45 -91 0
4532 0 189 75 -219 14 53 -109 -47 67 44 -2 -67 141 44 71 59 -109 133 48 155 -250 216 14 105 94
$$ packed form
4369A00j40L1K82m61J67j15K3J37j25J32k20l5J41j82j66O64l87L18l36k51P24
4390C01l16J03m89m4Q77k98o51O65n72N44L6lK94n61O83m88n9K31k96N56n05o8
4412f0J33l60J72L85k01J75l62L17l0k81J82k20L25j28j17o0J30OJ26m1k7Q2l3
4435A13k15K32l2k89K06J6L5N9q0J66Mk17ml4J51q1r1K21j11O4p3K13j13M8k59
4460g1o3K21j2k8j79j47M12l03K53K5J30j72r0NK61q7k42K93k00L58q7j47O4q7
4484A07j02Q5o4K04j96Oq5j7q9K56J73k83om4J01j48J73k46Q2M14p8k64J59q4
4508E4J14q7p4jq3L02j37l91J99k5l9K22j45o4J77Q1j01J91j22M7k66J93j36R1
4532@J89j14k94K33L9j62O2J14k3m6o5K08r7K7j2j68K42q5J07m05M66k02R1j1
$$ plain form
4556 94 -467 24 -39 -137 203 -152 -198 -10 -64 163 9 132 48 -209 -25 -101 130 -82 -30 61 -154 115 147
4579 147 120 220 93 -208 72 12 110 -99 -7 -66 229 25 81 -201 -45 189 103 -144 -156 62 280 8 66
4602 66 -172 321 499 69 -501 200 196 -356 -148 -315 81 57 104 115 149 32 -24 140 -5 -182 111 47 81
4625 81 35 106 -15 -94 96 -26 143 144 -130 -12 -11 -10 -66 -2 167 173 -53 265 463 -36 -127 24 -52 102 -574
4650 -574 37 870 -363 59 -210 155 166 -533 477 -170 26 -224 33 -14 81 -94 -61 240 138 -83 184
4671 184 31 30 96 180 -70 313 -866 -217 -136 -620 257 -100 142 -66 -586 -377 -5 314 380 259 -2 403
4693 403 511 -565 146 -62 279 -430 -1034 253 -145 -23 627 96 -269 -99 -180 852 498 -180 891
4712 891 -210 -104 1 355 75 -80 57 -455 -409 -138 456 -436 331 79 263 -24 253 -287 480 -76
$$ packed form
4556I4n61M91o3r8L40l55m6J88n4K27j54J23q4k57J84p6K31k12N2R1k15K69L2
4579A47k7J00j27l01K80o0R8k09R2n9K95k04N6k82J56K34q6k47j2K18K18k72N8
4602F6k38M93J78m30n70P01mn52K08j67L96k4M7J1L4j17n6J64j45j77K93o4L4
4625H1m6P1j21p9J90j22J69Jk74J18JJn6O4J69Ok26L18J98m99r1J51p6J54o76
4650e74O11Q33j233M22k69L65J1o99J010o47J96k50K57m7R5j75L3L01j02k21K67
4671A84j53jO6Q4k50L83j179O49Q1m84Q77l57K42k08n20K09L72L19O6j21k61M05
4693D03J08j076P11k08L41p09o04J287l98J22O50n31l65J70q1J032l54o78J071
4712H91j101J06J05L54k80j55J37n12M6K71N94q92P67k52J84k87K77n40P67n56
$$ plain form
4732 -76 74 241 604 -189 771 -67 -972 -291 -276 -267 210 -569 383 406 92 -178 268 203 91 700 -2 335
4754 335 699 -526 62 -91 87 -56 -82 -83 267 251 -5 -690 -502 208 83 178 544 -216 -251 -42 399 -157
4776 -157 14 415 -33 26 -40 550 -86 -26 -41 351 431 -105 256 107 256 462 -289 179 -203 294 239 17
4798 17 -208 6 -189 -305 253 -32 90 384 70 51 463 12 445 890 -31 504 664 -757 69 183
4818 183 14 165 154 399 368 88 99 -450 78 251 -201 801 344 242 -84 301 -209 78 12 263 -102
4839 -102 296 -270 -204 -274 103 444 -467 870 -191 602 -105 130 656 -476 -25 -378 -76 802 -23 277
4859 277 307 -81 1048 369 21 -289 148 -499 -62 -501 124 205 185 -158 -106 97 -86 113 -254 51 40
4880 40 -264 89 57 52 -170 26 -224 138 176 -31 -171 -232 -186 119 -161 36 246 43 293 -130 96 51 206
$$ packed form
4732g6J50J67L63p93R60q38r05O81J5RM77p79R52K3l14k70M46o5j12O09p02L37
4754C35L64j225N88j53J78j43k6jL50j6k56o85J88P10j25R5L66p60l5K09M41n56
4776a57J71M01m48N9o6N90o36O0j5L92Q0n36L61j49J49K06p51M68l82M97n5k22
4798A7k25K14j95j16N58k85J22K94l14j9M12m51M33M45r21N35J60j421Q26J14
4818A83j69J51j1K45l1k80J1n49N28J73m52J002m57j02l26L85n10K87o6K51l65
4839a02L98n66O6p0L77L41r11J337j061P93p07K35N26j132M51l53L02Q78q25L00
4859B77L0l88J129o79l48l10M37o47M37m39O25Q1k0l43N2K03j83J99l67L05j1
4880D0l04L53l2nk22J96k50L62L8k07j40o1M6L05k80J97K10k03K50m23K26m5J55
$$ plain form
4903 206 19 269 -148 -45 10 -28 390 -197 102 309 55 -85 330 114 -330 241 45 154 -6 460 -15
4924 -15 -454 89 -52 21 94 124 -231 237 -561 -168 384 -208 127 194 -419 88 24 -149 -96 157 31 14 -173
4947 -173 -173 -154 -239 -59 45 -24 11 170 274 -152 128 -121 -50 142 193 -105 18 -122 85 25 -103 169 -21
4970 -21 -6 179 216 33 13 -60 322 81 -48 -97 167 -25 -33 6 -50 -73 92 91 -146 24 -144 -116 -205 -154 91
4995 91 79 198 34 323 146 73 111 -7 42 -185 -98 -143 51 6 73 -195 121 78 -78 -252 -180 219 180 -45
5019 -45 31 294 51 126 -113 96 122 -39 -96 -49 -66 113 12 -37 -23 122 42 270 -193 35 -153 -234 490 39
5043 39 -190 -8 275 -320 -182 20 140 -79 158 -298 129 195 -577 214 76 -40 202 206 -567 166 -39
5064 -39 50 547 -234 345 -31 707 -3 381 152 300 149 36 -224 132 -212 26 5 264 454 319 -144
$$ packed form
4903B06j87K50m17J03N5l8M18n87K99K07k54j40M15k16m44N71j96J09j60M66m75
4924a5m39N43j41P3P3L0l55M68p98L93N52n92L35O7o13N07o4j73N3K53j26j7j87
4947a73%J9q5J80J04o9L5J59J04m26K80k49P1J92N1k98J23j40K07o0j28K72j90
4970b1J5J85L7j83k0p3L82k41j29m9K64j92qL9n6k3J65jk37J70j68K8q9N1K45
4995I1j2J19j64K89j77p3L8j18M9k27Q7m5J94m5O7k68L16m3j56j74P2L99l9k25
5019d5P6K63k43P5k39K09K6j61n7M7j7J79j01m9J4J45q0K28m63K28j88q1P24m51
5043C9k29J82K83n95J38K02J20k19K37m56M27O6p72P91j38j16K42Mp73P33k05
5064c9Q9M97p81N79l76P38p10L84k29J48j51j13k60L56l44K38k1K59J90j35m63
$$ plain form
5085 -144 666 238 -362 209 -181 -880 429 345 -37 -231 328 248 768 355 212 8 410 202 483 374
5105 374 205 -120 561 82 188 127 -334 125 14 493 30 8 269 -145 -43 -175 -157 309 162 567 -41
5126 -41 86 212 -520 -137 204 -110 217 -30 -107 -571 -236 207 88 -184 103 -464 572 -471 497 -251
5146 -251 -279 -249 193 356 -614 -4 124 403 339 148 463 -562 -646 163 649 414 -572 559 -67 -107 222
5167 222 -102 134 -65 66 156 -100 -26 202 -25 49 -334 -43 76 -166 25 -126 5 -211 -90 -43 -22 -112
5189 -112 -208 118 89 -51 -29 175 -156 232 191 106 27 62 145 159 -46 -29 348 68 68 -325 -61 -153 41 -131
5213 -131 77 34 22 58 -3 -154 -103 -80 -110 96 -256 -1 4 331 -307 16 -61 -28 -28 -30 -259 114 94 -173 -29
5238 -29 -34 75 -47 202 293 170 41 19 -390 -38 -46 -227 -3 304 -26 200 225 -39 -107 -159 71 145 286 169
$$ packed form
5085a44Q10m28o00N71l90o99J309q4l82j94N59q0N20m13j43k04M02k08K81j09
5105C74j69l25O81m79J06o1m61M59j11M79m63k2K61m14J02j32J8M66j47M05o08
5126d1J27J26p32L83L41l14L27k47p7m64L35M43j19k72K87n67J036j043R68p48
5146b51k8L0M42J63r70O10J28K79o4j91L15j025q4Q09M86k35r86J131o26m0L29
5167B22l24K36j99J31R0k56P4K28k27P4l83K91J19k42J91j51J31k16J21M7K1r0
5189a12r6L26k9j40K2K04l31L88m1q5p9L5Q3J4k05J7L77k80%l93K64r2J94j72
5213a31K08m3j2L6o1j51N1K3l0K06l52K55NL27o38L23p7L3%kk29L73k0k67J44
5238b9nJ09j22K49R1j23j29k2m09L52qj81K24L07l30K26K5k64o8n2K30P4J41j17
$$ plain form
5262 169 -160 116 143 72 -92 -16 -70 -62 171 -517 -333 150 -6 77 -118 -149 254 143 -196 152 -156 -89 -70
5285 -70 28 10 176 33 161 -87 -150 -69 -13 29 -72 -125 -83 122 30 188 161 -197 28 142 -142 68 -227 -14
5309 -14 -179 49 82 168 50 65 -122 240 -112 134 -105 -234 35 -54 -136 16 -70 108 178 11 -64 -24 116
5332 116 -55 17 -112 7 108 136 -9 59 64 8 -169 29 63 -58 215 66 56 -54 36 -153 -51 -9 263
5355 263 297 66 -117 52 118 20 48 45 231 223 3 92 89 34 -24 -30 -258 101 78 -63 103 -121 -95 -182 -57 -146
5381 -146 -63 33 -52 -22 70 -245 -108 153 -115 273 20 -111 134 -105 -53 -172 162 37 87 247 90 -183
5403 -183 55 -26 47 -118 91 54 19 101 -226 221 172 139 -251 1 12 90 -27 184 239 58 150 -147 82 -74
5427 -74 66 261 -123 20 50 -72 160 -149 -28 173 61 -127 -97 59 -244 -380 -133 32 137 -31 341
$$ packed form
5262A69l29K76K7p1j64P6n4QK33o88J84M83j56Q3j95l1M03j11l39L48l08O7J9
5285g0R8j8J66j43J28k48o3Q1N6M2j01n3M2K05r2J58k7l58K25J14k84K10k95K13
5309a4j65K28L3Q6j18J5j87L62l52K46k39j29K69q9q2J52q6J78P0j67p5M0J40
5332A16j71P2j29J19J01K8j45O8Nn6j77J98L4j21K73j49j0j10R0j89J02M2K72
5355B63L4k31j83J69O6r8K8lJ86qk20Q9ln5n8ok28L59k3j41J66k24K6q7J25q9
5381a46Q3R6q5L0R2l15J37K61k68L88k53j31K45k39N2j19L34j25N0J60j57k73
5403a83K38q1P3j65K09l7l5Q2l27M47m9l3l90K52J1P8j17K11N5j81R2k97K29j56
5427g4J40J95l84J43L0j22K32l09J21K01j12j88L0J56l03j36K47J65J05j68L72
$$ plain form
5448 341 2 -123 -126 26 168 -96 -114 -140 -192 -151 319 183 31 66 71 -258 69 -31 103 286 193 -251 74
5471 74 112 30 94 -24 78 -175 96 26 -25 60 70 133 -13 -296 -63 -22 -127 -80 78 -39 -145 140 36 -67
5495 -67 152 81 -82 -34 -21 135 -21 -39 20 34 -371 76 86 -273 220 -4 30 138 72 -285 40 -71 -86 -98
5519 -98 -209 -126 -184 31 105 -3 22 51 -20 -119 13 297 146 -45 -81 -28 -30 223 -309 -155 145 -160 151 63
5543 63 201 114 127 38 -86 86 20 -50 -157 -25 -171 -181 -273 -206 -39 -131 264 -6 202 39 124 -235 27 9
5567 9 -162 -90 -91 -84 61 54 96 65 32 16 112 52 -209 10 49 22 88 -13 159 44 -26 -160 79 -2 -53 -91 -70 -288
5595 -288 -161 -45 234 15 228 -126 44 194 46 -53 -65 91 52 -6 -91 -183 -69 53 -103 127 88 -145
5617 -145 113 85 157 73 123 140 -300 -103 16 -221 -104 -127 311 -11 -301 75 73 -70 -183 -237 -29 188 40
$$ packed form
5448C41l39j25lJ52J42k64j8k6n2M1M70j36j52L5Nl29L27j00J34J83r3m44L25
5471G4L8q2O4j18J02k53K71p0n1Q5J0O3j46k83K33M1j05M7J58j17j06K85j04j03
5495f7K19p1j63M8J3J56j56j8N9J4m05M47J0l59M93k24L4J08o6l57L25j11j5j2
5519i8j11Q3n8K15P4j08K5K9p1r9J32K84j51j91l6N3kK53n32J54L00l05L11q8
5543F3J38q7J3q9j24J72o6p0j07J32j46j0r2O7J67r2L95k70K08j63Q5l59K62j8
5567Ij71P2jPJ45pM2l1l3j6R6o0k61K19L9k7O6j01J72j15p0j34K39q1n1l8K1k18
5595b88J27J16K79k19K13l54J70J50j48r9j2J56l9n8q5r2J14J22j56K30l9k33
5617a45K58k8P2q4N0J7m40J97J19k37J17k3M38l22k90L76kj43j13n4K08K17j48
$$ plain form
5640 40 94 -38 56 47 -179 157 93 92 91 -67 -127 9 -90 -5 199 96 153 -57 -102 -99 -162 -197 60 305 228 -179 -90
5667 -90 15 62 144 35 7 -68 175 102 322 32 239 6 108 -182 -7 69 209 29 -79 -60 11 96 -58
5690 -58 -15 17 -62 382 51 -94 122 45 -7 6 10 -251 186 148 -60 -11 372 -58 -234 5 41 64 -44 -151
5714 -151 46 21 233 -67 -150 -95 -151 -52 93 16 -179 -121 54 -312 -60 94 -30 50 -108 75 -122 49 -26
5737 -26 11 -89 -43 91 125 -41 -64 93 50 -137 199 43 10 115 -260 30 37 -19 -37 -121 132 -10 -8 -10 22 160
5763 160 21 -94 77 21 -10 -184 25 146 -11 101 -104 69 100 131 50 41 129 -92 -139 137 -131 -50 -258
5786 -258 -178 -105 -58 -77 61 -76 -197 249 59 -111 164 -266 -160 26 94 15 118 -216 -73 31 82 116 49
5809 49 147 77 -96 147 69 109 -34 53 -29 29 -38 122 -15 -94 -47 -52 193 -203 -195 202 198 14 -225 9 228 6
$$ packed form
5640D0N4j32R4rk26L36o4jjj58o0J36r9Q5K04j03N7k10m5Lo3l5K57K45p7m07Q9
5667i0J05M7Q2j09k8p5K43p3K20k90K07k33J02k90J75P6J40j80j08J9P1Q5j54
5690e8M3L2p9M44l31j45K16p7n2J3Mk61M37l8k08M9L83m30j76K39L6K3j08j07
5714a51J97k5K12l00q3N5n6R9J45p7j95N8J75l66K52J54j24Q0j58J83j97J71p5
5737b6L7j00M6J34L4j66k3J57m3j87L36j56l3J05l75K90Pn6j8q4K53j42KkL2J38
5763A60j39j15J71n6l1j74K09J21j57J12k05J73L1L1q1rQ8k21m7K76k68Q1k08
5786b58Q0P3M7j9J38j37j21M46j90j70K75m30J06J86O8p9J03l34J43J04N1L4o7
5809D9R8p0j73K43p8M0j43Q7q2N8o7J60j37p9M7nK45l96QL97mj84k39K34K19k22
$$ plain form
5835 6 121 98 228 1 82 -1 -152 212 58 -81 102 101 -264 112 225 198 -247 206 168 -222 -162 -345 -81
5858 -81 45 94 90 167 -72 92 41 -125 83 -27 64 -193 433 290 -215 -124 123 -83 191 -76 -141 167 166 -116
5882 -116 56 18 -33 -80 -221 -77 80 68 185 -225 -8 115 38 68 319 -55 -264 -153 -57 -65 -190 -47 -37
5905 -37 -238 -5 -128 -133 -285 182 225 -192 282 -42 -28 300 -246 10 14 -177 -126 114 -77 -9 28 155 -4
5928 -4 -30 65 -22 141 -25 -186 -28 62 -87 -5 -101 58 94 -75 81 367 -117 -45 -111 70 -228 -6 -42 -184
5952 -184 22 -102 35 51 -61 17 113 -101 131 32 -1 141 -99 23 122 61 33 131 -158 -180 -112 22 55 23
5976 23 151 -114 -54 -227 -101 -145 -309 34 -27 -69 56 166 152 -68 -193 51 -94 -148 -3 10 -95 -59 83
5999 83 -121 131 42 192 31 -42 -112 -190 49 122 -17 -147 106 24 -135 72 -195 -197 -102 34 -104 93 55 -89
$$ packed form
5835FJ15k3J30k27Q1q3j51L64j54j39J83jl65L76J13k7m45M53l8l90O0j83K64
5858h1J26M9mP7k39J64n1j66K08j10R1k57O26j43n05R1K47k06K74k67o5L08jk82
5882a16J72l8n1m7j41J44J57j2J17m10K17J23p7L0K51l74k09J11R6qj25J43J0
5905c7k01K33j23nj52M67M3m17M74l24J4L28n46K56Mj91N1K40j91O8L7J27j59
5928dk6R5q7J63j66j61J58R0j49Q2r6J59L6j69J56K86m84P2o6J81k98K22l6j42
5952a84K06j24J37J6j12P8R6k14K32r9l3J42k40J22R9o1k8R8k89k2O8J34L3l2
5976B3J28k65O0j73J26m4j64L43o1m2J25J10j4k20j25K44j45n4J45J3j05L6J42
5999H3k04K52q9J50j61p3p0p8K39P3j39j30K53q2j59K07k67kR5J36j38J97l8j44
$$ plain form
6023 -89 66 97 65 -73 -58 -50 -138 -223 166 82 -91 55 -114 143 -35 91 264 163 140 -170 -312 124 -31
6046 -31 -155 107 -100 5 -89 71 -22 -203 152 150 -13 -198 90 -88 -245 -318 -179 56 133 -143 77 -119
6068 -119 -130 -78 33 -12 -330 72 106 -40 -89 269 140 -21 -129 165 41 32 253 -124 84 -366 -35 87
6090 87 -81 86 -167 144 58 -272 16 82 102 61 353 -204 63 -102 -150 228 -136 322 -168 104 44 -129
6112 -129 40 359 -53 -43 2 104 51 -133 -233 -25 -206 14 201 -210 43 163 -44 -48 30 -10 -67 1 -67
6135 -67 -207 96 182 -157 21 -252 143 6 151 33 26 -34 247 -149 -14 53 -30 -49 -111 -3 177 120 -26
6158 -26 -55 -123 8 201 21 -203 -53 70 51 156 -115 7 -53 -84 223 -19 196 -149 -68 -13 12 -114 -85
6181 -85 64 157 -25 -78 -198 67 33 178 113 13 -70 -197 -68 176 -120 -145 -176 -94 108 44 233 20 138
$$ packed form
6023h9J55L1l2j38J5Qq8q5L89q4j73J46j69K57j78J26J73j01k3l10j42M36j55
6046c1j24K62k07J05r4J60r3j81L55kj63j85K88j78j57p3J39K35P7k76K20j96
6068a19j1N2J11m5l18M02L4j46m9L58j29j61j08K94j24rK21l77K08m50L31J22
6090H7j68J67k53L11q6l30K88O6K0m1K92n57K67j65m8L78l64M58m90K72o0j73
6112a29J69L19m12J0M5J02n3j84j00K08j81K20J87m11K53J20k07mP8m0n7O8o8
6135f7j40L03Q6l39J78k73L95j37J45j18po0K81l96J35O7q3j9o2J08J80n7j46
6158b6k9o8J31J93j80k24J50J23j9J05k71J22o0l1L07k42K15l45Q1N5K5j26K9
6181h5J49R3j82n3j20K65l4J45o5j00q3j27J29K44k96k5l1Q2K02o4J89k13J18
$$ plain form
6204 138 92 157 50 -72 14 23 -155 -44 50 4 170 -220 173 93 -13 -71 183 2 129 -21 -138 -203 -59
6227 -59 -24 -67 38 103 -153 319 -133 0 96 -259 -39 -135 -199 -254 154 -15 59 -128 2 -3 228 48 -83 -59
6251 -59 24 111 121 -26 160 22 3 -100 195 -84 -118 83 -22 33 -245 73 -160 131 87 23 73 -59 -131 -118
6275 -118 134 -333 183 0 63 -122 11 13 136 4 130 -153 32 -1 21 27 -90 -326 -3 194 99 -142 42
6298 42 15 116 185 228 -185 -28 37 -19 -25 -61 179 112 -155 -32 -248 65 -27 -220 -14 104 -8 -41 230 -129
6322 -129 -365 50 187 -75 -34 -7 -27 -64 -83 10 16 20 127 40 -141 -21 249 -42 17 69 -16 19 -138 -120 63
6347 63 43 83 -230 179 120 133 -96 -159 -315 8 -3 -118 -61 -132 -75 104 -151 -137 -47 -7 -30 29 130 -36 295
6372 295 79 138 -23 -127 185 -197 -114 -163 -69 229 -125 -39 -69 -55 145 -219 22 -10 -91 -117 -43 153 -67 -174
$$ packed form
6204A38m6O5j07j22Q6Rj78J11R4m6J66l90L93q0j06n8K54j81J27j50j17o5J44
6227e9L5m3J05O5k56M72m52J33R6l55K20r6o4n5M08j69P4j87J30nK31j80j31K4
6251e9Q3Q7J0j47J86j38j9j03K95k79l4K01j05N5k78L18k33K91m4o4N0j32p2J3
6275a18K52m67N16j83O3j85J33KJ23j32J26k83J85l3K2Oj17k36L23J97r5k41J84
6298D2k7J01O9M3m13J57O5n6ol6K40o7k67J23k16L13r2j93K06J18j12l3K71l59
6322a29k36M15J37k62M1K7k0l7j9R3OMJ07q7j81J20K70k91N9N2q5L5j57J8J83
6347F3k0M0l13M09n9J3k29o3j56L23j1j15N7p1N7J79k55J4R0M0k3N9J01j66L31
6372B95k16N9j61j04L12l82Q3m9R4K98l54Q6l0J4K00l64K41l2q1k6P4J96k20j07
$$ plain form
6396 -174 -125 -22 -233 -411 15 -73 -170 -134 -96 -10 231 -145 195 -76 101 -101 77 143 -60 -9 -125 103 373
6419 373 -184 113 -24 73 -73 -13 -174 -195 -175 13 48 -46 140 -132 -102 57 161 371 44 249 160 195 -113
6442 -113 -144 -119 34 -57 -191 -107 32 25 -46 72 23 -26 174 204 110 -65 153 -173 55 -144 161 -55 212 -230
6466 -230 -165 32 103 113 100 126 -190 -118 -110 -8 33 2 86 -167 -120 83 -176 16 124 -121 -68 -13 167 -16 -115
6491 -115 152 -20 210 100 28 -3 257 -155 68 200 -167 -38 -216 17 -16 155 -1 -30 -142 71 -43
6512 -43 21 216 108 -2 -26 46 -1 -126 -211 250 16 -7 -122 -352 219 31 -145 51 -92 144 -99 -381
6534 -381 -172 144 -139 28 -22 -123 -63 -24 74 47 -117 49 157 246 85 166 -136 104 63 -130 63 1 -313
6557 -313 -161 9 -13 -54 98 -112 -203 155 -115 107 -228 -116 92 -178 -46 -115 33 314 5 197 -3
$$ packed form
6396a74M9J03k11j78M26q8r7L6L8Q6K41l76L40k71J77k02J78O6k03N1j16K28K70
6419C73n57K97j37R7j46O0j61k1K0J88L5r4J86k72L0J59J04K10l27K05q9L5l08
6442a13l1K5J53r1j34Q4J39pp1J18m9m9K00L0r4j75K18l26K28j99L05k16K67m42
6466b30O5J97P1J0j3K6l16P2QJ02M1l1Q4k53M7K03k59J92J08k45N3N5J80j83r9
6491a15K67j72K30j10p2l1K60m12K23J32l67J29j78K33l3J71j56k9j12K13j14
6512d3O4J95j08j10k4P2m7j25q5M61k34k3j15k30N71j88j76J96j43K36k43k82
6534c81K09L16k83J67n0j01O0L9R8k7j64J66J08Q9j61Q1l02K40m1j93J93o2l14
6557c13J52J70k2m1J52k10r1L58k70K22l35J12K08k70J32o9J48K81l09J92k00
$$ plain form
6578 -3 30 -320 -167 130 91 27 35 11 -112 -202 36 61 35 -37 20 15 28 44 -98 373 81 -257 108 -90 106 -10
6604 -10 39 28 -309 158 -27 72 49 140 131 155 52 -7 -72 -153 -96 -181 281 57 48 235 3 29 161 -15 15 37
6630 37 222 -190 -141 -105 137 -24 -44 33 -65 -181 104 -10 48 -59 -165 74 58 -18 -257 -217 -49 -30 -130 -218
6654 -218 -203 -106 16 153 148 -28 -3 133 -53 44 240 42 49 251 -35 -67 64 -177 -137 11 265 -338 51
6677 51 137 122 193 12 202 205 -229 -43 -115 -286 -24 153 214 -42 -98 -66 -47 -28 249 113 -89 -119 193 -150
6701 -150 11 -251 -144 -145 114 134 86 -95 10 -150 -87 148 112 -187 95 -45 38 -95 -58 -28 -140 -128 -249
6724 -249 -113 50 -86 -14 61 -72 268 -58 128 -35 58 -249 167 95 -81 -63 26 -38 -114 -125 -92 324 43
6747 43 202 21 -366 153 0 -86 -29 222 -219 185 53 -104 24 -189 -4 23 18 -168 -198 -146 -27 -334 -79
$$ packed form
6578cL3l50J53K97l9o4Qk4j23r0K38K5k6p2N7nJ3J6j42M71k92l38L65j98J96j16
6604a0M9j1l37M67j85R9k3R1rK4j03n9o5q1N7q5M62k24rJ87k32K6J32j76L0K2
6630C7J85m12M9L6K42j61k0P7r8j16K85j14N8j07j06K39j6p6k39M0J68J9j00q8
6654b18J5R7J22J37nj76K5J36j86R7J96j98PK02k86l2J31k41M0J48K54o03L89
6677E1Q6j5P1j81J90Lm34J86p2j71K62J77O1k56n6L2J9J9K77j36k02l0L12l43
6701a50J61k62J07jK59K0m8j81J05j60O3K35l6k99K82j40Q3j33L7L0j12J2j21
6724b49J36J63j36P2P5j33L40l26J86j63R3l07M16p2j76J8Q9o4p6j1L3M16k81
6747D3J59j81l87N19j53q6N7K51m41M04j32j57J28k13J85K7nj86l0N2J19l07K55
$$ plain form
6770 -79 -157 101 192 -94 -20 -95 -252 6 17 53 -112 -179 29 -155 60 367 -127 47 111 316 199 -189 -150
6793 -150 282 -104 17 116 -82 -58 213 101 151 -298 185 -176 7 -57 -22 281 89 110 5 -228 -168 25
6815 25 -15 33 150 -87 -56 -180 125 -197 -47 294 28 184 -104 165 41 -21 -35 -197 -149 122 -167 88
6837 88 -142 227 73 124 4 262 22 80 -88 -128 -1 -177 52 -23 -53 -12 -135 -151 61 -66 -227 -266 -97
6860 -97 25 294 45 52 -40 2 -132 346 -28 6 44 31 180 15 -35 138 42 72 19 114 106 -32 12 105 -201 220
6886 220 150 -86 -56 -70 -188 -128 121 -36 -21 -189 -183 -143 -15 -13 165 -54 52 141 -44 -293 -285 50 22 354 -176
6911 -176 -94 153 -17 145 16 -114 -185 -159 -289 5 197 30 -298 28 -190 -172 1 -61 102 -89 21 -137
6933 -137 362 283 -147 112 -49 -224 82 148 28 5 43 -127 58 112 10 34 57 -79 183 64 30 -120 116
$$ packed form
6770g9p8K58R1k86P4p5j57K58J1L6j65o7K08j84K15L07m94J74O4K05j17l88L9
6793a50M32l86J21R9j98K4K71j12N0m49M83l61J83o4L5L03j92K1j05k33O0J93
6815B5m0M8J17k37L1j24L05l22J50L41k66J56k88K69j24o2j4j62M8K71k89K55
6837H8k30L69j54N1j20K58k40N8j68m0J27j76K29p5l0M1j23j6K12j27j61l9J69
6860i7J22K69k49Pr2M2j34M78l74L4L8j3J49j65n0J73r6L0n3R5qj38M4R3l06M21
6886B20p0k36L0j4j18O0K49j57J5j68OM0J28KJ78k19J06Q9j85k49QL35k8L32n30
6911a76Q2K47j70J62j29j30p1K6j30K94J92j67l28L26k18J8J73o2J63j91J10j58
6933a37M99p9m30K59j61j75L06O6j20k3L8j70J85N4j02K4K3j36K62j19l4j50K36
$$ plain form
6956 116 -60 113 -218 25 -23 -230 -57 -205 -102 -183 61 -111 34 323 -348 -31 26 -175 14 -46 108
6977 108 -53 -254 120 -288 -175 -48 -32 -45 -133 -336 -32 -8 -29 -30 -205 -27 -46 92 -172 209 -113 115 -31
7000 -31 19 88 -18 62 -131 -148 37 108 156 246 94 88 78 52 23 -149 19 214 -103 134 -24 -90 88 -66 -7
7025 -7 72 6 96 -149 -59 -66 58 -159 -55 52 -140 -80 -56 161 -74 -257 169 77 -47 -41 96 -147 -233 -91 -69
7050 -69 17 430 77 19 235 61 76 73 98 -181 53 -166 160 -20 -20 63 114 -210 -272 -227 -44 85 -8 -31 126
7075 126 124 -147 -66 -53 215 79 61 5 165 8 -207 9 -48 177 -71 215 5 63 88 29 98 -40 4 -6
7099 -6 -64 143 -79 -118 -244 52 12 171 67 50 85 61 368 -27 4 -201 110 92 -149 -195 -22 246 -109 219
7123 219 35 -5 6 -136 199 -17 -8 -94 153 40 -69 -9 5 -97 -185 128 -77 -75 -188 85 228 -175 67
$$ packed form
6956A16j76J73l31K43m8k07J73j48J03q1K44j72J45K89o71L17N7k01J89o0J54
6977A08j61k01L74m08J13J27J6j3q8k03L04K4k1jj75J78j9J38k64L81l22K28j46
7000c1N0O9j06Q0j93j7J85P1M8R0j52oj0k6k9j72J68J95l17K37j58o6J78j54N9
7025gP9o6R0k45R0pJ24k17J04J07j92O0K4K17k35j83M26r2j24OJ37k43q6J42K2
7050f9Q6M13l53n8K16j74J5lK5k79K34k19L26j80%Q3N1l24o2M5J83J29r3k3J57
7075A26kk71Q1J3K68j36j8n6J60j57k15K16n7K25k48K86k10N8K5n9O9j38M4j0
7099fn8K07k22l9j26K96m0J59j04j7L5k4L07l95L1k05L11j8k41m6J73K68l55L28
7123B19j84m0J1j42L35k16Rq6K47j13j09O0J4j02q8L13k05Kj13K73J43m03K42
$$ plain form
7146 67 -305 -126 -183 -47 -133 -179 93 -64 -38 169 121 -30 -211 212 146 -71 11 19 -73 259 -99 -50 131 43
7170 43 349 82 -192 197 -136 41 81 -57 102 -54 -97 258 89 123 150 -227 -41 209 251 209 17 49 180
7193 180 17 -12 28 -180 157 21 26 6 -19 47 -259 127 90 -61 214 178 52 -138 -157 -143 214 -55 23 218
7217 218 199 153 44 6 -12 -161 124 88 78 209 -130 -174 -81 -62 15 -284 -168 -20 -65 -163 45 142 -43 -203
7241 -203 -17 66 -189 -36 -14 78 10 25 -140 -175 -120 -53 -228 -61 33 -41 245 -132 -75 63 -63 95 -183 89
7265 89 112 16 249 -111 -171 -174 -58 -81 30 -141 183 -180 26 47 -43 13 4 204 -84 -118 10 81 -14 -48 -65 77
7291 77 128 193 93 60 183 452 78 -61 75 125 -202 91 -80 96 -139 172 284 69 -24 -57 -244 112
7313 112 -69 148 38 176 5 -133 -81 -52 49 36 -162 168 -70 -39 206 -127 20 -138 67 -215 85
$$ packed form
7146F7l72J79n7J36q6m6K72j57K6K07m8j51j81M23o6k17Q2Qr2L32l58M9J81q8
7170D3L06k67k74L89l33J77M0j38J59j56m3L55j69L4K7l77J86K50M2m2j92L2J31
7193A80j63k9M0k08L37j36Nk0k5O6l06L86l7j51K75l6j26j90j9J4L57k69P8J95
7217B18j9m6j09l8j8j49K85l6j0J31l39m4R3J9P7k99J16J48m5r8K08R7j85j60
7241b03J86Q3k55J53K2R2o8J5j65l5N5O7j75J67R4p4K86l77N7J38j26J58k78K72
7265H9K3r6K33l60o0lJ16k3J11j71L24l63K06K1r0N6rK00k88l4J28P1r5l4j7J42
7291G7N1O5j00l3J23K69l74j39J36N0l27K93j71J76k35L11J12k15r3l3j87L56
7313A12j81K17j10J38j71j38N2K9J01j3j98L30k38L1K45l33J47j58K05k82L00
$$ plain form
7334 85 -41 -201 -67 -47 -133 241 -50 50 63 6 -98 151 121 -1 209 118 57 3 -210 -29 -183 -150 -301
7357 -301 26 -121 -70 -60 83 230 -82 43 -10 39 -63 121 86 -174 -40 219 -32 -51 -161 25 -17 -107 -43
7380 -43 -46 101 87 42 106 46 28 134 202 59 -3 -219 25 -224 160 46 65 -195 133 -4 -23 -66 128 -170
7404 -170 -4 39 129 234 -145 -263 78 170 -4 10 -40 -70 -44 -51 128 -260 46 15 84 -47 -96 334 -245 -126
7428 -126 198 60 -97 149 -105 130 121 282 30 224 109 57 126 14 164 -63 152 134 -175 79 -83 -27
7450 -27 108 -193 127 107 140 -170 -145 -16 -91 161 187 125 58 42 25 -148 -49 -86 72 295 -21 -60 -153 -146 61
7475 61 -79 95 41 -84 133 -225 111 -280 73 -126 -101 57 -132 -82 101 -170 123 3 -259 23 -48 -25
7497 -25 -33 -293 -40 -239 291 54 86 -15 1 64 -41 154 136 196 165 -66 50 -15 22 -12 -180 2 191 -160
$$ packed form
7334H5j26j60J34K0q6L74k91J00J3n7j04K49l0j22K10r1o1n4k13J81j54L3j51
7357c01L27j47N1J0J43J47l12J25n3M9j02J84l5k60J34K59k51j9j10J86m2r0O4
7380d3lJ47j4m5O4o0j8J06O8j43o2k16K44k49L84j14J9k60L28j37j9m3J94k98
7404a70J66M3R0J05l79j18L41R2j74J4n0l0K6pJ79l88L06l1O9j31m9M30n79J19
7428a26L24j38j57K46k54K35rJ61k52J94j15n2O9j12J50k27K15j8l09K54j62N6
7450b7J35l01L20k0L3l10K5J29p5K52K6o2o7j6j7j73R9l7J58K23l16l9r3PK07
7475F1j40J74n4j25K17l58L36l91L53j99K5J58j89N0J83k71K93j20k62K82p1K3
7497b5qk60K53j99N30k37L2j01J6O3j05J95j8O0l1k31J16o5L7l4j68J82J89l51
$$ plain form
7521 -160 -282 -33 -135 -237 281 205 -146 38 -146 -92 -232 -202 -176 -264 -293 177 46 -179 73 33 -123 -48 -148
7544 -148 3 -16 -35 301 309 -44 -150 -258 -39 55 178 103 22 -58 -138 -220 106 -105 -57 163 0 46 -141 9
7568 9 34 -80 -176 57 -66 -71 -26 137 107 97 186 98 -111 -148 -77 194 -48 200 101 -46 438 34 62 -67 -32
7593 -32 1 -219 -202 18 25 10 63 48 -101 6 -344 -48 95 75 29 -176 50 -221 150 188 37 109 65 131 -210
7618 -210 137 416 5 -103 -9 -193 155 -128 -33 -125 17 -28 26 -104 156 -195 -228 -166 -114 9 152 -134 -201
7641 -201 225 -52 2 -205 51 48 -115 -4 54 124 -165 -211 45 152 171 75 -118 -91 -68 68 -197 -114 47 -31
7665 -31 -64 -42 96 -113 -56 54 77 -112 238 75 -67 73 -5 168 -172 31 -120 -16 18 48 167 -119 120
7688 120 -261 -94 -147 -11 -99 37 86 121 202 70 -107 -146 69 -211 -118 27 56 88 -156 106 -2 85 79 -4
$$ packed form
7521a60j22K49j02j02N18p6l51J84j84N4j40L0K6q8k9M70j31k25K52m0j56P5j00
7544a48J51j9j9L36Ql53j06j08K19R4J23p5q1q0q0q2L26k11M8K20j63M6j87J50
7568IK5j14r6K33j23nM5J63l0j0Q9q8k09l7P1K71k42K48r9j47M84m04K8j29L5
7593c2L3k20J7K20Pj5N3j5j49J07l50K96J43k0m6k05K26k71L71L8j51P2m4O6l41
7618b10L47K79m11j08R4j84L48k83R5r2J42m5N4j30K60l51l3O2N2J23J43k86o7
7641b01M26k77N4k07K56lj63J11N8P0k89m6K56J07J9r6j93K7K3J36k65Q3J61p8
7665c1l3K2J38k09N7J10K3j89L50j63j42J40p8J73l40K03j51J04L4L0J19k86K39
7688A20l81J67n3J36q8J36M9L5Q1j32j77l9K15k80R3J45K9L2k44K62j08Q7oq3
$$ plain form
7712 -4 83 77 -56 36 -89 259 -62 -73 -257 -273 -79 -70 -163 -57 244 192 87 36 109 -320 -260 -96 -62 -150 334 -35
7738 -35 -86 1 114 198 -95 -119 36 1 183 104 -113 -103 -25 -217 -45 -86 -99 -65 -52 30 226 -41 19 -108 -137
7763 -137 14 163 3 94 84 -121 -143 -87 -115 66 47 -4 -56 -182 84 93 -229 -194 109 168 -85 -83 252 -89 44
7788 44 -73 -48 -179 95 126 90 19 -209 -140 37 -40 -172 40 105 119 -1 187 -74 -11 -21 45 -65 7 26 -188
7813 -188 -58 68 -155 -125 193 59 -310 -228 33 161 47 218 239 -215 -9 -186 34 -53 -235 -23 28 127
7835 127 50 146 221 16 221 86 185 48 124 31 106 265 78 4 156 83 62 314 -153 -120 119 152 -111 -62
7859 -62 49 89 -82 153 -271 82 -2 24 173 -58 1 -95 -22 -326 -148 -16 -107 -125 -149 163 207 -222 -145 -75
7883 -75 -128 135 -72 259 174 -75 56 -77 10 -74 44 168 121 25 24 -30 21 68 77 -194 19 55 -106 -290 93
$$ packed form
7712dQ7oj33R2j25L48l21j1j84j6J94Rr3J06L01n2j05n1P3m29O0J64L4q8M84l69
7738c5n1Q7J13Q4k93k4J55l5J82p9k17J0P8j92J72m1j3L4J3Q2J96k67O0j27k9
7763a37J51J49j60R1j0k05k2N6k8J81j9n1n2j26K66Rl22L5L03N9k53KL35l41J33
7788D4j17K5j31K74L1l6p1k28O9J77p7j32K12O5J4j20J88k61O3j0O6j10P2J9k14
7813a88J30J26k23L0L18j34l69Q2K61J28j14J71K1m54K06j77K20q7j82K12N1R9
7835A27p7R6P5k05K05j35R9j37P6r3P5J59j87p4J52p3k1K52m67L3K39L3k63M9
7859f2J11M0j71K35m24L53q4K6J49k31N9r6P3l04J78J32r1j8k4L12M4m29P7P0
7883g5n3K63k07L31q5k49J31j33Q7q4J18J24m7r6jn4N1M7Rk71K13L6j61j84L83
$$ plain form
7908 93 -98 3 87 194 -3 93 128 11 2 174 -59 -235 -86 78 -43 -175 92 -114 19 141 249 272
7930 272 10 49 -20 112 286 -27 43 87 -24 95 64 -32 -196 -74 -280 -68 66 -70 58 -385 45 64
7952 64 -126 -1 69 -93 69 -54 -123 62 22 93 169 11 -16 -201 45 -269 269 -101 29 -87 1 70 -355
7975 -355 -173 -129 72 127 -30 54 -161 -12 133 -2 92 31 44 -234 -91 78 -80 -169 88 -38 -117 -197 6
7998 6 -206 88 214 -136 39 -65 267 28 -9 -59 10 10 176 -10 143 94 -228 -29 -113 -78 -85 -84 14 -14 -1 246
8024 246 -250 -85 -184 -147 -42 5 114 -107 69 -45 -62 -101 -32 60 218 3 -39 49 24 -30 -285 -57 -81 8
8048 8 168 -148 -128 -47 161 -92 47 103 -84 139 -65 37 -239 163 -208 -154 54 -164 47 -19 -22 -121 45
8071 45 138 -159 -27 -87 -13 18 -219 10 -181 33 65 -94 119 33 79 -23 100 31 -154 -140 102 144 -129 159
$$ packed form
7908I3j91J01Q4J07j97R6L5j17rJ72k33j76J49J64j21j32K67k06J33J22J08K3
7930B72k62L9o9J32J74l13P0M4j11J19l1r6j64J22k06K12J34j36J28m43M30J9
7952F4j90J25P0j62J62j23o9J85m0P1P6j58k7j85K46l14N38l70J30j16Q8O9m25
7975c55J82M4K01N5j57Q4k15J49J45j35R4o1J3k78J43J69j58q9K57j26p9q0K03
7998Fk12K94J26l50J75j04L32k39l7n0O9%J66j86J53m9l22J99q4L5pJR8k8J3K47
8024B46m96J65r9L7J05M7J09k21J76j14j7l9O9R2J58k15m2Q8k5n4k55K28k4Q9
8048HJ60l16K0Q1K08k53J39N6j87K23k04J02k76M02l71N4K08k18K11o6lr9J66
8071D5R3k97J32o0P4L1k37K29j91K14L2j59K13q6M6j02J23o9j85J4K42M2k73K88
$$ plain form
8095 159 -3 47 -20 15 8 63 26 85 100 47 281 -20 103 -38 133 -19 -1 74 118 -9 -46 71 -12 57 115 107
8121 107 114 -20 29 18 -121 12 128 -20 -19 33 -17 -24 -143 33 -136 -54 29 144 98 179 165 -78 -121 60 -4 98
8147 98 149 54 -72 14 -130 -53 -209 61 19 23 179 -131 152 -48 385 -98 -5 5 30 -63 -3 -47 255 177 144
8172 144 158 127 50 90 249 48 -66 -75 106 -214 44 -57 -97 -120 31 -110 -77 -41 -268
$$ packed form
8095A59j62N0o7L5pN5l7N9J5n3K34l01J23j41J71j52J8P5M4j27l7J17q3O9N8q
8121A07Pj34M9j1j39J33J16j48JN2n0pj19J76j69Q2Q3J15m6Q1j4k43m3J81o4J02
8147I8N1r5j26Q6j44P7j56K70m2MJ56l10K83k00M33m83R3J0K5r3O0m4L02p8l3
8172A44J4l1p7M0J59k01j14rJ81l20K58j01m0k3J51j41L3L6k27
8191b68
$$ Imaginary data points
##PAGE= N=2
##DATA TABLE= (X++(I..I)), XYDATA
$$ plain form
0 0 0 0 0 0 0 0 8 0 8 -8 8 -16 16 -24 32 -32 48 -56 64 -80 96 -112 136 -160 191 -216 256 -295 339 -392
30 -392 443 -509 576 -653 737 -828 932 -1043 1166 -1302 1449 -1609 1786 -1977 2187 -2416
46 -2416 2667 -2939 3239 -3571 3930 -4335 4776 -5271 5825 -6450 7164 -7977 8932 -10054
60 -10054 11404 -13066 15159 -17907 21679 -27204 36127 -52973 96268 -458934 -835776 -85939
72 -85939 284571 496059 394134 359184 253207 108835 -198289 -377683 -311205 41865 352763
83 352763 463678 321428 124150 -73044 -258750 -504691 -667713 -588694 -203929 256722
93 256722 554586 577963 450147 289334 123279 -119320 -381111 -482072 -281082 90016
103 90016 351991 314924 69996 -149529 -202704 -175406 -204942 -275099 -221836 34887 366035
$$ packed form
0@%%%%%%QqQj6J6k4L2m0N6o4Q0j04J20j44J76k08K48k96L51m07M72n51O34p31
30c92Q35r52J085j229J390j565J760j975K209k468K751l058L395l763M164m603
46b416N083n606O178o810P501q265R111j0047J1096j2275J3614j5141J6909j8986
60a0054K1458k4470K8225l3066L9586m8883O3331q9100J49241n55202l76842P49837
72h5939L70510K11488j01925l4950j05977j44372l07124j79394O6478L53070L10898
83C52763J10915j42250j97278j97194j85706k45941j63022P9019L84765M60651
93B56722K97864K3377j27816j60813j66055k42599k61791j00961K00990L71098
103I0016K61975l7067k44928k19525n3175K7298k9536p0157N3263K56723L31148
$$ plain form
114 366035 542793 457813 207985 -25266 -169559 -274001 -363667 -357916 -183066 98424 308958
125 308958 315844 151764 -31197 -130832 -173287 -211671 -207854 -79042 163858 375790 396414
136 396414 211599 -31099 -175495 -210314 -228352 -262592 -229698 -48330 222785 400049 340730
147 340730 90011 -162175 -270053 -240681 -160586 -70484 51014 207466 321607 292487 110166
158 110166 -111361 -242236 -253321 -202010 -131664 -29918 116379 251267 271423 134071 -73378
169 -73378 -208231 -209990 -134323 -56748 13694 115021 238627 294352 192231 -35878 -241228
180 -241228 -296230 -207062 -79490 3441 48516 105142 169599 175851 81188 -62744 -155817 -149061
192 -149061 -77213 -409 61272 123678 178614 171695 60345 -111452 -236000 -242546 -154825 -49174
$$ packed form
114C66035J76758q4980k49828k33251j44293j04442q9666N751J74850K81490K10534
125C08958O886j64080j82961r9635m2455l8384L817J28812K42900K11932K0624
136C96414j84815k42698j44396l4819j8038l4240L2894J81368K71115J77264n9319
147C40730k50719k52186j07878K9372Q0095R0102J21498J56452J14141k9120j82321
158A10166k21527j30875j1085N1311P0346J01746J46297J34888K0156j37352k07449
169g3378j34853j759P5667P7575P0442J01327J23606N5725j02121k28109k05350
180b41228n5002Q9168J27572Q2931M5075N6626O4457O252r4663j43932r3073O756
192a49061P1848P6804O1681O2406N4936o919j11350j71797j24548o546Q7721J05651
$$ plain form
204 -49174 30900 101482 179607 226024 172198 18427 -139734 -196700 -134196 -29490 36317
215 36317 58931 83962 123370 120374 22393 -134509 -243461 -226428 -102521 41457 141264
226 141264 193102 211626 179522 68190 -94303 -218589 -224504 -120634 10050 90524 114581
237 114581 117842 106615 45817 -76518 -196736 -221067 -117880 42447 155656 179418 152893
248 152893 121017 73619 -24114 -156430 -238653 -197408 -50998 97269 158221 129895 73181
259 73181 25144 -28829 -103949 -163297 -142134 -27464 110963 181746 158755 92678 36402 -12488
271 -12488 -85435 -170189 -199950 -124077 21576 136357 153036 94389 32238 -740 -32648 -89717
283 -89717 -136406 -105673 14041 146565 195020 135809 31636 -45424 -86100 -123331 -162199
$$ packed form
204d9174Q0074P0582P8125M6417n3826j53771j58161n6966O2504J04706O5807
215C6317K2614K5031L9408k996r7981j56902j08952J7033J23907J43978R9807
226A41264N1838J8524l2104j11332j62493j24286n915J03870J30684Q0474K4057
237A14581L261j1227o0798j22335j20218k4331J03187J60327J13209K3762k6525
248A52893l1876m7398r7733j32316q2223M1245J46410J48267O0952k8326n6714
259G3181m8037n3973p5120n9348K1163J14670J38427P0783k2991o6077n6276m8890
271a2488p2947q4754k9761P5873J45653J14781J6679n8647o2151l2978l1908n7069
283h9717m6689L0733J19714J32524M8455n9211j04173p7060m0676l7231l8868
$$ plain form
294 -162199 -157035 -65795 77759 181414 179707 95647 5520 -45887 -73163 -100860 -109982 -54201
306 -54201 63300 168521 176223 77501 -51164 -128940 -142923 -131250 -113934 -63693 44007
317 44007 168963 225016 163261 28448 -84215 -120017 -101791 -76043 -50418 3798 87998
328 87998 146065 115141 -129 -119558 -163267 -123309 -53135 4034 53547 115020 169352 160624
340 160624 65215 -66171 -148717 -141706 -79713 -24011 6436 36008 78051 100554 59856 -34202
352 -34202 -114957 -119695 -52466 25275 65925 76091 87002 97567 72172 -8497 -106164 -151388
364 -151388 -116595 -39164 20325 42461 53242 72516 80011 42269 -35019 -97583 -93601 -30202
376 -30202 37628 66611 62816 56258 52155 25298 -39781 -111358 -133832 -85535 -2007 60045 79346
$$ packed form
294a62199N164R1240J43554J03655j707q4060r0127n1407k7276k7697r122N5781
306e4201J17501J05221P702r8722j28665p7776j3983J1673J7316N0241J07700
317D4007J24956N6053o1755j34813j12663l5802J8226K5748K5625N4216Q4200
328H7998N8067l0924j15270j19429m3709L9958P0174N7169M9513O1473N4332q728
340A60624r5409j31386q2546P011O1993N5702L0447K9572M2043K2503m0698r4058
352c4202q0755m738O7229P7741M0650J0166J0911J0565k5395q0669r7667m5224
364a51388L4793P7431N9489K2136J0781J9274P495l7742p7288o2564L982O3399
376c0202O7830K8983l795o558m103k6857o5079p1577k2474M8297Q3528O2052J9301
$$ plain form
389 79346 74887 67921 51863 5713 -61092 -104962 -86433 -17132 52023 79592 67096 43246
401 43246 19771 -15792 -68380 -111792 -104251 -38224 46061 96519 94924 63860 31902 2558
413 2558 -35913 -77882 -91109 -53036 18389 75020 83147 50527 9339 -21421 -46823 -72207
425 -72207 -82537 -54706 9112 73888 99380 78054 35075 -2105 -28106 -52198 -71146 -63936
437 -63936 -21529 36469 71109 62758 24584 -12484 -33520 -45922 -55767 -52464 -20424 34686 82294
450 82294 91540 59099 10646 -26693 -49043 -63670 -68142 -49173 -3589 47893 74279 59567
462 59567 19488 -18620 -39996 -48644 -49233 -33023 6470 56824 87900 76741 29940 -23238 -58011
475 -58011 -70747 -69424 -53760 -17458 34210 77989 85081 49127 -4634 -44691 -57477 -50108 -32464
$$ packed form
389G9346m459o966j6058m6150o6805m3870J8529O9301O9155K7569j2496k3850
401D3246k3475l5563n2588m3412P541O6027Q4285N0458j595l1064l1958k9344
413B558l8471m1969j3227L8073P1425N6631Q127l2620m1188l0760k5402k5384
425g2207j0330K7831O3818O4776K5492k1326m2979l7180k6001k4092j8948P210
437f3936M2407N7998L4640q351l8174l7068k1036j2402r845L303L2040N5110M7608
450H2294R246l2441m8453l7339k2350j4627m472J8969M5584N1482K6386j4712
462E9567m0079l8108k1376q648n89J6210L9493N0354L1076j1159m6801n3178l4773
475e8011j2736J323J5664L6302N1668M3779P092l5954n3761m0057j2786P369J7644
$$ plain form
488 -32464 -4162 33901 68938 77041 45130 -11347 -59278 -76985 -66863 -41840 -9938 27618
500 27618 64567 81827 62260 11763 -39618 -63761 -56315 -32081 -5717 20157 46177 62626
512 62626 52575 10983 -40856 -71275 -66073 -37131 -4173 21965 43725 60300 60137 31727 -16106
525 -16106 -55519 -64014 -42266 -10045 16399 33374 45229 47904 29303 -10587 -52326 -68590
537 -68590 -52056 -15843 17456 37914 48928 52819 42090 9349 -34094 -63223 -59370 -27602
549 -27602 9669 32888 40652 39780 30801 7130 -30134 -61213 -64204 -34760 10281 44582 56049
562 56049 50990 37807 15086 -18753 -52079 -66397 -47859 -7275 30993 46850 41087 25409
574 25409 6457 -17020 -41402 -53924 -40544 -2721 38984 60133 53563 30624 4918 -18872
$$ packed form
488c2464K8302L8063L5037Q103l1911n6477m7931j7707J0122K5023L1902L7556
500B7618L6949J7260j9567n0497n1381k4143P446K4234K6364K5874K6020J6449
512F2626j0051m1592n1839l0419N202K8942L2958K6138K1760J6575j63k8410m7833
525a6106l9413q495K1748L2221K6444J6975J1855K675j8601l9890m1739j6264
537f8590J6534L6213L3299K0458J1014L891j0729l2741m3443k9129L853L1768
549b7602L7271K3219P764q72q979k3671l7264l1079k991K9444M5041L4301J1467
562E6049n059j3183k2721l3839l3326j4318J8538M0584L8268J5857n763j5678
574B5409j8952k3477k4382j2522J3380L7823M1705K1149o570k2939k5706k3790
$$ plain form
586 -18872 -40753 -55525 -51405 -23521 16731 45822 48701 30561 6829 -11754 -25392 -33752 -33085
599 -33085 -15291 16338 43733 49567 31589 2755 -21078 -35049 -40830 -39530 -26307 1370 32482
612 32482 49386 42726 19372 -5509 -21050 -27450 -28256 -22143 -5115 19115 37481 36124 16161
625 16161 -9946 -28551 -34294 -31490 -22244 -5502 17907 39764 46708 32234 5328 -19766 -32609
638 -32609 -32737 -25530 -12533 6017 26123 36955 29669 7285 -17655 -32842 -32600 -21523 -6206
651 -6206 11561 28772 38919 34571 14265 -12941 -33078 -38008 -28559 -12429 5105 21488 32922
664 32922 32477 17173 -6492 -27270 -34690 -26367 -9755 7752 21715 30725 30839 18565 -3159
677 -3159 -24887 -36136 -31583 -15234 3824 18837 27800 28484 19744 2301 -17992 -30931 -30154 -16883
$$ packed form
586a8872k1881j4772M120K7884M0252K9091K879j8140k3732j8583j3638q360O67
599c3085J7794L1629K7395N834j7978k8834k3833j3971n781J300J3223K7677L1112
612C2482J6904o660k3354k4881j5541o400q06O113J7028K4230J8366j357j9963
625A6161k6107j8605n743K804R246J6742K3409K1857O944j4474k6906k5094j2843
638c2609j28P207J2997J8550K0106J0832p286k2384k4940j5187K42J1077J5317
651f206J7767J7211J0147m348k0306k7206k0137m930R449J6130J7534J6383J1434
664C2922m45j5304k3665k0778p420Q323J6612J7507J3963R010J14j2274k1724
677c159k1728j1249M553J6349J9058J5013Q963O84q740j7443k0293j2939P77J3271
$$ plain form
691 -16883 1639 17459 26798 28031 20043 4308 -15014 -29381 -31762 -20925 -2981 13761 24758
704 24758 27083 21409 8219 -9283 -24484 -30732 -22662 -5543 12424 24593 27227 21378 8588
717 8588 -7785 -23007 -30810 -26163 -10622 8638 23131 28178 24040 11642 -4524 -19429 -27930
730 -27930 -25429 -11852 6076 20905 26758 22686 11359 -3947 -18463 -27797 -26422 -14541 3594
743 3594 20046 28128 24606 13469 -1207 -15268 -24690 -25341 -15990 -5 16028 25341 23677 13632
757 13632 -473 -14472 -23154 -23931 -15845 -1302 14182 24205 24551 15510 2247 -11563 -20916 -23735
771 -23735 -17798 -5051 10248 21285 23464 16151 3292 -9589 -18597 -21680 -16900 -6017 8146
784 8146 19641 23707 18192 5987 -7767 -17975 -21775 -18018 -8289 4375 16268 21900 19158 8475
$$ packed form
691a6883J8522J5820R339J233p988j5735j9322j4367k381J0837J7944J6742J0997
704B4758K325n674j3190j7502j5201o248Q070J7119J7967J2169K634n849j2790
717H588j6373j5222p803M647J5541J9260J4493N047m138j2398j6166j4905q501
730b7930K501J3577J7928J4829N853m072j1327j5306j4516r334J375J1881J8135
743C594J6452Q082l522j1137j4676j4061r422o51R351J5985J6033R313j664j0045
757A3632j4105j3999q682p77Q086J4543J5484J0023L46r041j3263j3810r353k819
771b3735N937J2747J5299J1037K179p313j2859j2881r008l083M780J0883J4163
784H146J1495M066n515j2205j3754j0208l800L757R729J2664J1893N632k742j0683
$$ plain form
798 8475 -4971 -15685 -20487 -17773 -9000 3066 14759 21350 19163 9725 -3635 -14921 -20355 -18488
812 -18488 -10665 926 12455 19655 19916 12134 -480 -12541 -19187 -18353 -10925 44 10544 17604
826 17604 18683 12471 859 -11076 -18546 -18795 -12205 -1541 9476 16982 18833 13403 3255 -8464
840 -8464 -16783 -18027 -13007 -2982 7357 14873 17284 13381 4708 -6858 -15283 -17547 -13664 -4103
854 -4103 5950 13735 16954 14233 6006 -4535 -13190 -17301 -14520 -6196 3857 12452 16070 13905
868 13905 6878 -2723 -11432 -15940 -14601 -7128 2519 11010 15769 14325 8064 -969 -9935 -15516 -15030
883 -15030 -8768 544 9233 14530 14430 8932 269 -8177 -13924 -14443 -9468 -808 8140 13849 14446 9738
899 9738 1578 -7039 -13275 -14094 -10028 -2405 6325 12769 13915 10316 2646 -5835 -11734 -13874 -10567
$$ packed form
798H475j3446j0714m802K714Q773J2066J1693O591k187r438j3360j1286n434J867
812a8488P823J1591J1529P200K61p782j2614j2061o646Q34P428J0969J0500P060
826A7604J079o212j1612j1935p470k49O590J0664J1017P506J851n430j0148j1719
840h464q319j244N020J0025J0339P516K411l903q673j1566q425k264L883R561
854d103J0053P785L219k721q227j0541q655m111K781Q324J0053Q595L618k165
868A3905p027r601q709m508J339P473R647Q491M759j444o261r033q966n581M86
883a5030O262R312Q689N297j00n498q663q446n747n19M975Q660Q948N709N97m708
899I738q160q617o236q19M066P623Q730O444J146l599p670q481n899k140L307
$$ plain form
914 -10567 -3332 5112 11401 13867 10664 4178 -4511 -10893 -13544 -11086 -4425 3634 10352 13178 11243
929 11243 5049 -2905 -9728 -12692 -11154 -5188 2342 8919 12837 11166 5613 -1778 -8417 -12247 -11462
944 -11462 -6299 901 8024 11999 10982 6700 -453 -7388 -11600 -11643 -6799 -76 7046 11146 11224 7018
960 7018 526 -6465 -10945 -11029 -7511 -998 5966 10455 11152 7563 1739 -5185 -9988 -10760 -8063 -2261
976 -2261 4611 9485 10899 8111 2485 -4013 -9263 -10735 -8263 -2965 3603 8815 10474 8610 3207
991 3207 -3000 -8204 -10271 -8919 -3898 2448 7637 9990 8778 4056 -2054 -7229 -9644 -8624 -4400
1006 -4400 1611 6915 9588 8734 4632 -1133 -6437 -9382 -8893 -4827 633 5986 9016 8845 5194 -322
1022 -322 -5423 -8666 -8643 -5672 -145 4979 8359 8438 5558 535 -4666 -8222 -8743 -5827 -1085 4218
$$ packed form
914a0567P235Q444O289K466l203o486q689o382k651K458O661Q059O718K826j935
929A1243o194p954o823k964J538N966P530O577L918j671n553p391o639l830P85
944a1462N163P200P123L975j017m282p153o935m212m3M844O723P122M100P8m206
960G018o492o991m480q4L518O513O964M489O97l589n824o924m803p72K697N802
976b261O872M874J414k788n626o498n250j472K472N298O568N212J659j864n403
991C207o207n204k067J352N021O346N189K353j212m722o110n175k415J020M224
1006d400O011N304K673q54m102n765n304k945M89M066N460N353L030j71l651n516
1022c22n101l243K3K971N527N124L380P9k880n023n201l556n21K916M742N303
$$ plain form
1038 4218 7852 8450 6278 1581 -3665 -7453 -8605 -6465 -1934 3316 6997 8333 6112 1927 -2946
1053 -2946 -6737 -8269 -6779 -2465 2543 6938 8190 6502 2533 -2118 -5900 -7728 -6705 -3201 1737
1068 1737 5886 7904 6706 3121 -1481 -5286 -7117 -6755 -3635 999 5343 7673 6875 3458 -840
1083 -840 -5060 -7112 -6747 -4215 -139 4363 6982 6893 4018 -247 -4063 -6661 -6603 -4145 -245 3775
1099 3775 6367 6766 4666 429 -3748 -6006 -6419 -4446 -1013 3008 5742 6712 5066 1277 -2747 -5779
1115 -5779 -6158 -4309 -784 2427 5368 6197 5045 1613 -2335 -5375 -6441 -4605 -1846 1704 4734
1130 4734 5841 5182 2613 -1330 -4822 -6044 -5041 -1945 1173 3951 5339 5101 2486 -929 -4453
1145 -4453 -5882 -5209 -2620 904 3886 5568 5219 3274 122 -3263 -5551 -5477 -3176 64 2976 4796
$$ packed form
1038D218L634N98k172m697n246l788j152K140M531N250L681J336k221m185m873
1053b946l791j532J490M314N008M395J252j688l969m651l782j828J023L504M938
1068A737M149K018j198l585m602l805j831L62L120M634M344K330p98l417m298
1083h40m220k052L65K532M076M502K619q9k875m265l816k598N8K458L900M020
1099C775K592L99k100m237m177k258m13J973L433M021K734R70j646l789m024l032
1115e779l79J849L525L211K941Q29j152l432l948l040j066J836K759L550L030
1130D734J107o59k569l943l492j222J003L096L118K778J388k38k615l415l524
1145d453j429O73K589L524K982J682l49j945l152l385k288P4K301L240K912J820
$$ plain form
1161 4796 4826 3129 328 -2468 -5042 -5184 -3326 -107 3055 4921 4883 3379 754 -2388 -4778 -5482
1177 -5482 -3980 -1098 2348 4252 4615 3492 1012 -1567 -3830 -5117 -4004 -1065 2176 4371 4670
1192 4670 3384 1120 -1389 -3754 -4821 -4028 -1712 1284 4077 4929 3837 1825 -924 -3173 -4459
1207 -4459 -4176 -2142 816 3186 4634 3913 2067 -561 -2847 -4405 -4286 -2667 412 3155 4411 4460
1223 4460 2552 -170 -2393 -3627 -3954 -2637 -214 2402 4080 4145 2393 -92 -2387 -3767 -4170 -2852
1239 -2852 -584 1872 4118 4419 2984 500 -1960 -3678 -3805 -3007 -858 1411 3709 4143 3010 485
1255 485 -1948 -3423 -3988 -2882 -998 1661 3525 4222 3540 1123 -1620 -3540 -3846 -2937 -1269 953
1271 953 2939 3734 2964 1200 -1254 -3160 -3597 -2557 -975 824 2903 3747 3347 1787 -723 -2934
$$ packed form
1161D796L0j697k801k796k574j42J858L219L162J866l8j504k625l142k390p04
1177e482J502K882L446J904L63j123k480k579k263j287J113K939L241K195K99
1192D670j286k264k509k365j067P93K316K996K793Q52j092k012k749k249j286
1207d459K83K034K958K370J448p21j846k628k286j558J19J619L079K743J256M9
1223D460j908k722k223j234l27J317K423K616J678O5j752k485k295j380m03J318
1239b852K268K456K246L01j435k484k460j718j27P98K149K269K298M34j133k525
1255D85k433j475n65J106J884K659J864O97o82k417k743j920l06R09J668K222
1271I53J986P95p70j764k454j906m37J040J582J799K079Q44m00j560k510k211
$$ plain form
1287 -2934 -3661 -2692 -1327 390 1705 2883 3067 1782 -127 -2310 -3190 -2838 -1127 459 2014 2620
1303 2620 2931 2033 5 -2065 -3302 -3322 -1772 -205 1426 2305 2390 2146 619 -1471 -2658 -2978 -1888
1320 -1888 -41 1377 2356 2573 2114 650 -976 -2747 -3267 -2418 -392 1519 2629 2922 2194 941 -148
1337 -148 -1991 -2751 -2474 -712 1178 2417 2227 1513 610 -887 -2223 -2918 -2765 -1197 855 2314 2813
1354 2813 1968 917 -145 -1306 -2329 -2003 -1239 37 1847 2394 1776 613 -396 -1438 -1991 -2126 -1246
1371 -1246 373 1892 2732 2233 907 -142 -1072 -1724 -1974 -1771 -616 836 1947 1886 1060 -156 -1089
1388 -1089 -1104 -1308 -1431 -640 691 1996 2315 1705 393 -905 -1870 -1831 -1675 -1150 434 1779 2327 2040
1406 2040 678 -665 -1321 -1441 -1246 -490 127 1419 2358 1831 815 -934 -2082 -2436 -1907 -929 -48 1169
$$ packed form
1287b934p27R69J365J717J315J178J84j285j909k183q80L52J711J586J555O06
1303B620L11q98k028k070j237k0J550J567J631Q79Q5k44j527k090j187l20J090
1320a888J847J418R79K17m59j464j626j771n20Q49K026J911J110K93p28j253j089
1337a48j843p60K77J762J890J239j90p14r03j497j336o95J53J568K052J459M99
1354B813q45j051j062j161j023L26P64J276J810N47o18j163j009j042n53j35Q80
1371a246J619J519Q40m99j326j049r30o52k50K03J155J452J111o1q26j216r33
1388a089j5k04j23P91J331J305L19o10j312j298r65L9J56N25J584J345N48k87
1406B040j362j343o56j20J95P56O17J292R39n27j016j749j148l54N29R78Q81J217
$$ plain form
1424 1169 2287 2487 1645 66 -1459 -1914 -1813 -571 165 1173 1411 1757 1271 -191 -1403 -2286 -1900
1441 -1900 -816 35 1118 1719 1920 1468 368 -1314 -2099 -1826 -1010 68 964 1286 1404 1180 619 -774
1459 -774 -2129 -1792 -1014 164 1093 1557 1879 1455 659 -642 -1862 -1939 -1095 -243 675 1327 1655 1131 540
1478 540 -360 -1584 -1994 -1587 -306 889 1277 1536 1234 739 -115 -1268 -1751 -1765 -494 689 1289 1631
1496 1631 1132 433 -184 -1279 -1798 -1739 -532 798 1649 2130 1504 663 -356 -984 -1754 -1787 -1027 -95 1409
1515 1409 1389 1287 357 -127 -981 -1338 -1260 -706 552 1308 1790 1342 669 -287 -1168 -1427 -1546 -945 -227 646
1535 646 1103 1081 564 -82 -649 -878 -860 -231 122 783 1557 1161 448 -229 -767 -1338 -1054 -965 -517 393 1201
1556 1201 1450 1303 187 -187 -988 -842 -736 -177 177 798 918 1046 -87 -564 -1003 -1105 -607 -460 248
$$ packed form
1424A169J118K00q42j579j525m55J01J242P36J008K38L46m86j462j212q83L86
1441a900J084Q51J083O01K01m52j100j682p85K73Q16J078Q96L22J18k24n61j393
1459g74j355L37P78J178R29M64L22m24p96j301j220p7Q44Q52R18O52L28n24n91
1478E40r00j224m10M07J281J195L88K59l02m95q54j153m83j4J271J183O00L42
1496A631m99o99o17j095n19N9J207J330Q51M81o26q41j019o28p70l3P60R32J504
1515A409k0j02r30m84q54l57P8N54J258P56M82m48o73r56q81k59j19O01P18Q73
1535F46M57k2n17o46n67k29J8O29L53O61P74l96p13o77n38n71K84Q9M48R10Q08
1556A201K49j47j116l74q01J46J06N59L54O21J20J28j133m77m39j02M98J47P08
$$ plain form
1575 248 768 1310 1476 645 -67 -574 -1245 -834 -357 -43 430 609 838 368 -364 -839 -817 -763 -347 192 633
1596 633 916 1227 943 11 -912 -849 -990 -683 129 311 432 913 507 110 -727 -1045 -888 -339 197 444
1616 444 681 811 715 91 -352 -999 -1068 -701 31 -12 564 594 479 98 -349 -781 -851 -650 -271 309 681 583
1638 583 580 240 -65 -381 -1167 -1068 -468 273 594 759 542 742 84 -198 -792 -810 -478 133 806 669 778
1659 778 352 -232 -775 -1129 -1199 -679 103 649 865 835 671 -3 -468 -854 -773 -554 -54 510 826 783 227
1680 227 80 -431 -900 -1153 -638 30 704 1052 1062 609 31 -385 -867 -614 -515 -307 304 877 812 750 -215
1701 -215 -251 -867 -753 -603 -480 271 678 775 684 25 -459 -761 -679 -712 -420 70 427 802 363 168 -119 -658
1723 -658 -586 -554 -212 -20 439 810 522 348 -69 -547 -792 -773 -307 153 535 628 541 481 -305 -437 -637 -452
$$ packed form
1575B48N20N42J66q31p12n07o71M11M77L14M73J79K29m70p32m75K2N4M16N39M41
1596F33K83L11k84r32r23O3j41L07Q12J82J21M81m06l97q37l18J57N49N36K47
1616D44K37J30r6o24m43o47o9L67P32m3N76L0j15l81m47m32p0K01L79N80L72r8
1638E83ll40l05l16p86R9O00P41L21J65k17K00o58k82n94j8L32O11O73j37J09
1659G78m26n84n43l54p0N20P82N46K16l0j64o74m65l86Q1K19N00N64L16m3n56
1680B27j47n11m69k53N15O68O74L48J0m53n78m16m82K53R9K08O11N73o5o2r65
1701b15l6o16J14J50J23P51M07R7r1o59m84l02Q2l3K92M90L57L75m39j95k87n39
1723f58P2L2L42J92M59L71k88j74m17m78k45J9M66M60L82R3q7o0p86j32k00J85
$$ plain form
1745 -452 -353 154 582 757 587 379 -86 -758 -764 -657 -343 -151 186 512 783 381 209 -449 -494 -644 -219
1766 -219 -47 166 742 507 186 -41 -474 -797 -645 -571 120 156 415 670 360 293 -360 -502 -686 -475 -119
1787 -119 433 581 365 310 -57 -483 -514 -561 -316 -175 195 618 668 650 340 -144 -402 -392 -602 -182 289 443
1809 443 477 501 56 -40 -322 -654 -279 -174 254 337 315 504 463 -178 -329 -390 -299 -210 212 248 566 617 313 156
1833 156 -157 -518 -589 72 -13 248 284 296 402 -43 -284 -597 -540 -489 -332 166 633 738 268 95 -215 -372
1855 -372 -455 -422 -72 321 311 554 472 -23 -387 -286 -505 -486 -93 183 606 729 580 83 -229 -587 -286 -438
1877 -438 -59 136 191 534 184 145 -451 -245 -642 -404 -408 -85 259 488 265 324 -131 -170 -322 -376 -127 12
1899 12 498 494 405 213 222 -22 -172 -153 -338 215 508 528 265 118 -14 -336 -340 -226 -106 -188 145 282 456 336
$$ packed form
1745d52R9N07M28J75j70k08m65o72oJ07L14J92L37L26K71m02j72o58m5j50M25
1766b19J72K13N76k35l21k27m33l23J52P4O91L6K59K55l10o7o53j42j84K11L56
1787a19N52J48k16n5l67m26l1m7K45J41L70M23N0j8l10m84k58J0k10M20M71J54
1809D43L4K4m45r6k82l32L75J05M28Q3k2J89m1o41j51o1R1Q9M22L6L18N1l04j57
1833A56l13l61p1O61q5K61L6J2J06m45k41l13N7N1J57M98M67J05m70j73l10j57
1855c72q3L3L50L93j0K43q2m95l64J01k19J9L93K76M23J23j49m97l12l58L01j52
1877d38L79J95N5L43l50l9n96K06l97K38mL23L44K29k23N9m55l9j52n4K49J39
1899A2M86mq9j92Rk44j50J9j85N53K93K0k63j47j32l22mJ14J20q2L33J37J74j20
$$ plain form
1923 336 -69 -262 -209 -407 9 -104 251 166 480 245 -208 -132 -363 -510 80 91 177 238 191 325 -32 -115 -198
1946 -198 -456 -173 -55 314 132 352 308 105 -197 -356 -207 -295 -95 212 286 501 549 -13 -313 -291 -454 -368
1968 -368 -289 113 133 331 453 100 177 -307 -461 -370 -237 -198 214 158 434 -35 -86 94 -378 -314 -64 -42 119
1991 119 258 254 236 -89 -20 -307 -156 -177 42 65 175 97 72 293 -88 -361 -377 -323 167 -47 163 362 239
2014 239 253 -8 -320 -293 -407 122 33 153 379 204 78 -47 -270 -302 -179 -276 163 -287 360 329 244 326 -387
2037 -387 -431 -374 -28 -16 357 252 219 143 16 -241 -164 -477 -219 73 179 263 369 213 -139 -92 -326 -212 -284
2060 -284 17 15 -23 241 81 -64 80 -197 -271 -274 -56 422 536 315 482 -120 29 -520 -486 -309 -264 115 7
2083 7 383 210 32 -237 -98 -302 10 -112 219 400 517 71 133 -233 -335 -524 -461 -151 -155 57 354 444
$$ packed form
1923C36m05j93N3j98M16j13L55q5L14k35m53P6k31j47N90J1Q6O1m7J34l57q3q3
1946a98k58K83J18L69j82K20m4k03l02j59J49q8K00L07P4K15M8n62l00K2j63Q6
1968c68P9M02K0J98J22l53P7m84j54R1J33L9M12n6K76m69n1J80m72O4K50K2J61
1991A19J39mj8l25O9k87J51k1K19K3J10p8k5K21l81k73j6N4M90k14K10J99j23
2014B39J4k61l12K7j14N29q9J20K26j75j26j25k23l2J23r7M39m50O47l1q5Q2p13
2037c87m4N7L46J2L73j05l3p6j27k57P7l13K58K92J06Q4J06j56l52M7k34J14p2
2060b84L01kl8K64j60j45J44k77p4lK18M78J14k21J67o02J49n49L4J77M5L79j08
2083GL76j73j78k69J39k04L12j22L31J81J17m46O2l66j02j89O3L10mK12K97R0
$$ plain form
2105 444 144 -319 -252 -301 -320 -24 90 278 49 282 296 21 -474 -285 -155 -56 301 364 290 202 410 93 -58
2128 -58 -172 -256 -224 -117 109 212 -24 -3 46 -229 -88 -107 -101 239 -7 416 90 -32 180 -42 -139 -188 116
2151 116 64 51 109 71 338 141 -48 -128 -445 -405 381 282 17 376 -53 -284 -149 13 -219 88 57 -48 95
2174 95 -10 -215 -213 -152 -424 -59 -52 0 334 255 20 59 73 -163 -300 -145 -247 37 -83 201 373 22 222
2197 222 -25 66 -65 -149 -258 498 239 649 126 -141 234 -236 -14 -13 -149 22 17 181 372 -18 102 -17
2219 -17 -7 -289 -14 -16 105 257 332 113 -157 -2 -128 -271 -84 -176 156 274 456 334 230 73 -58 -150
2241 -150 -130 -395 -57 -74 131 300 169 -127 -29 -214 11 -166 120 229 253 183 1 33 74 -229 -309 -91 4
2264 4 -45 -27 50 -18 329 -287 -42 -164 188 50 213 408 60 94 67 -128 -180 -340 -307 -84 -52 209 235 222
$$ packed form
2105D44l00m63O7m9j9K96J14J88k29K33J4k75m95J89J30R9L57O3p4q8K08l17j51
2128e8j14q4L2J07K26J03k36K1M9k75J41j9OL40k46M23l26j22K12k22r7m9L04
2151A16n2j3N8l8K67j97j89q0l17M0P86r9k65L59m29k31J35J62k32L07l1j05J43
2174I5j05k05KO1k72L65PN2L34p9k35L9J4k36j37J55j02K84j20K84J72l51K00
2197B22k47R1j31q4j09P56k59M10n23k67L75m70K22Jj36J71nJ64J91l90J20j19
2219a7J0k82K75kJ21J52P5k19k70J55j26j43J87r2L32J18J82j22j04j57j31r2
2241a50K0k65L38j7K05J69j31k96R8j85K25j77K86J09K4p0j82L2M1l03q0K18R5
2264Dm9J8P7o8L47o16K45j22L52j38J63J95l48L4k7j95n2j60L3K23L2K61K6j3
$$ plain form
2288 222 172 -79 -122 -219 16 18 -6 332 268 169 174 -338 -184 -157 -148 -6 -98 91 395 254 -51 -168 -28 -291 -196
2313 -196 -14 25 165 37 60 154 103 -374 -395 -4 114 -229 320 67 192 168 205 -2 -50 -273 143 -29 78
2336 78 106 -12 19 -67 84 -181 -359 -211 42 245 167 251 180 -161 -181 -149 -49 -229 -230 98 -25 111 209 -245
2360 -245 -145 -235 24 47 289 241 67 189 -69 301 192 -108 203 -4 30 48 86 179 26 166 -220 125
2382 125 -116 81 -77 17 181 377 321 319 36 -142 -321 -109 171 32 329 -42 53 -17 -129 9 -34 -50 -405
2405 -405 163 21 276 184 299 -41 -117 -101 -160 -51 19 -83 31 157 6 141 -75 -200 -93 26 177 194
2427 194 270 -244 78 -66 -80 10 -223 -66 181 195 119 266 60 -14 -193 -5 -21 36 -103 384 -43 21 51
2450 51 49 -178 -114 -22 25 184 57 169 171 180 -24 -3 -57 -152 118 -76 105 27 76 -43 275 234 -152 -48 -53 90
$$ packed form
2288B22n0k51m3r7K35Kk4L38o4r9Nn12J54K7RJ42r2J89L04j41l05j17J40k63R5
2313a96J82L9J40j28K3R4n1m77k1L91J18l43N49k53J25k4L7k07m8k23M16j72J07
2336G8K8j18L1q6J51k65j78J48K53K03p8Q4p1l41k0L2J00j80jL28j23J36R8m54
2360b45J00r0K59K3K42m8j74J22k58L70j09l00L11k07L4J8L8R3j53J40l86L45
2382A25k41J97j58R4J64J96n6kk83j78j79K12K80j39K97l71R5p0j12J38m3j6l55
2405d05N68j42K55r2J15l40p6J6n9J09P0j02J14J26j51J35k16j25J07J19J51J7
2427A94P6n14L22j44j4R0k33J57K47J4p6J47k06p4j79J88j6N7j39M87m27O4L0
2450E1kk27O4R2M7J59j27J12KRk04K1n4r5K70j94J81p8M9j19L18m1l86J04nJ43
$$ plain form
2476 90 221 86 298 133 265 -81 -289 -152 -167 24 -42 79 27 210 72 240 -36 188 -144 -59 172 114
2498 114 -47 44 224 -109 -85 -168 -2 -149 -96 -95 63 211 24 -185 -176 47 -338 -127 27 39 -5 69 -1 143
2522 143 -23 123 -209 -117 48 78 149 215 -45 87 -146 48 49 78 -182 -183 61 -16 -50 21 1 46 80 -272 -42
2547 -42 87 104 201 169 -13 75 -221 81 73 -220 -219 -153 -180 49 55 81 -88 -192 -144 110 77 53 -13 137 30 37 -258
2574 -258 15 263 55 61 -46 120 205 -132 20 79 -150 -86 -50 -7 -59 187 28 -27 -35 89 7 -343 23 -149
2598 -149 185 20 14 220 42 -95 -112 -43 -242 -32 78 200 242 182 248 -171 -26 -164 69 164 103 40 -69
2621 -69 -157 186 25 -9 67 -104 26 -7 94 199 115 61 -239 6 -106 -88 18 179 -27 299 372 -170 231
2644 231 -403 -89 25 80 -4 -40 131 114 -200 -106 -77 93 -9 138 -149 -66 307 145 -40 217 -7 135
$$ packed form
2476I0J31j35K12j65J32l46k08J37j5J91o6J21n2J83j38J68k76K24l32Q5K31n8
2498A14j61R1J80l33K4q3J66j47N3JJ58J48j87k09RK23l85K11J54J2m4P4p0J44
2522A43j66J46l32R2J65L0P1O6k60J32k33J94JK9k60jK44p7l4P1k0M5L4l52K30
2547d2J29J7R7l2j82Q8k96L02qk93JO6k7K29OK6j69j04M8K54l3k4o6J50j07Pk95
2574b58K73K48k08Oj07J66Q5l37J52N9k29O4L6M3n2K46j59n5qJ24q2l50L66j72
2598a49L34j65oK06j78j37j7O9j99K10J10J22M2o0O6m19J45j38K33R5o1o3j09
2621f9q8L43j61l4P6j71J30l3J01J05q4n4l00K45j12J8J06J61k06L26P3n42M01
2644B31o34L14J14N5q4l6J71j7l14R4K9J70j02J47k87Q3L73j62j85K57k24J42
$$ plain form
2666 135 -161 -302 -37 90 126 108 -182 29 156 -136 74 -224 199 175 142 25 149 -179 -53 -128 22 63
2688 63 -4 213 -120 44 -133 -124 53 58 101 -481 -419 223 46 11 -17 -80 -189 92 -50 56 -90 -14 311 -35
2712 -35 267 186 0 -70 145 -125 -336 43 60 122 -32 296 27 -170 -118 -230 -138 -202 3 -52 222 -61 -277
2735 -277 -64 -128 18 73 72 110 -101 -47 -223 -120 -27 -25 3 -70 -96 -1 166 170 234 -22 -259 -52 -150 -205 11 -21
2761 -21 26 -185 178 -172 -55 -66 -27 -76 -116 215 23 149 279 167 -84 -267 -220 -42 95 69 31 -155 7
2784 7 325 50 64 -253 -121 118 -112 -10 -27 264 149 -41 -64 23 -103 -153 -104 20 69 88 -133 -121 -56 231
2808 231 27 -56 -114 -17 -78 -39 32 46 101 -237 251 -25 88 -58 -160 90 1 176 -138 -39 75 -111 133
$$ packed form
2666A35k96j41K65J27L6j8k90K11J27k92K10k98M23k4l3j17J24l28J26p5J50M1
2688F3o7K17l33J64j77RJ77NM3n82O2O42j77l5k8o3j09K81j42J06j46P6L25l46
2712c5L02q1j86p0K15k70k11L79J7O2j54L28k69j97N2j12R2o4K05n5K74k83k16
2735b77K13o4J46N5jL8k11N4j76J03R3KK8p3k6R5J67MO4k56k37K07r8n5K16l2
2761b1M7k11L63l50J17j1L9m9m0L31j92J26J30j12k51j83M7J78J37k6l8j86J62
2784GL18k75J4l17J32K39k30J02j7K91j15j90k3Q7j26n0M9J24M9J9k21J2O5K87
2808B31k04q3n8R7o1L9P1J4N5l38M88k76J13j46j02K50q9J75l14R9J14j86K44
$$ [...]
8191A73
##END NTUPLES=NMR FID
##END=
