##TITLE=1H_Pr Q-1
 200.13MHz, CDCl3,
 8 sc
 
 15.1.2025
##JCAMPDX= 6.0         $$ Bruker NMR JCAMP-DX V2.0
##DATA TYPE= NMR FID
##DATA CLASS= NTUPLES
##ORIGIN= UXNMR, Bruker Analytische Messtechnik GmbH
##OWNER= pz
$$ XWIN-NMR		Version 3.5
$$ Wed Jan 15 14:43:14 2025 Russian Standard Time (UT+4h)  she@DPX200
##.OBSERVE FREQUENCY= 200.1313
##.OBSERVE NUCLEUS= ^1H
##.DELAY= (6, 6)
##.ACQUISITION MODE= SIMULTANEOUS
##.ACQUISITION SCHEME= undefined
##.AVERAGES= 8
##.DIGITISER RES= 18
##SPECTROMETER/DATA SYSTEM= spect
##.PULSE SEQUENCE= zg30
##.SOLVENT NAME= DMSO
##.SHIFT REFERENCE= (INTERNAL, DMSO, 0, 14.3821)
##AUDIT TRAIL= $$ (NUMBER, WHEN, WHO, WHERE, WHAT)
$$ ##TITLE= Audit trail, XWIN-NMR		Version 3.5
$$ ##JCAMPDX= 5.01
$$ ##ORIGIN= Bruker BioSpin GmbH
$$ ##OWNER= she
$$ F:/spectra/data/she/nmr/H-C/1/audita.txt
$$ ##AUDIT TRAIL=  $$ (NUMBER, WHEN, WHO, WHERE, WHAT)
(   1,<2025-01-15 14:42:03.48 +0400>,<she>,<DPX200>,
      <created by zg, POWCHK disabled, PULCHK disabled
       configuration hash MD5:
       00 E9 B6 7A A2 85 ED C7 34 08 36 98 17 FE 4E 26
       data hash MD5: 16K
       B7 90 84 E2 A1 4E D5 6B B0 02 B0 38 59 BC 33 4D>)
$$ ##END=
$$ 
$$ hash MD5
$$ A8 B3 19 07 95 AA AE 6A 57 50 5C 1B 91 13 8D B0
##$RELAX= 
##$RELAX= 
##$RELAX= 
##$RELAX= 
##$RELAX= 
##$RELAX= 
$$ Bruker specific parameters
$$ --------------------------
##$DU= <F:/spectra>
##$EXPNO= 1
##$NAME= <H-C>
##$PROCNO= 1
##$TYPE= <nmr>
##$USER= <she>
##$AMP= (0..31)
100 100 100 100 100 100 100 100 100 100 100 100 100 100 100 100 100 100 
100 100 100 100 100 100 100 100 100 100 100 100 100 100 
##$AQSEQ= 0
##$AQ_mod= 1
##$AUNM= <au_zg>
##$AUTOPOS= <>
##$BF1= 200.13
##$BF2= 200.13
##$BF3= 200.13
##$BF4= 200.13
##$BF5= 200.13
##$BF6= 200.13
##$BF7= 200.13
##$BF8= 200.13
##$BYTORDA= 1
##$CFDGTYP= 0
##$CFRGTYP= 5
##$CHEMSTR= <none>
##$CNST= (0..31)
1 1 145 1 1 1 1 1 1 1 1 1 1 1 1 1 1 1 1 1 1 1 1 1 1 1 1 1 1 1 1 1 
##$CPDPRG= <>
##$CPDPRG1= <>
##$CPDPRG2= <>
##$CPDPRG3= <>
##$CPDPRG4= <mlev>
##$CPDPRG5= <mlev>
##$CPDPRG6= <mlev>
##$CPDPRG7= <mlev>
##$CPDPRG8= <mlev>
##$CPDPRGB= <>
##$CPDPRGT= <>
##$D= (0..31)
0 0.7 0 0 0 0 0 0 0 0 0 0.03 0 0 0 0 0 0 0 0 0 0 0 0 0 0 0 0 0 0 0 0 
##$DATE= 1736937722
##$DBL= (0..7)
120 120 120 120 120 120 120 120 
##$DBP= (0..7)
150 150 150 150 150 150 150 150 
##$DBP07= 0
##$DBPNAM0= <>
##$DBPNAM1= <>
##$DBPNAM2= <>
##$DBPNAM3= <>
##$DBPNAM4= <>
##$DBPNAM5= <>
##$DBPNAM6= <>
##$DBPNAM7= <>
##$DBPOAL= (0..7)
0.5 0.5 0.5 0.5 0.5 0.5 0.5 0.5 
##$DBPOFFS= (0..7)
0 0 0 0 0 0 0 0 
##$DE= 6
##$DECBNUC= <off>
##$DECIM= 32
##$DECNUC= <off>
##$DECSTAT= 4
##$DIGMOD= 1
##$DIGTYP= 9
##$DL= (0..7)
0 120 120 120 120 120 120 120 
##$DP= (0..7)
150 150 150 150 150 150 150 150 
##$DP07= 0
##$DPNAME0= <>
##$DPNAME1= <>
##$DPNAME2= <>
##$DPNAME3= <>
##$DPNAME4= <>
##$DPNAME5= <>
##$DPNAME6= <>
##$DPNAME7= <>
##$DPOAL= (0..7)
0.5 0.5 0.5 0.5 0.5 0.5 0.5 0.5 
##$DPOFFS= (0..7)
0 0 0 0 0 0 0 0 
##$DQDMODE= 0
##$DR= 18
##$DS= 0
##$DSLIST= <SSSSSSSSSSSSSSS>
$$ [...]
##$SUBNAM0= <"">
##$SUBNAM1= <"">
##$SUBNAM2= <"">
##$SUBNAM3= <"">
##$SUBNAM4= <"">
##$SUBNAM5= <"">
##$SUBNAM6= <"">
##$SUBNAM7= <"">
##$SUBNAM8= <"">
##$SUBNAM9= <"">
##$SW= 18.0517328524113
##$SWIBOX= (0..15)
0 0 2 0 0 0 0 0 0 0 0 0 0 0 0 0 
##$SW_h= 3612.71676300578
##$TD= 16384
##$TD0= 1
##$TE= 0
##$TE2= 300
##$TE3= 300
##$TEG= 300
##$TL= (0..7)
0 120 120 120 120 120 120 120 
##$TP= (0..7)
150 150 150 150 150 150 150 150 
##$TP07= 0
##$TPNAME0= <>
##$TPNAME1= <>
##$TPNAME2= <>
##$TPNAME3= <>
##$TPNAME4= <>
##$TPNAME5= <>
##$TPNAME6= <>
##$TPNAME7= <>
##$TPOAL= (0..7)
0.5 0.5 0.5 0.5 0.5 0.5 0.5 0.5 
##$TPOFFS= (0..7)
0 0 0 0 0 0 0 0 
##$TUNHIN= 0
##$TUNHOUT= 0
##$TUNXOUT= 0
##$USERA1= <user>
##$USERA2= <user>
##$USERA3= <user>
##$USERA4= <user>
##$USERA5= <user>
##$V9= 5
##$VALIST= <valist>
##$VCLIST= <CCCCCCCCCCCCCCC>
##$VD= 0
##$VDLIST= <DDDDDDDDDDDDDDD>
##$VPLIST= <PPPPPPPPPPPPPPP>
##$VTLIST= <TTTTTTTTTTTTTTT>
##$WBST= 1024
##$WBSW= 4
##$XGAIN= (0..3)
0 0 0 0 
##$XL= 0
##$YL= 0
##$YMAX_a= 465067
##$YMIN_a= -482774
##$ZGOPTNS= <>
##$ZL1= 120
##$ZL2= 120
##$ZL3= 120
##$ZL4= 120
##$ABSF1= 10
##$ABSF2= 0
##$ABSG= 5
##$ABSL= 3
##$ALPHA= 0
##$AQORDER= 0
##$ASSFAC= 0
##$ASSFACI= 0
##$ASSFACX= 0
##$ASSWID= 0
##$AUNMP= <proc_1d>
##$AZFE= 0.1
##$AZFW= 0.1
##$BCFW= 1
##$BC_mod= 2
##$BYTORDP= 1
##$COROFFS= 0
##$CY= -3
##$DATMOD= 1
##$DC= 2
##$DFILT= <>
##$DTYPP= 0
##$F1P= 0
##$F2P= 0
##$FCOR= 0.5
##$FTSIZE= 0
##$FT_mod= 4
##$GAMMA= 1
##$GB= 0.15
##$INTBC= 1
##$INTSCL= 1
##$ISEN= 128
##$LB= 0.25
##$LEV0= 0
##$LPBIN= 0
##$MAXI= 10000
##$MC2= 0
##$MEAN= 0
##$ME_mod= 0
##$MI= 1.114404
##$NCOEF= 0
##$NC_proc= 0
##$NLEV= 6
##$NOISF1= 3.799351
##$NOISF2= 2.8
##$NSP= 1
##$NTH_PI= 0
##$NZP= 0
##$OFFSET= 14.38212
##$PC= 1
##$PHC0= 253.733
##$PHC1= 9.7922
##$PH_mod= 1
##$PKNL= yes
##$PPARMOD= 0
##$PSCAL= 0
##$PSIGN= 0
##$REVERSE= no
##$SF= 200.129724274929
##$SI= 16384
##$SIGF1= 3
##$SIGF2= 2
##$SINO= 400
##$SIOLD= 16384
##$SREGLST= <1H.CDCl3>
##$SSB= 0
##$STSI= 0
##$STSR= 0
##$SW_p= 3205.1282051282
##$SYMM= 0
##$S_DEV= 0
##$TDeff= 0
##$TDoff= 0
##$TI= <>
##$TILT= no
##$TM1= 0
##$TM2= 0
##$TOPLEV= 0
##$USERP1= <user>
##$USERP2= <user>
##$USERP3= <user>
##$USERP4= <user>
##$USERP5= <user>
##$WDW= 1
##$XDIM= 8192
##$YMAX_p= 0
##$YMIN_p= 0
$$ End of Bruker specific parameters
$$ ---------------------------------
##NTUPLES= NMR FID
##VAR_NAME=  TIME,          FID/REAL,        FID/IMAG
##SYMBOL=    X,             R,               I
##VAR_TYPE=  INDEPENDENT,   DEPENDENT,       DEPENDENT
##VAR_FORM=  AFFN,          ASDF,            ASDF
##VAR_DIM=   8192,          8192,            8192
##UNITS=     SECONDS,       ARBITRARY UNITS, ARBITRARY UNITS
##FACTOR=    0.0002768,     1,               1
##FIRST=     0,             0,               0
##LAST=      2.2672688,     0,               0
##MIN=       0,             -482774,         0
##MAX=       2.2672688,     465067,          0
$$ Real data points
##PAGE= N=1
##DATA TABLE= (X++(R..R)), XYDATA
$$ [...]
$$ plain form
2068 -323 -680 672 247 600 601 -808 633 60 -1028 313 -208 -832 848 -392 -910 154 -515 323
2086 323 181 -993 860 683 -703 703 834 -242 -10 -493 709 718 -1550 -300 1000 -552 -322
2103 -322 -476 -165 656 -956 -629 1310 -319 -431 609 318 887 -415 -780 1800 310 -1081 681
2120 681 176 -36 -126 -613 471 -216 -1461 700 402 -912 319 73 43 866 -314 424 723 -396
2138 -396 639 666 -581 227 47 -212 236 -959 -411 1165 -1249 -468 411 -58 205 -423 -93 1402
2156 1402 -598 -810 1513 402 -457 82 51 891 -221 -1513 1004 93 -1306 207 79 -77 342
2173 342 -1220 222 879 -1100 138 586 -609 456 43 193 1050 -673 -50 1216 -1013 -598 491
2190 491 -608 -22 -210 -759 648 -886 -737 1229 -454 -478 708 -246 515 284 -766 1206 480 -1263
$$ packed form
2068c23l57J352m25L53Jj409J441n73j088J341n21o24J680j240n18J064o69Q38
2086C23j42j174J853j77j386J406J31j076K32m83J202Rk268J250J300j552K30
2103c22j54L11Q21j612L27J939j629j12J040k91N69j302l65K580j490j391J762
2120F81n05k12r0m87J084o87j245K161k98j314J231k46l0Q23j180P38K99j119
2138c96J035K7j247Q08j80k59M48j195N48J576k414P81Q79m69K63o28L30J495
2156A402k000k12K323j111q59N39l1Q40j112j292K517r11j399J513j28j56M19
2173C42j562J442O57j979J238M48j195J065m13J50Q57j723O23J266k229M15J089
2190D91j099N86j88n49J407j534J49J966j683k4J186r54P61k31j050J972p26j743
$$ plain form
2208 -1263 778 302 -420 132 -843 559 382 -1454 505 1241 -1053 -214 -14 -30 701 -837 -10 1566
2226 1566 -929 -137 908 -279 166 74 -620 708 -560 -1207 1242 -354 -884 420 -316 245 278 -924
2244 -924 1072 403 -1025 1060 543 -381 318 -373 544 547 -1228 496 754 -1398 -143 250 -623 396
2262 396 -914 -215 1011 -975 -484 1221 -153 -8 411 -295 1155 -59 -471 1342 -318 -798 807
2279 807 -589 -300 201 -1032 393 -170 -1297 600 -30 -1048 269 -329 537 717 -634 673 1079
2296 1079 -960 82 813 -295 160 -644 102 521 -1254 -301 968 -378 -309 368 -235 661 -175 -231
2314 -231 1053 189 -464 642 -153 362 -31 -850 642 245 -792 331 -11 -574 333 -482 -227 96
2332 96 -257 363 826 -864 540 700 -191 434 73 83 290 -639 269 1107 -497 -431 406 -338 271 -810
$$ packed form
2208a263K041m76p22N52r75J402j77j836J959P36k294Q39K00j6P31j538Q27J576
2226A566k495P92J045j187M45r2o94J328j268o47K449j596n30J304p36N61L3j202
2244i24J996o69j428K085n17r24O99o91R17Lj775J724K58k152J255L93q73J019
2262C96j310O99J226j986M91J705j374J45M19p06J450j214m12J813j660m80J605
2279H07j396K89N01j233J425n63j127J897o30j018J317n98Q66J80j351J307M06
2296A079k039J042P31j108M55q04P46M19j775R53J269j346O9O77o03Q96q36n6
2314b31J284q64o53J106p95N15l93q19J492l97j037J123l42n63R07q15K55L23
2332I6l53O20M63j690J404J60q91O25l61J0K07r29R08Q38j604O6Q37p44O09j081
$$ plain form
2352 -810 -666 701 -368 -245 832 -215 216 420 -66 705 -110 -833 1033 199 -550 360 -415 81
2370 81 333 -847 -248 48 -884 359 -38 -445 483 -359 210 875 -171 120 599 -443 413 106 -893
2389 -893 165 -98 -463 401 -1326 -312 674 -698 -382 41 -386 619 -42 -462 1345 22 -411 728
2407 728 93 142 139 -803 445 231 -1214 235 101 -408 225 -789 -241 732 -624 -83 643 -514 380
2426 380 505 87 514 213 -361 1086 -146 -251 715 -924 330 254 -964 -166 -47 -438 435 -749
2444 -749 -661 780 -702 -205 739 -430 194 363 -322 782 137 -713 300 81 21 284 -1400 -100
2462 -100 482 -928 -45 345 -259 515 -101 -525 915 -381 -178 667 -266 227 436 -699 857 164
2480 164 -1193 150 -13 -710 323 -784 -425 769 -674 -189 366 -265 560 11 -407 1057 -92
$$ packed form
2352h10J44J367j069J23J077j047M31K04m86P71q15p23J866q34p49R10p75M96
2370H1K52j180N99K96r32J243l97m07R28q42N69O65j046K91M79j042Q56l07r99
2389h93J058k63l65Q64j727J014R86j372L16M23m27J005o61m20J807j323m33J139
2407G28o35M9lr42J248k14j445J449j34n09O33j014N48R73j356N41P26j157Q94
2426C80J25m18M27l01n74J447j232j05R66j639J254p6j218P98J19l91Q73j184
2444g49Q8J441j482M97R44j169O24J69o85J104o45q50J013k19o0K63j684J300
2462a00N82j410Q83L90o04P74o16m24J440j296K03Q45r33M93K09j135J556o93
2480A64j357J343j63o97J033j107L59J194j443M85N55o31Q25n49m18J464j149
$$ plain form
2497 -92 -451 735 2 -21 311 -761 276 423 -1033 -98 304 -287 351 -667 -431 642 -436 -13
2515 -13 894 -411 373 515 -168 735 64 -622 706 -70 -257 306 -940 88 309 -870 -236 -58 -487
2534 -487 202 -164 -591 892 -191 26 721 -15 54 505 -407 634 345 -1054 116 209 -430 -192 -778
2553 -778 -103 648 -847 368 448 -251 136 282 316 799 -427 -337 1034 -82 78 23 -214 286 -202 -995
2573 -995 263 -106 -712 521 -384 -170 341 -379 456 179 -547 429 296 -363 671 78 -127 349 -52
2592 -52 402 -46 -574 224 383 -509 67 37 49 292 -564 -82 820 -459 -40 833 -14 52 -161 179 812
2613 812 -379 -603 533 -200 -386 -141 -371 266 -123 -717 436 -79 -438 730 -97 127 634 35 365
2632 365 432 -354 241 172 -362 165 -118 -559 82 -507 -68 178 -567 165 481 -297 171 18 89 765 -523
$$ packed form
2497i2l59J186p33k3L32j072J037J47j456R35M02n91O38j018K36J073j078M23
2515a3R07j305P84J42o83R03o71o86J328p76j87N63j246J028K21j179O34J78m29
2534d87O89l66m27J483j083K17O95p36O9M51r12J041k89j399J170R3o39K38n86
2553g78O75P51j495J215Q0o99L87J46L4M83j226R0J371j116J60n5k37N00m88p93
2573i95J258l69o06J233r05K14N11p20Q35k77p26R76j33o59J034n93k05M76m01
2592e2M54m48n28P98J59q92N76l0J2K43q56M82R02j279M19Q73q47O6k13L40O33
2613H12j191k24J136p33j86K45k30O37l89n94J153n15l59J168q27K24N07n99L30
2632C65O7p86N95o9n34N27k83m41O41n89M39K46p45P32L16p78M68j53P1O76j288
$$ plain form
2653 -523 -48 977 -205 -611 514 76 -55 -328 -696 719 -525 -896 506 124 -471 12 -445 686
2671 686 424 -781 361 567 -654 309 55 -192 383 -727 -7 1003 -753 -309 376 -469 187 -74
2689 -74 -318 202 -434 -163 471 -476 3 693 122 227 96 86 640 -51 -485 955 -205 -677 389 -208
2709 -208 146 145 -895 550 320 -835 336 500 -167 294 -361 150 832 -970 29 848 -381 -45 -101
2728 -101 67 327 -698 -440 863 -451 -524 460 2 -34 210 -398 705 66 -401 985 -224 -225 483
2747 483 -51 -87 -120 -706 362 401 -1236 395 245 -483 99 -342 90 537 -653 172 969 -488 30
2766 30 463 -271 590 -276 -134 524 -525 -313 284 -284 -362 -413 -336 370 -19 -372 482 287 -589 557 17
2787 17 249 269 -291 484 211 -818 372 173 -418 -131 -411 -103 341 -757 213 858 -650 32 321
$$ packed form
2653e23M75J025j182m06J125m38j31k73l68J415j244l71J402l82n95M83m57J131
2671F86k62j205J142K06j221R63k54k47N75j110P20J010j756M44O85q45O56k61
2689g4k44N20o36K71O34r47M79O90n71J05j31j0N54o91m34J440j160m72J066n97
2709b08L54jj040J445k30j155J171J64o67M61o55N11O82j802R99Q19j229L36n6
2728a01J68K60j025K58J303j314p3R84m58l6K44o08J103o39m67J386j209jP08
2747D83n34l6l3n86J068L9j637J631j50p28N82m41M32M47j190Q25P97j457N18
2766C0M33p34Q61q66J42O58j049K12N97n68p8n1P7P06l89l53Q54j95q76J146n40
2787A7K32K0n60P75k73j029J190j99n91K87k80L08M44j098R70O45j508O82K89
$$ plain form
2806 321 -45 43 -173 43 660 -447 -207 604 73 -298 -233 -341 385 -112 -415 415 -128 -517 394 31
2826 31 42 -80 -366 558 281 -551 523 611 -71 238 -13 -112 305 -498 186 288 -741 -75 325 -309 -121
2847 -121 -356 54 529 -415 -202 526 -38 -244 194 -192 76 -287 -188 993 -102 -415 267 -8 -151 -106
2867 -106 -536 384 119 -609 390 462 -276 254 118 416 484 -492 385 529 -184 -204 57 -504 105 -274 -154
2888 -154 213 -527 -34 751 -212 2 249 37 465 32 -190 565 15 -201 679 -62 -242 234 -160 374
2908 374 -416 -703 530 296 -387 -59 63 19 270 -559 570 780 -437 390 439 -466 117 -285 206 782
2928 782 -421 -536 500 -400 9 -19 -552 291 -147 -670 500 -381 -226 693 -277 125 332 -431 287
2947 287 44 -488 373 -166 -165 288 55 -512 -54 -333 174 189 -617 234 551 -395 339 178 99 708 -328
$$ packed form
2806C21l66Q8k16K16O17j107K40Q11n31l71O5j08P26m97l03Q30n43l89R11l63
2826C1J1j22k86R24k77q32J074Q8o82L09k51r9M17q03O84J02j029O66M00o34J88
2847a21k35M10M75r44K13P28n64k06M38l86K68l63R9J181j095l13O82k75j43M5
2867a06m30R20k65p28R99P2p38N30j36K98O8r76Q77J44p13k0K61n61O09l79J20
2888a54L67p40M93P85r63K14K47k12M28m33k22P55n50k16Q80p41j80M76l94N34
2908C74p90k87J233k34o83L28J22m4K51q29J129K10j217Q27M9r05N83m02M91N76
2928G82j203j15J036r00M09k8n33Q43m38n23J170q81J55R19r70M02K07p63P18
2947B87k43n32Q61n39JM53k33n67M58k79N07J5q06Q51L17r46P34j61p9O09j036
$$ plain form
2968 -328 320 624 -580 -152 767 -489 103 -307 -588 668 -108 -504 356 -276 -169 490 -172 137 331
2987 331 -513 502 188 -388 275 -35 -153 292 -522 -43 106 -734 62 130 -639 190 108 -441 499 -39
3007 -39 -172 610 -361 204 354 -560 312 495 -185 261 -191 -480 748 -347 -207 34 -270 68 21 -442
3027 -442 302 -15 -167 345 407 -290 363 -161 290 265 -598 80 331 -346 208 -711 -396 406 -523 -178 188
3048 188 -356 61 423 -207 559 169 -149 388 233 -141 206 -298 261 505 -271 -106 -109 -430 157 -362 -568
3069 -568 455 295 -514 524 -226 129 195 -154 304 468 -289 239 -24 34 279 -792 -156 435 -333 250
3089 250 -428 -633 443 52 -371 109 -109 -196 613 -321 353 558 -242 225 481 -222 210 -105 -285 313
3109 313 -473 -284 233 -576 -344 436 -234 73 -151 -408 323 -98 -476 450 166 298 367 95 174 285 -169
$$ packed form
2968c28O48L04j204M28R19j256N92m10k81J256p76l96Q60o32J07O59o62L09J94
2987C31q44J015l14n76O63l10j18M45q14M79J49q40P96O8p69Q29q2n49R40n38
3007c9j33P82r71N65J50r14Q72J83o80M46m52k89J228j095J40K41l04L38m7m63
3027d42P44l17j52N12O2o97O53n24M51k5q63O78K51o77N54r19L15Q02r29L45L66
3048A88n44M17L62o30P66l90l18N37j55l74L47n04N59K44p76J65ll21N87n19k06
3069e68J023j60q09J038p50L55O6l49M58J64p57N28k63N8K45j071O36N91p68N83
3089B50o78k05J076l91m23M80k18q7Q09r34O74K05q00M67K56p03M32l15j80N98
3109C13p86J89N17q09K32P80o70L07k24k57P31m21l78R26k84J32O9k72P9J11m54
$$ plain form
3130 -169 -106 -25 -338 78 -302 -233 333 -261 -233 135 -255 281 446 -45 586 215 -116 243 -267 95 426
3151 426 -387 -203 436 -329 -192 132 -232 288 -131 -632 616 -300 -434 419 257 312 132 -620 397 234
3171 234 -363 270 -50 -407 410 -282 229 164 -773 133 495 -392 186 166 -374 736 -56 -231 387 -50
3191 -50 104 465 -228 419 338 -594 254 -477 -140 485 -445 -402 302 -88 58 211 -67 448 77 -150 518
3212 518 440 -254 478 6 -170 561 -429 117 432 -494 146 -5 -442 261 -496 -138 521 -453 -177 388
3232 388 -78 -84 167 -131 226 -133 -102 468 -251 -250 448 -490 -211 348 -323 -71 -151 -294 374 164 258 328 -128
3255 -128 -246 302 -305 153 448 -325 -23 339 -204 160 6 -68 395 -359 -364 316 -416 44 312 -276 109
3276 109 -102 -229 555 133 -160 550 -153 174 270 -238 597 8 -474 212 -100 -346 7 -216 29 304
$$ packed form
3130a69O3Q1l13M16l80O9N66n94K8L68l90N36J65m91O31l71l31L59n10L62L31
3151D26q13J84O39p65J37L24l64N20m19n01J248r16j34Q53j62N5j80p52J017j63
3171B34n97O33l20l57Q17o92N11o5r37R06L62q87N78k0n40J110p92j75O18m37
3191e0J54L61o93O47q1r32Q48p31L37O25r30M3P04l90J46J53k78N15l71k27O68
3212E18p8o94P32m72j76P31r90N46L15r26O40j51m37P03p57L58O59r74K76N65
3232C88m66oK51k98L57l59L1N70p19JO98r38K79N59o71K52q0j43O68k10R4P0m56
3255a28j18N48o07M58K95p73L02L62n43L64j54p4M63p54nO80p32M60K68n88L85
3276A09k11j27P84m22k93P10p03L27R6n08Q35n89m82O86l12k46L53k23K45K75
$$ plain form
3296 304 -413 -96 339 -124 493 76 -406 336 201 75 527 -343 -47 258 -507 -7 299 -205 313 221
3316 221 -231 275 -181 -202 407 -231 205 241 -108 419 -35 -300 279 131 -398 288 -369 -313 183 -610 123
3337 123 33 -519 348 24 -258 215 -128 -91 308 -289 22 543 -352 337 286 -420 11 38 -266 169 -356
3358 -356 -114 139 -162 -136 202 -32 333 364 -302 640 23 -294 589 -206 76 385 -376 92 194 -460 225
3379 225 125 -415 59 -196 -248 278 -344 -240 381 -360 160 197 238 319 210 -166 446 -138 -239 152 -301
3400 -301 -272 307 -477 -58 180 -270 340 6 -343 331 -196 35 607 -204 -72 115 -196 320 213 -690
3420 -690 390 -122 -134 125 -464 94 441 -417 108 -8 -322 478 469 42 171 -247 -174 698 41 -141 288
3441 288 -542 228 57 -181 222 40 -767 134 -263 -327 292 -135 100 319 -150 122 157 -131 405 128 -240
$$ packed form
3296C04p17L17M35m63O17m17m82P42j35j26M52q70K96L05p65N00L06n04N18r2
3316B21m52N06m56k1O09o38M36L6l49N27m54k65N79j48n29O86o57N6M96p93P33
3337A23r0n52Q67l24k82M73l43L7L99n97L11N21q95O89n1p06M31K7l04M35n25
3358c56K42K53l01K6L38k34L65L1o66R42o17l17Q83p95K82L09p61M68J02o54O85
3379B25j00n40M74k55n2N26o22J04O21p41N20L7M1Q1j09l76O12n84j01L91m53
3400c01K9N79p84M19K38m50O10l34l49O74n27K31N72q11J32J87l11N16j07r03
3420f90J080n12j2K59n89N58L47q58N25j16l14Q00rm27J29m18P3Q72o57j82M29
3441B88q30P70j71k38M03j82q07R01l97o4O19m27K35K19m69K72L5k88N36k77l68
$$ plain form
3462 -240 368 109 -231 186 -523 116 14 -346 100 -194 -439 84 -256 -258 450 108 -85 384 172 202 26
3483 26 -130 283 108 -313 710 -233 -32 50 -251 -343 91 -248 -183 21 -300 55 33 -18 465 -103 45 246
3505 246 -147 333 279 -258 534 264 -345 315 -317 -300 216 -147 -330 231 -332 122 203 -9 328 298 -35
3526 -35 379 35 77 489 -135 114 73 -559 -27 307 -273 -92 -139 -147 377 -322 -134 269 -53 -18 282 -63
3548 -63 85 92 -503 174 129 56 147 -331 71 19 -808 103 122 -157 170 -79 -425 70 -98 95 516 -149 -74
3571 -74 261 -26 347 -187 -101 64 131 -114 416 -229 85 331 -485 101 76 -65 202 28 17 299 58 26
3593 26 466 -169 -89 32 -376 214 11 -315 268 205 -387 152 -287 79 313 -216 34 293 -191 337 556
3614 556 -174 421 -71 -92 340 -164 -194 221 -212 -82 -194 -280 45 -145 -335 436 -65 -155 313 -85 -199
$$ packed form
3462b40O08k59l40M17p09O39j02l60M46k94k45N23l40kP08l42j93M69k12L0j76
3483B6j56M13j75m21J023r43K01Q2l01r2M34l39O5K04l21L55k2n1M83n68J48K01
3505B46l93M80n4n37P92k70o09O60o32J7N16l63j83N61n63M54Q1k12L37l0l33
3526c5M14l44M2M12o24K49m1o32N32L34n80J81m7qN24o99J88M03l22L5L00l45
3548f3J48Pn95O77m5p3R1m78M02n2q27R11J9k79L27k49l46M95j68J93M21o65P5
3571g4L35k87L73n34Q6J65O7k45N30o45L14K46q16N86k5j41K67j74j1K82k41l2
3593B6M40o35Q0J21m08N90k03l26N83o3n92N39m39L66K34n29K50K59m84N28K19
3614E56p30N95m92k1M32n04l0M15m33J30j12q6L25j90j90P71n01r0M68l98j14
$$ plain form
3635 -199 159 127 63 364 120 243 6 -389 417 87 -50 170 -626 -214 220 -526 90 305 -526 -156 -125
3656 -125 29 343 -103 -75 562 -147 -100 320 -85 236 57 -431 471 -306 -257 231 -321 -254 19 -352 103
3677 103 222 -377 122 -196 -265 308 -42 70 458 -89 116 201 -191 206 457 -189 231 -1 -212 219 -113
3698 -113 -274 578 -235 -34 276 -189 -26 267 -122 418 -71 -163 25 19 -189 285 -216 -335 158 -313 -61
3719 -61 -24 -319 161 198 -149 372 -128 164 539 -311 104 90 -325 140 -35 -93 -41 -191 -238 323 -320 -262 99
3742 99 -92 -27 14 -343 427 91 -188 516 -243 95 295 -215 146 159 -278 -48 204 -283 258 -298 -202 187
3764 187 -182 -138 259 -130 86 245 -151 304 362 15 426 176 -86 510 -214 -10 -171 -162 -73 103 -447 142
3786 142 40 -279 112 -122 -36 231 -87 202 97 -206 -39 -28 -58 352 -199 16 -249 -78 124 82 -253
$$ packed form
3635a99L58l2o4L01k44J23k37l95Q06l30j37K20p96M12M34p46O16K15q31L70L1
3656a25J54L14m46K8O37p09M7M20m05L21j79m88R02p77M9M88n52O7K73l71M55
3677A03J19n99M99l18o9N73l50J12L88n47K05Q5l92L97K51o46M20k32k11M31l32
3698a13j61Q52q13K01L10m65J63K93l89N40m89r2J88ok08M74n01j19M93m71K52
3719f1L7k95M80L7l47N21n00K92L75q50M15j4m15M65j75n8N2j50m7N61o43N8L61
3742I9j91O5M1l57P70l36k79P04p59L38K00n10L61J3m37K30K52m87N41n56R6L89
3764A87l69M4L97l89K16J59l96M55N8l47M11k50k62N96p24K04j61RQ9J76n50N89
3786A42j02l19L91k34Q6K67l18K89j05l03J67J1l0M10n51K15k65J71K02m2l35
$$ plain form
3807 -253 -88 -184 -180 205 -14 -196 -59 16 -51 164 22 -261 90 34 156 -119 -203 485 -110 -240 81 -5 -332
3830 -332 -74 -93 -71 6 -308 299 120 15 371 174 -73 280 -221 -2 215 -410 163 225 -233 -110 -85 -248
3852 -248 175 -110 198 299 -249 92 410 -31 -33 302 256 444 29 37 327 31 237 322 -225 202 -204 -478
3874 -478 109 -42 -380 199 -77 -225 -102 -55 406 252 -232 95 298 -98 134 33 -108 141 -250 -351
3894 -351 320 -334 137 -120 -53 -172 -23 5 244 83 -212 99 -78 149 469 95 38 -101 -187 42 155
3915 155 -359 267 -67 -220 267 -214 240 478 57 119 -7 -272 365 62 -77 92 -186 188 415 -227
3935 -227 -155 168 -410 77 226 -227 0 -9 -141 6 -280 -118 541 -57 78 57 -103 424 -134 19 36 104
3957 104 -220 -22 120 -62 71 -325 100 115 -267 7 233 -175 123 -283 -88 339 -156 18 254 -367
$$ packed form
3807b53J65r6ML85k19j82J37P5o7K15j42k83L51n6J22k75q4O88n95j30L21q6l27
3830c32K58j9K2P7l14O07j79j05L56j97k47L53n01K19K17o25N73O2m58J23K5j63
3852b48M23k85L08J01n48L41L18m41kL35m6J88m15QK90k96K06Q5n47M27m06k74
3874d78N87j51l38N79k76j48J23M7M61j54m84L27K03l96K32j01j41K49l91j01
3894c51O71o54M71k57O7j19J49K8K39j61k95L11j77K27L20l74n7j39q6K29J13
3915A55n14O26l34j53M87m81M54K38m21O2j26k65O37l03j39J69k78L74K27o42
3935b27P2L23n78M87J49m53K27rj32J47k86J62O59n98J35k1j60N27n58J53J7O8
3957A04l24J98J42j82J33l96M25J5l82K74K26m08K98m06J95M27m95J74K36o21
$$ plain form
3977 -367 -6 115 45 235 -34 -252 59 -143 -117 126 -322 269 79 -205 146 82 -184 174 8 -164 271
3998 271 -2 164 297 -222 260 309 -417 28 0 -673 73 -115 -149 13 -101 78 188 -244 178 -11 -305
4019 -305 59 15 -16 354 80 -52 69 -13 172 -296 -59 38 -397 -160 -13 180 -58 136 169 346 221 -282
4041 -282 134 404 -297 -30 -68 -135 107 18 69 144 75 -64 -24 -316 1 141 -134 83 -76 260 13 107 -137
4064 -137 123 -165 -155 79 -178 -83 138 -265 -8 -146 -163 70 -157 161 -240 -358 139 64 -242 384 -99
4085 -99 -157 171 -17 45 -32 -354 19 -1 -182 345 -63 56 -97 138 -321 179 -304 126 -300 -252 313 166
4107 166 -265 82 144 -267 309 -68 138 121 -228 105 82 -246 72 -138 -149 5 -78 -104 201 56 -217 200
4129 200 -70 273 141 -249 130 359 -124 336 37 -293 388 96 7 183 -214 82 -7 70 124 133 -121 344
$$ packed form
3977c67L61J21p0J90k69k18L11k02K6K43m48N91j90k84L51o4k66L58j66j72M35
3998B71k73J66J33n19M82M9p26M45k8o73P46j88l4J62j14J79J10m32M22j89k94
4019c05L64m4l1L70k74j32J21q2J85m68K37R7m35K37J47J93k38J94L3J77j25n03
4041b82M16K70p01K67l8o7K42q9N1P5o9j39M0k92L17J40k75K17j59L36k47R4k44
4064a37K60k88J0K34k57R5K21m03K57j38j7K33k27L18m01j18M97p5l06O26m83
4085i9n8L28j88O2p7l22L73k0j81N27m08J19j53K35m59N00m83M30m26M8N65j47
4107A66m31L47O2m11N76l77K06j7l49L33k3l28L18k10j1J54q3k6L05j45k73M17
4129B00k70L43j32l90L79K29m83M60k99l30O81k92q9J76l97K96q9P7N4Rk54M65
$$ plain form
4151 344 -63 -178 268 -81 47 239 -390 88 66 -155 -92 -162 -318 78 -225 -139 134 -167 -139 230 -244 235
4173 235 47 -296 339 12 297 181 211 377 47 -224 78 -88 -67 10 306 9 79 -11 -299 120 203 50
4195 50 247 -180 38 259 -316 -17 149 -53 47 -137 123 167 -314 -380 147 -409 -5 27 -358 409 -119
4216 -119 -136 157 54 -34 3 -134 124 23 -213 263 12 -91 79 31 -285 146 -255 -110 516 -120 -111 13
4238 13 68 125 129 -24 278 -21 -60 299 -222 95 42 -142 133 172 -337 -14 -55 -174 190 -141 198 93 114
4261 114 288 197 -196 -44 171 -18 87 -74 -51 158 208 -107 107 -81 20 267 -125 178 -62 80 114
4282 114 -117 -158 127 88 -232 193 -109 -26 102 -307 133 -24 -276 358 -94 -57 109 -67 53 133 -396 188
4304 188 -97 30 81 129 34 99 -182 24 154 46 74 75 -27 -94 131 -104 230 -25 -326 242 -72 -39 13
$$ packed form
4151C44m07j15M46l49J28J92o29M78k2k21O3p0j56L96l03Q6K73l01K8L69m74M79
4173B35j88l43O35l27K85j16L0J66l30k71L02j66K1P7K96k97P0r0k88M19Q3j53
4195E0J97m27K18K21n75K99J66k02J00j84K60M4m81o6N27n56M04L2l85P67n28
4216a19j7K93j03q8L7j37K58j01k36M76k51j03J70m8l16M31m01J45O26o36RJ24
4238A3N5N7Mj53L02k99l9L59n21L17n3j84K75L9n09L23m1j19L64l31L39j05K1
4261A14J74r1l93J52K15j89J05j61K3K09N0l15K14j88J01K47l92L03k40J42L4
4282A14k31m1K85l9l20M25l02Q3J28m09M40j57k52O34m52L7J66j76J20Q0n29N84
4304A88k85J27N1M8r5O5k81K06J30j08K8Jj02o7K25k35L34k55l01N68l14L3N2
$$ plain form
4327 13 -234 171 87 16 100 -148 -6 132 113 100 197 -52 -342 176 -285 -4 13 -267 18 146 -141 50 -89
4350 -89 -156 181 76 132 96 -132 64 -133 -69 -50 -215 -121 88 -82 17 -86 -148 179 -152 -245 38 128 -313 424
4374 424 158 -223 314 4 -86 184 -3 -141 -41 121 -191 134 -30 8 -88 -197 134 95 -121 242 -120
4395 -120 34 46 -53 178 202 46 136 -107 -163 144 -344 -225 -70 -87 130 82 -200 108 -70 -332 120 -189
4417 -189 -272 -17 -89 163 -4 -327 265 149 -299 307 -192 -94 -122 -50 -126 175 -253 75 -25 -284 24 170
4439 170 -75 315 -163 -188 -43 -140 166 262 -202 132 8 -631 155 -59 -294 216 -22 -121 273 -17 195
4460 195 108 -341 -5 180 -341 178 35 -3 275 -274 82 284 -427 51 155 -112 8 35 94 -160 -79 -141
4482 -141 199 -211 -67 354 85 78 31 -269 -3 24 -44 -119 52 -51 -218 -217 19 -124 -332 189 74 -266 391
$$ packed form
4327A3k47M05q4p1Q4k48J42J38j9j3R7k49k90N18m61K81J7k80K85J28k87J91j39
4350h9o7L37j05N6l6k28J96j97O4J9j65R4K09j70R9j03o2L27l31r3K83R0m41P37
4374D24k66l81N37l10r0K70j87j38J00J62l12L25j64L8r6j09L31l9k16L63l62
4395a20J54J2r9K31K4j56R0k43n6L07m88J19J55j7K17m8k82L08j78k62M52l09
4417a89q3K55p2K52j67l23N92j16m48O06m99R8k8P2p6L01m28L28j00k59L08J46
4439A70k45L90m78k5J45r7L06R6m64L34j24o39P86k14k35N10k38r9L94k90K12
4460A95q7m49L36J85n21N19j43l8K78n49L56K02p11M78J04k67J20K7N9k54Q1o2
4482a41L40m10J44M21k69pm7l00K66K7o8p5J71j03j67JK36j43k08N21j15l40O57
$$ plain form
4505 391 -92 -267 -202 62 -24 289 -470 21 -59 -125 134 -31 -93 59 84 -207 99 -113 -31 -22 48 97 335 201
4529 201 -130 44 -46 182 278 195 -9 -80 -276 114 24 -113 159 -382 148 149 -13 -2 64 342 458 -77 -46
4552 -46 134 -160 425 67 -226 86 90 230 298 -68 -186 25 -185 -32 -126 -56 28 78 -64 386 -389 206 -129
4575 -129 -48 -74 -64 -114 62 -29 97 160 36 -145 256 -26 120 -132 -373 188 47 -14 67 126 -269 198 32
4598 32 256 420 -250 -112 51 80 180 166 -329 236 -257 -258 308 -63 -173 183 -176 -193 96 -91 -59 -105 43
4621 43 180 97 -172 337 4 -364 199 -94 34 -107 -80 357 -455 -330 30 -372 -159 88 -187 107 113 -147
4643 -147 193 140 -90 -49 53 -97 333 -123 -185 133 187 -236 180 -67 112 3 -301 154 -192 -101 158 -154
4665 -154 -266 83 -185 -130 -178 -65 53 268 16 154 -105 75 211 41 113 -264 -344 -12 18 -130 166 -274
$$ packed form
4505C91m83j75O5K64q6L13p59M91q0o6K59j65o2J52K5k91L06k12Q2RP0M9K38j34
4529B01l31J74r0K28R6q3k04p1j96L90r0j37K72n41N30Jj62J1O6K78J16n35L1
4552d6J80k94N85l58k93L12MJ40O8l66j18K11k10J53r4P0Q4N0j42M50p75N95l35
4575a29Q1k6J0n0J76r1J26O3j24j81M01k82J46k52k41N61j41o1Q1N9l95M67j66
4598C2K24J64o70J38J63K9J00j4m95N65m93jN66l71j10L56l59j7K89j87L2m6J48
4621D3J37q3k69N09l33l68N63k93J28j41K7M37q12J25L60m02K13K47k75K94Ok60
4643a47L40n3k30M1J02j50M30m56o2L18N4m23M16k47J79j09l04M55l46R1K59l12
4665a54j12L49k68N5m8J13J18K15k52J38k59J80J36j70P2l77q0L32L0j48K96m40
$$ plain form
4687 -274 25 93 -45 -7 9 89 123 -150 -184 -4 -106 -6 -148 29 -219 -25 -410 91 44 20 -127 -17 -55
4710 -55 122 272 -260 -33 43 215 205 -179 89 128 1 -99 -43 -56 209 5 -186 191 -408 -350 253 -108
4732 -108 -59 141 -99 -119 -166 -59 12 82 177 24 -199 -433 183 -201 -174 18 -134 -60 7 -11 59 -5 161 176
4756 176 -256 -52 250 -141 121 88 -204 254 -11 -209 -19 -129 -341 194 -108 -58 -13 -395 -235 91 35
4777 35 14 -25 -179 101 -36 -54 -80 -66 93 34 2 -69 -43 -68 -23 60 -21 -50 -208 12 164 -398 -126 76 -97
4802 -97 -50 83 141 100 28 107 -188 -95 -199 200 -141 -15 98 -305 -204 14 -220 162 -92 122 240 -33
4824 -33 57 76 -114 143 -8 -106 191 12 -10 115 -69 83 26 -199 87 33 -241 -3 15 -170 519 -231 199
4847 199 282 79 120 -22 -44 41 21 -475 148 -120 -112 122 -171 -278 -168 -181 -329 200 40 279 55 -419 136
$$ packed form
4687b74K99O8j38L8J6Q0L4k73l4J80j02J00j42J77k48J94l85N01m7k4j47J10l8
4710e5J77J50n32K27P6J72j0l84K68L9j27j00N6j3K65k04j91L77n99N8O03l61
4732a08M9K00k40k0m7J07P1P0R5j53k23k34O16l84K7J92j52P4O7j8P0o4J66J5
4756A76m32K04L02l91K62l3k92M58k65j98J90j10k12N35l02N0M5l82J60L26n6
4777C5k1l9j54K80j37j8k6J4J59n9l2p1K6k5M5Q3q1k9j58K20J52n62K72K02j73
4802i7M7J33N8m1p2P9k95R3j04L99l41J26J13m03J01K18k34L82k54K14J18k73
4824c3R0J9j90K57j51r8K97j79k2J25j84J52n7k25K86n4k74K38J8j85O89p50M30
4847A99Q3k03M1j42k2Q5k0m96O23k68QK34k93j07J10j3j48N29j60K39k24m74N55
$$ plain form
4870 136 -48 42 3 1 215 310 -266 190 -100 -31 266 -110 -63 -111 -40 29 154 -172 34 276 102 27 133 -215
4894 -215 31 160 -57 257 58 -108 84 -1 -11 24 -344 172 -295 -106 -8 -348 -32 37 -32 11 71 -39 330
4917 330 158 -136 71 -48 -184 -53 148 29 -57 -230 -106 266 -137 -187 200 -29 30 -202 184 194 24
4938 24 -191 60 -190 -36 317 10 -23 107 -35 423 -56 -232 216 -357 -134 -227 9 66 76 17 25 27 98 206
4962 206 9 289 -210 -49 91 -81 -16 141 133 -70 320 45 -540 177 -85 214 -38 19 303 82 357
4983 357 174 -172 -36 353 -67 -147 174 -209 -46 62 -365 89 -1 -219 3 54 215 -69 73 -114 -31
5004 -31 65 -54 258 110 -120 120 106 -7 -193 -123 252 -259 32 8 -183 -114 197 -55 26 96 41 219 -111
5027 -111 -42 189 -312 -86 -82 40 29 -120 -106 27 8 -339 37 128 124 121 111 162 280 -130 -241 95 -289 65
$$ packed form
4870A36j84R0l9kK14R5n76M56k90O9K97l76M7m8P1O9J25l26K06K42j74p5J06l48
4894b15K46J29k17L14j99j66J92q5j0L5l68N16m67J89R8l40L16O9o9M3O0j10L69
4917C30j72k94K07j19j36J31K01j19q6j73J24L72m03n0L87k29N9k32L86J0j70
4938B4k15K51k50J54L53l07l3J30j42M58m79j76M48n73K23r3K36N7J0n9QKP1J08
4962B06j97K80m99J61J40j72O5J57qk03L90k75n85P17k62K99k52N7K84k21K75
4983C57j83l46J36L89m20q0L21l83J63J08m27M54r0k18K22N1J61k84J42j87Q3
5004c1R6j19L12j48k30K40j4j13j86P0L75n11K91k4j91O9L11k52Q1P0n5J78l30
5027a11O9K31n01K26MJ22j1j49J4J33j9l47L76R1mlj0N1J18m10j11L36l84L54
$$ plain form
5051 65 45 -251 31 -118 -308 -25 -3 171 129 -105 -74 -1 76 -181 -117 207 -91 8 38 -188 4 201 180 48
5075 48 -22 188 -226 83 66 -165 362 -236 353 -43 -95 -230 48 -5 -91 -63 213 6 -137 278 143 -27
5097 -27 -190 -94 -239 64 87 -95 206 101 -5 -261 -305 202 -62 -202 -174 69 -146 -29 86 114 114 37 -194
5120 -194 291 -235 -1 30 -84 -7 -115 -240 103 347 -198 -135 18 -69 -11 -65 9 -23 -49 303 131 -63 87
5143 87 130 -136 -3 -98 -21 -48 -546 -206 337 13 117 355 60 -114 -59 -158 -358 -102 48 11 -100 -3 12
5166 12 59 92 -3 -60 -125 -80 -3 127 268 9 205 97 -119 162 -4 19 157 -284 173 184 -262 28 40 -122
5190 -122 -47 435 -10 -13 -89 67 -232 -51 38 287 -167 170 -152 23 -35 -151 333 -7 -266 -93 359 -156
5212 -156 320 119 218 25 -245 94 -55 -299 -146 -193 -241 142 24 20 352 253 52 22 -42 94 -16 -368 -120
$$ packed form
5051F5k0k96K82j49j90K83K2J74m2k34L1P3P7k57O4L24k98R9L0k26J92J97k1j32
5075D8p0K10m14L09j7k31N27n98N89l96n2j35K78n3q6K8K76k07j43M15j35j70
5097b7j63R6j45L03K3j82L01j05j06k56m4N07k64j40K8K43k15J17J15K8%p7k31
5120a94M85n26K34L1j14P7j08j25L43K44n45O3J53q7N8n4P4l2k6L52j72j94J50
5143H7M3k66J33r5P7k7m98L40N43l24J04K38k95j74N5r9k00K56J50l7j11R7J5
5166A2M7L3r5n7o5M5P7J30J41k59J96j08k16K81j66K3J38m41M57J1m46K90J2j62
5190a22P5M82m45lp6J56k99J81Q9K49m54L37l22J75n8j16M84l40k59J73M52n15
5212a56M76k01R9j93k70L39j49k44J53m7m8L83j18mL32r9k01l0o4J36j10l52K48
$$ plain form
5235 -120 155 -216 49 -106 -137 232 -236 180 170 -41 -79 153 -194 167 84 100 211 194 153 -199 199 -87
5257 -87 272 -176 -183 136 -229 -63 -209 182 -27 94 54 216 -316 353 -110 147 41 -10 -73 218 17 12 180
5280 180 -41 -123 -154 -378 7 -198 -92 46 -256 -12 12 13 -85 44 -323 -121 -78 -231 -197 100 -246 251 -465
5303 -465 46 327 -153 -78 -45 -223 -4 340 72 181 -181 -186 215 161 3 116 -196 63 179 -294 159 10
5325 10 -133 -26 -53 34 108 -412 179 -35 -64 85 -418 -52 -24 242 -80 -95 15 -92 37 -124 -79 62 107
5348 107 15 -118 -184 64 -151 -219 182 220 -84 205 -45 -19 282 -165 88 37 -13 102 -195 -15 22 -121 156
5371 156 59 45 67 157 -260 -160 53 -87 286 56 -288 45 -146 163 115 209 286 -17 -30 87 -176 83 -29
5394 -29 -188 95 234 -132 72 253 -71 54 218 248 134 101 -130 73 228 57 217 -235 93 143 24
$$ packed form
5235a20K75l71K65j55l1L69m68M16j0k11l8K32l47L61q3J6J11j7m1l52L98k86
5257h7L59m48pL19l65J66j46L91k09J21m0J62n32O69m63K57j06n1o3K91k01nJ68
5280A80k21q2l1k24L85k05J06J38l02K44K4Jr8J29l67K02M3j53L4K97l46M97p16
5303d65N11K81m80P5L3j78K19L44k68J09l62nM01n4j58J13l12K59J16m73M53j49
5325A0j43J07k7Q7P4n20N91k14k9J49n03L66K8K66l22j5J10j07J29j61M5J41M5
5348A07r2j33o6K48k15o8M01L8l04K89k50K6L01m47K53n1n0J15k97J80L7j43K77
5371A56r7j4K2R0m17J00K13j40L73k30l44L33j91L09m8R4P7l03j3J17k63K59j12
5394b9j59K83J39l66K04J81l24J25J64L0j14l3k31K03J55j71J60m52L28N0j19
$$ plain form
5415 24 179 238 -261 -260 -232 -190 270 -104 -19 -171 16 305 331 223 291 329 -87 292 -94 -281 3 -104 50
5438 50 65 100 33 88 -90 30 135 -231 55 198 -31 32 56 347 220 150 -54 135 68 20 78 6 41 -135
5462 -135 3 -132 -39 -248 34 30 -38 -127 118 292 72 -33 41 287 11 272 37 -111 -14 -273 -16 114
5484 114 -71 -79 -273 -75 9 -54 63 141 -220 292 228 -122 211 125 169 7 -37 -319 105 -244 -12 207 22
5507 22 7 55 -42 86 -48 39 135 -71 89 222 -207 370 -212 130 28 -118 118 -132 212 -194 186 -101
5529 -101 -306 235 -139 -118 134 -97 127 136 41 205 433 203 -202 -358 224 -49 -301 37 -108 -71 115 1
5551 1 1 8 167 89 -74 -40 0 94 194 97 26 -214 16 -26 -380 -25 -42 59 175 -290 189 -46 -40 102 -260
5576 -260 -259 203 116 -75 61 -125 64 42 -32 88 -222 -112 68 -52 -100 93 171 153 29 -157 1 -6 -28 -28
$$ packed form
5415B4J55N9m99JK8M2M60l74Q5j52J87K89K6j08O8L8m16L79l86j87K84j07J54
5438E0J5L5o7N5j78J20J05l66K86J43k29O3K4K91j27p0k04J89o7m8N8p2L5j76
5462a35J38j35R3k09K82mo8q9K45J74k20j05P4K46k76K61k35j48R7k59K57J30
5484A14j85qj94J98Q4o3J17P8l61N12o4l50L33q6M4j62m4k82M24l49K32K19j85
5507B2j5M8r7J28j34Q7R6k06J60J33m29N77n82L42j02j46K36k50L44m06L80k87
5529a01k05N41l74K1K52k31K24Rr5J64K28k30m05j56N82k73k52L38j45L7J86j14
5551A%PJ59p8j63L4M0R4J00r7p1k40K30m2l54L55j7J01J16m65M79k35OJ42l62
5576b60JM62q7j91J36j86J89k2p4J20l10J10J80j20m8J93P8j8j24j86J58pk2%
$$ plain form
5600 -28 170 -78 67 28 154 165 -184 57 -57 -154 223 71 -48 -24 -26 -100 82 125 -134 -22 -120 -275 227
5623 227 80 38 -109 10 -42 29 -114 103 84 -94 -104 13 48 -40 -163 10 -24 -18 129 -106 -65 123 -90 45
5647 45 281 -193 78 -157 -103 -51 114 -84 56 -106 -86 -204 173 64 59 -300 -245 -160 -192 -255 -91 -207 -68
5670 -68 -79 138 263 -71 -121 250 -399 -214 -250 -218 273 -54 -43 191 -211 -188 -80 -238 73 -44 -141 -64 29
5693 29 -101 376 279 7 65 295 101 57 105 -52 -99 -63 -65 213 -144 -72 183 -3 -354 -298 136 323 -98 146
5717 146 31 -247 -139 -154 -295 242 51 -313 -20 -34 33 -8 -129 -121 104 -107 21 187 -127 -172 -92 197 216
5740 216 33 -85 84 -13 121 -5 66 280 287 -86 -17 162 -191 67 -304 40 231 0 240 144 -42 -46 101
5763 101 0 142 46 -127 3 152 10 157 9 -30 325 12 -109 10 -103 -156 21 39 6 -202 -197 2
$$ packed form
5600b8J98k48J45l9J26J1l49K41j14r7L77j52j19K4kp4J82M3k59J12r8j55N02
5623B27j47m2j47J19n2P1j43K17j9j78j0J17L5q8j23J73l4OJ47k35M1J88k13J35
5647D5K36m74K71k35N4N2J65j98J40j62K0j18L77j09nl59N5Q5l2o3J64j16J39
5670f8j1K17J25l34n0L71o49J85l6L2M91l27J1K34m02K3J08j58L11j17r7P7R3
5693B9j30M77r7k72N8K30j94m4M8j57m7L6kK78l57P2K55j86l51N6M34J87m21K44
5717A46j15k78J08j5j41N37j91l64K93j4O7m1j21QK25k11J28J66l14m5Q0K89J9
5740B16j83j18J69r7J34j26P1K14Pl73O9J79l53K58l71L44J91k31K40r6j86mJ47
5763A01j01J42r6j73J30J49j42J47j48l9L55l13j21J19j13n3J77J8l3k08NJ99
$$ plain form
5785 2 196 84 161 48 -97 65 -159 -176 -236 187 195 -144 307 -195 -10 214 -204 -108 146 -63 31 226 -211
5808 -211 166 79 96 98 -8 -28 -254 18 39 113 12 -138 -50 33 271 -65 66 -367 -87 53 26 22 176 109
5832 109 176 3 -74 -192 -182 103 77 218 -152 90 -156 -185 -2 -49 -114 144 -83 -186 -233 -333 334 228 28
5855 28 -236 249 17 -202 -140 11 147 -19 103 39 70 72 110 -102 -137 23 165 223 -134 -184 98 52 -86 71
5879 71 59 -15 496 -123 111 131 31 -18 -131 -184 66 79 -191 222 -192 -174 -176 91 -67 213 -78 9 125 -54
5903 -54 103 184 -306 136 -231 -180 -37 19 100 -24 -12 231 174 -19 87 164 50 327 184 -184 69 -280 176
5926 176 -43 -201 44 59 -210 -7 -94 -146 62 -63 -274 -78 76 -140 216 -59 279 -194 1 -56 39 164
5948 164 181 -71 -259 76 -475 174 194 -51 48 -39 96 -188 -98 -39 111 40 160 161 7 -80 -223 -264 -58 -13
$$ packed form
5785BJ94j12P7j13j45J62k24j7o0M23Ql39M51n02J85K24m18R6K54k09R4J95m37
5808b11L77q7J7Kj06k0k26K72K1P4j01j50Q8Q3K38l36J31m33K80J40k7mJ54o7
5832A09O7j73p7j18J0K85k6J41l70K42k46k9J83m7o5K58k27j03m7j00O67j06k00
5855B8k64M85k32k19O2J51J36j66J22o4L1KL8k12l5J60J42N8l57n0K82m6j38J57
5879G1j2p4N11o19K34K0j00m9j13n3K50J3k70M13m14J8kK67j58K80k91Q7J16j79
5903e4J57Q1m90M42l67N1J43N6Q1j24J2K43n7j93J06P7j14K77j43l68K53l49M56
5926A76k19j58K45J5k69K03q7n2K08j25k11J96J54k16L56k75L38m73J95n7R5J25
5948A64J7k52j88L35n51O49K0k45R9q7J35k84R0N9J50p1J20Jj54q7j43m1K06M5
$$ plain form
5972 -13 -12 -121 -60 -23 -30 -188 -76 241 119 225 77 227 -23 -12 164 109 207 60 134 -328 1 153 236 83
5996 83 130 352 151 -56 250 -43 -263 -99 74 -116 119 150 61 -87 162 284 208 -119 184 -15 3 -199
6018 -199 -18 38 42 -37 104 273 -238 -4 71 3 -66 -134 319 80 -71 -94 -80 45 -16 283 -182 80 -161 -174
6042 -174 30 -201 -109 -130 -216 29 402 -65 175 -114 -126 148 -6 73 16 -275 -149 60 -94 -164 76 41 -107
6065 -107 69 164 91 -174 -65 143 75 -69 -51 -221 -45 117 -56 55 12 -35 -178 82 -148 72 -222 44
6087 44 5 -303 42 -57 -138 -216 10 19 285 141 -103 157 291 91 -142 170 154 116 271 -131 -29 17 -200
6110 -200 -26 167 296 178 131 117 178 199 13 142 126 12 -96 -114 -101 109 78 -63 -209 1 -234 86 -32
6133 -32 -116 -98 -96 19 29 -44 -91 334 -315 -230 41 -164 237 137 -98 -149 61 -39 335 -59 59 -192 -48
$$ packed form
5972a3Jj09O1L7pj58J12L17j22J06j48J50k50J1J76n5R8j47P4m62L29J52Q3j53
5996H3M7K22k01k07L06k93k20J64J73j90K35L1q9j48K49J22p6l27L03j99J8k02
6018a99J81N6Mp9J41J69n11K34P5o8o9o8M53k39j51k3J4J25o1K99m65K62k41j3
6042a74K04k31R2k1q6K45L73m67K40k89j2K74j54P9n7k91J26K09j54p0K40l5j48
6065a07J76R5p3k65J09K08o8j44J8j70J76J62j73J11m3m7j43K60k30K20k94K66
6087D4l9l08L45r9q1p8K26RK66j44k44K60J34k00k33L12j6l8J55m02J02M6k17
6110b00J74J93J29j18m7j4O1K1j86J29j6j14j08j8J3K10l1j41j46K10k35L20j18
6133c2q4J8KJ15J0p3m7M25o49Q5K71k05M01j00k35n1K10j00L74l94J18k51J44
$$ plain form
6156 -48 183 -83 -28 166 -170 -69 287 105 50 129 116 2 42 77 55 295 -66 -23 151 155 90 -74 -100 68
6180 68 -15 97 238 176 170 -212 14 296 329 -2 103 -66 -158 235 -63 -31 0 -89 -328 91 -133 -40 -276 -18
6204 -18 15 -124 -208 35 73 -157 132 -108 73 132 -366 12 229 -189 232 -97 3 69 46 193 77 -62
6226 -62 -197 -169 111 -80 17 -252 190 140 -127 27 14 -100 127 1 180 -127 -247 -88 -55 -174 -13 4
6248 4 -81 135 -248 95 -47 132 21 -42 65 -146 42 -50 -103 59 15 62 139 -29 67 75 -101 -80 191 -60
6272 -60 3 152 8 193 -25 19 -429 127 -145 -10 272 9 -224 96 149 16 22 -283 -47 -40 -79 162 -13
6295 -13 -12 29 -175 -224 19 -306 -70 -134 -173 -2 -177 -197 -41 141 -104 120 -230 -9 236 -272 59 52 24 167
6319 167 125 104 38 376 -87 239 45 -18 156 -25 -25 -91 101 21 223 -125 151 -121 32 281 -217 28 -39
$$ packed form
6156d8K31k66N5J94l36J01L56j82n5P9j3j14M0L5k2K40l61M3J74Mo5j64k6J68
6180F8q3J12J41o2ol82K26K82L3l31J05j69r2L93k98L2L1q9k39M19k24R3k36K58
6204a8L3j39q4K43L8k30K89k40J81N9m98L78K17m18M21l29J00O6k3J47j16j39
6226f2j35K8K80j91R7k69M42n0k67J54j3j14K27j26J79l07j20J59L3j19J61J7
6248Dq5K16l83L43j42J79j11o3J07k11J88r2n3J62m4M7P7j68R6Qj76K1K71k51
6272f0O3J49j44J85k18M4m48N56k72J35K82k63k33L20N3j33Ol05K36Pl9K41j75
6295a3JM1k04m9K43l25K36o4l9J71j75k0J56J82k45K24l50K21K45n08L31pk8J43
6319A67m2k1o6L38m63L26j94o3J74j81%o6J92q0K02l48K76k72J53K49m98K45o7
$$ plain form
6342 -39 -80 -19 159 -242 23 -110 -242 201 -34 140 58 -83 194 146 -194 138 311 -80 -35 -232 179 -64
6364 -64 32 76 80 87 -160 215 9 27 -121 -142 35 -218 63 23 8 81 180 -97 154 -79 -137 -24 141 44 130
6389 130 -179 -52 154 142 -3 346 225 -80 28 -87 -83 -30 74 178 -84 1 -8 90 -100 52 -142 218 39
6412 39 -149 -21 -25 184 36 121 16 -98 30 255 75 -81 155 -188 60 78 -322 0 121 -42 -201 -60
6434 -60 -57 151 -95 108 -74 -149 182 -81 -41 70 -262 105 -98 -244 -40 293 97 6 -40 101 298 -21
6456 -21 -168 105 113 -225 320 253 -90 -26 61 -108 -98 243 -181 -107 -138 66 -39 154 30 -171 -243 125 -236
6479 -236 128 30 -68 -56 56 -82 -142 -44 -233 108 -127 29 -48 -81 172 182 -165 120 -109 57 140 151 -115
6502 -115 88 163 -31 251 168 -66 182 75 -176 27 78 116 63 319 -47 -256 -261 -75 89 -68 -188 7
$$ packed form
6342c9m1O1J78m01K65j33j32M43k35J74q2j41K77m8l40L32J73l91M5j97M11k43
6364f4R6M4MPk47L75k06J8j48k1J77k53K81m0j5P3R9k77K51k33n8J13J65r7Q6
6389A30l09J27K06j2j45L49j21l05J08j15MN3J04J04k62Q5rR8j90J52j94L60j79
6412C9j88J28mK09j48Q5j05j14J28K25j80j56K36l43K48J8m00L22J21j63j59J41
6434f0LK08k46K03j82p5L31k63M0J11l32L67k03j46K04L33j96r1m6J41J97l19
6456b1j47K73Ql38N45o7l43O4Q7j69J0L41m24P4l1K04j05J93j24k01p2L68l61
6479b36L64r8r8J2J12j38o0R8j89L41k35J56p7l3K53J0l47K85k29J66Q3J1k66
6502a15K03P5j94K82q3k34K48j07k51K03N1L8n3K56l66k09nJ86J64j57j20J95
$$ plain form
6524 7 88 72 59 -268 -47 -33 101 -72 -164 -69 -92 129 99 -65 53 -94 -172 -120 -168 -62 -39 -32 -376 96 -173
6549 -173 -189 242 -37 120 172 170 135 -288 -26 -72 158 22 -19 -202 -118 -228 205 -144 170 -9 97 -79 127
6572 127 196 -64 -59 92 -81 -7 -75 50 -49 -121 -78 231 82 -71 156 -64 163 49 -93 103 -35 7 62
6595 62 253 -137 200 -249 -67 20 -80 34 -195 -31 -15 171 -57 -25 50 -226 43 24 -98 -77 18 -114 40
6618 40 -201 -17 -15 -201 -180 48 -13 -182 -66 -120 251 -76 37 -121 -350 -95 304 -197 -3 -130 -111 103
6640 103 -109 64 27 -38 -11 134 7 -130 172 -422 119 -254 319 230 -44 -201 70 296 -9 -110 -47 -2
6662 -2 35 -14 159 277 213 179 -251 -16 334 -416 -130 -134 1 -8 -121 171 204 -129 57 -195 -83 -107 172 335
6686 335 34 75 -54 38 -3 -124 -34 117 -122 -125 97 -151 117 -251 -70 -52 -113 0 -207 -250 265 -88 -19
$$ packed form
6524GQ1j6j3l27K21J4J34j73r2R5k3K21l0j64J18j47p8N2m8J06K3Pl44M72k69
6549a73j6M31k79J57N2kl5m23K62m6K30j36m1j83Q4j10M33l49L14j79J06j76K06
6572A27O9k60NJ51j73P4o8J25r9p2M3L09j49j53K27k20K27j14j42J96j38M2N5
6595F2J91l90L37m49J82Q7j00J14k29J64J6J86k28L2P5k76K69j9j22K1R5j32J54
6618D0k41J84Kj86K1K28o1j69J16n4L71l27J13j58k29K55L99n01J94j27J9K14
6640A03k12J73l7o5K7J45j27j37L02n94N41l73N73q9k74j57K71K26l05j01O3M5
6662bL7m9J73J18o4l4m30K35L50p50K86mJ35rj13K92L3l33J86k52J12k4K79J63
6686C35l01M1j29R2m1j21R0J51k39lK22k48K68l68J81J8o1J13k07m3N15l53O9
$$ plain form
6709 -19 61 105 19 -7 91 103 -103 5 -130 158 -135 -104 -6 128 -106 -120 1 -178 -154 -52 -117 -260 -161 165
6733 165 41 -53 110 -158 190 84 4 -53 242 -42 -118 7 175 17 129 268 -304 -4 -180 -296 204
6754 204 -23 19 83 -38 -47 90 12 38 16 259 243 106 123 -72 96 -75 -49 -258 18 -141 -262 83 -38
6777 -38 -181 -94 -4 -293 -257 -337 -163 176 -26 -48 -70 45 -185 -92 26 137 -271 -166 -72 -65 122 -27 -128 37
6801 37 121 -222 173 -90 -32 250 152 -100 -205 -243 189 173 -63 291 -32 102 95 -97 25 -48 9 97 58 106
6825 106 99 215 -9 -100 -224 118 138 94 135 65 192 -111 64 -368 40 -75 -345 -97 272 -246 -58 -214
6847 -214 -36 181 -382 -33 -128 -177 75 -6 -35 360 88 -138 108 170 -39 75 -13 -127 -185 41 382 -52
6869 -52 -108 94 -158 -78 10 95 -47 10 -249 177 121 73 216 175 -57 -134 113 -41 61 -146 -71 81 130 -56
$$ packed form
6709a9Q0M4q6k6R8J2k06J08j35K88k93L1R8J34k34j4J21j79K4J02o5j43R9L26
6733A65j24r4J63k68L48j06q0n7K95k84p6J25J68j58J12J39n72L00j76j16N00
6754B04k27M2O4j21rJ37p8K6k2K43j6j37J7j95J68j71K6k09K76j59j21L45j21
6777c8j43Q7R0k89L6q0J74L39k02k2k2J15k30R3J18J11m08J05R4PJ87j49j01J65
6801C7Q4l43L95k63N8K82r8k52j05l8M32j6k36L54l23J34pj92J22p3N7Q8l9M8
6825A06pJ16k24r1j24L42K0m4M1p0J27l03J75m32M08j15k70K48L69n18J88j56
6847b14J78K17n63L49r5m9K52q1k9L95k72k26K46O2k09J14q8j14n8K26L41m34
6869e2n6K02k52Q0Q8Q5j42N7k59M26n6m8J43m1k32p7K47j54J02k07P5J52M9j86
$$ plain form
6893 -56 -158 135 -225 -113 10 -220 96 -203 74 180 90 58 49 69 43 -152 131 -227 228 232 -137 93 -68
6916 -68 15 -165 98 -78 54 -449 -291 -81 -58 -40 280 106 133 -183 -48 167 38 -89 -101 102 -201 -202 -182
6939 -182 -152 142 -106 -45 56 7 -155 378 84 109 -77 -223 -1 165 45 -30 239 -230 19 -140 -132 -11
6961 -11 -313 -30 -104 171 -157 -84 118 108 -138 -109 65 -71 91 134 -279 -138 35 -75 -72 27 249 161 -55
6984 -55 -47 163 -110 -93 336 -22 118 199 271 122 57 220 84 16 67 210 -307 -18 -114 64 -283 -278 9 73
7008 73 63 78 220 91 -148 85 38 -54 26 142 -175 182 -259 53 114 -106 107 199 156 -26 331 -59 -228
7031 -228 -259 78 188 -85 -79 -168 -198 -118 122 121 343 72 175 69 -8 47 123 -112 -102 105 100 -348 -151 100 -2
7056 -2 13 4 -37 67 200 -213 119 84 -155 11 128 43 -43 166 119 110 -55 26 -83 -18 122 -26 -287 174 -114
$$ packed form
6893e6j02K93l60J12J23k30L16k99K77J06r0l2rK0k6j95K83l58M55Ml69K30j61
6916f8Q3j80K63j76J32n03J58K10K3J8L20j74K7l16J35K15j29j27j2K03l03jK0
6939a82L0K94k48O1J01m9j62N33k94K5j86j46K22J66j20p5K69m69K49j59QJ21
6961a1l02K83p4K75l28P3K02j0k46K9J74j36J62M3m13J41J73j10LR9K22q8k16
6984e5QK10k73J7M29l58J40Q1P2j49o5J63j36o8N1J43n17K89r6J78l47NK87O4
7008G3j0J5J42j29k39K33m7r2Q0J16l17L57m41L12O1k20K13R2m3j82L57l90j69
7031b28l1L37J10k73Oq9l0Q0K40jK22k71J03j06p7N5P6k35J0K07nm48J97K51j02
7056bJ5rm1J04J33m13L32l5k39J66J17q5q6K09m7rj65Q1j09O5J40j48k61M61k88
$$ plain form
7081 -114 32 40 -72 -94 143 -84 32 -167 -2 267 113 96 -243 339 -371 89 -2 -39 216 -51 128 -84
7103 -84 -1 106 81 -96 150 211 -123 144 -8 18 -9 -77 92 62 208 102 27 -378 17 -151 36 -22 37 -89
7127 -89 62 -6 -112 -25 -274 -35 -115 -260 -121 159 290 -4 0 159 -76 42 -28 179 10 -17 -36 -117 32
7150 32 -3 107 73 -9 138 -57 -364 15 -82 5 196 9 -187 123 6 36 265 57 187 93 -263 71 -49
7173 -49 -105 137 154 -51 -112 -258 42 -65 -234 -96 30 288 -65 83 33 207 51 130 168 -6 -42 -116 -93
7196 -93 -91 125 -227 80 129 114 120 52 -298 27 -225 36 -177 -227 -39 -267 -78 119 -181 -128 36 -83 171
7219 171 65 -62 -113 21 181 -39 -41 -189 184 -20 10 79 42 -54 -153 -46 293 43 -30 252 -81 -230 -156
7242 -156 -5 -29 149 -151 125 31 186 -113 41 82 69 -159 -86 120 -171 27 -77 -265 39 90 -106 -55
$$ packed form
7081a14J46Qj12k2K37k27J16j99J65K69j54j7l39N82p10M60r1l7K55k67J79k12
7103h4Q3J07k5j77K46O1l34K67j52K6k7o8J69l0J46j06p5m05L95j68J87n8N9j26
7127h9J51o8j06Q7k49K39q0j45J39K80J31k94MJ59k35J18p0K07j69k7j9q1J49
7150C2l5J10l4q2J47j95l07L79r7Q7J91j87j96L10j17L0K29k08J30r4l56L34j20
7173d9n6K42J7k05o1j46L00j07j69J38J26K58l53J48n0J74j56P9L8j74l6p4K3
7196i3KK16l52L07M9j5Oo8l50L25k52K61k13n0J88k28J89J97l00N3J64j19K54
7219A71j06j27n1J34J60k20kj48L73k04L0O9l7r6r9J07L39k50p3K82l33j49P4
7242a56J51k4J78l00K76r4J55k99J54M1j3k28P3K06k91J98j04j88L04N1j96N1
$$ plain form
7264 -55 -113 -53 143 -41 -15 150 -267 -5 49 -84 161 -12 242 -5 -108 -110 230 -152 -2 404 3 -41 96
7287 96 -44 193 -160 -33 7 50 72 44 11 71 265 -35 81 -67 -89 76 236 229 -179 146 196 -15 -78 -189
7311 -189 102 -193 61 117 -7 190 -135 -32 483 189 -79 21 -9 142 -136 -241 -306 31 45 -95 149
7332 149 76 144 37 47 -23 -499 218 16 -121 152 90 -68 19 -119 -56 187 -66 181 47 137 -186 92 4
7355 4 85 -224 -158 133 -46 227 49 -5 -286 111 -221 58 -212 -109 243 168 40 -295 50 175 -15 -1
7377 -1 5 128 -38 238 49 129 68 -441 -100 48 243 -105 210 -78 -100 140 -323 -10 191 148 230 -233 115
7400 115 -159 -69 80 178 33 -43 -96 -165 -187 88 -87 22 -187 -316 -215 -88 123 -34 -165 -89 72 -219
7422 -219 -34 -196 -149 265 -21 148 -97 -180 -19 14 78 263 16 -116 207 -242 -91 190 -318 -211 -440
$$ packed form
7264e5n8O0J96j84K6J65m17K62N4j33K45j73K54k47j03kL40l82J50M06m01m4J37
7287I6j40K37l53J27M0M3K2k8l3O0J94l00J16j48k2J65J60pm08L25N0k11o3j11
7311a89K91k95K54N6j24J97l25J03N15k94k68J00l0J51k78j05o5L37J4j40K44
7332A49p3O8j07J0p0m76P17k02j37K73o2j58Q7j38O3K43k53K47j34R0l23K78q8
7355DQ1l09O6K91j79K73j78n4k81L97l32K79k70J03L52p5j28l35L45J25j90J4
7377aOJ23j66K76j89Q0o1n09L41J48J95l48L15k88k2K40m63L13K01m3Q2m63L48
7400A15k74R0J49R8j45p6n3o9k2K75j75J09k09j29J01J27K11j57j31P6J61k91
7422b19J85j62M7M14k86J69k45q3J61L3O4J85k47j32L23m49J51K81n08J07k29
$$ plain form
7443 -440 238 -67 54 207 327 80 -88 64 107 138 -45 77 47 98 -191 140 102 -101 -212 99 -22 -44
7465 -44 -44 416 224 -249 -30 -80 -112 -137 -215 -260 -54 -267 -120 -19 -103 -57 -199 -61 -99 269 6 97 -1 -148
7489 -148 497 -64 169 -8 -41 -106 -172 -184 -103 -100 -125 -147 107 -4 23 -216 -130 -104 66 201 150 140 17 21 183
7514 183 98 -8 116 224 -75 65 -125 -176 -10 82 -251 -65 -134 -79 143 -74 154 29 105 205 -83 -108
7536 -108 11 113 -3 13 -42 37 -159 -133 -110 -46 -236 -192 55 114 39 166 27 92 -146 -28 162 35 74 -141
7560 -141 85 -7 -208 -55 120 -263 -38 185 32 80 101 228 125 72 48 -56 -43 1 -124 98 215 -65
7582 -65 183 148 -175 -68 145 -22 67 7 -142 196 -93 -12 -94 69 -15 -4 -40 26 -132 76 43 -191 -23 -220
7606 -220 -24 -159 -215 274 -81 -337 -9 59 66 156 -2 -38 -81 -244 -5 76 -23 -222 -175 -40 -136 -47 -103 89
$$ packed form
7443d40O78l05J21J53J20k47j68J52M3L1j83J22l0N1k89L31l8k03j11L11j21k2
7465d4%M60j92m73K19n0l2k5p8m5K06k13J47J01q4M6j42J38l8L68k63R1r8j47
7489a48O45n61K33j77l3o5o6j2Q1Lk5k2K54j11K7k39Q6K6J70J35n1j0j23MJ62
7514A83q5j06J24J08k99J40j90n1J66R2l33J86o9N5K22k17K28j25P6J00k88k5
7536a08J19J02j16J6n5P9j96K6K3O4j90M4K47N9p5J27j39O5k38J18J90j27L9k15
7560a41K26r2k01J53J75l83K25K23j53M8K1J27j03n3k4j04J3M4j25K22J17k80
7582f5K48l5l23J07K13j67Q9o0j49L38k89Q1q2J63q4J1l6O6j58K08l3k34J68j97
7606b20J96j35n6M89l55k56L28O8PR0j58l6m3j63K39Q1r9j99M7J35r6Q9n6J92
$$ plain form
7630 89 -128 -269 26 18 95 127 -342 68 -417 178 -42 -235 -45 72 168 -68 -137 -24 -168 230 281 -173 169
7653 169 60 179 45 128 168 -15 103 -105 136 234 -79 77 -59 -117 111 -61 -14 80 184 52 -294 -75
7675 -75 48 -62 -88 -47 39 -58 247 -47 -141 206 -79 -2 -181 -20 275 -141 -103 112 -163 4 81 -213 -188
7698 -188 123 -360 -53 17 -224 7 153 142 36 86 -66 76 -164 32 31 -157 -32 310 -96 -29 -162 -27
7720 -27 -40 169 -134 104 95 -152 33 -257 135 286 -92 254 112 -497 -21 2 -285 161 -185 105 185 220
7742 220 552 -280 45 218 71 -91 -68 27 -193 212 -318 -104 257 -19 129 -73 -5 -16 60 -6 66 -21 -182
7765 -182 140 -18 -159 88 27 -123 22 43 -81 31 -45 -37 -131 -182 254 45 -45 208 79 -183 12 231 -219
7788 -219 119 -7 140 30 -116 -107 -113 -110 -119 -65 65 -238 -136 29 19 -163 -1 29 -122 154 -63 44 -72 58
$$ packed form
7630H9k17j41K95qP7L2m69M10m85N95k20j93J90J17R6k36o9J13j44L98N1m54L42
7653A69j09J19j34Q3M0j83J18k08K41R8l13J56j36n8K28j72M7R4J04j32l46K19
7675g5J23j10k6M1Q6r7L05k94r4L47k85P7j79J61K95m16L8K15k75J67P7k94K5
7698a88L11m83L07P0k41K31J46j1j06N0j52J42k40J96jj88J25L42m06O7j33J35
7720b7j3K09l03K38rk47J85k90L92J51l78L46j42o09M76K3k87M46l46K90Q0L5
7742B20L32q32L25J73j47j62K3R5k20M05n30K14L61k76J48k02O8j1P6o6P2q7j61
7765a82L22j58j41K47o1j50J45K1j24J12p6Qr4n1M36k09r0K53j29k62J95K19m50
7788b19L38j26J47j10j46RoLrN4J30l03J02J65j0j82J62L0j51K76k17J07j16J30
$$ plain form
7812 58 -17 42 -93 -89 -194 95 222 81 114 -198 28 80 -32 187 -116 -58 -169 30 -125 -1 174 -233 -193
7835 -193 69 74 122 147 3 -220 217 -144 69 52 -20 190 -177 136 -245 160 104 -139 6 33 120 -102 130
7858 130 98 15 13 65 109 24 -11 141 228 -34 51 5 -45 73 -119 55 -137 41 -29 -277 -81 208 -155 311
7882 311 11 120 85 -199 -228 -72 121 94 -95 3 98 -89 161 76 143 -88 -120 83 -204 153 -18 -184 -214
7905 -214 -246 118 -243 11 30 177 103 -24 193 121 -166 180 -32 86 -11 -225 216 97 -107 -108 21 -139
7927 -139 339 88 234 -200 125 0 -388 145 -24 38 112 -12 54 -52 29 -506 -100 -59 -50 342 122 -1
7949 -1 -21 -200 56 58 -94 -34 70 1 -307 -7 142 23 -19 -118 -133 -136 194 44 3 -24 -122 75 -190 53 120
7974 120 54 -153 129 227 182 178 173 -156 -262 -154 -34 30 47 61 -164 -133 15 31 -125 235 162 157 16 117 34
$$ packed form
7812E8p5N9j35Mj05K89J27j41L3l12K26N2j12K19l03N8j11J99j55J24J75m07M0
7835a93K62NM8K5j44k23M37l61K13j7p2K10l67L13l81M05n6k43J45K7Q7k22K32
7858A30l2q3kN2M4q5l5J52Q7k62Q5m6n0J18j92J74j92J78p0k48J96K89l63M66
7882C11l00J09l5k84k9J56J93k7j89R8R5j87K50q5O7k31l2K03k87L57j71j66l0
7905b14l2L64l61K54J9J47p4j27K17p2k87L46k12J18r7k14M41j19k04jJ29j60
7927a39M78k51J46m34L25j25l88N33j69O2P4j24O6j06Q1n35M06M1RL92k20j23
7949ak0j79K56Kj52O0J04o9l08L00J49j19m2r9j5lL30j50m1k7r8J97k65K43O7
7974A20o6k07K82R8m5mnl29j06J08J20O4J7J4k25L1J48J6j56L60p3nj41J01q3
$$ plain form
7999 34 -60 25 27 201 113 -6 -143 -138 42 164 -21 -30 98 0 221 -4 207 -139 -85 18 22 125 116 31 -10 -15 40
8026 40 191 83 -223 -134 -1 -97 55 -338 -106 91 -115 -41 125 36 13 -108 -154 -180 -98 -134 -87 -10 80 83 110
8051 110 151 141 -15 -25 -266 -198 -49 77 -109 -242 103 128 40 213 56 -203 -29 -10 264 -144 -61 -351 -106
8074 -106 13 -21 -6 132 91 -135 -260 8 84 -126 -246 232 34 -291 -19 128 23 -21 -145 -69 64 -164
8096 -164 -305 41 -127 -237 -167 45 62 48 -85 197 268 -169 39 -180 -182 96 -335 -227 -218 -31 147 -140 -57
8119 -57 43 -39 177 -163 -268 -59 204 109 8 84 79 179 -93 -186 -117 155 191 3 112 39 180 -175 104
8142 104 -27 -11 -49 125 -5 -83 -3 188 4 29 50 58 33 291 -14 -111 -60 -23 39 -158 201 -45 205 -118
8166 -118 -113 -118 65 142 105 279 381 -66 -18 43 -17 69 14 15 -10 -187 40 -14 -141 39 117 -425 -79 -26 216
$$ packed form
7999C4r4Q5KJ74q8j19j37NJ80J22j85rJ28r8K21k25K11l46N4J03MJ03rq5m1nN5
8026D0J51j08l06Q9J33r6J52l93K32J97k06P4J66q9k3j21m6k6Q2l6M7P7R0LK7
8051A10M1j0j56j0k41O8J49J26j86j33L45K5q8J73j57k59J74J9K74m08Q3k90K45
8074a06J19l4J5J38m1k26j25K68P6k10j20M78j98l25K72J47j05m4j24P6J33k28
8096a64j41L46j68j10P0K12J7j4j33K82P1m37K08k19kK78m31J08RJ87J78k87Q3
8119e7J00q2K16l40j05K09K63r5j01P6nJ00k72r3O9K72L6j88J09p3J41l55K79
8142A04j31J6l8J74j30p8Q0J91j84K5K1Qk5K58l05r7N1L7O2j97L59k46K50l23
8166a18NnJ83P7l7J74J02m47M8O1o0Q6n5Jk5j77K27n4j27J80P8n42L46N3K42
8191B16
$$ Imaginary data points
##PAGE= N=2
##DATA TABLE= (X++(I..I)), XYDATA
$$ plain form
0 0 0 0 0 0 0 0 0 0 0 0 8 -8 8 -16 16 -24 24 -32 40 -48 56 -65 80 -96 112 -128 152 -175 200 -229 264 -301
32 -301 341 -386 437 -490 550 -617 689 -769 857 -951 1054 -1169 1293 -1429 1576 -1738 1915
49 1915 -2112 2325 -2560 2824 -3114 3441 -3811 4230 -4710 5271 -5931 6720 -7692 8913
63 8913 -10506 12678 -15833 20839 -30048 52549 -229618 -93280 465067 132975 -265740
74 -265740 -233805 126932 176112 18491 -49280 -57852 -123165 53593 224876 60645 -234931
85 -234931 -179072 174408 273069 -95442 -271580 -17749 181140 85993 -70401 -105756 -22334
96 -22334 32247 78337 66500 -95360 -139969 76507 161262 -8129 -126341 -30322 88551
107 88551 26292 -43634 29380 1475 -96208 4922 129974 26434 -141586 -89673 123233
$$ packed form
0@%%%%%%%%%%Qj6J6k4L2m0M8n6P2q8J04j21J45j76K08k40K80l27L75m29M93n65
32c01O42p27Q23r27J040j167J306j458J626j808K005k223K462k722L005l314L653
49A915m027M437m885N384n938O555p252Q041q940R981j1202J2651j4412J6605
63H913j9419K3184k8511L6672n0887Q2597k82167J36338N58347l32092l98715
74b65740L1935L60737M9180j57621o7771q572o5313J76758J71283j64231k95576
85b34931N5859L53480R8661l68511j76138K53831J98889r5147j56394l5355Q3422
96b2334N4581M6090j1837j61860m4609K16476Q4755j69391j18212R6019J18873
107H8551o2259o9926P3014k7905r7683J01130J25052j03540j68020N1913K12906
$$ plain form
118 123233 114471 -100845 -97435 69266 60866 -39065 -18298 58601 -963 -108302 12346 163015
130 163015 1741 -175343 -36218 154561 77613 -126095 -103408 80851 72581 -44350 -22210
141 -22210 15310 -22579 -17548 50393 55631 -56555 -89932 56330 108014 -26964 -87976 -5052
153 -5052 62693 24611 -38569 -16307 8095 -18170 12721 42570 -21561 -57244 5033 59235
165 59235 11763 -60444 -10555 59198 616 -40864 18435 37968 -20715 -46468 21857 63820
177 63820 -21594 -66579 16952 47922 -11513 -32763 4330 16544 -23526 -12974 53192 13775
189 13775 -73071 -22477 74940 48706 -56856 -67724 40548 73128 -15041 -47004 -8344 10652
201 10652 17016 14786 -6196 -37251 -32103 42376 61765 -37301 -76351 8907 71119 26394 -54452
$$ packed form
118A23233q762k15316L410J66701q400r9931K0767P6899n9564j07339J20648J50669
130A63015j61274j77084J39125J90779p6948k03708K2687J84259q270j16931K2140
141b2210L7520l7889N031O7941N238j12186l3377J46262N1684j34978o1012Q2924
153e052O7745l8082o3180K2262K4402k6265L0891K9849o4131l5683O2277N4202
165E9235m7472p2207M9889O9753n8582m1480N9299J9533n8683k5753O8325M1963
177F3820q5414m4985Q3531L0970n9435k1250L7093J2214m0070J0552O6166l9417
189A3775q6846N0594R7417k6234j05562j0868J08272L2580q8169l1963L8660J8996
201A0652O364k230k0982l1055N148P4479J9389r9066l9050Q5258O2212m4725q0846
$$ plain form
214 -54452 -40904 34707 35791 816 -7712 -25179 -16740 28260 37876 -8737 -59149 -20214 63640
227 63640 31963 -53933 -39826 21880 37342 194 -30048 -3559 12060 -419 16302 9629
239 9629 -26249 -13148 22302 28090 -8564 -41548 2706 40382 -6294 -30327 -1922 11911
251 11911 3673 -12758 -1137 15427 -13145 -11971 24818 6621 -18425 -2917 13391 13727 -10372
264 -10372 -14567 18767 5712 -20344 2557 10162 -5197 -10441 -6480 14755 4777 -25050 982
277 982 20202 -4368 -8183 832 8255 7856 -10250 3009 15888 -13370 -7146 17940 669 -12579
291 -12579 -8226 6286 15526 -15321 -19477 15274 6720 -9071 -1125 -1949 5619 4096 -4378 9453
305 9453 -614 -13232 13678 12911 -9752 -8856 -1880 14504 6543 -23600 -4405 14866 -4074
$$ packed form
214e4452J3548P5611J084l4975q528j7467Q439M5000R616m6613n0412L8935Q3854
227F3640l1677q5896J4107O1706J5462l7148l0242K6489J5619j2479J6721o673
239I629l5878J3101L5450N788l6654l2984M4254L7676m6676k4033K8405J3833
251A1911q238j6431J1621J6564k8572J174L6789j8197k5046J5508J6308L36k4099
264a0372m195L3334j3055k6056K2901P605j5359n244L961K1235r978k9827K6032
277I82J9220k4570l815R015P423l99j8106J3259J2879k9258O224K5086j7271j3248
291a2579M353J4512R240l0847m156L4751q554j5791P946q24P568j523q474J3831
305I453j0067j2618K6910p67k2663Q96O976J6384p961l0143J9195J9271j8940
$$ plain form
318 -4074 -4088 -973 -4475 3752 -406 3279 7235 -13402 -1164 19895 37 -8847 -1885 3713 12913
333 12913 -5557 -14439 7604 3169 -6114 1393 -5036 -2463 2339 -3799 5407 -717 -11629 10131
347 10131 10744 -7238 -2587 2057 8129 6117 -11736 -727 9710 -4324 -95 633 -7978 1075
361 1075 833 -1317 2031 -9951 -2273 12559 -568 -5340 -1149 403 10734 1971 -8014 4382
375 4382 1300 -1313 7510 -2156 -7333 -1576 -268 7805 -1033 -15202 -122 7286 1348 1324 -7521
390 -7521 -4604 9124 4797 2542 -1726 -9280 5466 12015 558 -4363 -9848 -1624 13966 2479
404 2479 -10272 -8483 -4575 11028 10689 -10347 -13318 -1860 12410 15553 -8902 -16871 4328 12574
418 12574 9726 -1472 -15060 -3439 9907 9641 2662 -15862 -15958 10328 16554 769 -18012 -19328
$$ packed form
318d074j4L115l502Q227m158L685L956k0637J2238K1059j9858q884O962N598R200
333A2913j8470q882K2043m435r283P507o429K573M802o138R206o124j0912K1760
347A0131O13j7982M651M644O072k012j7853J1009J0437j4034M229P28q611R053
361A075k42k150L348j1982P678J4832j3127m772M191J552J0331q763r985J2396
375D382l082k613Q823r666n177N757J308Q073q838j4169J5080P408n938k4q845
390g521K917J3728m327k255m268p554J4746O549j1457m921n485Q224J5590j1487
404B479j2751J789L908J5603l39k1036k971J1458J4270L143k4455p969K1199Q246
418A2574k848j1198j3588J1621J3346k66o979j8524r6K6286O226j5785j8781j316
$$ plain form
432 -19328 12103 24308 -3309 -18466 -9164 10976 20517 121 -13132 -6057 89 13776 13362
445 13362 -11432 -17076 -3230 13096 18029 -10198 -27817 -3742 19270 17398 -8459 -27768 -1067
458 -1067 23779 9538 -6201 -12919 -5265 13984 11623 657 -6583 -15603 285 19522 7666
471 7666 -11871 -22790 -5296 29074 14293 -25578 -21744 7012 24192 8272 -20015 -9560
483 -9560 9544 6173 10149 3532 -13591 -10107 2956 19381 14404 -24725 -27174 14698 28600
496 28600 3614 -30830 -24411 22981 26555 -8619 -15696 -7974 5884 17313 5351 -4691 -11555
509 -11555 -12231 17072 26524 -7363 -26612 -15324 18774 33754 -11906 -40425 -6181 26121 22964
522 22964 -11374 -32111 -294 22433 9066 -649 -11402 -11949 8165 14982 12795 -4917 -30624
$$ packed form
432a9328L1431J2205k7617j5157R302K0140R541k0396j3253P075O146J3687m14
445A3362k4794n644J3846J6326M933k8227j7619K4075K3012j872k5857j9309K6701
458a067K4846j4241j5739o718P654J9249k361j0966p240r020J5888J9237j1856
471G666j9537j0919J7494L4370j4781l9871L834K8756J7180j5920k8287J0455
483i560J9104l371L976o617j7123L484J3063J6425m977l9129k449M1872J3902
496B8600k4986l4444O419M7392L574l5174p077P722J3858J1429j1962j0042o864
509a1555o76K9303R452l3887j9249J1288L4098J4980m5660k8519L4244L2302l157
522B2964l4338k0737L1817K2727j3367r715j0753n47K0114O817k187j7712k5707
$$ plain form
535 -30624 -5707 32561 16904 -21148 -34515 1026 41200 9438 -34362 -17577 11169 19347
547 19347 6216 -12906 -5594 957 82 19025 11657 -21976 -20229 9330 30984 11286 -35877
560 -35877 -25083 23790 25548 -4839 -26771 -16717 18879 19046 -4953 -9032 -10233 -936 17887
573 17887 10730 -4475 -15888 -12516 21132 26325 -11405 -27305 -9151 20249 25757 -14752 -33275
586 -33275 -429 22759 15722 -11115 -24180 1549 16010 5179 2250 -6704 -12514 5662 17366
599 17366 10606 -12271 -26258 5216 29828 3091 -22142 -16526 8687 22841 -3657 -21790
611 -21790 -3141 7857 6853 3228 -4759 -3494 -1857 2320 15300 2448 -17469 -4528 11318
624 11318 10843 -1170 -15906 -5166 10318 4079 -3015 -7735 -6473 6166 5124 -1623 617 -4023
$$ packed form
535c0624K4917L8268j5657l8052j3367L5541M0174l1762m3800J6785K8746Q178
547A9347j3131j9122P312O551q75J8943p368l3633J747K9559K1654j9698m7163
560c5877J0794M8873J758l0387k1932J0054L5596J67k3999m079j201R297J8823
573A7887p157j5205j1413L372L3648N193l7730j5900J8154K9400N508m0509j8523
586c3275L2846K3188p037k6837j3065K5729J4461j0831k929q954n810J8176J1704
599A7366o760k2877j3987L1474K4612k6737k5233N616K5213J4154k6498j8133
611b1790J8649J0998j004l625p987J265J637M177J2980j2852j9917J2941J5846
624A1318m75j2013j4736J0740J5484o239p094m720J262J2639j042o747K240m640
$$ plain form
638 -4023 -3375 6334 5850 1437 -5182 -6923 8161 10818 -3185 -8227 -7255 3559 11856 -3448 -11565
653 -11565 -1923 3796 5097 -48 -6742 -2099 -694 4443 10837 -3235 -11331 1696 10065 7401
667 7401 -5494 -12863 2478 10778 1508 -4658 -8953 -1872 8344 1161 -4318 -3505 -4168 4684 7649
682 7649 -1990 -4277 -2937 4113 9508 -2090 -6969 1278 2666 3833 1464 -6809 -2651 2064 1307
697 1307 1997 -4760 -5149 3860 1057 421 981 -4315 544 4811 497 1891 -1101 -2583 4845 2016
713 2016 -1698 -221 -4267 753 4777 -3318 -2803 -1260 -2397 3789 724 -4315 216 -815 2906
728 2906 5320 -4394 -2079 4369 784 3048 -603 -5206 3180 2137 -1571 263 -5316 -888 4954
743 4954 -2709 -2445 -421 -2749 4929 2050 -5231 1420 1643 2001 4500 -4125 -1356 5570 -517 621
$$ packed form
638d023O48R709m84m413o619j741J5084K657j4003n042R72J0814Q297j5304q117
653a1565R642N719J301n145o694M643J405N137O394j4072q096J3027Q369k664
667G401j2895p369J5341Q300r270o166m295P081J0216p183n479Q13o63Q852K965
682G649r639k287J340P050N395j1598m879Q247J388J167k369q273M158M715p57
697A307O90o757l89R009k803o36N60n296M859M267m314J394k992j482P428k829
713B016l714J477m046N020M024q095N15J543j137O186l065n039M531j031L721
728B906K414r714K315O448l585K264l651m603Q386j043l708J834n579M428N842
743D954p663K64K024k328P678k879p281O651K23L58K499q625K769O926o087J138
$$ plain form
759 621 -608 -4965 3364 1969 -4317 222 -2525 -1001 4429 -3531 -2895 2377 -751 3812 1664 -4779
775 -4779 3159 3142 -843 2601 -2571 -1453 5005 -1721 -1794 297 -4203 2451 1245 -5746 1114 -82
791 -82 -1867 3940 -2421 -2268 4532 -409 1390 2251 -3512 2956 2969 -2889 1825 -1385 -2349 3655 -2979
808 -2979 -3095 2197 -2813 10 1294 -4438 1689 1448 -1835 3970 -744 -1986 4926 357 -352 2322
824 2322 -2917 1476 2370 -3909 549 -379 -2845 2637 -1709 -2943 1808 -2222 652 2935 -3690 466
840 466 3039 -404 2890 -432 -1896 3889 -48 -506 2619 -3684 -872 3026 -1930 -1069 -2199 -3102
856 -3102 4087 714 -3480 1085 -932 906 3935 -1713 -386 1413 -331 4692 1532 -4958 320
871 320 1357 1460 826 -5192 -2017 3084 -821 39 -987 -4773 2120 3760 564 -884 -3805 2019
$$ packed form
759F21j229m357Q329j395o286M539k747J524N430p960O36N272l128M563k148o443
775d779P938j7l985L444n172J118O458o726p3K091m500O654j206o991O860j196
791h2j785N807o361J53O800m941J799Q61n763O468J3n858M714l210r64O004o634
808b979j16N292n010K823J284n732O127k41l283N805m714j242O912m569p09K674
824B322n239M393Q94o279M458r28k466N482m346j234M751m030K874K283o625M156
840D66K573l443L294l322j464N785l937m58L125o303K812L898m956Q61j130r03
856c102P189l373m194M565k017J838L029n648J327J799j744N023l160o490N278
871C20J037J03o34o018L175N101l905Q60j026l786O893J640l196j448k921N824
$$ plain form
887 2019 7130 -526 -2511 -217 -521 3580 1231 -2873 -941 -2768 -114 5344 -2252 -6281 -1374
902 -1374 2715 5670 -2156 -7409 2793 5168 114 75 -1164 -436 1959 776 3226 -367 -7315 181
918 181 5641 600 -3541 -6257 -313 7266 -251 -4924 -1888 -581 4929 3396 -3405 -1425 -94
933 -94 2157 6093 -1579 -4739 44 650 3615 1881 -6119 -4147 891 4529 3621 -8074 -8154 7210
949 7210 7045 -1949 -5230 -2571 6290 4014 -3907 1155 791 -3811 2676 5071 595 -5824 -8492 6091
965 6091 10831 -7366 -10641 1685 7728 4291 -7389 -5426 6288 1789 -1154 4133 -879 -2736
979 -2736 40 2855 6578 -3221 -10599 2698 7733 440 -4722 -7741 1628 8353 -1821 -4850 -2407
994 -2407 -596 6931 2249 -5071 655 1021 870 4858 -165 -1817 -2272 -3484 8133 5840 -10775
$$ packed form
887B019N111p656j985K294l04M101k349m104J932j827K654N458p596m029M907
902a374M089K955p826n253J0202K375n054l9j239P28K395j183K450l593o948P496
918A81N460n041m141k716N944P579p517m673L036J307N510j533o801J980J331
933i4K251L936p672l160M783O06K965j734q000J972N038L638r08j1695q0J5364
949G210j65q994l281K659Q861k276p921N062l64m602O487K395m476o419k668J4583
965F091M740j8197l275J2326O043l437j1680J963J1714m499k943N287n012j857
979b736K776K815L723r799p378J3297N035p293n162l019R369O725j0174l029K443
994b407J811P527m682p320N726L66j51L988n023j652m55j212J1617k293j6615
$$ plain form
1009 -10775 -7259 4427 7507 492 -12471 -3809 11917 2358 -6018 -473 896 2004 -1088 310
1023 310 7760 -3818 -9380 7297 9887 -3922 -10331 -4099 10770 5934 -11871 -4723 5216 1222
1037 1222 242 -2721 -1639 2699 -2142 2223 6934 -3492 -4788 2893 4288 3902 -4520 -7337 4265
1052 4265 4487 -853 -1388 -6096 -682 6858 -1038 -4787 -2493 569 6194 111 -3785 3496 -227
1067 -227 -3098 4881 2944 -2300 -4451 -899 9142 2221 -12051 -3182 6767 2801 -3237 -6294 1848
1082 1848 5861 -4046 -1186 5166 -2300 -3572 2337 5705 2494 -7569 -3118 10242 2234 -7255
1096 -7255 -2399 1459 3027 -618 -3971 1108 -167 -3160 3648 1386 -4499 -1036 1993 4374 1691
1111 1691 -4516 752 3903 -1253 1353 309 -3221 342 1602 2039 -482 -6727 -76 5249 -2213
$$ packed form
1009a0775L516J1686L080p015j2963Q662J5726r559q376N545J369J108l092J398
1023C10P450j1578n562J6677K590j3809o409O232J4869m836j7805P148R939l994
1037A222r80k963J082M338m841M365M711j0426j296P681J395l86q422k817J1602
1052D265K22n340n35m708N414P540p896l749K294L062N625o083l896P281l723
1067b27k871P979j937n244k151L552J0041o921j4272Q869R949l966o038l057Q142
1082A848M013r907K860O352p466j272N909L368l211j0063M451J3360q008r489
1096g255M856L858J568l645l353N079j275k993O808k262n885L463L029K381k683
1111A691o207N268L151n156K606j044l530L563J260M37k521o245O651N325p462
$$ plain form
1126 -2213 -3534 216 1673 1981 -1915 -107 3455 -2914 -1823 5778 1854 -2987 -2182 1857 4725
1141 4725 -3174 -5594 3285 1685 -3561 -509 555 201 -1775 -1779 4361 1424 -5401 813 4888 840
1157 840 -1389 -1604 3160 2780 -4034 -147 3045 -2579 -2209 1037 1304 -612 -4753 132 4846 -3060
1173 -3060 -3627 2790 1633 38 -830 274 3031 -1903 -1523 4625 103 -3403 757 1327 628 -2357
1189 -2357 -3554 2636 617 -4263 1346 1456 -1575 -49 -16 2374 850 -3856 2533 4364 -3077 -956
1205 -956 2139 1010 -211 -3609 581 3375 -4121 -1919 3470 -922 -2315 -408 952 2696 -2986
1220 -2986 -2341 5295 394 -2781 1622 1480 983 -1075 -2091 4049 764 -4569 1737 1419 -2542 -1001
1236 -1001 -1237 1235 970 -4301 1528 3412 -3277 -92 2217 290 818 -1359 973 3967 -3114 -1080
$$ packed form
1126b213j321L750J457L08l896J808L562o369J091P601l924m841Q05M039K868
1141D725p899k420Q879j600n246L052J064l54j976mO140k937o825O214M075m048
1157H40k229k15M764l80o814L887L192n624L70L246K67j916m141M885M714p906
1173c060n67O417j157j595q68J104K757m934L80O148m522l506M160N70o99k985
1189b357j197O190k019m880N609J10l031J526L3K390j524m706O389J831p441K121
1205i56L095j129j221l398M190K794p496K202N389m392j393J907J360J744n682
1220b986O45P636m901l175M403j42m97k058j016O140l285n333O306l18l961J541
1236a001k36K472k65n271N829J884o689L185K309j927N28k177K332K994p081K034
$$ plain form
1252 -1080 3951 -1442 -1873 363 -643 1428 -2436 -2534 3513 -984 -3274 2566 231 -112 514 -1316
1268 -1316 3362 1023 -3185 3025 2209 -2423 237 -306 491 387 -3917 1016 2320 -3998 -899 2234
1284 2234 -800 -17 -923 583 3204 -2606 -377 4615 -788 -1438 1112 -60 1275 -1342 -2364 2955
1300 2955 -1036 -3426 1608 -26 -1319 224 -1096 1886 780 -3275 2335 2096 -1839 1205 528
1315 528 193 1799 -1622 82 1684 -2583 227 1464 -2473 -348 -157 -522 1496 -2077 -1079 2321
1331 2321 -872 -638 1627 -643 796 464 -64 2421 -879 -2107 2410 208 -1874 -269 -1118 868
1347 868 87 -2759 584 456 -1776 1113 809 -790 940 -722 1457 2372 -1841 206 1753 -210
1363 -210 729 -822 -1351 1646 -696 -658 644 -2001 -344 1370 -959 -19 -381 -756 2142 233 -675
$$ packed form
1252a080N031n393m31K236j006K071l864r8O047m497k290N840k335l43O26j830
1268a316M678k339m208O210q16m632K660n43P97j04m304M933J304o318L099L133
1284B234l034P83r06J506K621n810K229M992n403o50K550j172J335k617j022N319
1300B955l991k390N034j634j293J543j320K982j106m055N610k39l935L044o77
1315E28l35J606l421J704J602m267K810J237l937K125J91l65K018l573R98L400
1331B321l193K34K265k270J439l32n28K485l300j228M517k202k082J605q49J986
1347H68p81k846L343j28k232K889l04j599J730j662K179R15m213K047J547j963
1363b10R39j551n29K997k342L8J302k645J657J714k329R40l62l75K898j909r08
$$ plain form
1380 -675 1440 -404 504 1937 -466 -283 -205 -1099 1446 -422 -2630 -121 -205 231 560 -2102 -296
1397 -296 1827 -505 776 456 -892 1470 783 248 1428 -1167 -539 1844 -175 -10 -839 -2097 1788
1414 1788 881 -2374 -324 -189 538 1645 -1787 -344 1595 -726 1299 1283 -909 549 -327 170 2476
1431 2476 -1229 -2434 966 246 451 -1447 -3172 1475 1093 -1573 219 -589 -7 2219 -297 -41
1447 -41 1628 -1184 613 1775 -5 888 -1709 -1242 3301 -336 -3455 -547 257 1098 -68 -3518
1463 -3518 765 1972 -1243 573 340 -177 1413 -1021 809 3412 -2281 -1605 2278 888 -284 -2752
1479 -2752 -1581 3931 -104 -3540 453 65 -111 699 -2058 980 1590 -1705 1336 1842 -1015 148
1495 148 -1022 781 2965 -2621 -2238 2091 311 -39 -1242 -2735 1508 688 -2090 742 82 35 1950
$$ packed form
1380f75K115j844R08J433k403J83P8q94K545j868k208K509q4M36L29k662J806
1397b96K123k332J281l20j348K362o87n35J180k595O28K383k019J65q29j258L885
1414A788r07l255K050J35P27J107l432J443J939k321K025j6k192J458q76M97K306
1431B476l705j205L400p20K05j898j725M647l82k666J792q08N82K226k516K56
1447d1J669k812J797J162j780Q93k597M67M543l637l119K908Q04Q41j166l450
1463c518M283J207l215J816k33n17J590k434J830K603n693O76L883j390j172k468
1479b752J171N512m035l436L993l88j76Q10k757L038O10l295L041N06k857J163
1495A48j170J803K184n586L83M329j780l50j203j493M243q20k778K832o60m7J915
$$ plain form
1512 1950 -1258 732 2193 -1984 -104 2660 324 137 -2296 -231 3702 -1375 -3531 892 572
1527 572 554 -744 -2367 1637 814 -2519 1371 1701 -818 211 -132 2059 2106 -3351 -793 3182 -402
1544 -402 -1260 -1046 -410 2030 -971 -2205 1418 -1282 -962 1385 -478 453 461 -1295 2227 1122 -1467
1561 -1467 507 -74 630 2152 -1278 -1242 943 -700 147 -885 -2372 1376 410 -1687 664 99 -494
1578 -494 814 -688 1391 1185 -1799 662 2604 27 -569 -1062 795 1900 -2402 -1778 1813 -497
1594 -497 -660 191 -243 373 -1201 -1059 2304 194 -1594 1239 1493 806 -189 -1509 1386 797 -1883
1611 -1883 261 697 -1174 -80 -615 -44 76 -2403 574 1640 -978 -468 706 264 1170 -189 189
1628 189 1000 -911 246 1742 -1015 -535 360 -505 129 -1066 -1019 1596 -865 -955 1564 -351 -525 156
$$ packed form
1512A950l208J990J461m177J880K764k336j87k433K065L933n077k156M423l20
1527E72j8j298j623M004q23l333L890L30k519J029l43K191M7n457K558L975l584
1544d02q58K14O36K440l001j234L623k700L20K347j863R31Qj756L522j105k589
1561a467J974n81P04J522l430L6K185j643Q47j032j487L748r66k097K351n65n93
1578d94J308j502K079k06k984K461J942k577n96m93J857J105m302O24L591k310
1594d97j63Q51m34O16j574J42L363k110j788K833K54o87r95j320K895n89k680
1611a883K144M36j871J094n35N71J20k479K977J066k618N10J174m42R06j359L78
1628A89Q11j911J157J496k757M80Q95q65O34j195M7K615k461r0K519j915j74O81
$$ plain form
1646 156 308 1603 -329 -1176 2346 1170 -984 135 269 646 -416 -1687 1170 985 -2486 48
1662 48 818 -775 -624 -1015 920 1687 -1597 -267 2101 -348 -129 211 322 1020 -813 -474 1615 -1221
1680 -1221 -1413 719 -209 -337 -779 -1097 856 80 -1158 1691 244 -969 963 315 512 597 -1140
1697 -1140 1624 998 -1662 772 430 -806 -108 -716 -116 478 -1923 286 1969 -1704 -420 1178
1713 1178 189 877 -631 -317 2348 -846 -736 1834 -404 -449 82 -667 976 -776 -2008 1536 -147
1730 -147 -2055 611 26 203 584 -1129 1288 1422 -1744 1094 1406 -1065 467 -89 222 1009 -1592
1747 -1592 -185 1435 -1776 -690 768 -823 292 -208 -508 1657 -665 -1082 2161 48 -244 960
1763 960 -51 1003 -37 -1359 1593 -69 -1999 669 -144 -1053 -68 -1092 690 856 -2043 820
$$ packed form
1646A56J52J295j932q47L522j176k154J119J34L77j062j271K857j85l471K534
1662D8P70j593J51l91J935P67l284J330K368k449K19L40J11O98j833L39K089k836
1680a221j92K132r28j28m42l18J953p76j238K849j447j213J932o48J97Q5j737
1697a140K764o26k660K434l42j236O98o08O00N94k401K209J683l673J284J598
1713A178r89O88j508L14K665l194J10K570k238m5N31p49J643j752j232L544j683
1730a47j908K666n85J77L81j713K417J34l166K838L12k471J532n56L11P87k601
1747a592J407J620l211J086J458j591J115n00l00K165k322m17L243k113k92J204
1763I60j011J054j040j322K952j662j930K668q13r09R85j024J782J66k899K863
$$ plain form
1779 820 1135 -1214 895 744 139 776 -1001 511 1727 -1659 -312 1464 -699 -330 -806 -542 1133
1796 1133 -1297 -1187 1845 -446 -1002 771 44 691 61 -904 1799 818 -1601 870 750 -171 -52
1813 -52 -1085 338 501 -1572 -76 787 -1523 105 -38 66 759 -861 273 1491 -493 200 1149
1830 1149 -464 115 6 -355 642 -887 -543 1243 -817 -1366 272 -408 -80 -398 -624 1372 -163
1847 -163 -1494 1469 622 -632 306 195 1114 193 -1725 925 1187 -1262 -320 -42 -203 28 -1377 62
1865 62 868 -1240 -294 1351 -145 -122 234 42 1688 -427 -321 1206 -243 -273 493 -574 -488 -394 -645
1884 -645 797 -846 -1461 586 60 -564 -148 -170 562 222 -606 1361 428 -1089 732 489 2 -222
1902 -222 -866 498 1157 -1611 -573 551 -548 141 -277 -209 1068 -801 -67 1530 -651 -188 571
$$ packed form
1779H20L15k349K109j51o05O37j777J512J216l386J347J776k163L69m76K64J675
1796A133k430J10L032k291n56J773p27O47o30r65K703r81k419K471j20r21J19
1813e2j033J423J63k073J496Q63k310J628j43J04O93j620J134J218j984O93R49
1830A149j613N79j09l61R97j529L44J786k060n49J638o80L28l18k26J996j535
1847a63j331K963q47j254R38j11R19r21j918K650K62k449R42K78j61K31j405J439
1865F2Q06k108R46J645j496K3L56j92J646k115J06J527j449l0P66j067Q6R4k51
1884f45J442j643o15K047n26o24M16k2P32l40q28J967r33j517J821k43m87k24
1902b22o44J364O59k768J038J124j099O89m18O8J277j869P34J597k181M63P59
$$ plain form
1919 571 -254 1246 148 -965 601 -315 -481 386 -1031 -414 849 -645 -316 247 -1040 855 36
1936 36 -1456 1271 -173 -618 1242 124 132 586 -991 1109 1089 -1606 -166 648 -217 409 -1274 -802
1954 -802 1201 -1008 -440 1128 -614 494 322 -276 1688 -239 -1255 1233 247 -243 239 -1137 470
1971 470 910 -1840 -322 278 -719 673 -858 -762 1477 -785 -398 1601 -154 19 486 -296 1917
1988 1917 -72 -1690 1043 511 -679 116 -1321 13 1047 -1385 -125 651 -1110 180 178 -283 1129
2005 1129 -778 -265 1662 -229 -176 542 -376 961 396 -1162 415 -150 -613 586 -934 -600 979
2022 979 -1297 -275 934 -284 -28 323 -85 1575 -430 -1057 1485 514 -589 102 -734 930 623
2039 623 -1613 -24 607 -937 -266 -330 76 553 -1464 177 2050 -740 -758 775 459 898 -419 -777
$$ packed form
1919E71q25J500j098j113J566r16j66Q67j417O17J263j494L29N63j287J895q19
1936C6j492K727j444m45J860j118QM54j577K100k0k695J440Q14q65O26j683M72
1954h02K003k209N68J568j742J108j72n98J964j927j016K488r86m90M82j376J607
1971D70M40k750J518O00r97J392j531R6K239k262L87J999j755J73M67p82K213
1988A917j989j618K733n32j190P95j437J334J034k432J260P76j761J290km61J412
2005A129j907N13J927j891N3P18r18J337n65j558J577n65m63J199j520L34J579
2022I79k276J022J209j218K56L51m08J660k005o27K542r71j103O91q36J664l07
2039F23k236J589O31j544O71o4M06M77k017J641J873k790j8J533l16M39j317l58
$$ plain form
2057 -777 1352 -369 -835 587 -606 -392 -23 -953 766 -170 -1501 722 402 -409 483 -479 258 1030
2075 1030 -677 557 949 -857 916 470 -1080 -41 -262 -177 350 -1038 -12 731 -1288 197 1203
2092 1203 -611 -131 56 578 1050 -976 -304 1570 -171 -465 96 276 308 -553 -810 766 -114 -1029
2110 -1029 208 265 -70 -557 -627 1366 661 -1242 497 930 1 115 2 166 620 -785 327 884
2128 884 -1192 -247 70 -729 20 -701 -281 599 -815 -153 842 -578 144 640 65 703 -212 -138 1308
2147 1308 -464 -1007 904 -336 -743 -270 -633 793 -156 -1197 1029 416 -1449 -56 324 342 716
2164 716 -494 1058 958 -1218 48 714 -338 276 -505 -129 890 -1286 -662 729 -713 -68 200
2181 200 -244 862 -146 -676 1478 -288 -680 1468 -71 -192 411 -808 490 -6 -1011 1027 -152
$$ packed form
2057g77K129j721m66J422j193K14L69r30J719r36j331K223l20q11Q92r62P37P72
2075A030j707J234L92j806J773m46j550J039k21Q5N27j388J026P43k019J485J006
2092A203j814M80J87N22M72k026O72J874j741k94N61J80L2q61k57J576q80r15
2110a029J237N7l35m87p0J993p05j903J739M33r29J14j13J64M54j405J112N57
2128H84k076R45L17p99P49p21M20Q80j414O62R95j420P22M96n75O38r15P4J446
2147A308j772n43J911j240m07M73l63J426r49j041K226o13j865J393L80J8L74
2164G16j210J552j00k176J266O66j052O14p81L76J019k176O24J391j442O45K68
2181B00m44J106j008n30K154j766l92K148j539j21O03j219J298m96j005K038j179
$$ plain form
2198 -152 -1278 614 196 -206 150 -759 594 955 -1239 654 1066 -800 424 -36 281 987 -1178
2215 -1178 -81 1481 -1150 -924 468 -440 307 -429 -869 1191 -730 -974 1217 -57 -155 358 -298
2232 -298 1178 357 -984 1354 369 -1230 840 184 -135 452 -1195 63 184 -1493 332 748 -1175
2249 -1175 369 68 -13 560 -749 95 1367 -852 -208 721 -359 -105 -45 -472 1001 -714 -1051 1211
2267 1211 -306 -764 553 -274 704 107 -888 888 392 -843 907 463 -191 710 -341 157 530 -1066
2285 -1066 47 319 -953 9 150 -791 189 -506 -76 843 -732 -308 1170 -85 64 418 138 1142
2303 1142 -255 -717 1150 -182 -737 214 -301 -443 -469 -598 384 20 -1257 491 325 -180 396 -212
2321 -212 646 832 -421 288 446 -773 59 336 -647 203 -603 -236 657 -1028 -590 460 -522 297 292
$$ packed form
2198a52j126J892m18m02L56r09J353L61k194J893M12j866J224m60L17P06k165
2215a178J097J562k631K26J392r08P47p36m40K060j921k44K191j274r8N13o56
2232b98J476q21j341K338r85j599K070o56l19N87j647J258J21j677J825M16j923
2249a175J544l01q1N73j309Q44J272k219O44R29j080K54O0m27J473j715l37K262
2267A211j517m58J317q27R78n97r95J776m96j235J750m44o54R01j051M98L73j596
2285a066J113K72j272R62J41r41R80o95M30R19j575M24J478j255J49L54k80J004
2303A142j397m62J867j332n55R51n15j42k6j29R82l64j277J748j66n05N76o08
2321b12Q58J86j253P09J58j219Q32K77r83Q50q06L67Q93j685M38J050r82Q19n
$$ plain form
2340 292 -349 256 13 -269 1100 -404 -608 784 142 -35 -111 -298 435 -83 -717 466 10 -540 52
2359 52 -679 156 449 -804 790 780 -501 511 438 164 644 -582 -174 642 -488 -96 282 -657 140
2378 140 325 -490 227 -585 -566 890 -369 -156 511 -560 356 563 -195 606 -209 -337 1034 -435 -645
2397 -645 321 -286 19 -99 -822 365 311 -710 746 242 -154 488 -253 561 778 -688 174 802 -108
2416 -108 243 -324 -412 631 -350 -603 581 -536 -298 243 -422 242 67 -627 838 495 -327 868 -201
2435 -201 61 796 -698 -331 556 -177 371 -487 -721 482 114 -926 214 -376 -105 593 -395 312 366
2454 366 -970 493 650 -253 344 -254 124 1142 -549 -781 722 -490 91 8 -850 373 -254 -1044
2472 -1044 642 -81 -186 386 -71 275 968 -845 59 693 -480 562 -451 -433 782 -402 -766 498
$$ packed form
2340B92o41O05k43k82J369j504k04J392o42j77p6j87P33n18o34J183m56n50N92
2359E2p31Q35K93j253J594j0j281J012p3k74M80j226M08Q16j130L92L78r39P97
2378A40J85q15P17q12J9J456j259K13O67j071R16K07p58Q01q15j28J371j469k10
2397f45R66o07L05j18p23J187n4j021J456n04l96O42p41Q14K17j466Q62O28r10
2416a08L51n67q8J043r81k53J184j117K38N41o65O64j75o94J465l43q22J195j069
2435b01K62P35j494L67Q87p33N48q58k34J203l68j040J140n90K71O98r88P07N4
2454C66j336J463J57r03N97n98L78J018j691k32J503j212N81q3q58J223o27p90
2472a044J686p23j05N72m57L46O93j813R04O34j173J042j013J8J215j184l64J264
$$ plain form
2490 498 -313 -478 554 -688 361 47 -659 664 358 -352 557 -38 314 678 -643 52 500 -270
2508 -270 151 -113 -689 290 -428 -558 589 -406 -232 341 -392 330 248 -567 492 512 -157 329 -465 93
2528 93 819 -480 -210 321 -371 111 -190 -447 494 297 -879 557 -325 -50 152 -108 396 687 -659
2547 -659 444 854 -168 182 -184 138 648 -442 -233 130 -540 -264 196 -225 342 -371 -328 949 -20
2566 -20 -281 426 5 541 259 -365 473 513 -477 289 46 -520 -69 -610 -220 18 -424 141 352 -697
2586 -697 335 358 -332 97 234 66 524 -440 436 435 -960 54 153 -403 -70 -571 -799 248 -568 -613
2606 -613 628 -163 -177 117 64 635 -199 -609 829 357 -647 355 96 283 67 -552 207 93 -941
2625 -941 65 -61 -512 253 -114 -40 376 -163 177 803 -732 274 167 -371 436 146 -199 302 -366
$$ packed form
2490D98q11j65J032j242J049l14p06J323l06p10R09n95L52L64j321O95M48p70
2508b70M21k64n76R79p18j30J147r95J74N73p33P22q2q15J059K0o69M86p94N58
2528I3P26j299K70N31o92M82l01k57R41j97j176J436q82K75K02k60N04K91j346
2547f59J103M10j022L50l66L22N10j090K09L63o70K76M60m21N67p13M3J277r69
2566b0k61P07m21N36k82o24Q38M0r90P66k43n66M51n41L90K38m42N65K11j049
2586f97J032K3o90M29J37j68M58r64Q76jj395J014R9n56L33n01k28J047q16m5
2606f13J241p91j4K94n3N71q34m10J438m72j004J002k59J87k16o19P59j14j034
2625i41J006j26m51P65l67P4M16n39L40O26j535J006j07n38Q07k90l45N01o68
$$ plain form
2644 -366 -478 692 -679 -229 496 -248 410 -167 -531 835 -14 -595 565 394 -18 -18 -162 925 229
2663 229 -760 348 294 -733 27 -209 -65 278 -1027 31 709 -810 39 664 -103 484 -44 -42 1159
2682 1159 -93 -463 609 -3 -121 449 -683 153 74 -626 462 -499 -834 549 114 -217 464 13
2700 13 317 284 -646 938 274 -638 408 221 -433 241 -648 327 611 -843 -228 492 -342 62 -274 -106
2720 -106 899 -418 -335 1084 -100 -403 516 -101 270 -199 -566 790 -226 -1115 420 -331 -343 259
2738 259 -520 -12 156 -709 412 366 -469 500 345 -54 435 -259 471 467 -828 -114 558 -489 -51 86
2758 86 -319 401 -569 -289 932 -545 -350 562 -94 77 -135 -106 744 387 -572 466 152 -326 36 -187
2778 -187 -16 347 -763 216 329 -684 64 149 -170 37 -115 272 712 -527 218 807 -349 -172 179
$$ packed form
2644c66j12J170j371M50P25p44O58n77l64J366q49n81J160j71m12%j44J087o96
2663B29r89J108n4j027P60k36J44L43j305J058O78j519Q49O25p67N87n28KJ201
2682A159j252l70J072o12j18N70j132Q36p9p00J088r61l35J383m35l31O81m51
2700A3L04l3r30J584o64r12J046j87o54O74q89R75K84j454O15P20q34M04l36J68
2720a06J005j317Q3J419j184l03R19o17L71m69l67J356j016q89J535p51j2O02
2738B59p79N08J68q65J121m6q35R69j55l99M89o94P30mj295P14O72j047M38J37
2758H6m05P20r70K80J221j477J95R12o56J71k12K9Q50l57r59J038l14m78L62k23
2778a87J71L63j110R79J13j013P48Q5l19K07j52L87M40j239P45N89j156J77L51
$$ plain form
2797 179 -138 147 -213 -162 566 -594 -561 299 -319 -445 -8 -72 240 -283 -438 672 384 -368 221 -58
2817 -58 279 81 -569 381 287 -666 165 17 -631 9 -207 388 293 -751 -79 702 -273 82 125 97 431
2838 431 -65 195 752 -506 -216 385 -238 -172 -212 -22 232 -655 -726 617 -95 -414 284 -36 71 228
2858 228 4 672 -12 -704 323 266 -196 223 -214 -20 306 -975 26 535 -677 90 11 -145 135
2877 135 -360 144 842 -489 -13 260 -266 370 10 -569 164 -419 -290 564 -438 -162 185 -262 -65
2896 -65 115 -489 243 29 -407 372 461 -347 488 -96 322 175 -675 446 372 -651 19 383 -27 10 -427
2917 -427 -462 484 -679 -8 470 -238 114 270 -146 489 -131 -86 817 -212 -612 163 -175 -166 -52 -710 279
2938 279 8 -753 590 -261 -329 555 -501 12 511 -317 391 382 -242 694 189 -535 368 1 -175 188
$$ packed form
2797A79l17K85l60N1P28j160L3Q60o18j26M37o4L12n23j55J110k88p52N89k79
2817e8L37j98o50R50r4r53Q31j48o48O40k16N95r5j044O72P81r75L55M3k8L34
2838D31m96K60N57j258K90O01o23O6m0J90K54q87p1J343p12l19O98l20J07J57
2858B28k24O68o84o92J027n7m62M19m37J94L26j281J001N09j212P67p9j56K80
2877A35m95N04O98j331M76K73n26O36l60n79P33n83J29Q54j002K76L47m47J97
2896f5J80o04P32k14m36P79Q9q08Q35n84M18j47q50J121p4j023O70L64m10L7m37
2917d27l5R46j163O71M78p08L52J56m16O35o20M5R03j029m00P75l38RJ14o58R89
2938B79k71p61J343q51o8Q84j056N13M99q28P08ro24R36n05p24R03l67j76L63
$$ plain form
2958 188 -703 -163 236 -574 -32 170 -269 78 54 -40 394 -317 -342 585 -47 38 516 -453 493 265 -641
2979 -641 -160 277 -369 113 -483 -391 97 -369 298 264 -678 102 557 -107 519 -30 -38 690 -81 -137 395 -469
3001 -469 -121 105 -443 302 23 -482 164 -294 -302 490 -300 -46 408 26 55 284 -428 518 305 -476 614
3022 614 -25 98 212 -681 77 484 -611 -214 141 -213 117 -229 4 144 114 -110 527 -166 144 70
3042 70 -398 533 320 -421 287 -92 -203 -138 -383 -81 256 -363 93 331 -70 144 -28 -107 394 120 -250
3063 -250 477 -319 412 179 -307 374 93 -488 -134 -258 -288 131 -140 -154 483 -482 -29 406 -71 51 36
3084 36 110 416 -188 -152 418 -41 82 57 -639 209 167 -608 38 -49 -77 32 -367 -82 834 -512 391 312
3106 312 -93 510 -107 -233 376 63 -597 369 -149 -31 34 -532 -326 -67 -587 527 46 -429 246 -186
$$ packed form
2958A88q91N40L99q10N42K02m39L47k4r4M34p11k5R27o32Q5M78r69R46k28r06
2979f41M81M37o46M82n96R2M88m66O67l4r42P80M55o64O26n49qP28p71n6N32q64
3001d69L48K26n48P45k79n05O46m58qP92p90K54M54l82K9K29p12R46k13p81J090
3022F14o39J23J14q93P58M07j095L97L55l54L30l46K33J40l0k24O37o93L10p4
3042G0m68R31k13p41P08l79j11O5k45L02L37o19M56K38m01K14j72p9N01k74l70
3063b50P27p96P31k33m86O81k81n81L54j24l0M19k71j4O37r65M53M35m77J22j5
3084C6P4L06o04L6N70m59J23k5o96Q48m2p75O46q7k8J09l99K85R16j346R03p9
3106C12m05O03o17j26O09l13o60R66n18J18O5n66K06K59n20J114m81m75O75m32
$$ plain form
3126 -186 191 469 -307 129 319 -161 325 45 -277 405 64 -392 360 -409 -173 155 -712 35 156 -231
3146 -231 218 146 -120 709 157 -80 852 11 -127 355 123 245 223 -452 484 -156 -450 266 -236 -42 225
3167 225 -458 281 735 -596 165 441 -220 25 -26 -124 493 -209 -157 594 -412 -331 144 -729 186 25 -549
3188 -549 239 -16 -185 242 -117 128 740 -257 300 424 -381 400 51 -459 334 134 -506 313 -350 189
3208 189 47 -332 108 245 -547 8 -48 -227 493 88 95 588 -442 -419 654 -343 124 -83 -427 537 -309
3229 -309 -876 596 -276 -439 222 -329 43 162 -553 506 -58 -415 392 -70 14 370 -275 -83 335 -429
3249 -429 -98 71 -488 378 135 -475 106 -134 -349 395 -322 238 562 -456 195 330 -453 383 -55 -161
3269 -161 91 -452 -236 273 -195 -52 1 -529 309 -42 -505 189 165 169 189 -6 315 260 -393 245 277 -358
$$ packed form
3126a86L77K78p76M36J90m80M86k80l22O82l41m56P52p69K36L28q67P47J21l87
3146b31M49p2k66Q29n52k37R32q41j38M82k32J22k2o75R36o40k94P16n02J94K67
3167B25o83P39M54j331P61K76o61K45n1r8O17p02N2P51j006Q1M75q73R15j61n74
3188e49P88k55j69M27l59K45O12r97N57J24q05P81l49n10P93k00o40Q19o63N39
3208A89j42l79M40J37p92N55n6j79P20m05PM93j030K3J073r97M67k07l44R64q46
3229c09n67J472q72j63O61n51L72J19p15J059n64l57Q07m62Q4L56o45J92M18p64
3249d29L31J69n59Q66k43o10N81k40k15P44p17N60L24j018O51J35p83Q36m38j06
3269a61K52n43K16N09m68J43N3n30Q38l51m63O94k4MK0j95L21n5o53O38L2o35
$$ plain form
3291 -358 152 94 -314 -23 -391 -285 184 -353 -132 100 -445 161 368 -479 510 249 -246 457 235 -133
3311 -133 333 -268 -109 -101 -283 198 -160 -562 366 -376 -589 80 -54 227 221 -355 154 179 -142 417 -79 16
3333 16 225 -146 205 363 -373 61 329 -250 -38 206 -523 242 -211 -159 466 5 -144 357 -372 62 297
3354 297 185 343 17 -414 344 94 -410 279 -128 -46 -12 -559 114 301 -185 352 518 -202 204 19 58
3375 58 533 -598 133 279 -194 148 -71 -371 337 -277 -243 371 -300 -178 275 -154 147 72 -496 436 253
3396 253 -181 440 54 -62 476 -218 -189 308 -535 146 116 -629 15 92 -293 183 -226 -369 148 -295 64
3417 64 363 -399 278 258 -279 267 181 -165 281 -295 -511 304 -239 -435 227 -505 460 -10 -386 354 -68
3438 -68 -268 118 -191 318 264 -66 -5 133 -280 292 92 -235 36 -39 -431 219 -395 -175 384 -315 146
$$ packed form
3291c58N10n8m08K91l68J06M69n37K21K32n45O06K07q47R89k61m95P03k22l68
3311a33M66o01J59Qj82M81l58m02R28p42k13O69j34K81on76N09K5l21N59m96R5
3333A6K09l71L51J58p36M34K68n79K12K44p29P65m53N2O25m61j49N01p29M34K35
3354B97j12J58l26m31P58k50n04O89m07Q2L4n47O73J87m86N37J66p20M06j85L9
3375E8M75j131P31J46m73L42k19l00P08o14L4O14o71J22M53m29L01p5n68R32j83
3396B53m34O21l86j16N38o94K9M97q43O81l0p45O44P7l85M76m09j43N17m43L59
3417F4K99p62O77k0n37N46q6l46M46n76k16Q15n43j96O62p32R65m70l76P40m22
3438f8k00L86l09N09n4l30O1J38m13N72k00l27K71p5l92O50o14K20N59o99M61
$$ plain form
3459 146 446 -353 249 266 -230 361 -92 -396 360 -188 -236 405 37 203 21 -539 -120 -26 -526 -31 -202
3480 -202 -181 -102 -108 214 325 -389 173 164 -132 497 107 -177 550 -21 -406 338 -325 -199 81 -52 34 131 -89
3503 -89 318 -118 -89 186 -204 271 323 -144 380 34 -150 192 -109 -186 387 -197 -208 -65 -273 -255 168 -404
3525 -404 236 27 -347 226 14 47 385 -55 72 384 -171 -128 -1 -3 221 8 -224 387 41 -377 187
3546 187 -31 128 -33 -409 206 288 -302 324 -136 -52 56 -412 -164 147 -366 -159 -126 -200 -299 -330 -506 302
3568 302 -27 -149 13 -29 62 71 -397 407 341 -224 62 14 218 353 -260 -247 313 -284 -253 -70 -264 207 0
3591 0 -250 227 362 -253 7 78 160 340 -316 -19 367 -486 75 -93 -170 298 -337 -341 128 -461 -262 201
3613 201 -196 -42 78 -397 337 168 -233 120 -25 20 395 -196 35 366 -340 92 -68 -485 -16 -233
$$ packed form
3459A46L00p99O02J7m96N91m53l04P56n48m8O41l68J66j82n60M19R4n00M95j71
3480b02K1P9oL22J11p14N62rk96O29l90k84P27n71l85P44o63J26K80j33Q6R7k20
3503h9M07m36K9K75l90M75N2m67N24l46j84L42l01p7N73n84j1J43k08J8M23n72
3525d04O40k09l74N73k12L3L38m40J27L12n55M3J27kK24k13k32O11l46m18N64
3546A87k18J59j61l76O15Q2n90O26m60Q4J08m68K48L11n13K07L3p4r9l1j76Q08
3568C02l29j22J62m2R1Rm68Q04o6n65K86m8K04J35o13J3N60n97L1J83j94M71k07
3591@k50M77J35o15K60P1Q2J80o56K97L86q53N61j68p7M68o35mM69n89J99M63
3613B01l97J54J20m75P34j69m01L53j45M5L75n91K31L31p06M32j60m17M69k17
$$ plain form
3633 -233 -244 -46 -244 -349 115 40 447 40 -11 420 173 -70 141 18 -25 555 -411 -286 475 -149 -268
3654 -268 161 -194 71 -18 -564 603 -100 -217 400 -10 -35 43 -377 471 -79 -150 462 182 -97 20 -422
3675 -422 -74 312 -570 127 64 -285 13 -71 -481 464 -78 -13 387 -395 180 546 28 40 560 -100 -122 156
3697 156 -416 75 -417 18 348 -283 -187 486 -334 87 -83 -60 394 222 106 381 161 -115 547 -298 22
3718 22 281 -203 -100 -60 -298 -174 -114 -39 337 -343 -209 453 24 -64 341 44 425 150 -390 444 176 -118
3740 -118 80 -31 18 -158 -239 -144 253 -515 43 -111 -338 12 61 107 153 -175 -76 185 -402 165 146 -160 90
3763 90 54 -348 -87 27 -96 11 -269 -131 372 -178 215 -57 -210 327 181 -73 257 -57 -53 285 142
3784 142 135 79 -495 168 363 -279 -26 -87 258 -60 -236 530 12 -257 70 91 63 302 -196 139 214 -258
$$ packed form
3633b33j1J98j98j05M64p5M07m07n1M31k47k43K11j23m3N80r66J25P61o24j19
3654b68M29l55K65q9n46J167p03j17O17m10k5P8m20Q48n50p1O12k80k79J17m42
3675d22L48L86q82O97o3l49K98q4m10R45n42O5M00p82N75L66n18J2N20o60k2K78
3697A56n72M91m92M35L30o31R6O73q20M21j70K3M54j72j16K75k20k76O62q45L20
3718B2K59m84J03M0k38J24O0P5L76o80J34O62m29q8M05k97L81k75n40Q34k68k94
3740a18J98j11M9j76q1R5L97p68N58j54k27L50M9M6M6l28R9K61n87N67j9l06K50
3763I0l6m02K61J14j23J07k80J38N03n50L93k72j53N37j46k54L30l14ML38j43
3784A42pn6n74O63J95o42K53o1L45l18j76P66n18k69L27K1k8K39m98L35P5m72
$$ plain form
3806 -258 58 185 -216 -256 -157 -446 116 -182 -325 310 61 -214 200 -287 161 17 15 244 5 -294 -127
3827 -127 142 -196 195 120 -95 77 -328 166 57 -197 109 217 -48 143 -85 -277 480 -319 145 162 -43
3848 -43 58 285 -41 370 -138 4 135 -74 -627 60 -278 -112 178 -110 120 89 23 7 239 -343 475
3869 475 -32 -97 370 -185 351 -87 -332 -42 80 -400 167 -248 -349 281 -279 38 185 -2 -12 142 154
3890 154 158 -24 -182 396 83 -182 333 94 -409 39 -285 -365 65 -290 289 -88 -131 382 -23 -290 86
3911 86 -134 10 86 -420 21 182 -328 101 -49 -187 193 -341 76 183 -276 -92 314 25 53 63 -323
3932 -323 178 166 -322 379 -124 98 128 -412 134 223 -88 255 -32 -324 243 -111 -234 266 -161 -188 465
3953 465 -246 109 313 -218 94 365 45 -160 86 -153 446 -204 -5 275 -368 266 -7 -27 129 -107
$$ packed form
3806b58L16J27m01m0R9k89N62k98j43O35k49k75M14m87M48j44kK29k39k99J67
3827a27K69l38L91p5k15J72m05M94j09k54L06J08k65J91k28j92P57p99M64J7k05
3848d3J01K27l26M11n08J42J31k09n53O87l38J66K90k88K30l1o6j6K32n82Q18
3869D75n07o5M67n55N36m38k45K90J22m80N67m15j01O30n60L17J47j87j0J54J2
3890A54Mj82j58N78l13k65N15k39n03M48l24q0M30l55N79l77m3N13m05k67L76
3911H6k20J44P6n06M41J61n10M29j50j38L80n34M17J07m59J84M06k89K8J0l86
3932c23N01j2m88P01n03K22L0n40N46Q9l11L43k87k92N67l54j23N00m27k7O53
3953D65p11L55K04n31L12K71l20k05K46k39N99o50J99K80o43O34k73k0J56k36
$$ plain form
3973 -107 -311 150 -175 0 34 56 245 91 -271 268 -1 -293 95 -186 -137 451 -399 -54 179 -253 265
3994 265 142 -4 236 228 -205 111 -13 -283 479 -96 -73 -31 -527 42 253 -11 57 84 -27 207 -146 -299
4016 -299 130 -521 117 289 -228 45 -66 -54 202 123 -130 355 58 -267 -35 -402 54 14 -83 -212 -218 205
4038 205 -147 -81 240 -13 -214 8 329 -296 27 209 0 182 38 98 333 -276 -178 190 -355 -100 442
4059 442 -303 241 231 -70 315 19 -73 223 112 290 39 -144 146 67 -53 86 201 40 17 -250 -210 -9
4081 -9 -338 -118 203 -315 -153 -52 213 431 108 81 312 -37 71 226 135 329 -66 -274 213 36 -278
4102 -278 116 -119 -3 54 -93 -22 120 -330 99 337 -178 170 -48 218 344 -330 33 96 -155 33 223
4123 223 -304 203 40 -336 33 -256 12 176 -60 -64 213 186 142 211 -53 154 224 -117 313 -13 -304 25
$$ packed form
3973a07k04M61l25J75L4K2J89j54l62N39k69k92L88k81M9N88q50L45K33m32N18
3994B65j23j46K40qm33L16j24k70P62n75K3M2m96N69K11k64O8K7j11K34l53j53
4016b99M29o51O38J72n17K73j11J2K56p9k53M85k97l25K32l67M56m0r7j29oM23
4038B05l52O6L21k53k01K22L21o25L23J82k09J82j44O0K35o09R8L68n45K55N42
4059D42p45N44j0l01L85k96r2K96j11J78k51j83K90p9j20J39J15j61k3k67M0K01
4081il29K20L21n18J62J01K65K18l23k7K31l49J08J55r1J94l95k08M87j77l14
4102b78L94k35J16N7j47P1J42m50M29K38n15L48k18K66J26o74L63O3k51J88J90
4123B23n27N07j63l76L69k89K68J64k36mK77k7m4O9k64K07P0l41M30l26k91L29
$$ plain form
4145 25 5 -210 -400 5 99 83 -206 112 137 -223 99 -253 -72 239 109 31 408 -243 365 69 -346 58
4167 58 -179 -500 169 -279 -178 610 -197 -16 192 -255 87 231 -279 25 128 -141 260 45 2 189 -125
4188 -125 304 -36 -445 210 51 -324 195 -126 -117 268 13 -60 -50 30 -77 266 -39 147 -118 -153 130 -324
4210 -324 -15 311 -33 -16 211 -470 72 10 -167 145 -18 -88 304 -200 48 80 -368 95 420 -83 145
4231 145 -221 -147 450 -73 -64 103 -205 -197 181 -207 -79 -19 -205 265 250 -84 134 132 -42 -114 -27 84 426 -67
4255 -67 87 28 -301 158 -1 -268 42 -142 -80 43 -178 118 -7 -325 175 -12 22 221 -300 -204 138 -113
4277 -113 -294 143 -166 77 -105 -230 88 -181 -143 222 79 -19 186 262 245 168 -306 6 -10 -214 -5 -199
4299 -199 -93 176 -254 61 -14 -289 48 -20 -88 83 -192 -169 143 -65 3 -99 146 71 98 -151 -132 -45 0
$$ packed form
4145B5k0k15j90M05R4j6k89L18K5l60L22l52J81L11j30p8L77o51O08k96m15M04
4167E8k37l21O69m48J01P88q07J81K08m47L42J44n10L04J03k69M01k15m3J87l14
4188a25M29l40m09O55j59l75N19l21RL85k55p3J0Q0j07L43l05J86k65l5K83m54
4210c24L09L26l44J7K27o81N42o2j77L12j63p0L92n04K48L2m48M63L25n03K28
4231A45l66P4N97n23RJ67l08QL78l88J28O0j86M70j5l34K18kj74p2Q7J11L42m93
4255f7J54n9l29M59j59k67L10j84O2J23k21K96j25l18N00j87L4J99n21R6L42k51
4277a13j81M37l09K43j82j25L18k69L8L65j43r8K05P6j7p7m74L12j6k04K09j94
4299a99J06K69m30L15p5k75L37o8o8J71k75K3L12k08O8j02K45p5K7k49J9Q7M5
$$ plain form
4322 0 188 9 -228 28 -140 -155 7 -481 -149 72 -14 -387 -148 -137 -9 3 59 294 -146 -164 201 -174 -146
4345 -146 157 -58 -143 113 -299 -72 -203 2 68 -304 49 70 -181 324 136 26 86 115 -40 163 -97 -32
4367 -32 102 -293 -252 130 16 -3 111 -282 216 323 -309 262 51 -131 191 -6 312 91 -202 203 -56
4388 -56 -16 446 -86 14 -93 -296 -273 211 -529 -70 85 -267 36 44 -105 377 -3 15 14 -39 168 163 -117 21
4412 21 4 -95 65 -131 -67 92 -234 -58 383 -116 243 321 -363 159 -1 -108 253 15 -20 191 -146 100
4434 100 -174 -204 23 -179 -57 -94 -5 -234 40 -328 177 219 -53 -189 346 -87 24 57 -289 284 388 -163
4456 -163 454 137 -69 44 -218 -269 278 -80 103 94 -279 190 46 51 383 213 -149 113 170 -72 -90 -123 88
4479 88 -277 -146 229 22 33 171 -68 69 264 -128 311 46 -246 133 16 -67 405 124 -77 -9 -158
$$ packed form
4322@J88j79k37K56j68j5J62m88L32K21q6l73K39J1J28J2N6K35m40j8L65l75K8
4345a46L03k15q5K56m12K27j31K05O6l72L53K1k51N05j88j10O0K9j55K03k60O5
4367c2J34l95M1L82j14j9J14l93M98J07o32N71k11j82L22j97L18k21k93M05k59
4388e6M0M62n32J00j07k03K3M84p40M59J55l52L03Qj49M82l80J8jn3K07nk80J38
4412B1j7r9J60j96O4J59l26J76M41m99L59P8o84N22j60j07L61k38l5K11l37K46
4434A00k74l0K27k02J22l7Q9k29K74l68N05M2k72j36N35m33J11L3l46N73J04n51
4456a63O17l17k06J13k62n1N47l58J83rl73M69j44NL32j70l62K62N7k42j8l3K11
4479H8l65J31L75k07J1J38k39J37J95l92M39k65k92L79j17q3M72k81k01O8j49
$$ plain form
4500 -158 246 349 -134 230 -38 -9 -133 9 -169 -180 -57 -205 -80 -320 -209 -26 -165 182 -29 -193 -27
4521 -27 -113 31 256 -139 -89 -66 -203 -63 84 -184 385 -69 -13 -6 -141 20 -26 -75 215 243 -369 4 147
4544 147 -90 -138 -75 -251 295 -77 -157 98 -211 -126 -31 -121 -3 13 -76 -55 -5 -4 128 -128 -18 64 -254 155
4568 155 12 -102 383 -211 -358 -15 -100 -65 148 -71 55 -129 279 218 180 -193 99 64 -82 94 -133 -244
4590 -244 95 -189 -1 88 -206 161 -221 -98 138 -394 -94 333 -151 13 81 -38 354 59 -114 214 246
4611 246 5 326 42 -102 72 -86 86 336 -31 -156 -60 -28 10 -87 -99 120 -295 154 57 158 177 22
4633 22 -11 7 120 -514 -68 -362 -34 198 -78 -315 99 -160 118 283 -27 205 -5 -144 453 -72 -13
4654 -13 34 13 -184 306 -63 207 -41 -204 4 -60 -43 260 52 207 139 -207 71 44 -151 314 -1 -162
$$ packed form
4500a58M04J03m83L64k68K9j24J42j78j1J23j48J25k40J11J83j39L47k11j64J66
4521b7q6J44K25l95N0K3j37J40J47k68N69m54N6Pj35J61m6m9K90K8o12L73J43
4544A47k37m8O3j76N46l72q0K55l09Q5R5r0J18J6q9K1N0JJ32k56J10Q2l18M09
4568A55j43j14M85n94j47L43q5L5K13k19J26j84M08o1l8l73K92l5j46J76k27j11
4590b44L39k84J88Q9k94L67l82J23K36n32L00M27m84J64O8j19L92k95j73L28L2
4611B46k41L21k84j44J74j58J72K50l67j25R6L2L8r7j2K19m15M49r7J01J9j55
4633B2l3J8J13o34M46k94L28K32k76k37M14k59K78J65l10K32k10j39N97n25N9
4654a3M7k1j97M90l69K70k48j63K08o4J7L03k08J55o8l46K78k7j95M65l15j61
$$ plain form
4676 -162 299 337 -117 263 26 -288 -38 -359 -61 -64 -521 65 -139 -30 199 -288 -112 39 181 -31 35
4697 35 74 159 72 -89 79 53 -41 -42 -58 -212 -167 -105 -401 134 -217 36 31 -85 261 176 -148 289 -57 225 106
4722 106 -212 114 -59 -274 -47 -43 -161 -119 -110 -25 16 -162 79 258 -121 42 -15 -282 115 28 -121 251 -78
4745 -78 -130 -88 37 238 -9 65 -124 285 213 -197 -32 78 136 -204 -286 85 -166 20 -1 92 161 -153 -241 17
4769 17 78 -100 217 -141 0 91 -42 22 235 -171 265 31 192 0 102 -185 33 -86 -193 -95 -310 199
4791 199 -17 -82 36 -16 -193 26 -7 17 76 -300 -36 -54 84 408 -160 124 33 229 -41 244 -81 -73 72
4814 72 39 -10 95 -140 -73 -127 -60 128 -170 -64 193 -279 10 68 -187 247 224 153 549 21 -184 283 -191
4837 -191 -162 187 -328 -103 55 -297 216 -56 -227 212 1 42 -122 -263 -84 48 -280 -57 -43 -102 127
$$ packed form
4676a62M61L8m54L80k37l14K50l21K98lm57N86k04J09K29m87J76J51J42k12O6
4697C5L9Q5q7j61J68k6r4jj6j54M5O2k96N35l51K53nj16L46q5l24M37l46K82j19
4722A06l18L26j73k15K27Mj18M2RQ5M1j78K41J79l79J63n7k67L97q7j49L72l29
4745g8n2M2J25K01k47P4j89M09p2m10J65J10N8l40q2L71k51J86k1R3O9l14q8K58
4769A7O1j78L17l58J41R1j33O4K13m06M36k34J61j92J02k87K18j19j07R8k15N09
4791A99k16o5J18n2j77K19l3K4N9l76K64j8J38L24n68K84r1J96k70K85l25QJ45
4814G2l3m9J05k35O7n4O7J88k98J06K57m72K89N8k55M34k3p1L96n28k05M67m74
4837a91K9L49n15K25J58l52N13k72j71M39k11M1j64j41J79J32l28K23J4n9K29
$$ plain form
4858 127 161 -78 204 60 -147 26 -47 -602 -173 145 231 -14 -144 30 225 -28 183 -189 294 450 -168
4879 -168 208 229 -191 111 -187 -101 99 -143 -143 121 -150 61 117 -269 -258 100 88 39 20 -108 210 -65 -147
4902 -147 183 -55 -113 15 -202 44 16 -133 -53 -74 -256 31 -354 -79 -30 86 -24 498 -48 29 71 95 101
4925 101 -111 -154 94 -221 109 213 -236 209 -164 -293 89 -130 58 373 170 -69 -223 117 34 137 -150
4946 -150 -313 -7 -143 -194 35 -225 -46 -135 -118 224 -195 -134 82 39 54 373 -235 253 135 72 387 -73
4968 -73 27 205 -160 81 107 -281 -273 41 -50 55 -57 -175 218 -14 -172 156 -49 146 46 -272 321 168
4990 168 15 -19 -55 -203 -179 -177 405 -100 -28 29 64 -409 -120 -46 -38 -190 81 257 292 102 -169 310 -148 -47
5014 -47 -94 -85 -180 -28 16 85 15 207 -135 -298 -286 49 104 126 -20 -159 -6 -151 -68 235 -30 193 19 -112
$$ packed form
4858A27L4k39K82j44k07J73p3n55M29L18Q6k45j30J74J95k53K11l72M83J56o18
4879a68L76K1m20L02k98Q6K00k42%K64k71K11N6l86J1L58j2m9j9j28L18k75q2
4902a47L30k38n8J28k17K46k8j49Q0k1j82K87l85K75M9J16j10N22n46P7M2K4O
4925A01k12m3K48l15L30J04m49M45l73j29L82k19J88L15k03k39j54L40q3J03k87
4946a50j63L06j36n1K29k60J79q9J7L42m19O1K16m3J5L19o08M88j18o3L15m60
4968g3J00J78l65K41K6l88QL14r1J05j12j18L93k32j58L28k05J95j00l18N93j53
4990A68j53l4l6j48K4KN82n05P2N7L5m73K89P4Qj52K71J76L5j90k71M79m58J01
5014d7m7Rr5J52M4O9p0J92l42j63J2L35N5K2j46j39J53j45Q3L03k65K23j74j31
$$ plain form
5038 -112 -124 -113 -386 -72 227 14 136 -217 -159 297 -52 63 173 -323 140 -34 108 284 383 105 253
5059 253 73 -153 -14 -276 -118 -134 -550 -110 -52 38 -60 -127 -67 86 -357 90 183 33 -96 101 22 193 -66
5082 -66 -13 -41 85 146 183 -246 44 188 94 -242 -85 -42 -19 -137 28 195 -416 -126 95 -224 -138 229 58
5105 58 165 53 -204 20 -195 -100 135 -80 344 121 -381 -4 -100 -137 93 -6 -137 337 -24 269 245 -74
5127 -74 93 3 -75 29 122 -368 110 -90 -184 268 -210 54 -120 -19 187 33 -37 22 -226 111 316 -71
5149 -71 -43 -4 -204 4 -160 -158 -89 148 -213 109 -23 180 -4 101 215 285 -208 -450 -30 -13 212 78 -1
5172 -1 69 -366 -80 -84 147 -158 12 -72 -120 42 -325 122 74 14 81 -97 211 194 -92 -72 209 -2 -264 68
5196 68 -79 10 -5 -312 92 -263 -84 115 -24 -11 54 18 -103 85 -18 -101 174 -60 568 -73 91 -65
$$ packed form
5038a12j2J1k73L14K99k13J22l53N8M56l49J15J10m96M63j74J42J76R9k78J48
5059B53j80k26J39k62J58j6m16M40N8R0r8o7O0J53m43M47R3j50j29J97p9J71k59
5082f6N3k8J26O1L7m29K90J44r4l36J57M3K3j18J65J67o11K90K21l19Q6L67j71
5105E8J07j12k57K24k15R5K35k15M24k23n02L77r6l7K30r9j31M74l61K93k4l19
5127g4J67r0p8J04R3m90M78k00r4M52m78K64j74J01K06j54p0N9k48L37K05l87
5149g1K8L9k00K08j64KO9K37l61L22j32K03j84J05J14P0m93k42M20J7K25j34p9
5172aP0m35K86mK31l05J70q4m8J62l67M47m8o0O7j78L08j7k86K0K81k11k62L32
5196F8j47Q9j5l07M04l55J79J99j39J3O5l6j21J88j03q3K75k34O28o41J64j56
$$ plain form
5218 -65 59 40 64 -337 119 248 28 32 -1 57 30 -6 347 -1 -12 194 197 81 -103 225 -30 72 120 -263
5242 -263 -81 -21 -277 -5 97 -72 -44 -397 91 374 -270 -38 -43 -176 22 58 23 27 -271 211 -72 -277 -96
5265 -96 62 -99 17 -14 28 -78 -36 47 159 296 261 -109 -206 53 -17 -31 114 -285 -72 -23 -207 224 184 -48
5289 -48 -59 -54 -141 -224 57 -51 85 -131 -220 -93 -218 -198 -194 -42 88 0 -143 304 -132 -156 -123 -182 140 350 -17
5314 -17 46 -284 3 129 71 -156 -127 31 190 -126 -232 11 39 -204 97 160 -178 -222 -44 -55 87 -144 -67
$$ packed form
5218f5J24j9K4m01M56J29k20Ml3N8k7l6L53l48j1K06Lj16j84L28k55J02M8l83
5242b63J82O0k56K72J02j69K8l53M88K83o44K32nj33J98L6l5Mk98M82k83k05J81
5265i6J58j61J16l1M2j06M2Q3J12J37l5l70r7K59p0j4J45l99K13M9j84M31m0k32
5289d8j1Nq7q3K81j08J36k16q9J27j25K0MJ52J30q8j43M47m36k4L3n9L22K10l67
5314a7O3l30K87J26n8k27K9J58J59l16j06K43K8k43L01O3l38m4J78j1J42k31P7
$$ [...]
8191B28
##END NTUPLES=NMR FID
##END=
