##TITLE=1H_Pr Q-1-D
 200.13MHz, CDCl3,
 8 sc
 
 3.2.2025
##JCAMPDX= 6.0         $$ Bruker NMR JCAMP-DX V2.0
##DATA TYPE= NMR FID
##DATA CLASS= NTUPLES
##ORIGIN= UXNMR, Bruker Analytische Messtechnik GmbH
##OWNER= pz
$$ XWIN-NMR		Version 3.5
$$ Mon Feb  3 17:45:12 2025 Russian Standard Time (UT+4h)  she@DPX200
##.OBSERVE FREQUENCY= 200.1313
##.OBSERVE NUCLEUS= ^1H
##.DELAY= (6, 6)
##.ACQUISITION MODE= SIMULTANEOUS
##.ACQUISITION SCHEME= undefined
##.AVERAGES= 8
##.DIGITISER RES= 18
##SPECTROMETER/DATA SYSTEM= spect
##.PULSE SEQUENCE= zg30
##.SOLVENT NAME= CDCl3
##.SHIFT REFERENCE= (INTERNAL, CDCl3, 0, 14.3821)
##AUDIT TRAIL= $$ (NUMBER, WHEN, WHO, WHERE, WHAT)
$$ ##TITLE= Audit trail, XWIN-NMR		Version 3.5
$$ ##JCAMPDX= 5.01
$$ ##ORIGIN= Bruker BioSpin GmbH
$$ ##OWNER= she
$$ F:/spectra/data/she/nmr/H-C/1/audita.txt
$$ ##AUDIT TRAIL=  $$ (NUMBER, WHEN, WHO, WHERE, WHAT)
(   1,<2025-02-03 17:44:08.15 +0400>,<she>,<DPX200>,
      <created by zg, POWCHK disabled, PULCHK disabled
       configuration hash MD5:
       00 E9 B6 7A A2 85 ED C7 34 08 36 98 17 FE 4E 26
       data hash MD5: 16K
       BC 29 36 16 FB A4 80 F9 84 B9 0E 26 7E 89 83 63>)
$$ ##END=
$$ 
$$ hash MD5
$$ BF 20 97 B6 55 FB 9E CE C7 54 E2 BB CF C4 34 06
##$RELAX= 
##$RELAX= 
##$RELAX= 
##$RELAX= 
##$RELAX= 
##$RELAX= 
$$ Bruker specific parameters
$$ --------------------------
##$DU= <F:/spectra>
##$EXPNO= 1
##$NAME= <H-C>
##$PROCNO= 1
##$TYPE= <nmr>
##$USER= <she>
##$AMP= (0..31)
100 100 100 100 100 100 100 100 100 100 100 100 100 100 100 100 100 100 
100 100 100 100 100 100 100 100 100 100 100 100 100 100 
##$AQSEQ= 0
##$AQ_mod= 1
##$AUNM= <au_zg>
##$AUTOPOS= <>
##$BF1= 200.13
##$BF2= 200.13
##$BF3= 200.13
##$BF4= 200.13
##$BF5= 200.13
##$BF6= 200.13
##$BF7= 200.13
##$BF8= 200.13
##$BYTORDA= 1
##$CFDGTYP= 0
##$CFRGTYP= 5
##$CHEMSTR= <none>
##$CNST= (0..31)
1 1 145 1 1 1 1 1 1 1 1 1 1 1 1 1 1 1 1 1 1 1 1 1 1 1 1 1 1 1 1 1 
##$CPDPRG= <>
##$CPDPRG1= <>
##$CPDPRG2= <>
##$CPDPRG3= <>
##$CPDPRG4= <mlev>
##$CPDPRG5= <mlev>
##$CPDPRG6= <mlev>
##$CPDPRG7= <mlev>
##$CPDPRG8= <mlev>
##$CPDPRGB= <>
##$CPDPRGT= <>
##$D= (0..31)
0 0.7 0 0 0 0 0 0 0 0 0 0.03 0 0 0 0 0 0 0 0 0 0 0 0 0 0 0 0 0 0 0 0 
##$DATE= 1738590247
##$DBL= (0..7)
120 120 120 120 120 120 120 120 
##$DBP= (0..7)
150 150 150 150 150 150 150 150 
##$DBP07= 0
##$DBPNAM0= <>
##$DBPNAM1= <>
##$DBPNAM2= <>
##$DBPNAM3= <>
##$DBPNAM4= <>
##$DBPNAM5= <>
##$DBPNAM6= <>
##$DBPNAM7= <>
##$DBPOAL= (0..7)
0.5 0.5 0.5 0.5 0.5 0.5 0.5 0.5 
##$DBPOFFS= (0..7)
0 0 0 0 0 0 0 0 
##$DE= 6
##$DECBNUC= <off>
##$DECIM= 32
##$DECNUC= <off>
##$DECSTAT= 4
##$DIGMOD= 1
##$DIGTYP= 9
##$DL= (0..7)
0 120 120 120 120 120 120 120 
##$DP= (0..7)
150 150 150 150 150 150 150 150 
##$DP07= 0
##$DPNAME0= <>
##$DPNAME1= <>
##$DPNAME2= <>
##$DPNAME3= <>
##$DPNAME4= <>
##$DPNAME5= <>
##$DPNAME6= <>
##$DPNAME7= <>
##$DPOAL= (0..7)
0.5 0.5 0.5 0.5 0.5 0.5 0.5 0.5 
##$DPOFFS= (0..7)
0 0 0 0 0 0 0 0 
##$DQDMODE= 0
##$DR= 18
##$DS= 0
##$DSLIST= <SSSSSSSSSSSSSSS>
$$ [...]
##$SUBNAM0= <"">
##$SUBNAM1= <"">
##$SUBNAM2= <"">
##$SUBNAM3= <"">
##$SUBNAM4= <"">
##$SUBNAM5= <"">
##$SUBNAM6= <"">
##$SUBNAM7= <"">
##$SUBNAM8= <"">
##$SUBNAM9= <"">
##$SW= 18.0517328524113
##$SWIBOX= (0..15)
0 0 2 0 0 0 0 0 0 0 0 0 0 0 0 0 
##$SW_h= 3612.71676300578
##$TD= 16384
##$TD0= 1
##$TE= 0
##$TE2= 300
##$TE3= 300
##$TEG= 300
##$TL= (0..7)
0 120 120 120 120 120 120 120 
##$TP= (0..7)
150 150 150 150 150 150 150 150 
##$TP07= 0
##$TPNAME0= <>
##$TPNAME1= <>
##$TPNAME2= <>
##$TPNAME3= <>
##$TPNAME4= <>
##$TPNAME5= <>
##$TPNAME6= <>
##$TPNAME7= <>
##$TPOAL= (0..7)
0.5 0.5 0.5 0.5 0.5 0.5 0.5 0.5 
##$TPOFFS= (0..7)
0 0 0 0 0 0 0 0 
##$TUNHIN= 0
##$TUNHOUT= 0
##$TUNXOUT= 0
##$USERA1= <user>
##$USERA2= <user>
##$USERA3= <user>
##$USERA4= <user>
##$USERA5= <user>
##$V9= 5
##$VALIST= <valist>
##$VCLIST= <CCCCCCCCCCCCCCC>
##$VD= 0
##$VDLIST= <DDDDDDDDDDDDDDD>
##$VPLIST= <PPPPPPPPPPPPPPP>
##$VTLIST= <TTTTTTTTTTTTTTT>
##$WBST= 1024
##$WBSW= 4
##$XGAIN= (0..3)
0 0 0 0 
##$XL= 0
##$YL= 0
##$YMAX_a= 93348
##$YMIN_a= -90934
##$ZGOPTNS= <>
##$ZL1= 120
##$ZL2= 120
##$ZL3= 120
##$ZL4= 120
##$ABSF1= 10
##$ABSF2= 0
##$ABSG= 5
##$ABSL= 3
##$ALPHA= 0
##$AQORDER= 0
##$ASSFAC= 0
##$ASSFACI= 0
##$ASSFACX= 0
##$ASSWID= 0
##$AUNMP= <proc_1d>
##$AZFE= 0.1
##$AZFW= 0.1
##$BCFW= 1
##$BC_mod= 2
##$BYTORDP= 1
##$COROFFS= 0
##$CY= -3
##$DATMOD= 1
##$DC= 2
##$DFILT= <>
##$DTYPP= 0
##$F1P= 0
##$F2P= 0
##$FCOR= 0.5
##$FTSIZE= 0
##$FT_mod= 4
##$GAMMA= 1
##$GB= 0.15
##$INTBC= 1
##$INTSCL= 1
##$ISEN= 128
##$LB= 0.25
##$LEV0= 0
##$LPBIN= 0
##$MAXI= 10000
##$MC2= 0
##$MEAN= 0
##$ME_mod= 0
##$MI= 1.114404
##$NCOEF= 0
##$NC_proc= 0
##$NLEV= 6
##$NOISF1= 3.799351
##$NOISF2= 2.8
##$NSP= 1
##$NTH_PI= 0
##$NZP= 0
##$OFFSET= 14.38212
##$PC= 1
##$PHC0= 90.60433
##$PHC1= 17.39222
##$PH_mod= 1
##$PKNL= yes
##$PPARMOD= 0
##$PSCAL= 0
##$PSIGN= 0
##$REVERSE= no
##$SF= 200.129724274929
##$SI= 16384
##$SIGF1= 3
##$SIGF2= 2
##$SINO= 400
##$SIOLD= 16384
##$SREGLST= <1H.CDCl3>
##$SSB= 0
##$STSI= 0
##$STSR= 0
##$SW_p= 3205.1282051282
##$SYMM= 0
##$S_DEV= 0
##$TDeff= 0
##$TDoff= 0
##$TI= <>
##$TILT= no
##$TM1= 0
##$TM2= 0
##$TOPLEV= 0
##$USERP1= <user>
##$USERP2= <user>
##$USERP3= <user>
##$USERP4= <user>
##$USERP5= <user>
##$WDW= 1
##$XDIM= 8192
##$YMAX_p= 0
##$YMIN_p= 0
$$ End of Bruker specific parameters
$$ ---------------------------------
##NTUPLES= NMR FID
##VAR_NAME=  TIME,          FID/REAL,        FID/IMAG
##SYMBOL=    X,             R,               I
##VAR_TYPE=  INDEPENDENT,   DEPENDENT,       DEPENDENT
##VAR_FORM=  AFFN,          ASDF,            ASDF
##VAR_DIM=   8192,          8192,            8192
##UNITS=     SECONDS,       ARBITRARY UNITS, ARBITRARY UNITS
##FACTOR=    0.0002768,     1,               1
##FIRST=     0,             0,               0
##LAST=      2.2672688,     0,               0
##MIN=       0,             -90934,          0
##MAX=       2.2672688,     93348,           0
$$ Real data points
##PAGE= N=1
##DATA TABLE= (X++(R..R)), XYDATA
0 0 0 0 0 0 0 0 0 0 0 0 0 0 0 0 0 0 0 0 0 0 0 -2 8 -8 8 -8 8 -8 11 -16 16 -16 21 -24 24 -32 32 -39 41 -48 52 -58
42 -58 65 -73 80 -89 98 -107 118 -130 143 -159 175 -191 213 -234 258 -289 319 -356 399 -450 512
63 512 -588 684 -806 966 -1163 1249 323 93348 58149 -76976 -61927 36544 51513 -5618
77 -5618 -21808 -13015 -10898 8041 32794 892 -47219 -22642 44626 38042 -32419 -46611 18406
90 18406 49924 5117 -31768 -11779 11686 9157 4661 -2198 -21608 -16037 20710 23128 -19460
103 -19460 -27034 12840 24289 -2918 -8505 6377 1079 -6000 9570 11040 -14939 -17634 11485
116 11485 15673 -12928 -19547 6747 16636 -3164 -11305 5117 9459 -5816 -5096 12725 7282 -16764
130 -16764 -10495 17783 11994 -18467 -15252 12270 12455 -6413 -5637 4740 926 -2982 3920 3356
144 3356 -6082 -4117 5256 2372 -6741 -4619 4175 4504 -2361 -3503 2713 5032 386 -1046 2735
159 2735 1482 -4215 -2063 4178 256 -7119 -3464 2952 624 -1888 1264 810 -2339 1297 5906
174 5906 1683 -3102 394 3386 23 -2536 -1324 -429 -671 -886 -1052 -363 446 -474 -485 1756 1354 -1570
192 -1570 -398 3285 1230 -3101 -1479 1961 830 -737 -397 -903 -651 2117 2192 -1532 -1953 1293 1324
209 1324 -1176 -1006 -111 -1099 -1108 429 302 -699 -483 422 1220 1554 386 -634 1100 2529 -136 -2805
227 -2805 -808 1484 -281 -2082 -1495 -952 -103 1184 329 -1509 -393 2348 1971 -458 -385 1093 1004
244 1004 -63 -693 -583 -90 26 -825 -803 7 77 -502 -101 661 201 -576 31 623 113 -136 -136 -197 290
265 290 793 84 -698 56 1131 613 -599 -399 297 -126 -543 -391 -485 -679 -331 79 20 -422 -184 827
285 827 1009 340 46 570 928 389 -210 -184 -283 -472 -98 -340 -1062 -1029 83 551 -340 -705 262 1212 586
306 586 -241 103 687 684 68 -234 -16 -51 -106 -151 -409 -475 -18 86 -192 -473 -127 253 56 -193 -48 59
328 59 108 176 185 57 245 456 363 131 51 159 30 -214 -242 -287 -380 -408 -384 -338 -274 -156 97 225 170 233 486 461
354 461 294 184 393 512 -165 -511 -158 53 -421 -774 -449 -25 -59 -365 -220 -30 249 395 215 -60 169
375 169 587 410 23 -254 -13 352 208 -252 -565 -177 276 -54 -608 -361 134 55 -235 -263 -50 94 329
396 329 303 30 41 367 446 257 76 -21 -67 150 35 -549 -585 -170 -203 -463 -220 161 -207 -337 228 545 240
419 240 170 241 300 407 441 -19 -234 22 2 -332 -346 -296 -373 -231 97 -340 -565 219 706 -122 -624 143 807
442 807 644 184 -289 -305 306 649 -24 -547 -84 -62 -239 133 71 -758 -531 257 154 -418 88 577 81
463 81 -216 170 215 355 718 139 -591 -47 613 -16 -365 -21 -455 -969 -23 701 -225 -757 30 270 4
484 4 428 498 -280 -2 592 309 98 527 39 -879 -185 664 -326 -811 293 195 -919 -394 683 134 -549
505 -549 -55 155 213 678 442 -520 -132 694 153 -130 657 221 -1114 -485 939 237 -930 -455 -120 -494
525 -494 103 698 4 -468 66 149 -33 855 744 -584 -521 632 348 -151 243 10 -1091 -702 493 220
545 220 -274 15 -300 -748 84 690 156 44 335 -304 -346 1069 1226 -712 -1117 244 571 -10 53 -147
565 -147 -871 -335 315 -12 -356 -102 -16 -196 408 433 -135 290 685 -394 -798 736 1126 -289 -796 -185
585 -185 -66 200 550 -534 -1607 -190 1234 131 -666 53 55 -372 293 796 96 -114 354 67 -213
604 -213 463 450 -471 -546 -163 -290 164 779 -406 -1336 -112 801 -105 -122 811 80 -908 299 1249 122
624 122 -389 154 -196 -469 570 716 -533 -743 -67 -119 -213 327 -46 -749 0 595 -104 -109 675 64 -670
645 -670 102 751 164 4 241 -499 -590 592 528 -897 -707 471 94 -484 138 288 -470 -159 459 176
665 176 -7 478 289 -488 -65 626 181 -220 -140 -410 -180 459 164 -672 -501 194 -99 -300 358 337 -334
686 -334 -110 547 220 -25 434 210 -424 -82 468 148 -228 -209 -345 -311 99 189 -294 -275 98 -99 -103 343
708 343 254 -139 16 372 123 102 342 40 -392 -28 257 -164 -262 -78 -109 -334 -54 27 -156 44 82 -42
730 -42 -98 289 413 -25 -34 216 199 53 19 -168 -208 77 -23 -275 -210 19 -110 -242 8 153 -135 -16 161
753 161 -16 46 344 245 -22 37 186 139 -9 -40 -117 -151 -68 -45 -214 -174 -18 -102 -159 -3 82 46 33 113 128 80
779 80 249 239 -40 -85 118 23 -112 -67 -91 -96 -94 -202 -169 -88 6 0 -84 83 250 94 39 142 149 126 159 71 -35 -11
807 -11 -2 -15 -200 -142 20 -77 -164 -106 -114 -38 96 -21 -26 90 208 103 47 92 199 80 -12 18 -49 -28 -108 -120 -226
834 -226 -139 -91 -89 -171 -53 37 95 86 129 41 229 196 98 -14 66 114 40 -147 -75 -59 -82 -105 -141 -181 -31 -38 -38 -55 -21 66
864 66 64 189 123 103 137 152 31 -3 18 73 -76 -78 -82 -55 -91 -159 -115 -6 -2 -106 -116 53 161 46 -32 48 180 77
892 77 143 34 -101 8 117 -54 -164 -183 -86 -35 -72 -159 -197 30 168 -43 -127 146 218 83 18 180 81 0 55
917 55 72 -85 -72 55 -72 -197 -59 -120 -178 -63 25 -78 2 148 -3 -41 213 222 -88 -78 198 187 -81 3 56
942 56 -219 -123 36 -179 -291 -4 -49 -258 -75 206 64 14 89 14 -24 244 322 -169 -115 195 71 -159 17
965 17 -12 -232 -146 99 -98 -217 101 16 -233 14 277 -13 -75 213 76 -47 227 299 -197 -182 166 64 -231
988 -231 48 -5 -241 -157 62 -31 -88 78 -145 -210 200 400 66 -106 149 76 -80 256 260 -155 -327 117 61
1011 61 -149 31 -75 -334 -156 165 -23 -52 138 -81 -240 208 481 32 -116 160 69 -158 205 271 -234
1032 -234 -262 -56 -96 -175 151 39 -426 -170 269 17 -66 180 -9 -201 219 474 -59 -181 124 5 -183
1053 -183 169 191 -295 -239 48 -156 -161 210 48 -444 -111 334 81 -57 166 35 -199 172 453 -32 -139
1074 -139 80 -125 -185 195 224 -341 -387 18 -52 -84 390 45 -447 -154 386 179 -28 242 96 -251 107 362
1096 362 -69 -138 74 -189 -361 146 273 -239 -321 -41 -93 -106 259 110 -251 -26 295 48 -23 241 61 -281
1118 -281 8 273 -50 -161 -7 -187 -318 95 218 -219 -207 -13 3 -27 185 106 -196 19 243 33 -28 194
1140 194 25 -300 7 243 -66 -190 -11 -119 -161 162 237 -226 -208 30 54 127 260 153 -126 1 187 26
1162 26 33 183 -98 -295 -18 207 -63 -138 -46 -224 -153 101 192 -169 -33 131 1 61 248 160 -117 -28 48 -33
1186 -33 95 128 -122 -295 -71 51 -104 -83 10 -160 -45 122 79 -88 35 160 -80 15 217 172 -105 -72 55
1209 55 -18 -15 9 -33 -242 -42 44 -70 -96 -104 -60 -16 113 52 -33 114 86 -48 -20 158 101 -111 -33 36 -61 -46 41
1236 41 -101 -167 -55 -48 -16 -50 52 -15 1 24 78 2 90 63 -4 13 69 -7 -146 -64 -52 -78 -47 -75 -76 -147 -47 -7 2
1265 2 2 76 87 24 7 137 16 30 65 -14 18 9 -13 -93 -73 -20 -11 -24 -97 -62 -27 28 -4 43 57 77 18 26 44 61 9 44
1297 44 -23 -94 -6 -60 -33 -106 -38 -93 -25 -49 -57 -43 21 17 -60 25 81 53 41 27 46 37 -21 25 -32 -52 -15 -48 -9 -142 -83
1328 -83 -54 -5 7 -79 48 70 84 28 58 78 97 41 99 65 -35 6 -56 -82 -48 -77 -82 -72 -4 -26 -54 -13 8 11 59 35
1358 35 64 56 27 124 -9 29 -25 -14 -5 -101 -64 -18 -4 -2 -6 -32 -58 -47 -14 31 16 40 59 -3 25 24 20 6 -10 -28 -9 -1 -86
1391 -86 -51 -22 -11 -61 8 -3 28 42 -18 -38 21 80 15 -9 85 60 81 2 -17 13 2 -51 -59 -79 -124 -16 -45 -32 -49 -21
1421 -21 10 14 64 18 40 59 10 0 53 48 -25 -8 -46 -51 -51 -68 -98 -68 -70 7 -18 -67 82 46 21 3 69 58 14 68 33 25 -31
1454 -31 70 -3 -144 -45 36 -35 -8 -70 -20 -78 -20 45 -37 -17 100 -9 11 74 80 27 21 64 -61 0 49 19 -115 -109 -3
1483 -3 -98 -110 19 1 -90 1 83 -47 33 89 -35 -79 115 157 -99 -24 82 -28 3 76 -12 -137 -121 42 -59 -123
1509 -123 110 52 -97 -7 119 -25 -11 137 31 -24 87 68 -53 -61 37 -34 -100 102 52 -179 -84 28 -123 -91
1533 -91 52 53 -113 -17 112 39 -33 47 -42 -157 69 42 -90 -57 8 -126 -132 48 77 -77 -62 23 -38 -28 209 105
1559 105 -135 -43 98 27 20 127 -85 -202 42 66 -108 -85 11 -97 -153 71 71 -98 -60 24 -8 -14 143 77 -86
1584 -86 29 115 -1 -31 57 -62 -171 -21 73 -67 -51 14 -68 -112 99 154 -106 -27 105 -37 12 126 -9 -181
1608 -181 -3 91 -19 -44 64 -102 -189 29 16 -68 -59 43 -95 -93 67 140 -90 -80 69 -6 22 112 -13 -148 -57
1633 -57 7 -45 -21 39 -48 -206 -26 60 -59 -13 65 -104 -69 96 118 -46 -18 113 -20 6 120 65 -52 -21 99
1658 99 -89 -19 52 -15 -183 0 91 -76 -44 112 -68 -105 114 124 -47 -53 115 -30 -35 84 33 -97 -46 18 -81
1683 -81 -65 59 -109 -198 15 83 -3 -93 7 -61 -22 147 151 -31 -2 41 -38 -21 31 24 -48 -44 -41 -101 -5 56 -77 -123 67
1712 67 99 20 40 99 -51 -37 89 97 -23 -35 2 -83 -83 48 44 -109 -100 -19 -69 -2 45 -27 -92 22 73 -40 5 70 -12
1741 -12 -45 33 36 -9 -28 -12 -91 -38 43 6 -63 -66 63 -72 -10 68 17 -21 60 29 6 -13 75 -48 26 6 29 -36 -44 -5
1771 -5 -51 -36 20 -30 -71 -48 11 -12 -12 31 -8 9 30 24 -3 31 38 0 -26 37 48 -51 -21 -41 -28 -39 35 -18 -73 -1 9 1 0
1804 0 71 5 -18 -4 56 -3 43 6 7 -17 -3 -31 -30 -48 -1 -23 38 7 7 -27 7 16 -81 4 67 37 7 18 34 -28 -53 23 -26
1837 -26 -70 -6 62 -29 -75 14 -21 14 31 -25 -7 15 19 -20 29 20 17 -20 4 -10 -91 -7 -34 -46 -49 -59 -56 31 -16 -52 -21 -28 16
1870 16 67 23 77 54 -38 -16 91 -48 6 -18 -29 18 -2 -16 -39 -27 -45 -26 -23 -77 65 54 -5 -26 14 31 -24 -32 22 -20
1900 -20 -61 -56 -36 -1 -38 -24 -48 -90 -41 2 8 -38 -36 19 63 6 18 53 43 -35 -7 -16 -10 4 -30 -59 -26 -54 15 11 -28 -22 -28 -55
1934 -55 -39 7 -15 18 42 45 16 9 23 35 21 -61 0 -3 33 15 -16 6 -33 -73 -15 57 -52 -46 34 25 -15 2 45 27 51 37
1966 37 43 -61 -24 32 -56 25 56 -99 -44 -8 10 -46 -26 -2 -7 -41 15 63 -9 -6 32 74 1 43 9 7 8 3 -4 -23 13 -60 -59
1999 -59 27 44 -3 -63 50 -4 7 48 49 -22 45 50 -15 -1 8 -71 -74 -32 -12 -37 -91 4 -24 -85 -2 80 3 28 41 -49 21 87
2031 87 0 19 -59 4 -7 29 21 -37 -51 -41 10 3 1 -7 -4 -116 10 94 10 -38 30 15 0 92 40 -39 17 37 14 -27 -30 -16
2063 -16 -72 5 15 -103 -33 18 -9 -54 21 -10 -50 -29 31 7 11 58 4 -72 -65 84 -25 25 13 22 -42 11 23 -80 -21 -1
2093 -1 3 29 98 37 22 -51 34 -114 40 46 56 -7 -27 7 -20 -15 -10 -15 -17 -39 -16 -28 31 65 -24 -63 -9 119 -20 17 -6 -96
2125 -96 -44 94 -36 -17 -75 -20 -8 -36 28 -3 -17 -31 34 42 8 25 -13 6 75 39 -14 -10 -4 -57 -33 51 -53 -40 -56 11
2155 11 -6 6 52 33 -43 -25 122 76 52 45 -47 -16 40 42 17 -38 11 -37 0 28 6 -66 -31 16 -31 -70 30 0 -71 -23
2185 -23 73 -27 36 36 3 -80 41 33 -40 38 19 -41 0 33 17 -65 -25 -11 -84 -14 50 -30 -20 69 -19 65 41 42 -7 -125
2215 -125 -34 -7 -54 -23 -51 -41 -56 -6 52 -29 50 44 -25 39 -6 12 -15 -11 -6 50 -1 7 -5 -41 -2 51 -38 -43 -47 -61 -20 33 23
2248 23 -26 7 12 -7 11 35 -18 -14 -10 -25 -52 -17 42 -26 -78 45 -49 -70 11 -23 -48 -3 15 18 16 18 15 -14 7 36 -19 -24 -19 10
2282 10 -42 -11 -1 70 -72 42 -28 -9 -9 -9 23 -15 85 4 -15 -31 83 -21 -46 38 -1 -24 -21 -2 -8 -69 50 9 -15
2311 -15 -14 18 -7 -15 -5 23 2 26 -18 -71 -18 -11 10 0 11 -2 33 32 -57 -7 17 -30 -3 -32 16 60 2 -22 8 21 -9 1
2343 1 25 10 12 34 -65 -46 21 -13 23 -55 -46 17 46 6 -13 -38 58 -51 -21 21 -9 68 20 4 -62 -5 -3 -21 -14 -6 5 67 45
2376 45 -17 7 -13 -27 -16 -61 -4 48 37 9 -15 -6 50 46 4 -9 15 30 -8 -22 25 34 7 21 1 -36 15 -38 -25 -8 116
2407 116 28 -29 -10 -41 5 27 -33 -9 7 -23 -8 -25 65 -6 -6 -39 54 10 -51 38 16 -16 79 5 -17 24 -31 -13 37 68
2437 68 28 62 -3 -22 -12 1 18 -44 54 -35 -36 -29 28 37 21 0 32 14 30 2 -23 -44 33 0 -19 -26 16 -33 -21 61 -13 44
2469 44 23 -22 -23 55 38 52 31 -4 -1 60 -16 -14 -30 -14 -9 -4 -3 22 18 -81 17 44 -24 -45 -3 41 -51 -56 3 -49 -27 28 -24 -6
2503 -6 1 28 -20 -42 3 -35 -36 64 -48 -8 31 -11 -1 -21 -8 1 -31 85 10 -46 39 1 2 -3 -6 7 -87 5 -1 -25 16 18 2
2536 2 -4 2 15 2 26 -14 45 -27 48 12 0 4 2 -10 28 30 2 -64 -43 15 -35 -12 31 4 -81 -12 3 -46 -8 -3 -18 -52 28 61
2570 61 26 26 39 -23 -47 56 16 -101 -35 -12 -15 -49 42 6 -69 55 58 -53 37 43 -2 -65 5 51 5 -41 -15 -37 -75 33
2600 33 28 -13 -16 2 3 16 5 -47 -13 46 48 24 27 -3 -50 -69 42 25 -27 -52 -15 -4 12 24 22 14 -30 -17 -22 -35 24 28 -16 -37
2634 -37 23 41 -8 59 34 -69 38 9 29 55 -6 -11 -12 0 -3 9 39 18 -15 -50 77 51 -8 -25 -20 -44 -1 21 -46 -40 15
2665 15 46 -24 -4 18 15 -42 50 16 -26 -100 -22 8 -59 75 0 -6 -25 -56 14 -12 11 -31 -30 -4 15 -37 -5 8 -73 -44 -8
2696 -8 73 -19 81 -22 -44 -7 68 66 -18 -14 69 29 20 20 14 -6 28 -11 -23 -33 -10 -14 31 -3 83 -3 -73 -14 -24 -7 68 27 -42
2729 -42 -6 -7 -14 -57 -20 -18 -56 6 10 19 -60 51 86 -48 -1 47 39 33 35 21 20 43 -19 -60 -24 -15 5 -9 52 -35 24 -17 -45 -32
2763 -32 -5 -9 -37 24 -16 6 0 -17 12 26 -8 43 -48 -33 4 -2 -38 -11 -25 41 -48 -4 28 1 -18 22 -66 -11 56 3 40 11
2795 11 -15 -26 55 10 -4 -23 -82 -54 -7 -4 -10 3 41 -22 18 42 52 27 -11 16 -19 -10 -35 -25 21 8 -29 16 7 -12 20 -18
2827 -18 -43 -14 22 5 15 -14 67 29 74 -12 18 -95 -28 -15 20 22 -36 -16 -44 -41 48 33 28 -36 28 -8 -28 -27 57 4 13 -6
2859 -6 2 -41 -53 65 -35 -4 21 26 -40 6 -1 17 -7 9 -2 51 25 -28 -29 34 35 -19 25 -29 36 1 34 -32 39 4 9 -4 19
2892 19 -43 -19 -16 21 -10 -13 2 -17 -4 -9 -10 47 22 21 -20 -31 -22 -61 0 34 -29 -43 -26 -37 3 17 -4 -24 -16 -103 -6 -4 2 17 19
2927 19 17 19 -26 -22 20 -6 -17 12 19 -10 -16 34 49 13 -18 -43 48 17 -29 38 -10 3 23 -16 -18 24 11 -47 54 23 -11 -4 17
2960 17 48 -55 -3 5 -1 50 29 21 -4 29 30 27 -10 -5 -16 -41 9 -28 -48 -102 2 -47 -24 -8 64 8 -4 34 69 -8 -31 23
2992 23 10 0 -14 30 11 31 3 -38 32 -32 9 8 60 -27 -48 -6 -1 37 -7 27 -42 63 -25 -11 -36 3 -12 -16 -12 -48 -59 -18
3024 -18 12 -39 -5 -25 -4 -21 28 19 -22 -25 2 12 -37 8 0 15 -23 -14 -19 8 -4 13 7 -19 -46 38 20 -49 -12 5 38 10 4 -29
3058 -29 5 45 -11 18 7 -7 -35 -32 -47 -20 30 11 -51 -100 -5 -11 -19 10 13 7 -5 11 -28 -25 40 -20 32 52 48 -39 -33 -13 36 -61
3092 -61 3 26 -13 6 112 6 6 72 29 -25 -37 -3 33 32 -26 22 -73 -51 0 14 -60 -1 75 -72 1 -31 3 69 28 59
3122 59 -22 12 23 -32 -17 7 21 -4 -22 0 7 20 -79 -22 17 22 -23 15 -61 43 -4 -37 38 75 -23 9 42 -18 -10 4 98
3153 98 31 -12 58 -77 0 22 -6 -21 -24 -45 19 17 8 -6 29 18 5 -22 27 57 38 -44 -3 29 -24 -22 5 -9 -18 -2 -32 -82
3185 -82 -16 6 -22 -8 30 -21 -6 -38 25 -28 11 19 24 5 20 -57 3 10 -1 4 -30 48 11 3 6 4 -38 -2 6 -45 8 2 -31 15 -21
3220 -21 -22 -31 -52 -22 28 -28 -33 -41 -33 44 16 -15 36 5 25 -6 5 -34 -41 -5 58 -24 -7 9 3 4 -38 39 28 -2 -13 -5 -44 24 -19
3255 -19 -75 -23 5 -12 -18 -1 56 40 -46 77 41 33 0 -20 -16 -58 -12 -47 -20 -38 2 -7 -38 -35 -13 -23 -29 2 -25 -54 5 -17 -8
3288 -8 30 6 -16 -26 31 0 -45 53 1 -20 -22 -9 33 40 24 -68 0 -27 70 -7 -14 2 -20 -1 -56 -21 -55 -2 14 -28 -6 23
3320 23 -18 13 12 28 -6 39 5 33 -37 40 14 -20 40 -12 42 6 40 -35 40 -86 -3 -23 6 -65 74 1 -46 7 68 0
3350 0 -58 -7 30 9 12 38 -55 -17 -23 29 20 28 -14 2 42 53 39 42 17 1 -22 -41 10 -34 -21 -33 -64 -18 -15 64 -37 -28 -16 -22
3384 -22 -30 -34 12 -21 19 -19 7 -31 25 -9 61 17 28 -13 42 -16 -18 -18 44 -17 -24 -10 -27 -7 -6 8 -48 -51 -15 -11 27 44 51 -1 -9
3419 -9 -8 -19 2 26 45 -5 23 -48 -38 15 42 -3 43 28 3 5 14 11 -3 -12 -48 -4 43 -33 -29 -34 -23 -29 21 -18 5 22 -34 -10 0
3454 0 -3 14 -32 24 -1 24 -15 -14 -3 10 5 62 48 13 -34 -42 28 20 -29 46 -25 31 11 -8 7 28 25 17 101 -45 -16 30 -4 41
3488 41 4 79 -59 -62 -35 17 -34 -27 6 4 28 6 44 -10 25 31 -60 -22 -13 23 -19 22 10 1 -6 -21 47 7 -40 -40 -9 26 44 59
3522 59 -14 14 -41 -63 -50 -1 -22 -14 -9 -44 20 27 5 -38 -19 -64 -4 15 5 -36 21 -12 -85 -31 35 -7 13 -2 -21 2 16 -7
3554 -7 43 25 25 -29 -47 -66 -35 -7 -53 -11 8 2 -15 -44 -57 -10 14 4 -3 -12 18 -19 2 38 -14 -17 -40 -3 35 1 -60 -6 37
3587 37 -19 -5 29 18 62 30 3 -10 -63 -3 -40 7 14 56 -16 -21 44 25 14 -4 -11 -2 -5 -15 -14 13 33 8 52 -6 40 -28 -38
3620 -38 9 -59 19 -33 -20 6 -14 -18 -26 -47 -1 -2 -9 6 -4 44 25 33 24 -56 -16 5 -15 2 -44 -3 23 -79 39 -1 -50 -18
3652 -18 -8 0 -13 31 14 1 45 -5 -34 -21 47 28 8 -2 -16 -13 -4 -2 -36 -21 -6 1 43 -20 -37 -59 -46 18 -17 -8 28 8 24
3685 24 -13 16 -72 -29 -7 15 -23 -31 -11 -16 26 8 30 -27 4 34 11 14 -28 -6 12 -4 -1 -39 -64 -5 -47 14 35 26 11 36 18
3718 18 -39 28 13 -18 8 -30 -27 7 -1 2 -16 -17 -56 -16 7 59 -61 -20 -34 23 -60 39 -13 3 1 -54 12 45 -83 -22 15 -71
3750 -71 31 47 -48 41 36 -41 21 -6 -35 -16 -5 10 14 44 -23 -32 7 -3 35 -21 -53 -6 -38 5 -59 9 5 66 33 -41 4 -19
3782 -19 -50 -81 5 -35 31 1 20 13 9 17 -12 -52 28 28 -51 11 -28 20 42 -60 21 30 -21 40 57 12 26 2 -22 22 -60 -3
3814 -3 -18 -20 -38 29 40 -31 25 -50 -46 21 -50 -6 -27 10 15 -22 0 -10 -16 -20 77 -1 34 -10 -6 -32 27 9 27 -6 -41 -6 -4 -20
3848 -20 54 -31 -44 -10 18 -25 20 -26 -10 18 -18 6 -42 35 17 1 9 13 -19 -8 -26 26 53 3 -25 45 -12 -6 -16 7 -33 2
3880 2 -33 -19 -2 31 -3 -39 -27 -8 -10 12 16 -17 -13 -20 16 -9 -11 -37 -25 -39 -29 -35 37 -17 14 20 -20 24 33 -48 -17 42 -21 -25 -29 13
3916 13 70 47 18 45 -35 21 -22 -1 -4 -57 -12 29 -46 -34 -35 -20 31 62 -31 2 -26 14 -3 -4 -16 -33 -31 -8 4 9 22 36 -7
3949 -7 25 9 12 30 -37 5 -4 -28 -13 10 -10 29 -28 -23 6 -8 -12 64 -9 50 25 -36 -1 17 34 -58 -10 -21 -16 -9 -16 13 19 -6 -4
3984 -4 -15 52 -24 -7 -15 0 17 21 37 -4 -96 27 31 -21 -56 10 40 -26 15 -25 78 86 -33 -13 -10 -9 -8 -60 43 34 -1 8 -57
4017 -57 54 -17 -45 -8 -54 -31 45 0 22 -21 -13 -28 -4 -3 -21 -74 16 0 7 26 8 12 -77 71 -42 -12 -63 7 4 -55 -86
4048 -86 71 29 -5 14 10 6 -3 -38 -21 4 37 9 13 6 0 40 48 7 57 -51 -22 -1 -25 6 -8 50 -3 39 13 21 40 5 -6
4081 -6 42 -18 5 -38 -5 43 -9 23 -23 -6 6 3 40 -6 39 -45 -12 -24 -51 -3 -2 3 -68 25 -11 -19 4 23 7 -51 -27 -7 -7
4114 -7 30 -20 12 -59 -31 42 -18 9 1 -11 -28 -27 4 45 13 -29 -4 12 -72 0 -83 -21 5 -32 -18 -21 12 31 29 4 -37 35 -20
4147 -20 -3 -17 59 -36 -16 39 -18 2 -10 -7 -78 -32 5 9 -24 17 -1 32 -20 8 18 6 73 30 2 19 -2 19 -22 21 -40
4178 -40 -62 -34 2 -18 -31 -30 14 -54 -5 30 10 -74 1 -10 -28 -4 5 -50 17 14 37 -36 -55 -51 -18 -24 35 30 4 41 67 -64 38
4211 38 23 -32 -50 5 11 -7 -42 -32 -11 -17 58 -54 -36 2 -48 -1 20 -8 -2 -29 -2 -17 -4 23 38 36 44 -57 -72 37 -48
4242 -48 24 16 -55 -9 7 28 -16 3 15 3 -14 17 -30 24 23 26 -37 -20 51 -15 -40 -21 -66 -15 -36 -23 52 -11 -23 -55 -68 60
4274 60 3 119 12 -59 43 -6 13 5 -33 14 -58 47 8 24 -44 5 2 29 -32 11 34 39 25 14 23 7 -21 -4 0 -31 -10
4305 -10 -10 39 9 -35 -14 83 33 72 2 29 66 80 -94 -25 -2 -28 11 25 -10 0 11 42 23 35 33 18 19 -36 15 -22 -8
4336 -8 -21 -12 43 39 -13 -48 -21 -21 42 12 -21 1 7 -14 10 31 0 33 -34 7 43 69 24 -19 8 -62 -32 -38 52 38 22 4 -28
4369 -28 11 10 -31 -9 37 17 -36 20 -22 29 -37 -29 14 35 -28 22 -7 20 66 16 -17 21 -20 6 15 -25 -3 -10 -48 -4 24 19 -61
4402 -61 3 -17 -30 -3 0 40 -40 29 27 -23 -49 -18 13 18 -30 22 30 -31 -33 -8 -5 4 -15 5 15 -14 -37 -56 -6 22 -23 13 -28 -16
4436 -16 -43 41 -8 -13 -6 -65 -38 26 89 21 -18 -23 -28 12 32 -61 -23 2 -34 -5 46 -13 -9 -21 18 -7 13 0 -40 -3 -18 -41 -10
4469 -10 -17 -18 12 3 0 3 25 10 48 23 10 28 10 -22 3 0 48 17 -32 20 12 66 19 26 21 2 -50 7 0 -14 25 -10 -6 -39 -34 -28 23
4506 23 -17 15 -19 -3 -88 14 -27 -48 -7 37 58 1 -5 -32 1 -64 16 38 2 31 4 -7 20 9 35 31 47 -24 -24 -6 -37
4537 -37 41 -28 -77 -49 -6 -56 -38 50 -3 52 23 17 2 11 14 16 -10 51 -9 -1 -19 -34 -42 -31 -18 -15 39 -70 25 -15 8 17 -34 43
4571 43 13 -11 -39 5 -7 -47 -24 46 -16 0 68 10 64 11 -36 19 53 68 11 -50 -24 8 -52 33 5 32 -16 13 -8 7
4601 7 50 -45 -21 5 11 32 -14 9 40 -1 -28 -23 11 57 -75 -7 -35 -15 -12 -19 17 -17 2 -18 -24 23 -13 46 -19 25 21 -53 -25
4634 -25 26 76 -19 -1 24 -12 23 -75 17 -1 -18 -13 17 -18 18 8 46 20 -16 -64 -5 -33 -14 21 -58 15 -17 7 15 -11 -26
4665 -26 5 7 1 26 -10 8 12 14 -20 28 -27 62 12 -26 -26 -29 0 -74 17 -36 -30 -48 3 54 -24 40 -64 -37 -22 -9 31 -47 37
4698 37 25 1 -4 23 -45 13 25 -7 -11 5 -9 -36 24 -52 27 -3 8 -12 -50 32 23 -47 -4 -46 -44 26 44 -17 -11 44 24 13 14
4731 14 -14 9 28 1 3 26 -44 6 -18 20 -27 14 -23 33 -25 -5 -4 -11 39 15 -22 -22 -16 19 45 -15 -10 59 -39 -27 -3 67 -12
4764 -12 -19 -45 -1 13 -17 16 -67 15 -49 2 -64 -51 -34 -24 -4 9 -13 -11 5 24 18 -100 9 2 43 -15 14 -11 19 40 -30
4795 -30 -64 -50 9 -1 14 9 -2 -27 -12 50 -9 -35 5 -52 -13 -2 24 -14 -38 1 1 3 -29 -40 -12 -3 -13 15 30 -4 -49 38
4827 38 -25 39 38 -47 -12 23 8 -36 51 -21 -52 -10 -6 -1 -45 16 -3 -2 -25 33 42 20 -34 -59 19 45 -7 -40 14 7 2 -36 -29 -23 -64
4862 -64 -10 11 30 -44 -10 -22 -5 48 -22 -33 27 -1 83 26 -16 -2 0 15 59 16 18 -34 -32 4 59 -43 18 0 22 -11 -8 30
4894 30 3 -4 -27 51 -48 -18 -114 -51 -19 -14 -1 -43 15 69 -34 -23 3 -16 8 11 8 34 -10 -31 10 30 -15 -13 21 5 -5 -8 16
4927 16 47 5 -56 20 77 -31 -23 38 -29 33 19 -34 13 34 0 -7 4 -80 -12 -33 -36 8 -28 -3 -56 -2 -3 77 42 26 40 26
4959 26 21 11 -6 28 0 -7 -20 -3 75 -17 -25 32 28 30 1 6 -30 -13 -1 12 -19 -36 38 -30 10 13 17 -49 13 4 -44 -8 -3 -20 8
4994 8 21 26 -13 38 26 54 -12 35 36 -7 0 -25 -42 -4 36 41 57 31 52 -24 -35 2 1 -4 -12 1 -9 23 -7 -53 -1 -26 16 -9
5028 -9 54 -26 10 -35 18 -17 50 29 6 -14 -8 -50 12 26 6 5 17 -10 -31 31 24 -1 1 -14 -47 4 59 1 -52 29 10 5 39
5061 39 -10 11 41 13 -17 55 -37 0 19 -52 -35 -30 -3 7 25 18 13 36 -25 -16 26 33 -59 10 27 15 -40 76 21 22 -53 -2 73
5094 73 -31 -23 -19 14 -47 20 -5 32 30 -27 -17 -50 8 1 -10 15 -64 44 2 37 69 -29 4 5 -2 37 14 20 -57 -4 1 -9 -13 17
5128 17 4 -39 -20 15 -32 16 -4 24 4 -44 -10 -48 -37 -11 -3 -16 24 -36 -71 -8 3 0 33 15 -38 -26 18 24 -33 -72 -21 -9
5160 -9 7 -9 1 -8 37 28 -35 19 31 -8 -15 5 19 -4 9 31 30 -19 -31 1 33 1 21 -52 -45 17 47 -38 -38 -33 -19 0 33 38 -73
5195 -73 16 -3 -19 -12 -28 14 7 -7 38 -29 21 -17 12 -58 -16 18 11 40 15 -5 0 26 -63 -15 -73 -13 22 -31 -42 -37 -14 -4 9
5228 9 -61 60 -45 20 -50 -3 33 -23 6 32 -10 27 17 38 -45 -16 -44 50 -25 45 -5 5 -32 -12 27 103 -13 20 -21
5257 -21 34 -35 -14 13 -50 -3 -2 -49 -38 -25 -29 11 40 -40 6 -2 -61 -47 32 15 -15 40 -31 -3 -22 -37 -56 16 9 -1 -23 -5
5289 -5 -19 30 15 -26 8 0 -16 -27 52 -39 8 -16 44 -30 -13 -25 -45 14 5 -22 37 20 -16 14 -12 18 -19 -22 15 8 -29 -32 26
5322 26 -36 8 7 4 -5 -28 47 7 18 -27 14 -46 -14 -10 25 -12 -31 -64 3 14 -8 -8 2 -28 -87 -39 32 -16 43 -12 -59 -27 -57
5355 -57 16 5 -49 -41 -11 32 37 -14 -13 -19 18 3 -5 54 -12 29 8 -3 -31 29 -9 -15 -7 36 -5 -25 -21 -13 16 7 12 -50 -38 -22 -12 -68
5391 -68 -52 -52 11 40 -39 -4 41 -20 36 -25 -2 8 14 6 16 4 -3 -30 11 27 -24 35 21 -8 -42 -25 -11 31 12 17 -43 -15 71
5424 71 28 -4 -64 25 33 -55 -29 7 -18 -25 -11 5 -22 2 35 -5 -21 99 -20 7 16 6 26 7 12 28 -8 14 15 -8 -18 -25
5456 -25 -8 -35 13 -14 20 -20 14 -1 -26 14 -15 -11 28 36 -11 -59 -15 -38 49 8 -27 22 -37 5 19 1 -21 -9 33 -7 -48
5487 -48 -25 16 -4 32 3 -8 16 0 -5 -20 27 5 9 15 -2 -27 18 2 -19 5 53 34 -27 8 20 4 -2 -35 -18 -37 7 -3
5519 -3 21 20 -16 0 7 -46 -9 67 -8 -38 -44 -38 7 72 -71 35 -34 -16 18 -17 12 3 13 -37 -16 -20 -53 44 36 28 -31 36 37 53
5553 53 9 45 4 40 12 -62 -23 -31 23 5 50 -14 4 58 -15 -19 -48 -17 11 -18 55 39 3 -34 -26 -35 -39 5 -27 -8 10 45 72
5586 72 37 -15 -58 -57 -2 5 3 -18 8 9 63 56 48 13 -19 87 -29 45 -6 -20 44 -23 -41 -22 -84 -10 3 -31 1 -62 -27 0
5618 0 -52 13 42 -35 -14 -7 -17 24 44 7 30 -4 -9 -16 19 61 -2 18 -35 57 -62 -7 -12 3 7 -9 42 -12 -14 -19 28 -45 -4 23
5652 23 -5 -19 9 32 32 25 -28 -13 18 -40 5 -17 18 19 -2 -50 27 -40 -17 40 10 34 -14 -32 -36 8 24 25 12 13 17 -13 -67 -12
5686 -12 -39 -18 12 -8 -13 10 -14 -83 21 3 -15 13 -26 -5 -42 14 29 -3 -2 51 -20 15 -32 -21 -15 -23 -21 -21 32 -41 27 -38 29
5719 29 -20 -60 32 2 23 -25 -35 -78 -15 -5 34 17 -64 22 9 7 21 13 36 -13 -51 -50 15 -1 0 59 -15 12 29 -30 -6 35
5751 35 15 42 25 16 43 -16 49 9 -25 19 -43 5 -24 -10 18 -30 -79 22 -31 -21 -27 -30 -38 -26 -7 51 -37 12 -26 -4 43 -8
5783 -8 10 5 25 -40 -8 -4 5 25 37 49 -5 36 31 13 41 -25 -9 1 19 30 -18 -2 -13 -7 -10 -22 -34 -8 -13 -52 13 -17 19 -16
5817 -16 -11 -18 -24 -10 -25 27 -60 -36 52 -10 -5 -27 -4 -8 1 16 -11 49 -3 -1 -21 -20 0 -3 -36 -3 38 13 -73 -43 23 -6 -10 23 5
5852 5 -31 37 -8 -31 21 -10 25 24 -19 23 23 -47 28 -21 35 17 28 64 -8 7 -1 -12 -14 0 -58 22 61 -38 10 -19 -40 29 -1
5885 -1 34 -50 -10 -19 -60 -57 -14 -53 -18 1 -41 18 -20 -40 18 -25 -14 -41 -26 -10 29 35 -23 18 -20 18 -5 -40 -6 -47 -34 30
5917 30 -27 -10 31 -17 -1 -28 19 -14 -22 9 9 38 -10 -6 -52 11 30 -49 0 -18 43 9 33 19 -4 43 -45 -15 37 2 12 -8
5949 -8 48 -39 35 4 9 29 -14 -23 -4 63 -15 -29 -61 18 -25 -68 -7 -14 59 -75 21 -17 33 -58 -11 -18 -37 -14 40 -9 -10 30 -38
5982 -38 -27 -18 -74 -44 38 -23 -59 2 -35 -1 -7 -21 3 -34 -22 -62 -11 -34 -6 -13 -6 15 -1 -35 3 31 5 10 -4 29 53 -27 -11
6015 -11 1 -27 -54 2 3 18 -39 10 -14 -43 10 -21 -15 -20 -12 31 -1 15 -21 -28 -70 -21 -8 -23 32 80 -35 -31 -35 -13 -30 17 -1
6048 -1 -9 -19 -35 1 -47 -57 -11 -8 -5 -19 -14 -36 15 55 -26 -6 -41 -23 23 20 -6 -21 62 46 30 -40 15 6 26 25 12 31 16 16 -36
6083 -36 8 17 5 -14 -23 -44 -6 -30 -12 39 4 7 38 -1 -5 -1 26 24 -34 -101 -22 -25 7 10 -44 -1 -54 -33 29 6 11 59 35 39 23
6118 23 11 27 28 -45 36 18 3 -59 -6 -10 57 -2 29 -17 -5 -29 7 62 -22 8 -1 -13 4 -50 21 4 -20 0 -19 5 -23 -7
6150 -7 -64 -1 -32 10 -49 48 -39 -32 -30 44 13 -55 6 -22 7 73 25 29 13 15 -7 -14 18 64 15 -18 -26 49 1 12 6 -23 -11 28
6184 28 -6 -50 -1 -71 39 12 -29 2 48 -25 18 70 -21 -31 31 -3 -1 -6 -2 54 -59 16 -12 18 -44 -10 -3 -43 0 11 -51
6215 -51 27 -4 -1 -24 53 6 37 -65 -35 -13 8 20 -2 -16 21 -47 12 12 12 6 -30 -9 -15 1 -26 22 -15 -22 30 -11 19 -52 -5
6248 -5 4 -6 23 -32 -7 -5 4 -4 86 -40 -29 9 -20 -22 -46 5 10 2 -2 2 9 4 -3 4 -7 -62 55 41 -4 17 8 24 -24 12 -44 -11 -58
6285 -58 4 55 -7 -12 15 -1 -15 18 -14 17 19 40 5 21 38 -49 -60 35 -30 25 18 -28 -39 -23 -9 -32 -64 -27 -10 12 -42 -35
6317 -35 -36 -1 -45 17 39 -14 -16 48 -5 54 0 18 3 13 14 -40 -7 -12 -21 -2 -7 -6 -4 5 -10 19 -15 -50 -31 30 0 23 14 -31 -5
6352 -5 55 -14 24 3 -14 -26 -11 15 -17 11 -31 16 -20 15 -29 -10 37 61 -2 23 -44 -24 -18 16 19 14 36 -83 -42 -10 -13 -24
6384 -24 26 -31 22 9 8 -26 -40 25 8 14 33 21 -26 46 -20 -14 21 13 28 -8 25 -29 51 22 8 -1 -58 -35 14 26 -24 4 -8
6417 -8 19 31 -59 28 -12 34 17 9 25 30 34 -8 -2 6 32 25 -61 -14 -37 51 -16 23 -2 -42 20 -34 70 -29 -2 -12 -18 -26 12 19 -9
6452 -9 -12 -15 54 5 13 -10 36 16 10 -36 30 -4 29 13 29 17 11 -37 42 64 -5 -42 50 -10 -19 -55 26 -12 -7 -3 -73 33 -13 -22 26
6487 26 23 26 -54 -30 -2 -24 37 5 28 -43 -35 62 -34 19 -14 -12 -21 -15 -37 0 -12 0 35 -19 -16 35 -2 -11 -2 -10 -15 -4 -25 4 -2 -43
6523 -43 6 -22 -9 -57 31 -3 -1 5 -2 4 2 -19 3 -13 25 36 31 3 -35 17 6 24 -24 0 -16 12 3 45 -26 10 -28 13 -40 32
6557 32 10 7 36 -7 15 -19 -27 -5 -25 -43 18 32 -25 -10 73 -31 -30 -60 11 -12 8 -2 -18 25 19 -24 51 9 -35 43 16 28
6589 28 -12 -7 -88 16 10 -36 -4 -37 63 -16 -27 -35 -15 -15 27 -1 -23 47 65 3 27 -36 27 -44 -45 6 1 21 29 -41 -17 -54 -32
6622 -32 18 10 -9 15 -16 18 88 -8 -25 -13 65 76 1 -4 -5 -27 -6 4 -23 -2 7 -25 -48 -16 42 -21 32 29 -39 8 5 18 -15
6655 -15 49 20 10 26 -2 -12 -19 72 15 -28 -13 -32 25 -14 -44 7 9 -55 11 -9 -8 -14 22 -26 -23 3 -22 -12 -44 -35 16 28 45
6688 45 50 -23 -44 -36 -10 5 0 -22 19 15 13 -15 -15 -13 -14 36 -24 -15 7 16 -57 -10 -12 6 45 -22 15 -28 -5 34 -29 -4 -17 33 -3 36
6724 36 -55 -20 1 -20 -58 -47 -8 -15 -78 -19 -27 18 -6 -27 -82 -10 -11 26 -39 15 6 -7 43 -6 -49 -51 -9 -8 -13 -15 24 25 22 -43 -19
6759 -19 -27 -1 56 -5 60 29 2 16 64 20 -44 -15 -21 -1 12 -8 42 20 -59 2 -32 -15 -19 56 40 -41 -24 -6 10 -16 -18 -29
6791 -29 -23 -38 -37 40 -64 43 13 -21 -23 -13 25 -11 14 -22 -13 -69 20 60 -18 -24 -16 -2 19 -11 13 11 26 14 18 -15 32 25 13 -21
6825 -21 -8 37 -17 -49 -6 44 -16 -21 20 -17 38 -14 -37 10 -11 -20 25 -15 11 -5 -26 12 -16 54 8 22 -33 42 -27 -37 23
6856 23 -21 -26 -38 41 63 -33 -5 16 59 21 -2 8 -53 -35 -21 -17 46 8 30 -45 -2 -10 -34 34 -11 14 2 -2 5 -30 -17 -49 23
6889 23 28 27 2 63 -12 -52 29 -37 78 18 -8 3 -38 10 7 10 -25 32 -29 2 -17 -8 -15 1 -79 -22 -37 -8 -4 -18 41 52 57 -31
6923 -31 57 -10 0 8 -42 41 -24 -41 -34 39 44 -16 6 13 9 -10 -12 20 -32 57 -40 3 10 -18 12 -7 -41 -26 23 15 -52 17 -2 73
6957 73 2 39 47 -22 -39 47 -2 -30 5 58 16 -38 12 25 16 -33 -26 22 41 28 -26 -10 -79 -10 -8 -3 -28 22 12 26 45 21 42
6990 42 7 -8 -13 51 16 -8 -26 -11 67 23 13 -10 9 11 -29 -37 12 -16 28 10 50 -5 -22 -4 -2 -33 37 -13 27 -10 16 31
7022 31 -17 -24 5 -4 -43 -47 11 -20 -22 -3 -30 -27 -29 40 38 28 -17 -40 0 -14 33 56 -48 5 56 -5 -8 -16 27 -20 12 -9 24 46
7056 46 14 69 -18 18 -2 25 -72 -21 5 -14 -14 -15 -12 -34 4 -47 -27 -22 -40 -17 -21 -18 -34 0 17 -37 -28 -26 57 29 -13 8 3 -43 41
7091 41 -9 -30 3 -4 -10 -22 33 -43 40 -15 12 -18 -18 -1 -3 -4 -49 -17 70 -7 15 -32 -9 -7 44 42 7 -41 27 -6 14 16 -83 42
7125 42 -19 -4 14 2 -22 47 19 8 -23 -11 -8 17 30 -18 -15 5 -6 38 36 -22 5 -11 56 -17 -24 -4 9 -34 36 65 -19 -5
7157 -5 -9 43 31 6 24 11 -27 1 0 -28 32 -36 45 8 -28 46 26 22 -2 8 -71 45 49 10 -28 -39 -7 -9 20 64 -40 -23
7189 -23 5 -34 -58 -26 -11 4 22 -34 -33 -8 11 15 -30 -20 11 -34 -37 10 -22 -6 -13 -31 14 14 43 -1 22 -29 -24 -6 15 12 -1 -13
7223 -13 16 -7 32 -35 62 -62 -63 -3 19 -19 44 -4 19 -21 32 18 18 -5 -52 25 9 -56 87 16 -64 -26 1 -45 13 10 -13
7254 -13 17 37 -16 47 4 7 11 4 -18 -10 0 -69 -49 26 24 21 -25 -18 -4 -15 -21 38 12 11 -6 29 -28 -17 26 -8 -13 16 25 -50 -12 0
7290 0 -15 -5 23 -18 -21 16 -52 -10 48 -34 -3 -22 12 9 11 -12 -22 18 7 24 -36 31 -16 53 -23 -23 -3 3 20 -60 46 -11 -12
7323 -12 64 41 -26 3 -35 -15 33 24 0 -6 -51 28 -49 -8 20 -43 -19 19 -1 -62 -26 -36 -23 -5 -24 24 -30 -17 25 28 -9 -70
7355 -70 -27 21 -11 -21 -17 50 17 -20 -16 -24 2 -11 -25 27 51 -32 -23 6 -13 12 -4 -9 15 27 15 4 29 12 -7 -14 -51 22 -32
7388 -32 -44 -16 -16 61 15 27 -28 3 -48 19 28 38 -8 -43 -38 -60 -19 10 -29 7 -107 -54 27 23 17 39 -2 -7 -30 -42 16 18 -23
7421 -23 -16 -12 -62 3 -6 -64 -16 -19 18 -12 -32 -3 -21 -16 -5 43 45 -4 30 -23 3 12 -33 17 2 32 19 -25 -19 -6 -21 41 -14 -31
7455 -31 -48 32 5 -6 8 64 29 -2 11 -9 -22 -30 -19 25 2 42 -7 0 50 27 15 -24 -40 22 22 43 -43 -13 2 14 -48 17
7487 17 -30 26 -35 29 70 5 12 -17 -53 17 -12 28 -18 -16 20 -3 24 -7 -29 -24 18 -54 -28 2 20 44 1 -32 23 11 -53 50
7519 50 -34 40 10 -11 -65 11 -13 -35 50 69 -22 -15 -20 -55 -21 -38 3 -10 16 25 -41 -60 20 -3 26 -31 -21 10 -12 40 -36 -29
7551 -29 28 -14 -11 18 -55 8 -13 11 7 -16 0 -39 -18 31 -2 -37 17 -26 -29 13 -25 -14 -23 30 21 35 -6 4 -27 -54 -20 -22 42
7584 42 34 -48 43 20 -88 4 -2 25 -6 23 14 -4 -29 -25 59 13 63 -11 -28 -2 -21 -50 -21 -12 56 -33 -48 29 -34 10 21 -5
7616 -5 -52 -3 -36 -3 -9 -10 -24 16 -36 9 22 -52 36 30 -11 -14 -48 -44 -41 -8 6 20 15 -34 40 39 -31 -70 48 -14 16 -48 -16 -19 -3
7651 -3 -6 10 0 36 31 -26 33 -27 25 -23 -6 -47 -13 28 25 -21 29 8 -3 -18 -15 28 59 4 -23 -14 -25 11 -2 32 -8 -9 24 -49
7685 -49 -7 -6 -50 46 -52 -43 44 2 21 -35 -5 -34 22 -48 52 -13 11 12 41 -20 -23 36 -40 -44 -25 44 17 57 30 -24 -35 56
7717 56 -16 -4 31 -10 -30 -35 -23 -61 50 -54 14 46 38 -51 29 -28 35 20 -9 37 -41 -11 -37 2 -10 34 -26 26 84 -19
7747 -19 -16 -15 4 11 47 48 -5 -27 20 17 -7 -24 -31 12 63 -17 96 -23 19 -20 -11 38 -16 20 28 -65 -9 -21 54 -20 -9 -12 -7 17
7781 17 -44 15 29 4 -8 -47 -30 29 -4 28 34 12 -5 -4 -23 72 -73 26 44 -52 10 -4 -3 1 22 16 -5 23 5 -77 41 8
7813 8 21 15 6 5 -43 4 20 -39 -54 -40 -91 34 26 29 47 -46 6 6 27 -7 46 10 15 24 -6 -4 18 -49 41 8 87 18 -54 21 9
7848 9 -25 -1 15 -1 49 -39 -3 -73 54 2 26 -50 13 -28 13 -22 -28 6 -44 9 4 -35 -26 8 -51 -46 31 27 -43 18 -57 -35 26
7881 26 77 66 -16 10 48 6 12 -65 -60 9 -33 67 -17 -49 11 50 -18 4 7 2 -30 -44 -16 0 19 -13 36 11 -1 0 28 3
7913 3 -55 -25 -31 38 -23 -38 10 35 -29 -51 21 3 33 33 -5 20 -31 14 14 -30 -54 14 -12 -23 -44 -35 -73 -22 1 27 -33 12 0
7946 0 63 -1 19 -15 -2 -8 -47 19 -27 14 28 30 28 21 0 11 15 23 10 7 27 -28 39 3 11 -10 45 -5 -5 43 -24 -22 -58 25 -40 -34
7982 -34 -26 0 21 14 26 18 32 29 10 15 51 0 -26 -1 0 8 43 16 82 -4 -36 -8 -17 -52 -31 17 13 25 -27 28 32 54 33 -36 -29 -12
8018 -12 -8 27 -39 21 -19 -59 -19 -41 20 39 24 -23 96 7 7 1 -19 -25 -13 32 40 4 9 21 15 5 -30 14 -19 -4 -7 -14 22 38
8052 38 22 -8 -38 -50 -49 15 -4 -17 10 -2 -33 -13 -22 2 45 -45 -20 -11 -38 26 37 21 -39 65 32 10 14 29 -73 -8 10
8083 10 -37 11 3 -73 -31 14 -15 29 15 -9 3 -8 -12 -3 -19 23 12 45 -21 -10 25 -51 -5 -10 101 11 17 36 -47 55 -43 22
8115 22 -5 10 -26 -18 11 63 -46 -3 20 53 -30 -33 -6 0 -48 27 33 -23 19 41 -60 -48 -33 6 32 -7 2 11 29 -13 54 -14
8147 -14 -8 -9 8 -40 57 1 14 49 -4 27 -52 37 -16 -15 -47 47 41 -4 -19 10 -29 9 20 -49 8 -23 50 29 6 4 -41 -63 29
8180 29 -9 -13 24 -45 1 39 46 33 43 -32 -80
8191h0
$$ Imaginary data points
##PAGE= N=2
##DATA TABLE= (X++(I..I)), XYDATA
0 0 0 0 0 0 0 0 0 0 0 0 0 0 0 0 -8 8 -8 8 -8 8 -16 16 -16 24 -24 32 -40 40 -48 56 -64 72 -82 96 -106 120
36 120 -136 152 -168 188 -210 234 -258 286 -316 350 -386 426 -468 515 -568 626 -692 763 -843
55 -843 933 -1035 1155 -1293 1456 -1652 1894 -2199 2598 -3147 3952 -5250 7675 -13797 63566
70 63566 71372 -90934 -55585 51313 61144 -22913 -36051 -8883 4388 7422 20664 -9043
82 -9043 -41816 -11563 50564 32588 -36890 -43097 27119 50197 -4414 -40989 -8176 21787 10960
95 10960 -5453 -8516 -15898 -7055 22712 21342 -20498 -26159 15551 26313 -7439 -15980 4843
108 4843 5101 -6138 3697 7081 -13666 -14522 14613 18376 -10937 -16887 10295 18523 -4459 -13763
122 -13763 4100 10223 -5806 -8442 7209 3887 -16355 -9272 17802 11922 -17866 -13133 16641
135 16641 15642 -7606 -7496 6685 4028 -3665 949 1850 -6602 -4999 4751 2433 -6795 -4112 4995
150 4995 4455 -2978 -3202 3714 5607 11 -2624 1133 1136 -3486 -1686 4299 1087 -6128 -2330 4802
166 4802 1925 -2596 277 1394 -1861 163 3995 -353 -5019 -926 3231 -43 -2824 -412 1459
181 1459 863 537 586 1021 1379 322 -544 717 319 -2508 -1743 1667 -25 -4103 -2008 2236 1183
198 1183 -1028 93 815 944 2665 2346 -1250 -1767 1580 1739 -1421 -1745 -276 -978 -1341 128 254
215 254 -893 -481 667 953 909 -34 -710 728 2008 -332 -2525 -106 2298 263 -1860 -667 592
232 592 663 947 -10 -1673 -737 1646 897 -1832 -1540 530 666 -598 -664 47 645 931 339 187 925
251 925 903 8 -140 376 -200 -1094 -736 -39 -667 -1082 -623 -276 164 715 294 -273 561 1590 886 -293
271 -293 -102 776 295 -396 -381 -434 -619 -396 -81 -227 -622 -346 427 494 -222 -438 376 662 267 -268 -30
292 -30 280 161 302 283 -348 -286 543 551 -453 -935 -69 630 -261 -1064 -583 176 143 -345 -388 300 567 417
314 417 498 348 229 536 540 57 -310 -180 3 -338 -801 -637 -384 -320 -133 -144 -104 166 404 406 293 319 533
337 533 466 129 47 10 -97 -172 -165 -254 -255 -304 -177 -156 -243 -111 108 75 -149 -153 212 327 34 -185 350 573 92
362 92 -207 134 436 126 -273 -327 -71 -68 -189 -489 -579 -248 138 64 -313 -224 213 585 483 134 15 398 734
385 734 278 -446 -248 157 -61 -536 -474 -262 -260 -159 -183 -254 -129 343 447 167 147 208 245 466 392 -140 -256
408 -256 240 142 -320 -212 66 -304 -518 -23 116 -293 -307 -131 5 231 268 -27 -98 321 432 71 96 272
430 272 108 70 177 -218 -544 71 285 -543 -933 -171 414 93 -340 -368 -55 549 867 133 -361 278 543
451 543 204 261 264 -425 -501 255 70 -595 -347 223 -227 -598 -96 206 145 385 127 -475 193 992 340 -331
473 -331 133 60 -379 253 810 -283 -1045 -213 224 -315 -182 99 -473 -369 393 235 -56 273 178 -400 252
494 252 1135 207 -537 394 587 -679 -423 672 -31 -981 -387 143 -8 141 5 -742 -386 753 417
513 417 -169 604 537 -651 -50 1331 396 -912 -399 305 -157 -35 392 -401 -982 -219 164 -144 409 510
533 510 -688 -508 821 775 -113 134 261 -518 -194 875 546 -458 -345 -215 -639 23 529 -307 -624
552 -624 -93 -262 -318 764 865 -816 -1121 757 1221 187 35 75 -452 -82 608 127 -582 -246 11 -336
572 -336 -31 37 -516 -224 363 -266 -571 803 1216 -340 -766 304 628 488 483 -398 -1149 94 1361 3
592 3 -1208 -350 114 -424 -56 496 -182 -590 147 223 -66 460 511 -314 -361 398 312 386 685 -334 -1294 -60
614 -60 857 -134 -649 223 -139 -1021 80 1140 -64 -793 142 336 37 682 795 -447 -609 376 364 -98
634 -98 123 3 -811 -296 387 -188 -531 211 13 -789 32 824 188 -186 242 -69 -219 769 809 -650 -644
655 -644 728 346 -570 -145 165 -534 -464 266 19 -316 124 135 -482 -80 690 302 -307 50 167 139 469
676 469 224 -647 -397 382 51 -373 21 167 -623 -439 259 134 -304 168 194 -294 8 674 395 -113 -35
697 -35 99 57 277 202 -370 -314 79 -19 -284 -49 -23 -373 -228 259 125 -32 236 94 -208 193 469 109
719 109 -130 171 69 -139 -17 12 -190 -182 -29 -265 -245 32 159 -243 -267 254 252 -5 97 67 48 293 287 -44
743 -44 -74 134 0 -223 -119 40 -107 -203 -31 -91 -216 58 66 -191 -114 262 216 34 89 93 62 106 141 -40 -57
768 -57 59 -120 -301 -52 -3 -144 -168 -20 -79 -128 31 109 -36 86 274 259 10 42 153 139 81 -17 -91 -31 -60
793 -60 -189 -256 -118 34 -63 -246 -32 70 47 71 75 34 145 175 173 -3 -7 198 45 -31 -80 -38 -65 -45 -178 -194 -1
820 -1 20 -105 -82 63 154 82 -12 144 178 146 122 42 67 0 17 -42 -128 -143 -100 -74 -170 -192 -152 -21 72 -63 -67 69 153
849 153 103 21 108 178 113 50 43 -13 -1 -39 -90 -188 -130 -89 -106 -88 -77 -63 41 73 76 65 140 127 72 117 180 172 49 2 -29
880 -29 -43 16 -198 -186 -103 -34 -139 -179 -76 5 18 2 18 23 154 180 109 -18 59 97 122 -34 -104 -185 -97 41 -177
907 -177 -242 -45 58 -60 -140 65 122 18 136 125 1 58 174 22 2 0 -44 -131 -72 69 -159 -186 -18 -68 -227
932 -227 63 108 -197 -143 179 196 -52 116 175 17 19 204 57 -117 84 69 -185 -95 156 -84 -211 -23 -103
955 -103 -102 101 125 -214 -113 243 232 -77 61 191 -115 -64 250 77 -149 25 -42 -311 -107 142 -156 -302
977 -302 37 59 -128 97 236 -159 -143 263 237 -81 100 179 -188 -58 172 10 -153 4 -58 -307 18 332
999 332 -119 -362 49 148 -47 208 329 -117 -188 262 282 -42 42 81 -262 -155 119 3 -228 -106 -110 -326 22
1022 22 302 -93 -298 105 126 -51 180 317 -75 -165 209 210 -23 119 18 -397 -188 265 -33 -223 10 -110
1044 -110 -222 61 370 -72 -228 135 181 -46 175 270 -243 -140 227 49 -166 109 5 -378 -159 308 14
1065 14 -280 -30 -75 -288 169 473 12 -186 157 143 -11 264 292 -238 -317 194 164 -128 96 -51 -565 -183
1087 -183 338 87 -262 62 6 -246 107 436 66 -224 159 89 -158 231 325 -225 -333 79 37 -110 100
1108 100 38 -404 -164 237 123 -161 127 69 -220 88 417 110 -169 122 76 -138 92 248 -232 -275 35
1129 35 14 -98 -3 -26 -319 -87 192 34 -61 128 149 -224 80 317 70 -174 37 1 -108 137 161 -279 -318
1152 -318 -31 6 -64 21 -18 -180 -71 192 36 -16 166 25 -159 124 306 39 -138 10 -116 -129 139 63
1174 63 -193 -253 25 -76 -128 27 31 -184 -44 156 61 89 151 -30 -162 56 188 67 -115 -46 -28 -136 24
1197 24 11 -241 -107 23 -26 -92 127 88 -92 17 125 92 29 153 -27 -123 36 168 -53 -147 -78 -93 -37 -25
1221 -25 -83 -180 -50 20 -60 -6 162 144 -97 11 173 69 19 59 12 -110 1 123 -28 -71 -28 -65 -68 -30 -33 -23
1247 -23 5 35 5 50 193 95 -31 -2 75 78 -14 12 30 -39 -39 -33 -78 -54 -24 -41 -136 -42 61 8 47 69 20 69 106 110 -16
1278 -16 58 43 91 -8 -33 -29 -43 -83 -85 -79 -36 -64 -81 -89 37 43 6 70 -26 63 82 114 19 30 32 41 -3 -87 -60 -52 -90 -84 -91 19
1312 19 -6 -50 -34 13 48 59 49 26 42 23 96 24 2 15 26 -49 -50 -57 -72 -81 -43 -28 -51 -13 -12 79 25 83 82 -12 0 37 77
1345 77 52 73 -8 2 21 -18 -57 -92 -55 -24 1 -33 -6 -1 20 59 -7 -21 68 73 39 25 50 74 22 -13 -51 -106 70 -15 -68
1376 -68 10 -40 38 -62 -23 -66 23 58 70 77 40 65 27 15 -21 72 4 -6 -53 -55 -7 -23 29 -53 8 -20 48 -63 58 24
1406 24 77 10 32 20 69 79 94 49 -4 16 54 -63 -79 -62 -81 -70 -28 -99 -48 -13 -55 3 11 14 50 35 4 51 37 31 16
1437 16 -11 8 16 -47 -64 -41 -36 -32 -33 -4 16 -26 9 72 -15 26 148 72 -47 57 137 32 -26 -6 20 -37 -22 -39 -45 -44 25
1468 25 -57 -84 17 73 -13 -15 27 90 107 159 113 -68 -36 92 32 -81 80 -48 -124 -92 -32 -42 -4 17 -31 -74 76
1495 76 152 -66 -48 91 7 -28 151 85 -111 -22 90 7 -135 27 -9 -101 -105 69 -29 -37 49 -29 -36 101 179 24 -35
1522 -35 105 -2 -14 62 140 -61 -123 104 -72 -73 35 65 -158 -43 111 37 -44 40 -32 -61 93 176 18 -81 58
1547 58 53 -81 92 124 -104 -162 14 -18 -116 -21 0 -172 -77 115 -3 29 75 21 -118 154 164 7 -44 37 -3 -63
1573 -63 118 111 -77 -95 7 -85 -97 100 -51 -142 -41 43 -26 -41 47 49 -85 150 180 -28 -28 41 -79 -87 51 63 -141
1600 -141 -163 33 -54 -27 62 38 -166 9 113 8 4 115 24 -78 26 125 -45 -43 23 -108 -140 104 48 -122 -132
1625 -132 4 -41 -14 122 82 -151 -23 181 -38 -35 123 2 -140 49 128 -5 -27 16 -47 -127 89 68 -151 -96
1649 -96 10 -10 -32 69 110 -94 21 174 1 27 158 30 -203 45 114 -46 -89 3 -62 -64 25 30 -107 -116 94
1674 94 14 -19 27 38 -91 -48 82 -2 -82 71 -19 -143 18 112 -91 -107 -23 -60 -91 54 97 -43 -59 20 66 30
1700 30 108 55 -45 -45 90 35 6 71 -56 -153 40 103 -53 -56 65 -43 -93 36 43 -5 -27 28 -33 26 92 54 -31 -37
1728 -37 32 -19 -36 16 -57 -132 26 66 -41 -77 38 77 -28 55 100 67 65 69 -16 -17 49 56 -18 -32 19 -36 -36 14 -31 -30 -48
1759 -48 -4 -67 4 48 4 -27 69 61 66 23 42 22 17 46 3 -97 -43 9 -49 -21 -39 -45 -68 5 47 -19 -2 74 27 -43 21 53
1791 53 58 12 44 -59 -88 62 79 -113 -48 54 -9 -90 -20 -60 -75 2 24 -6 39 24 20 57 64 48 6 17 6 -29 34 -30
1821 -30 7 -33 -17 9 -58 37 46 24 -18 58 25 95 63 58 33 -14 41 25 -26 -1 -46 -21 -32 -14 -32 -63 -17 -31 -50 -29 17
1852 17 16 45 -9 60 29 59 65 31 62 2 23 -22 18 -12 -29 -50 25 -23 -63 14 23 -47 -16 -20 24 -24 30 29 50 31 3 5 -5
1885 -5 4 -48 -27 -53 -24 -110 -96 -62 -36 -13 -33 -2 15 27 38 57 11 45 -52 12 16 -50 -8 -6 -27 -49 -30 -42 17 -4 -25 32
1917 32 -9 32 53 -6 3 -21 30 -17 -6 34 33 -13 13 -14 -11 -4 61 -34 -40 21 -40 -75 -70 1 8 -24 40 62 52 20 36 5 13 83
1951 83 -28 -1 -32 -25 8 -19 -4 4 -32 0 46 -6 8 -26 -23 -44 25 31 -11 -33 -5 25 35 47 6 -14 0 6 24 -5 46 -35
1983 -35 -40 -21 16 -9 58 32 73 -33 38 63 -11 47 -1 0 6 0 -16 -21 -18 -10 -17 -64 0 37 -8 -65 56 -5 17 34 17 -16 -35
2016 -35 83 22 -48 -1 -36 -1 36 28 -12 -77 30 21 32 15 14 -48 -36 60 28 2 -1 11 -30 -42 89 38 -9 5 -18 -15 26
2047 26 54 -43 -72 43 18 -53 107 -15 -61 32 67 18 19 5 36 -66 -26 63 -39 -4 13 -22 -41 -6 69 -94 -49 41
2075 41 0 -4 63 49 23 34 90 52 -45 9 -28 -73 -33 4 -7 -26 -62 -43 -66 -28 112 -19 -62 12 19 29 56 77 -62 -46
2105 -46 95 4 -60 72 -51 -58 -49 73 -31 -13 -16 -36 -23 7 112 -17 22 18 -23 24 21 53 -34 35 -19 0 -19 23 24 -81
2135 -81 -97 0 -26 -88 7 -110 -76 51 121 -18 13 -27 -38 45 80 -1 -2 -11 6 30 -24 12 -9 -102 -27 30 -62 15 -13 0
2165 0 12 8 78 -18 -44 12 16 -30 62 7 -60 18 -20 13 11 -65 -30 -107 -3 -28 -25 -15 -3 -15 3 65 108 -13 2 26 -7 -6
2197 -6 82 39 -32 -35 -8 4 39 16 19 -41 16 -18 11 -5 39 -15 -3 43 46 88 27 54 8 10 35 32 -15 -10 -26 -29 -29 16 -78 -14 36
2232 36 -5 -14 -55 3 -41 -23 -7 40 8 -13 41 0 23 3 15 2 19 -40 -16 -29 -41 14 -40 6 45 28 38 28 -14 6 -13
2263 -13 4 -5 32 -66 -10 -73 -28 -16 19 -35 -39 -7 -25 -23 -7 3 12 59 41 2 40 78 -14 19 34 -6 3 -21 4 -19 -47 8 13
2296 13 -11 -1 -45 -10 53 -30 -26 -39 34 -26 -23 32 33 -24 -10 -36 -49 82 -65 -49 -2 43 72 -27 -2 24 19 -53 5 -44 12
2327 12 88 47 19 28 20 -69 -14 -14 44 -20 -96 -2 14 -42 -13 8 32 35 47 -41 76 23 19 16 -27 43 -70 45 -37 29 -39 -46
2359 -46 -103 -40 -12 20 -21 -52 -44 -40 18 -7 70 -7 38 -27 86 -9 -17 -21 0 -34 -18 -35 -53 10 -79 -18 -34 10 -16 45 18 60
2391 60 64 43 0 -10 -27 24 42 36 -17 0 -41 -61 -1 -18 22 27 24 -31 40 51 20 -1 -1 32 -28 9 45 27 -6 -24 -3 -51 -37
2424 -37 22 -25 -29 -11 41 -53 10 49 -43 -24 24 55 4 10 17 26 7 41 -3 25 -9 1 -36 39 7 -27 20 7 -19 -23 -63 19 24
2457 24 -13 95 -25 17 27 22 -18 -11 29 4 9 -18 -61 -7 8 17 4 -7 -66 7 -59 -1 54 40 16 19 21 1 13 33 11 66
2489 66 50 -9 57 7 70 8 40 5 -77 100 17 -31 -49 -25 32 13 -18 -18 -48 -9 -10 17 -37 41 10 -36 14 -37 -37 -85 32
2520 32 11 -28 -25 68 -39 25 -6 51 -49 -58 35 -4 3 7 -30 22 -19 6 19 -36 -39 13 -70 -15 -14 -43 -26 66 -21 -20 18 19 10 -30
2554 -30 32 -10 -32 67 -14 -27 -5 18 -22 -41 11 -2 -56 8 17 3 -30 10 11 22 39 27 -51 -31 1 53 15 7 -23 -57 6 -22
2586 -22 -12 -61 14 -36 -36 -37 26 -19 -10 -48 16 -47 22 41 -44 -64 -23 3 -18 -40 28 -47 7 28 5 20 52 68 -27 68 -21 6
2618 6 -35 11 0 -29 31 -15 3 -54 -8 -54 19 34 20 -68 8 14 29 -3 30 -13 -59 19 44 -60 -1 -5 -80 57 -1 20 -24
2649 -24 11 51 10 -43 44 -12 -40 -11 -14 24 16 21 18 -39 -18 25 25 30 4 7 -58 23 -2 -28 -33 -32 -3 -23 -29 48 -48 33 45 18 -8
2684 -8 35 23 -73 16 86 59 27 -3 -1 -75 12 44 18 -23 36 2 -45 7 7 -10 -21 41 -61 14 -58 29 -4 -28 4 -23 -41
2715 -41 -45 -70 -16 -6 -1 -11 -57 37 -33 -39 -16 18 33 -4 0 33 -45 46 -30 -67 -20 -19 1 -28 -17 59 -76 -17 5 24 -27 40
2747 40 12 -27 21 17 -34 -12 -30 -46 -52 -7 -70 -77 -3 6 -29 -23 -67 -54 -40 35 36 70 -84 36 63 27 22 31 -39 50 85 -33 51
2780 51 53 -18 -49 12 46 19 31 1 -42 -20 67 20 -26 -27 -23 -23 -48 38 70 12 -50 1 21 -44 4 -14 -21 11 -44 10 18 -8 11
2813 11 16 84 -3 -15 13 43 16 3 27 -10 19 17 20 -70 -41 -36 -35 1 -43 35 5 25 4 5 -31 -40 -9 -13 17 14 17 -41 -7 -13 -51 36
2849 36 44 57 -17 -35 24 -43 -45 -20 -23 -14 -34 -18 0 1 39 6 -9 17 2 -54 -56 -9 38 -48 -17 30 -12 -5 7 -31 0 -6 -13 59 35
2884 35 -41 -113 -13 1 -33 26 -5 -93 -18 -41 52 17 21 25 56 54 -38 4 -51 53 34 -8 -52 11 37 -33 7 -16 31 42 -41
2915 -41 -37 3 -64 -48 -7 -12 6 -20 -22 0 30 16 6 30 9 10 1 -76 -23 -24 21 -10 -29 -37 -6 1 57 -16 42 61 25 -31 -9 26
2949 26 29 -42 27 34 79 -11 8 7 36 -27 -31 -43 -39 22 -18 -40 42 38 -23 -29 24 6 20 0 16 32 10 -21 -26 23 -19 -23 -45 21 38
2984 38 8 -26 37 10 -11 51 44 -15 -8 -2 40 -53 -10 24 -5 -63 16 -21 -24 -56 -14 -6 -25 -5 -27 57 22 6 -18 -30 19 5 66
3017 66 42 8 63 32 -3 43 -27 34 10 -4 -6 -27 -4 11 56 -60 37 -9 -8 -27 28 38 24 17 -9 -21 -39 -53 -44 -4 -3 -17
3049 -17 -48 -58 -4 -22 29 -35 -54 -46 -43 9 24 43 46 17 35 27 49 40 19 66 -27 -31 -16 34 -1 -31 -14 10 -38 89 -12 31
3081 31 -3 -5 -19 -17 18 19 6 12 41 21 -34 -29 -18 -29 5 46 5 -76 0 -8 24 -6 27 -68 9 60 2 -15 35 -54 52 82 40
3114 40 3 60 12 -2 -42 60 -12 -25 -49 6 29 -13 55 31 -54 -47 19 -25 1 23 -8 -29 -48 -9 -33 -44 33 -2 -20 -7
3144 -7 -77 19 -17 -15 -6 9 15 1 32 42 27 20 -3 52 36 -17 -3 81 -48 20 38 -61 -37 44 48 -17 -18 -17 10 -38 24 -17 -51 -67
3178 -67 37 -40 -18 29 9 -66 -27 23 -9 20 11 12 5 5 -13 11 -88 64 30 28 35 29 -26 59 54 11 61 -25 43 12 -26 23 -11
3211 -11 14 -1 -26 -36 45 11 27 -7 -72 10 22 -14 -57 10 -24 -14 -15 11 58 -21 14 30 17 47 -56 12 -44 21 17 70 -18
3242 -18 24 1 -7 -26 -45 5 5 -40 12 -20 -51 25 -5 -16 -54 14 -26 58 3 -36 -26 17 6 19 -23 42 -1 -70 -50 23 -30
3273 -30 76 -2 10 17 18 -32 15 -22 42 6 -24 4 -15 1 -29 23 -6 8 24 -13 0 23 4 -24 10 -53 -40 6 9 13 -3 -20
3305 -20 9 4 24 28 3 44 20 -11 55 -2 11 10 -3 4 44 -6 3 -24 -25 13 -13 -3 19 5 -4 14 -19 -25 -3 -1 -19 27 -26 31 -79
3340 -79 1 -39 -32 29 -41 -91 0 -35 -46 20 -28 -16 17 -20 -5 2 -8 31 -11 20 -35 -12 28 10 -44 -41 48 -5 -53 -15 25 32
3372 32 15 18 13 -7 -5 -3 9 12 6 21 18 -43 -7 -8 -15 1 -17 8 -19 30 -42 -12 42 -41 -26 16 -12 -16 -4 -29 -27 -42 16 -5 -5 -1 -13
3409 -13 -19 -14 36 -7 -42 72 21 25 -30 -29 4 13 -26 8 40 -30 -8 1 26 -27 -62 -20 -43 -8 -34 6 -5 6 -13 51 13 38 -20
3442 -20 36 -1 -12 52 10 -5 -100 20 3 25 -41 -31 -1 16 36 -1 32 24 -44 -45 38 -8 -63 28 15 -5 -15 -35 -17 60 39
3473 39 20 4 -25 -14 -28 -46 10 -10 28 -10 30 4 -38 36 30 -21 5 -62 -6 -3 -22 8 6 -11 23 69 -27 1 -52 24 1 -40
3505 -40 36 -5 16 27 -4 28 -19 -40 -6 -47 8 -23 -35 -39 -20 42 -25 -43 36 35 36 -35 -3 -37 -19 -14 35 14 -13 48 7 -20
3537 -20 11 -24 -19 -38 -41 -8 -75 56 -13 -22 54 -5 15 -19 -35 19 11 35 -3 -12 0 18 14 -30 -45 -12 -15 12 13 -18 -16 48 -60 29
3571 29 29 23 29 -13 -30 5 -42 13 -30 14 -29 27 27 -51 -36 1 -15 0 -8 -7 -5 -29 71 -21 8 -13 -5 -7 38 0 -78 -25 10 -40
3605 -40 35 -6 -26 -7 22 -33 61 57 -23 -35 32 -26 32 -63 -3 -3 13 3 1 -31 -6 13 18 -5 -15 -1 -44 -24 15 -50 -14 44
3637 44 6 -8 -35 20 40 35 56 34 13 12 24 -15 -4 -63 -3 5 -30 10 3 9 25 -23 16 17 82 13 23 33 -4 34 40 16 -57 -13
3671 -13 -9 39 -15 -19 -29 -21 29 4 -20 -39 11 21 46 22 10 -3 -33 45 -55 38 -18 -11 26 32 2 40 20 17 -13 -18 -24 20 -32 -63
3705 -63 36 -9 26 26 47 41 -56 -50 12 10 18 2 -36 -22 -26 2 -76 -60 27 -9 -20 -5 -22 12 -23 -6 -7 -27 18 41 3 48 58 14
3739 14 12 -35 -12 2 72 28 14 8 24 -1 -5 66 0 -32 5 -7 7 -31 -20 -54 48 46 -35 -9 3 -50 -21 -9 0 35 49 23
3771 23 5 34 -47 41 -14 79 -2 2 -3 -8 7 11 -16 83 7 -9 -9 -52 54 -74 44 -49 40 -5 -2 -17 -48 24 2 -9 9 19
3803 19 -23 53 60 44 -26 -11 70 25 -33 -32 -8 -19 2 20 -72 -40 36 16 38 8 22 -20 34 -10 -35 -32 0 -15 43 34 -28 66
3835 66 -32 -15 28 35 33 15 -63 -32 -40 38 14 36 -4 66 -37 -54 -72 -9 -10 1 -6 -35 57 -14 -63 -14 25 35 -6 4 -5 -28 -32
3868 -32 5 31 -4 60 -45 19 31 28 -6 13 15 -39 44 11 -19 -1 28 -6 34 -1 15 -73 -49 -49 6 13 -20 30 -46 8 44 -38
3900 -38 -43 13 48 -6 11 10 -27 98 32 5 24 -94 -12 12 8 19 6 17 39 -55 -34 -39 -73 29 0 34 -41 37 -26 -11 -10
3931 -10 7 51 -50 -29 -36 -6 -18 14 -7 27 -3 -6 54 23 -12 23 35 -11 42 52 -17 44 67 -49 -8 9 -11 -53 49 3
3961 3 -33 -20 -19 3 -20 -56 29 -26 -30 -49 -41 -32 -29 -63 63 -61 18 17 23 13 60 -24 -7 60 -22 0 2 -50 -4 -30 40 20 3 -12
3995 -12 24 -56 1 -1 22 1 -20 6 -2 -2 16 -19 -20 -45 -34 -1 -34 23 -10 83 -42 -82 2 34 12 -25 -25 21 41 42 23 -74 21
4028 21 -3 78 -27 8 -12 18 -29 -4 39 -20 -5 -61 13 -12 17 13 -33 -23 20 2 -3 -5 -31 39 -5 38 -60 -13 -1 4 -16 -19
4060 -19 -3 -16 13 -55 10 -19 -15 13 -26 76 -22 -10 -1 11 28 -35 32 -13 -55 2 6 -10 -4 -23 -3 -40 36 38 -28 21 -28 8
4092 8 -22 0 -12 -1 -16 -16 11 -18 4 -42 9 4 -60 -28 -5 -38 0 -50 -10 1 -15 15 -20 67 -37 6 59 -8 44 2 70
4123 70 33 5 24 30 17 10 33 -37 -19 -14 63 16 30 -79 -22 23 -23 17 1 64 -44 19 25 14 31 72 -21 -3 -9 40 14 18
4155 18 93 -7 -36 -23 -40 -34 37 -10 -6 -58 14 7 16 -26 44 0 -25 -26 -39 -13 0 21 10 20 13 -18 32 -44 -12 28 0 40 32
4188 32 -24 -19 -27 -39 36 6 22 5 23 31 -16 23 11 9 69 5 33 48 -8 -20 15 -68 -9 22 3 -37 25 59 22 32 -69 20
4220 20 -29 19 6 -1 -37 38 33 9 21 -17 -35 -19 0 -6 -17 1 14 67 22 -1 -2 0 5 -36 -27 42 52 -67 -2 4 -14 -10 16 -8
4254 -8 19 -68 -36 -33 -32 -14 13 -10 7 -7 25 47 19 -37 44 -7 19 36 63 -31 -27 1 -11 16 -16 40 -52 16 -24 12 48 57 4
4287 4 -16 14 17 6 24 -16 14 -29 -18 34 -36 1 -6 17 14 -35 29 -62 14 46 -38 16 39 -35 -30 -6 64 45 0 -53 -7 39 28
4320 28 18 8 -27 21 23 14 -9 27 60 5 17 -17 25 -20 -20 49 10 -16 7 42 37 13 -37 -3 38 43 -55 7 7 -2 29 -17 -31 57
4354 57 25 1 -39 -7 -30 -15 -11 5 35 0 3 -29 37 -12 -13 37 1 21 5 -10 -72 17 43 -6 -39 30 -53 41 -72 22 62
4385 62 39 -7 59 -5 -11 9 18 4 0 16 -53 67 37 -20 -5 -51 6 -10 -14 32 -3 5 10 -5 -18 -27 13 9 -27 4 8 -18 -2 -68
4419 -68 -38 -24 -13 -34 -2 -41 -10 5 -47 -18 -40 23 7 4 -27 -10 42 -65 -10 25 8 17 -9 25 -25 28 38 31 -9 -30 10
4450 10 -28 -39 -44 35 -17 -11 -40 0 -16 -88 -40 19 9 15 5 -42 -51 -6 -7 -47 -48 5 -27 -55 46 -62 -9 -26 -34 -7 22 71 -20
4483 -20 69 15 47 53 49 69 38 30 1 -15 22 -52 -35 89 21 37 -46 16 -36 -48 5 28 -66 -9 17 38 53 -18 -25 -38 3 33
4515 33 -57 -3 33 -25 -7 32 -23 0 -29 -25 18 12 -16 17 46 38 18 -29 22 -17 22 3 -25 -27 -20 -60 23 -26 -51 1 47 0 -42
4548 -42 13 -35 44 -15 5 -11 -39 -8 11 6 -7 -44 -32 81 -22 7 21 41 7 30 16 -9 -3 35 53 9 -15 5 -15 35
4578 35 -42 -6 24 0 -15 37 -6 13 -48 -23 -10 67 -30 3 -62 -52 16 8 -6 21 13 -34 -20 -14 15 -73 42 -3 12 -14 1
4609 1 22 23 22 35 31 -42 -22 7 24 -9 -37 39 -24 -2 -6 22 -19 -12 -44 -21 -4 57 5 21 -18 3 -41 -13 23 37 55 -44 -7
4642 -7 -20 19 74 -17 -16 1 -72 29 1 -14 -30 -13 54 -44 -32 -3 -6 5 10 8 -10 -43 -100 -51 -28 -19 36 -54 2 33 29 -8 25
4675 25 -54 35 -50 7 -6 20 -5 -15 -70 -23 -8 21 12 24 -16 7 -22 -33 3 -15 4 35 59 -30 -12 -23 64 -21 -13 8 55
4706 55 -37 15 -5 -36 -33 33 -67 -2 -76 -18 -72 9 -16 -31 24 2 35 16 27 -8 -2 -48 81 -39 -12 42 -14 -38 38 16
4736 16 12 9 -26 11 9 -47 36 -4 -99 35 6 -12 -39 7 36 3 27 38 -61 -37 -19 27 -39 -57 -27 -17 -57 -69 -15 -6 26 20
4768 20 13 34 -25 60 -4 16 48 10 -4 37 5 1 -2 -17 -12 41 -38 -25 66 -30 -63 8 -68 26 -15 26 -17 -19 16 -7 0 1 11 -16
4802 -16 -16 27 19 -5 33 94 45 -14 33 41 2 28 0 23 -54 4 23 24 -7 9 -79 -64 34 25 -11 -4 38 -21 25 -1 -27 21 5
4835 5 -10 14 39 50 -6 -61 0 -27 13 -5 -12 -61 -37 23 15 60 53 3 46 -40 -10 -4 -40 26 -66 14 55 11 21 -1 16 -60 -56
4868 -56 -75 -3 39 -58 8 -63 -15 49 -31 -13 38 1 -27 35 38 19 -14 33 0 -10 19 22 55 27 -41 22 4 -11 -24 20 -9
4899 -9 -25 8 -25 -7 34 43 21 -21 31 -42 2 2 -15 12 -14 38 -11 29 -14 -25 -20 52 42 33 -4 32 -28 -32 -14 22 23 -6 5 -22
4933 -22 -2 -11 28 13 77 -17 -1 -21 -27 -62 22 18 -31 8 -18 -8 -17 -42 -13 7 18 18 -21 -18 -7 -58 -32 17 13 9 -21 -101 40 -35
4967 -35 -24 22 15 -2 -43 23 20 5 24 -36 8 28 -18 -4 -63 -39 9 41 -15 31 32 -37 16 -61 13 24 40 17 -68 2 -42 -42
4999 -42 -8 41 -28 5 -25 -5 5 -20 27 -41 33 12 -17 33 68 10 42 4 -29 -12 37 -34 -45 -40 66 48 38 42 -49 23 21
5030 21 -22 7 53 0 88 -7 61 17 39 -24 23 15 -44 -41 10 -15 -55 -10 -41 7 -43 4 -6 18 -10 -36 -12 27 -38 67 5
5061 5 -7 5 27 -18 15 -18 14 -5 -45 11 -12 43 1 55 -14 -4 22 39 -31 -9 -14 -13 33 -47 34 -8 18 -1 -12 9 56 10
5093 10 -32 31 -15 -22 -3 -24 23 -8 12 -4 8 3 -29 58 9 15 7 21 39 26 -13 -23 5 16 31 16 -10 32 46 -41 -24 -16 -15
5126 -15 18 -50 -15 16 -1 -18 -3 12 -33 -17 -22 -33 2 18 29 -21 33 16 40 18 21 9 29 24 -4 -13 8 -23 18 50 -2 37
5158 37 -9 -4 20 25 -9 -44 -33 57 -21 -57 9 8 -53 -61 -19 39 6 29 22 20 -6 -73 -23 -31 50 19 -7 -56 -27 -24 11 3 -3 31 4
5193 4 -7 47 -32 -45 9 5 14 13 51 69 -34 -5 28 36 6 -2 -14 2 -17 -65 -19 12 13 7 -8 -55 41 -3 33 -22 24 -1 -7 24
5227 24 48 -10 -4 -10 38 26 20 36 0 -8 -23 -16 -11 -5 -24 54 12 -31 -31 -43 -6 43 -16 36 -72 -22 -8 -7 -2 -14 -70 -24 -18 -4 25
5262 25 -19 20 -57 -33 -19 19 -6 108 43 -25 -2 11 31 14 9 10 14 -10 12 18 -13 45 7 -9 3 32 -1 -30 -10 -26 -49 -54
5294 -54 -36 2 24 -10 1 17 -54 -41 1 25 -18 -7 40 -13 61 -10 -30 20 33 -25 -58 39 -24 60 9 19 23 -5 -13 13 17 40
5326 40 9 57 0 -48 -28 -27 -11 -14 -23 -27 7 -11 -36 -20 -22 22 -11 0 -22 -9 -2 -41 4 -10 -34 15 45 38 18 13 -3 56 21 -51
5360 -51 8 3 37 1 -5 -59 -17 -40 38 -30 3 1 -2 -18 -3 4 -64 57 -25 33 -3 -45 -8 4 -25 -4 53 -64 -40 -30 -82 -58
5392 -58 48 -30 17 13 3 28 8 12 38 -6 52 15 11 31 -23 5 -27 -45 33 15 -61 11 -7 -4 -52 54 -24 -39 10 -1 -16
5423 -16 -25 -11 18 -25 1 13 -3 0 19 -15 -5 -11 -72 -4 -6 25 -20 -25 -4 -88 -5 -4 -17 -52 3 -82 -30 17 83 34 35 1 -6 36
5457 36 8 2 -35 -17 -12 19 13 7 -14 15 9 -13 -24 -8 -2 3 3 10 46 -40 34 29 -18 57 -32 13 42 -4 -30 41 -39 -19 -2 -22 -22 -76
5493 -76 4 -28 -24 -29 14 -65 -11 32 29 65 34 21 26 -37 14 -29 0 9 -21 39 -8 -5 19 4 -18 -35 19 25 3 18 19 11 4 -16 -38
5528 -38 44 -13 34 53 0 24 69 -3 -14 -63 -10 -15 51 -6 -17 19 -23 24 57 -46 -12 62 -36 36 -54 -11 -71 1 42 12
5558 12 -19 -96 7 54 9 -54 -7 7 16 67 -4 0 40 -27 18 10 -1 51 5 -14 -65 11 -65 -4 6 31 3 -16 -27 -24 -20 -28 -21
5591 -21 32 15 -6 -36 26 8 -1 18 8 48 8 31 12 -29 28 -9 -42 20 26 -12 -13 20 14 -20 35 -34 1 -14 -59 -46 -5 6
5623 6 -36 -38 -27 6 10 -15 -9 -74 -35 -27 2 60 -25 18 -70 -52 57 3 -21 53 81 -25 -39 13 25 93 17 20 -20 -28 -34 42 28
5656 28 -17 -11 37 27 45 12 -15 35 -26 -20 17 -13 -15 25 -7 11 27 23 8 -40 -34 -31 2 -22 3 -20 -1 -6 8 -24 89 -15 -20
5689 -20 2 24 33 -33 46 16 17 43 29 -49 12 -49 3 49 -12 -29 27 20 29 10 -47 -28 -38 20 -29 -40 -40 -73 -25 -5 7 -25 -11
5722 -11 -47 -13 -46 -31 8 -2 23 -8 8 -5 10 30 8 -2 -18 -13 8 58 47 2 -60 -39 -3 40 -41 -35 15 -27 -51 27 -31
5753 -31 -30 3 -5 -1 -10 -25 23 97 39 -15 -5 23 -22 30 -19 4 -11 16 35 39 58 -10 8 49 50 53 -38 56 25 8 20 -63 33 30
5787 30 -74 -47 -18 35 18 5 -21 50 -1 -36 -5 8 -29 24 8 -25 6 -3 -68 10 62 -34 36 14 4 2 -2 32 -32 -18 54
5818 54 58 58 43 30 19 -15 -53 -4 -6 6 8 -4 30 4 11 -51 -50 6 -2 -25 -60 -17 -5 -8 -37 -23 -36 -52 -13 9 -68 -72 -30 -6 -3
5853 -3 58 33 26 27 70 23 -8 38 68 -8 -15 -54 24 36 10 -26 34 8 -1 6 -74 27 6 -30 40 -9 -12 -1 -33 -43 6 -12 -55
5886 -55 -73 -10 -23 37 -30 19 -5 48 15 26 40 33 27 -16 2 -83 -18 47 15 -6 -1 -15 5 19 -9 56 -15 -18 19 44 -25 5
5918 5 -51 12 34 -18 25 32 -13 -52 2 20 -26 -12 -2 37 40 -26 17 -35 15 -3 45 35 21 32 39 -20 24 13 32 -18 -65 -35
5950 -35 7 -32 30 15 29 -33 -35 35 2 28 -43 -17 -1 0 -12 -7 -3 -8 -26 5 -32 1 38 2 -111 33 14 -42 -12 38 27 20
5982 20 -18 56 94 56 -11 -28 -21 -14 -8 -36 -26 -11 -12 7 -8 -3 -31 -51 14 18 7 -30 25 -10 -35 -10 35 -46 -23 16 -9 5 -35
6015 -35 -31 -20 39 74 56 1 -66 7 -10 17 53 -38 -2 48 39 27 55 63 37 70 45 -21 20 1 -3 34 -19 50 20 -31 9 -13
6047 -13 14 -55 29 50 19 -22 -47 -12 -9 2 13 37 50 8 -1 -44 61 -13 8 -15 46 42 -18 -54 -63 48 -8 22 0 -49 -35
6078 -35 51 -20 -56 -21 22 17 12 -3 -9 -53 -23 -58 -36 -14 -6 -11 8 -11 3 -27 -5 -24 -7 -58 40 40 15 53 -28 24 0 11 19 9
6112 9 67 5 -23 82 19 -28 -10 49 31 -16 14 -40 -65 -28 14 -65 -2 21 -11 -26 5 -70 -57 -41 -34 -46 -64 38 -33 -24 36
6143 36 54 -14 -11 0 4 16 20 35 28 28 -1 -17 -32 17 36 35 -2 28 -41 17 -12 -42 20 -17 -38 9 -4 5 -24 29 14 10 -18 -38
6177 -38 0 -62 -31 2 -26 -44 -38 17 -5 27 10 0 -20 -44 23 -16 -25 20 72 26 51 -4 -30 35 24 -42 16 -6 36 -19 -40
6208 -40 23 -28 11 8 -25 19 -76 -65 -21 -1 -60 17 -54 -75 33 -40 9 -25 2 -8 42 -47 14 -8 21 34 37 -11 4 18 89
6239 89 -13 -50 -2 -22 75 -41 -18 32 34 -31 -20 24 1 -31 -17 -17 31 51 26 -9 6 -63 -2 -43 19 33 29 -88 -12 3
6269 3 -32 -34 -21 28 -20 -36 -3 15 -20 -21 -27 41 15 -50 19 -7 -14 -8 8 7 53 -16 0 -16 -25 10 70 4 35 -12 -14 -31 -51 43 -44
6304 -44 -10 16 -39 -59 -9 -27 -7 7 65 59 11 -7 37 21 -9 -6 8 -12 75 -5 21 -49 -5 -12 67 12 36 6 38 33 15 -49
6336 -49 -12 5 11 -15 -34 -35 13 68 14 23 -48 52 -15 -45 11 -4 -14 -44 -16 27 18 12 -15 -23 2 4 -2 -30 67 1 -20 8 -21 -15
6370 -15 25 21 35 12 -1 -26 -20 -64 8 -22 -5 -49 -19 -7 11 -35 -5 -20 28 9 -24 -65 8 -17 -1 43 14 -37 44 -45 -4
6401 -4 -23 30 -3 22 33 32 41 11 11 41 30 -56 -6 -5 -52 -24 -32 -8 14 -37 89 -18 -37 -60 -25 16 2 16 8 24 -52 42 33
6434 33 27 18 -6 -57 -25 30 -16 12 -21 45 52 31 -12 -18 9 52 0 46 -5 -38 18 51 24 16 25 -5 32 -12 -95 -20 -43 -59 16
6467 16 49 -33 -3 2 25 -6 49 42 33 18 48 27 -2 -40 32 90 -14 14 -21 52 2 26 -35 -3 -16 -41 49 29 -14 -1 -52
6498 -52 -62 22 24 -24 26 -36 30 -28 -21 -19 -6 -3 10 -63 -40 -19 -66 -73 -55 -20 -86 22 13 -8 -8 74 -6 41 11 -7 -8 -12 45 3
6532 3 33 61 44 5 10 -14 87 17 20 -41 40 3 2 -56 33 -52 3 2 -24 6 27 -9 5 19 20 0 -28 -22 -20 40 -7 31 6 -9
6566 -9 -20 57 9 -20 6 -36 -1 14 -16 0 13 10 -5 21 -8 22 -35 -7 -9 -34 -12 20 -20 -7 12 -29 44 -32 16 47 -4 -12
6598 -12 36 46 -35 -7 22 -24 11 32 -18 -50 -38 -51 -37 16 4 -5 -14 25 16 6 26 12 16 -8 -43 -24 -8 30 -37 -40 41 -28 -21
6631 -21 -1 36 -35 19 -44 -13 19 -47 25 -27 -3 -11 4 -2 3 12 -7 -1 -5 31 -14 48 46 -37 12 20 -120 -50 -55 -12 -28 -49 54 -7
6665 -7 -45 4 -18 -29 30 -35 5 -13 -25 -23 5 -39 40 -15 -15 -46 -24 -5 24 1 -23 -22 -14 21 2 -44 -24 -56 -47 -2 -24 56 -34
6698 -34 -16 -6 30 2 32 -71 32 -42 8 17 -20 32 -36 24 -29 -103 31 43 69 -55 6 -2 49 14 -22 -29 38 0 8 -17
6728 -17 -23 57 15 -36 10 59 -3 7 -7 -51 59 32 -43 23 2 -20 -4 52 44 36 -28 -16 -30 10 6 -24 -6 -23 -8 -56 -5 -44
6760 -44 70 11 16 -22 -13 2 -45 16 -11 58 -20 17 -19 -12 18 -15 7 77 43 -57 1 19 -20 5 28 34 0 12 -20 3 19
6791 19 13 7 -6 12 -22 -45 -13 -49 -28 55 11 -8 23 37 3 -38 -29 8 -39 -32 61 16 48 2 -23 -26 -1 31 64 3 40 42 28
6824 28 -7 18 18 -21 -10 8 -5 7 -3 -17 22 4 49 29 24 18 4 -8 13 39 -37 5 8 -69 7 -6 14 7 -10 18 -74 72
6856 72 15 -4 -32 -13 2 -37 47 -26 49 46 9 3 -26 -43 -20 -29 7 28 -9 40 12 -6 8 -18 -26 8 25 -31 -53 -41 -17 -4
6888 -4 -9 63 44 -28 59 -22 -58 23 -2 12 35 -22 -30 -39 -21 -16 -8 16 48 1 54 -11 -3 -8 49 4 4 10 -1 -52 -25 45 -22 -3 13
6923 13 -1 33 62 1 -15 16 42 -28 53 53 37 60 52 37 16 63 -17 -18 -32 10 -18 32 82 -9 -12 -32 72 -10 33 54 64 20
6955 20 -27 44 -1 16 12 -20 -26 9 -51 -2 24 -23 -13 -44 -18 -37 -15 -25 -10 -8 -6 3 -27 -23 25 -17 10 27 34 41 55 -32 56 12
6989 12 10 25 -26 20 1 -34 -90 48 6 44 53 94 17 -18 8 24 -57 -15 -24 -38 20 17 -2 -60 -4 5 41 23 -10 -12 3 -28 -81
7022 -81 -35 1 -20 6 17 28 25 -5 17 -49 12 -27 11 2 -15 -22 -67 -30 -51 -46 26 -34 -56 21 -13 31 -10 -26 18 -52 3 3 19
7055 19 6 42 11 23 1 -30 -11 -23 -5 -14 -6 16 -8 -12 1 25 -56 15 -8 27 7 13 -2 44 7 10 66 -25 -3 3 57 22 28 -57
7089 -57 -4 -4 -6 -38 12 -71 26 -28 48 75 41 -32 -18 0 -8 -5 -30 39 28 14 0 -8 39 80 -26 -14 -42 33 29 22 -40 52 -4
7122 -4 -38 4 -27 44 0 -3 21 14 11 44 40 8 28 16 28 15 -10 8 9 23 -12 25 8 15 -36 -18 23 66 23 34 -21 31 29 58
7156 58 10 53 49 6 19 14 6 16 23 -24 23 38 -22 -41 24 -29 -21 40 -3 7 -14 40 41 -72 -43 56 8 5 45 61 -1 -37 -13
7189 -13 9 9 -6 -53 -4 -38 32 10 -4 10 -37 -33 -9 -28 64 42 -46 16 12 -44 -2 -21 -79 16 18 72 -48 -39 13 28 -35 -54
7221 -54 -2 1 20 33 22 4 -39 -10 15 22 -10 -21 1 -9 27 -3 -26 -26 -1 -2 84 10 -24 -8 -15 -1 16 -24 26 13 -9 -37 8
7254 8 -5 -11 -2 -32 -64 -56 1 8 12 -55 -51 34 -32 66 24 36 23 5 24 -45 -4 38 -55 -89 -11 3 50 57 19 47 47 1 23 17 63
7289 63 -12 9 -16 -43 -14 -27 -49 -5 -5 11 12 -10 -29 9 21 12 39 -10 -18 38 21 27 -15 -10 -15 -28 25 16 18 13 74 14 -55 68 47
7324 47 62 71 -25 -30 -25 19 37 51 1 71 46 23 54 -5 -15 -5 51 -6 48 -22 1 35 65 7 -24 -36 41 -11 -47 22 12 30
7356 30 36 -24 65 18 -15 42 23 -23 -5 -11 28 9 5 -53 10 31 -25 -25 7 11 18 16 -8 0 16 1 8 34 12 98 38 -31 -27 12 26
7391 26 -26 -7 23 26 25 -7 36 24 9 35 18 -1 67 36 28 40 84 -20 20 49 -28 38 36 46 1 -8 -14 -51 60 -29 -20 10 26
7424 26 33 1 -69 -30 -27 -33 -25 -47 -5 -8 -30 -7 9 15 0 20 18 -3 -7 41 -44 52 31 44 32 23 36 21 15 3 -48 -17 -66 42 6
7459 6 -33 25 -58 23 10 -34 4 -1 -25 12 20 37 31 4 74 14 -8 -4 -1 25 1 7 -29 28 53 -2 -31 -38 15 29 30 7 31 38 -55
7494 -55 6 23 1 1 -16 -8 -69 -64 -10 -6 16 0 47 -12 -35 -27 -48 35 4 35 19 3 5 12 -24 3 18 12 31 -29 -8 -57 -47 -14
7528 -14 -12 53 17 39 -15 -29 33 33 2 17 -4 -22 32 -22 -16 -48 -37 -6 -11 26 -9 -30 4 -10 30 -50 -76 -20 14 -20 -40 19
7560 19 18 30 -25 -18 -57 -49 -44 18 -5 40 37 -39 42 -55 -9 17 -33 1 7 -24 -7 32 15 40 -35 19 32 -72 13 33 -20 8 -56
7593 -56 -30 -26 35 36 13 -19 -9 33 -16 51 -24 -8 51 -9 -1 14 -10 -3 -18 31 40 -28 -35 25 19 56 49 -23 -13 -21 -49 -35 31 -25 16
7628 16 0 4 27 -30 20 19 -40 16 -17 -21 19 -33 48 49 24 -13 -15 -36 14 27 25 7 -5 -51 28 17 64 7 -6 29 6 39 10
7661 10 2 -33 -33 -12 -9 -21 7 17 38 -31 -33 27 28 -33 -45 -44 34 -6 -23 -47 70 -5 17 9 -17 21 55 -12 23 17 -61 -5 -20 -35
7695 -35 -20 -12 26 7 -26 24 -2 46 -24 -6 -12 -41 -10 58 -39 18 -26 -22 -38 4 23 0 -15 -7 13 -21 -2 -19 -8 33 -44 -22
7727 -22 -13 -4 -13 17 10 24 73 55 15 -35 5 -30 5 7 33 45 9 -23 -14 -3 -13 -25 27 13 -13 16 -15 -7 39 -27 15 38 -29 21
7761 21 13 -70 1 -12 1 -18 21 2 -25 31 -4 -7 60 -30 -27 35 14 25 -18 3 -11 -23 32 -4 -12 59 31 5 -34 -37 48 94 17
7794 17 36 -34 -19 1 -88 -29 -19 -33 15 50 14 -32 -34 -4 17 18 -35 9 40 -10 -4 -37 7 22 9 18 31 65 -54 -4 -70 -38
7826 -38 38 10 4 13 29 26 52 4 -61 -20 -15 -27 24 20 40 -5 -48 -19 -47 -1 2 -7 -22 -19 30 -12 -37 -27 51 38 51 -21 24 -5
7860 -5 23 25 -5 -37 28 45 -24 -41 16 36 13 -67 -16 3 -41 14 11 6 -61 -59 15 53 -1 -11 -31 -3 -40 -41 21 20 21 19 -29 8 -30
7895 -30 30 -56 2 22 32 6 -10 5 -30 -32 9 -30 -3 70 57 -12 -83 -22 -76 26 38 -31 -1 0 11 -27 -8 -32 -34 -3 -27
7926 -27 17 16 -21 0 2 36 5 31 -4 23 21 42 17 -58 -17 2 45 12 8 -36 -6 -65 29 -3 -5 95 -24 -1 19 -51 -34 -15
7958 -15 -4 3 -9 10 -17 -12 5 -6 -3 8 -21 6 -21 31 -38 -19 -5 -23 1 -22 -5 -24 2 -10 27 4 36 -43 26 26 69 13
7990 13 36 5 -32 -15 25 -42 50 -40 -41 6 -48 18 20 -23 24 -70 1 -22 8 11 -29 -33 -1 73 -34 2 6 -3 -40 -4 -11 35 43 35
8024 35 -37 96 20 77 -17 0 23 23 33 -32 -43 -4 -34 -2 40 42 -10 50 -31 -2 -27 22 -33 23 0 -15 4 20 47 -38 -55
8055 -55 -30 -16 -9 3 -48 89 -25 20 32 -53 -22 -4 46 -39 -21 23 18 1 48 -48 21 17 -9 1 28 18 14 13 20 -23 -33 -7
8087 -7 34 0 -19 -13 33 24 11 33 41 -32 23 -45 -15 2 -9 9 -55 36 -32 -6 -17 -17 100 -20 -47 17 28 17 -17 17 41 33
8119 33 15 10 21 32 -31 47 11 -30 4 -35 30 -19 -24 -42 -79 -76 39 -45 -38 -32 -8 22 28 -28 -9 -4 1 31 -45 4 -34 12 23 1
8153 1 18 -50 -28 -56 57 -7 19 45 -8 23 24 -48 -30 25 -21 27 -10 10 -8 6 20 -2 -51 -59 -53 17 -38 -44 -13 -28 7 44
8185 44 16 50 -49 13 -51 -30
8191c0
##END NTUPLES=NMR FID
##END=
