##TITLE=1H_Pr Q-03
 CD3OD
 8 sc, 
 3.4.2024
##JCAMPDX= 6.0         $$ Bruker NMR JCAMP-DX V2.0
##DATA TYPE= NMR FID
##DATA CLASS= NTUPLES
##ORIGIN= UXNMR, Bruker Analytische Messtechnik GmbH
##OWNER= root
$$ XWIN-NMR		Version 3.5
$$ Wed Apr  3 14:42:21 2024 Russian Standard Time (UT+4h)  she@DPX200
##.OBSERVE FREQUENCY= 200.1309
##.OBSERVE NUCLEUS= ^1H
##.DELAY= (6, 6)
##.ACQUISITION MODE= SIMULTANEOUS
##.ACQUISITION SCHEME= undefined
##.AVERAGES= 8
##.DIGITISER RES= 18
##SPECTROMETER/DATA SYSTEM= spect
##.PULSE SEQUENCE= zg30
##.SOLVENT NAME= MeOD
##.SHIFT REFERENCE= (INTERNAL, MeOD, 0, 15.7039)
##AUDIT TRAIL= $$ (NUMBER, WHEN, WHO, WHERE, WHAT)
$$ ##TITLE= Audit trail, XWIN-NMR		Version 3.5
$$ ##JCAMPDX= 5.01
$$ ##ORIGIN= Bruker BioSpin GmbH
$$ ##OWNER= she
$$ F:/spectra/data/she/nmr/H-F/1/audita.txt
$$ ##AUDIT TRAIL=  $$ (NUMBER, WHEN, WHO, WHERE, WHAT)
(   1,<2024-04-03 14:40:57.07 +0400>,<she>,<DPX200>,
      <created by zg, POWCHK disabled, PULCHK disabled
       configuration hash MD5:
       00 E9 B6 7A A2 85 ED C7 34 08 36 98 17 FE 4E 26
       data hash MD5: 16K
       F6 C1 05 62 C1 6B CB E7 DF 7B 9C FE E5 7B 5B 83>)
$$ ##END=
$$ 
$$ hash MD5
$$ 1A 9B ED 7E 06 FA 4E 9C 37 70 C0 1C 11 5E 90 4A
##$RELAX= 
##$RELAX= 
##$RELAX= 
##$RELAX= 
##$RELAX= 
##$RELAX= 
$$ Bruker specific parameters
$$ --------------------------
##$DU= <F:/spectra>
##$EXPNO= 1
##$NAME= <H-F>
##$PROCNO= 1
##$TYPE= <nmr>
##$USER= <she>
##$AMP= (0..31)
100 100 100 100 100 100 100 100 100 100 100 100 100 100 100 100 100 100 
100 100 100 100 100 100 100 100 100 100 100 100 100 100 
##$AQSEQ= 0
##$AQ_mod= 1
##$AUNM= <au_zg>
##$AUTOPOS= <>
##$BF1= 200.13
##$BF2= 200.13
##$BF3= 200.13
##$BF4= 200.13
##$BF5= 200.13
##$BF6= 200.13
##$BF7= 200.13
##$BF8= 200.13
##$BYTORDA= 1
##$CFDGTYP= 0
##$CFRGTYP= 5
##$CHEMSTR= <none>
##$CNST= (0..31)
1 1 145 1 1 1 1 1 1 1 1 1 1 1 1 1 1 1 1 1 1 1 1 1 1 1 1 1 1 1 1 1 
##$CPDPRG= <>
##$CPDPRG1= <>
##$CPDPRG2= <>
##$CPDPRG3= <>
##$CPDPRG4= <mlev>
##$CPDPRG5= <mlev>
##$CPDPRG6= <mlev>
##$CPDPRG7= <mlev>
##$CPDPRG8= <mlev>
##$CPDPRGB= <>
##$CPDPRGT= <>
##$D= (0..31)
0 1.2 0 0 0 0 0 0 0 0.06 0 0.03 0 0 0 0 0.0002 0 0 0 0 0 0 0 0 0 0 0 0 
0 0 0 
##$DATE= 1712140856
##$DBL= (0..7)
120 120 120 120 120 120 120 120 
##$DBP= (0..7)
150 150 150 150 150 150 150 150 
##$DBP07= 0
##$DBPNAM0= <>
##$DBPNAM1= <>
##$DBPNAM2= <>
##$DBPNAM3= <>
##$DBPNAM4= <>
##$DBPNAM5= <>
##$DBPNAM6= <>
##$DBPNAM7= <>
##$DBPOAL= (0..7)
0.5 0.5 0.5 0.5 0.5 0.5 0.5 0.5 
##$DBPOFFS= (0..7)
0 0 0 0 0 0 0 0 
##$DE= 6
##$DECBNUC= <off>
##$DECIM= 32
##$DECNUC= <off>
##$DECSTAT= 4
##$DIGMOD= 1
##$DIGTYP= 9
##$DL= (0..7)
0 120 120 120 120 120 120 120 
##$DP= (0..7)
150 150 150 150 150 150 150 150 
##$DP07= 0
##$DPNAME0= <>
##$DPNAME1= <>
##$DPNAME2= <>
##$DPNAME3= <>
##$DPNAME4= <>
##$DPNAME5= <>
##$DPNAME6= <>
##$DPNAME7= <>
##$DPOAL= (0..7)
0.5 0.5 0.5 0.5 0.5 0.5 0.5 0.5 
##$DPOFFS= (0..7)
0 0 0 0 0 0 0 0 
##$DQDMODE= 0
##$DR= 18
##$DS= 0
##$DSLIST= <SSSSSSSSSSSSSSS>
##$DSPFIRM= 0
$$ [...]
##$SUBNAM2= <"">
##$SUBNAM3= <"">
##$SUBNAM4= <"">
##$SUBNAM5= <"">
##$SUBNAM6= <"">
##$SUBNAM7= <"">
##$SUBNAM8= <"">
##$SUBNAM9= <"">
##$SW= 18.0517689322627
##$SWIBOX= (0..15)
0 0 2 0 0 0 0 0 0 0 0 0 0 0 0 0 
##$SW_h= 3612.71676300578
##$TD= 16384
##$TD0= 1
##$TE= 0
##$TE2= 300
##$TE3= 300
##$TEG= 300
##$TL= (0..7)
0 120 120 120 120 120 120 120 
##$TP= (0..7)
150 150 150 150 150 150 150 150 
##$TP07= 0
##$TPNAME0= <>
##$TPNAME1= <>
##$TPNAME2= <>
##$TPNAME3= <>
##$TPNAME4= <>
##$TPNAME5= <>
##$TPNAME6= <>
##$TPNAME7= <>
##$TPOAL= (0..7)
0.5 0.5 0.5 0.5 0.5 0.5 0.5 0.5 
##$TPOFFS= (0..7)
0 0 0 0 0 0 0 0 
##$TUNHIN= 0
##$TUNHOUT= 0
##$TUNXOUT= 0
##$USERA1= <user>
##$USERA2= <user>
##$USERA3= <user>
##$USERA4= <user>
##$USERA5= <user>
##$V9= 5
##$VALIST= <valist>
##$VCLIST= <CCCCCCCCCCCCCCC>
##$VD= 0
##$VDLIST= <DDDDDDDDDDDDDDD>
##$VPLIST= <PPPPPPPPPPPPPPP>
##$VTLIST= <TTTTTTTTTTTTTTT>
##$WBST= 1024
##$WBSW= 4
##$XGAIN= (0..3)
0 0 0 0 
##$XL= 0
##$YL= 0
##$YMAX_a= 229294
##$YMIN_a= -414526
##$ZGOPTNS= <>
##$ZL1= 120
##$ZL2= 120
##$ZL3= 120
##$ZL4= 120
##$ABSF1= 10
##$ABSF2= 0
##$ABSG= 5
##$ABSL= 3
##$ALPHA= 0
##$AQORDER= 0
##$ASSFAC= 0
##$ASSFACI= 0
##$ASSFACX= 0
##$ASSWID= 0
##$AUNMP= <proc_1d>
##$AZFE= 0.1
##$AZFW= 0.1
##$BCFW= 1
##$BC_mod= 2
##$BYTORDP= 1
##$COROFFS= 0
##$CY= 11.3945322036743
##$DATMOD= 1
##$DC= 2
##$DFILT= <>
##$DTYPP= 0
##$F1P= 15.7292609196834
##$F2P= 12.9074282941183
##$FCOR= 0.5
##$FTSIZE= 0
##$FT_mod= 4
##$GAMMA= 1
##$GB= 0.15
##$INTBC= 1
##$INTSCL= 1
##$ISEN= 128
##$LB= 0.24
##$LEV0= 0
##$LPBIN= 0
##$MAXI= 10000
##$MC2= 0
##$MEAN= 0
##$ME_mod= 0
##$MI= 1.114404
##$NCOEF= 0
##$NC_proc= 0
##$NLEV= 6
##$NOISF1= 3.799351
##$NOISF2= 2.8
##$NSP= 1
##$NTH_PI= 0
##$NZP= 0
##$OFFSET= 15.70392
##$PC= 1
##$PHC0= -25299.29
##$PHC1= 9.787311
##$PH_mod= 1
##$PKNL= yes
##$PPARMOD= 0
##$PSCAL= 0
##$PSIGN= 0
##$REVERSE= no
##$SF= 200.130013532006
##$SI= 16384
##$SIGF1= 3
##$SIGF2= 2
##$SINO= 400
##$SIOLD= 16384
##$SREGLST= <1H.CDCl3>
##$SSB= 0
##$STSI= 0
##$STSR= 0
##$SW_p= 3612.71676300578
##$SYMM= 0
##$S_DEV= 0
##$TDeff= 0
##$TDoff= 0
##$TI= <>
##$TILT= no
##$TM1= 0
##$TM2= 0
##$TOPLEV= 0
##$USERP1= <user>
##$USERP2= <user>
##$USERP3= <user>
##$USERP4= <user>
##$USERP5= <user>
##$WDW= 1
##$XDIM= 8192
##$YMAX_p= 0
##$YMIN_p= 0
$$ End of Bruker specific parameters
$$ ---------------------------------
##NTUPLES= NMR FID
##VAR_NAME=  TIME,          FID/REAL,        FID/IMAG
##SYMBOL=    X,             R,               I
##VAR_TYPE=  INDEPENDENT,   DEPENDENT,       DEPENDENT
##VAR_FORM=  AFFN,          ASDF,            ASDF
##VAR_DIM=   8192,          8192,            8192
##UNITS=     SECONDS,       ARBITRARY UNITS, ARBITRARY UNITS
##FACTOR=    0.0002768,     1,               1
##FIRST=     0,             0,               0
##LAST=      2.2672688,     0,               0
##MIN=       0,             -414526,         0
##MAX=       2.2672688,     229294,          0
$$ Real data points
##PAGE= N=1
##DATA TABLE= (X++(R..R)), XYDATA
0 0 0 0 0 0 0 0 0 0 0 0 0 0 0 0 0 0 0 0 0 0 0 0 0 0 1 -1 3 -2 4 -4 6 -7 7 -9 10 -10 10 -12 13 -15 15 -17 21 -21 24 -25 29
47 29 -31 33 -37 41 -45 50 -56 62 -70 77 -87 101 -117 139 -166 203 -259 345 -489 763 -1398 3493
69 3493 -22729 -177372 -216505 -168417 -74293 40176 58832 -11432 -80606 -131657 -106707 13808
81 13808 120909 184830 217468 162449 72411 28423 -27199 -95186 -125041 -160372 -183164 -136356
93 -136356 -74996 -12653 70237 99455 81574 94268 105666 108523 132407 106388 15418 -69737
105 -69737 -149491 -196297 -156506 -93032 -39979 26177 45272 18017 32433 60971 73275 107583
117 107583 115583 69650 26681 -23236 -80692 -90696 -86051 -88549 -53698 -23703 -23127 5672 30418
130 30418 16565 24829 44665 46887 74211 94856 66434 35603 -10095 -83215 -110718 -97056
142 -97056 -81692 -35722 6121 -2666 -7386 1192 2611 40074 91862 103983 107528 87797 14845
155 14845 -43355 -69826 -102841 -104596 -79474 -72071 -46581 -426 24778 56133 87568 77346
167 77346 65522 60724 28468 11737 14122 -19577 -57964 -75182 -97836 -88682 -37062 230 32948
180 32948 60444 41297 17038 20456 17589 31507 63432 50373 14310 -11203 -50285 -71649
192 -71649 -54336 -45774 -35633 -9606 -12101 -16004 12728 30976 45201 71980 64182 37230 27894
205 27894 4258 -20637 -23422 -43161 -66273 -60241 -58682 -48270 -661 31880 39379 53148 44619
218 44619 25350 35111 37890 26994 25244 -1773 -46081 -63218 -73349 -71367 -30160 2177 9275
231 9275 25675 29079 20476 35970 45152 34281 33812 17999 -14676 -20765 -23303 -36803 -30028 -29337
245 -29337 -44569 -31873 -9350 3664 33269 50225 36778 32146 23430 4005 12051 21739 3101
258 3101 -10448 -28485 -58848 -58333 -37638 -25221 1928 24907 21138 28063 36457 28264 34514 39099
272 39099 14097 -4585 -14738 -37213 -39025 -28317 -34127 -27029 -11020 -10371 5086 29040 30225
285 30225 33971 37736 16659 7259 12485 1249 -5270 -6414 -27701 -38585 -31885 -35943 -24604 2384
299 2384 9015 16082 31684 26509 25671 36830 24390 9586 4429 -16401 -29979 -25678 -34452 -35862
313 -35862 -18633 -15886 -8764 15766 23674 27381 39260 28141 12250 12253 576 -10133 -5073 -14371
327 -14371 -25138 -18314 -22855 -25630 -7019 -361 730 16089 17470 13913 25754 23698 12889 15132
341 15132 4855 -10862 -9818 -18238 -31067 -23334 -21733 -24591 -6715 5792 9861 27255 31469
354 31469 22382 26543 20865 3889 2060 -7490 -26182 -25676 -25971 -32049 -16618 -3741 -3015 10642
368 10642 19144 15443 25597 28067 14115 12598 6301 -12803 -14400 -14331 -23735 -16761 -9577 -15866 -7189
383 -7189 3635 1969 13231 20653 10767 13187 15749 4193 5154 8720 -4318 -8241 -9288 -22442
397 -22442 -20738 -11942 -15376 -7625 4222 1202 9933 22889 19176 21401 26135 11381 501 -4600
411 -4600 -21002 -25308 -19755 -26132 -21246 -5576 -3417 6988 23374 20984 20011 24259 11821 2847
425 2847 3440 -8246 -14049 -10236 -19211 -20428 -8082 -8515 -4978 8908 7445 5098 13564 9127 5988
440 5988 13724 7364 1358 5470 -4086 -11308 -5433 -12308 -17744 -8177 -8021 -8738 3531 5470 5820 16965
456 16965 15381 10314 16613 10043 -769 546 -8956 -20823 -16308 -17097 -19817 -7116 -542 1367
470 1367 14567 17289 13952 21150 16569 2907 3255 -3137 -15001 -12052 -12785 -19259 -10215 -4681 -5264
485 -5264 5879 10338 6198 13496 12727 1715 5454 6905 -1671 1096 -13 -10368 -7455 -6561 -13289
500 -13289 -6562 -1439 -6334 1058 6742 1501 9395 16288 9069 9456 9153 -2184 -3611 -4999 -14902
515 -14902 -12027 -7470 -14405 -9197 95 -1450 6929 16724 11201 11633 14273 4591 1945 1363 -9822
530 -9822 -10797 -7279 -15799 -13512 -3086 -4369 454 10200 6015 6913 12922 6371 6063 9026 -614 -4444
546 -4444 -1699 -10887 -12204 -3854 -7368 -7200 1154 -1237 -346 8049 5103 5784 13456 6997 2012 5426
562 5426 -2862 -7725 -2007 -6768 -10902 -4095 -6111 -7092 1607 689 1623 11391 8208 3884 10376 5981
578 5981 -296 3721 -2317 -9697 -6347 -9412 -12811 -4259 -2683 -2430 7089 6746 2877 11192 10907 3348
594 3348 5967 1938 -6735 -3770 -5968 -10587 -3455 -2828 -7817 -1682 -313 -2437 8678 12205 5379
609 5379 7497 4898 -3489 -202 521 -3816 339 -1679 -12004 -8309 -4018 -5017 4637 9633 2596
624 2596 3881 4411 -1277 3159 6785 1185 2853 -365 -10528 -6593 -289 -4217 -1410 177 -7593
639 -7593 -4424 3035 2961 9308 13373 4619 1769 260 -7013 -2097 4818 -2355 -5465 -6169 -13475 -9601
655 -9601 668 3378 10361 15659 5639 1397 2381 -3773 -2273 3564 -2883 -5652 -2228 -7402 -6839
670 -6839 253 -1324 1719 7365 1673 1300 7274 2412 -636 2732 -3215 -5075 2297 184 -1330
685 -1330 3056 -3097 -6687 -3619 -6499 -4207 6647 6100 3235 6806 1929 -2190 3339 1478 -697
700 -697 3960 -1753 -8414 -4905 -7541 -7730 1355 1711 88 8095 8662 5316 8118 3026 -4416 -2396
716 -2396 -5751 -8907 -588 1133 -2981 165 -3213 -8019 1378 7177 7108 11564 6611 -4660 -5650 -7366
732 -7366 -8115 3531 8372 2306 1787 -2771 -9941 -3782 924 -872 4298 4291 -2814 55 2488 101
748 101 6486 7162 -2619 -2519 -1755 -6091 -2130 -294 -6464 -4408 -1508 -3639 4413 11723 8317 8128
764 8128 4707 -7276 -7444 -2446 -3791 378 2882 -4239 -5083 -2629 -5548 1680 9691 6210 5018
779 5018 4334 -4108 -4448 842 -2763 -1304 2760 -2430 -2579 1234 -2916 -872 3783 -2037 -2801 2322
795 2322 312 1987 7119 1730 -874 1678 -3448 -3673 2673 -487 -1728 791 -5551 -7340 235
810 235 613 2141 8329 4520 1206 3437 -1230 -3483 2148 -1012 -4318 -1163 -4513 -5351 2157 1898
826 1898 -401 4005 1512 -1375 3745 2233 256 4592 382 -5634 -2375 -3018 -3822 2518 1658 -2775
842 -2775 832 -658 -3122 2912 3929 1392 5292 1944 -4199 71 235 -3503 292 -583 -4601 -231
858 -231 998 -2578 2349 2603 -2086 1350 1474 -1786 3706 5136 -1406 -930 -1562 -5647 -1454 1134
874 1134 -2386 1397 2320 -3628 -492 1881 -707 3639 5528 -552 386 1599 -2955 -1040 780 -4080
890 -4080 -1836 215 -4008 -319 3962 207 1395 3478 -1824 -114 3944 -121 542 2546 -3295
905 -3295 -3907 -1119 -4814 -1392 4344 400 267 2745 -1996 -930 3440 279 1151 4267 -959 -2740
921 -2740 282 -3774 -2493 2425 -1368 -2261 2551 -533 -859 3247 293 -42 3660 -366 -2262 2515
937 2515 -270 -1910 1967 -2081 -3698 1137 -869 -2240 2314 613 -536 3415 92 -1619 3497
952 3497 1166 -1522 1803 -757 -3745 -2 -1921 -4165 1112 1101 -814 3508 1518 -1700 2996 1495
968 1495 -2111 1618 1003 -2516 319 -534 -3491 998 769 -2615 1117 720 -2495 1968 2180 -1034
984 -1034 2559 2426 -2142 141 456 -2355 1331 1192 -3500 -578 91 -3917 416 2679 -529 2329
1000 2329 3537 -1019 742 1996 -2154 -172 419 -3626 -829 1482 -2682 -284 2306 -1445 329
1015 329 2356 -799 1696 3668 -1099 -796 352 -3683 -1105 2672 -1090 604 3328 -1821 -2573 292
1031 292 -2613 42 3400 279 893 3138 -1496 -1206 1753 -1660 -1225 2237 -1621 -2531 740 -2114
1047 -2114 -1575 2187 -444 704 4738 1314 353 3075 -2156 -3721 -549 -2830 -2246 2722 1011 -21
1063 -21 2533 -1075 -1993 2269 247 -564 3620 255 -3580 -302 -2229 -2399 2782 1999 85 2967
1079 2967 40 -2712 304 -1735 -3467 1357 880 -644 3804 2981 -238 1853 -1269 -3948 281
1094 281 -70 -2077 1904 290 -3502 272 295 -1118 4053 4643 807 1498 -1296 -5482 -1944 -928
1110 -928 -2351 2413 3095 -1479 1170 1291 -1827 931 1814 -1562 851 1012 -2543 30 632 -3436
1126 -3436 156 1857 -1273 1685 3266 -783 -416 -571 -4632 -1825 1039 -829 2536 4278 -328
1141 -328 251 1041 -2833 -568 1993 -1507 -727 153 -3255 -1557 1183 -992 1690 4806 1065 1174
1157 1174 2424 -2645 -2781 -460 -3648 -2254 2016 69 1577 3373 -932 -1096 2071 -1230 -727 2884
1173 2884 -213 -1298 67 -2985 -2446 2106 680 992 3749 -207 -1717 561 -2341 -2703 1732 -144
1189 -144 -943 2284 349 -222 2993 221 -1142 1359 -1274 -2718 427 -911 -2399 1506 75 -1371
1205 -1371 2344 1732 1001 3644 590 -2411 -467 -2378 -4167 124 301 -831 2572 1253 -1383 1580
1221 1580 754 -950 2020 929 -1911 389 -692 -4131 346 1108 -751 2173 1954 -818 773 64
1237 64 -2464 487 729 -1695 1077 1476 -1431 1118 1727 -1754 394 1098 -2024 223 376 -2344 21
1254 21 1248 -1791 466 2212 -426 1681 2307 -1553 -547 336 -2662 -742 780 -1178 363 1847
1270 1847 -1852 -433 2071 -562 681 2437 -908 -78 707 -2599 -1670 604 -1383 -318 2002 -583
1286 -583 -3 2038 -788 -663 2023 -478 -59 1558 -1588 -1479 1007 -1494 -1009 2062 248 444 2306
1303 2306 -903 -1962 831 -957 -936 1958 -105 -479 1768 -648 -1708 1426 288 -425 1831 -860
1319 -860 -2118 230 -1344 -2306 1710 884 533 3316 1109 -995 908 -1034 -3309 -215 -818 -1688
1335 -1688 1396 374 -1074 1668 448 -884 2471 1467 -269 1527 -604 -3564 -1232 -867 -1849
1350 -1849 1734 2193 674 2648 798 -2353 -339 -103 -1407 1474 1008 -1600 541 251 -2309 453
1366 453 1457 -148 2265 1409 -2128 -733 -995 -3097 -797 1172 259 2793 2965 -366 269 -26 -2370
1383 -2370 -1126 176 -1903 535 1302 -1843 -771 915 -883 1677 3404 1096 1427 997 -3516 -3328
1399 -3328 -1675 -2603 395 3633 994 1369 2432 -663 -903 140 -1562 -313 1208 -1816 -1094 854
1415 854 -1588 -736 2271 514 1331 2922 -340 -1693 -673 -3451 -2653 592 -17 1598 4318 1330
1431 1330 -432 566 -1908 -2152 20 -982 -830 1479 -105 -1558 575 -386 398 3265 1651 -22
1447 -22 1539 -991 -3079 -1588 -2319 -1882 1728 1407 823 3004 897 -1594 647 -897 -1622 1465 466
1464 466 -1818 -373 -956 -2161 1049 747 487 3098 1719 -1501 -370 -1721 -3287 -214 71 -587
1480 -587 2350 2287 -103 757 2 -1756 151 -32 -2069 116 654 -1636 54 829 -682 1620 2028
1497 2028 421 1634 1097 -2188 -1335 -1491 -3125 -394 1786 232 1785 2426 -176 270 388 -1772
1513 -1772 -149 1031 -1421 -569 -64 -1905 -334 1448 -129 1555 2711 278 -235 -171 -2709 -1536
1529 -1536 215 -1270 -11 2177 693 774 1973 -900 -584 563 -1891 -1251 266 -1250 -274 1640
1545 1640 -595 209 2330 437 98 1868 -566 -1259 -276 -2300 -1793 1094 -251 320 2379 794
1561 794 -258 1745 -848 -1302 697 -270 -983 537 -970 -1453 1062 -54 -314 2277 1093 -95
1577 -95 1428 -403 -1818 -235 -928 -1551 785 382 -366 1764 380 -805 1366 331 -1569 188
1593 188 -261 -1645 572 -180 -930 1099 1011 -203 1483 650 -942 667 -222 -2276 -529 -380 -1560
1610 -1560 753 992 -200 1945 1370 -644 726 388 -1933 32 8 -2004 -163 669 -912 665
1626 665 1444 42 1445 1047 -1409 -315 -104 -1821 -435 67 -1280 677 1497 -204 884 1266 -682
1643 -682 197 398 -1765 -435 812 -1033 -376 1200 -184 729 1324 -720 23 902 -1171 -1070 280
1660 280 -1595 -391 881 -464 -19 1845 134 21 1058 -814 -717 434 -1300 -997 800 -637
1676 -637 -524 1226 -192 -94 1922 258 -322 877 -651 -1016 101 -1286 -1270 1116 -163 -371 1570
1693 1570 371 -299 1177 -212 -889 583 -601 -848 602 -159 -754 1036 116 -704 1184 469 -522
1710 -522 792 -771 -1238 148 -435 -998 1130 1096 -140 1325 298 -1136 415 70 -1190 114 -175
1727 -175 -961 690 213 -941 708 921 -348 1202 337 -1008 102 -387 -2117 -390 -150 -630 799
1744 799 752 -354 1113 1190 -1022 480 677 -1089 133 250 -1328 413 514 -1133 564 1137 -131
1761 -131 1116 1061 -1280 -416 428 -1539 -265 784 -629 356 1016 -749 127 789 -701 -1 965 -934
1779 -934 -50 518 -1065 -524 1047 -372 308 1297 -259 328 725 -1274 -1193 436 -565 -208 1093 -269
1797 -269 -508 1005 -297 200 1361 -93 -298 150 -1242 -1280 779 -352 -446 1085 70 -355 1223
1814 1223 24 -275 1263 -703 -1088 182 -644 -696 1260 281 -335 930 -506 -523 852 265 -349 611
1832 611 -998 -1394 730 257 -102 1418 461 -704 493 -234 -1010 553 104 -868 531 -312 -874 969
1850 969 655 -348 912 368 -895 254 -243 -1287 358 -71 -1044 623 491 -535 1220 588 -1000
1867 -1000 351 611 -434 144 -56 -1365 111 124 -965 831 1147 -308 625 366 -1219 55 727
1884 727 -793 -34 351 -955 389 1034 -632 370 1093 -1076 -14 702 -774 154 578 -1062 -364
1901 -364 804 -264 662 1286 -417 -157 114 -1431 -816 676 -438 156 920 -791 -427 1051 -294
1918 -294 -41 977 -702 -561 395 -1096 -676 1103 -365 -214 1059 86 -139 641 -768 -758 381 -556
1936 -556 -384 982 -234 -429 734 -482 -485 882 362 -362 443 -622 -834 824 41 -532 1084 159
1954 159 -567 555 -132 -432 926 -172 -980 374 -345 -574 1176 158 -720 635 116 -561 1143
1971 1143 751 -479 526 -703 -1357 376 511 87 1162 109 -1121 144 -58 -624 854 725 -725
1988 -725 14 -300 -1058 432 684 -463 534 317 -843 449 416 -772 282 57 -1355 33 482 -428
2006 -428 927 465 -1120 -134 443 -570 705 650 -617 -291 -73 -985 357 1256 -48 709 473 -1585
2024 -1585 -243 595 -1069 -205 797 -576 188 691 -716 77 675 -717 -228 967 -116 211 744
2041 744 -1161 -672 306 -543 95 1054 19 -119 213 -956 -555 817 53 -422 508 -607 -419 450
2059 450 -317 -373 941 78 -27 755 -322 -497 618 -551 -1025 624 75 -143 1090 279 -539 257
2077 257 -474 -544 740 169 -492 788 -412 -872 702 471 -172 698 76 -471 582 -25 -1150 262
2095 262 -532 -790 707 802 83 1029 113 -1119 -197 -270 -393 1132 522 -802 229 -471 -1228 577 1198
2114 1198 -12 833 18 -1169 -271 93 -592 584 468 -601 363 516 -702 494 708 -765 -191
2131 -191 -3 -552 542 937 -448 -207 -237 -917 246 1159 347 761 520 -1186 -881 -129 -311 455 969
2150 969 -493 -128 616 -790 247 845 -375 86 487 -819 -126 486 -461 -286 284 -914 396 1428
2168 1428 -113 -12 131 -1223 -971 163 -193 495 1171 -214 -498 368 -611 -106 1059 -450 -322 380
2186 380 -665 -666 722 -400 37 377 -167 -166 1034 114 -583 324 -985 -1085 668 309 223 1249 -113
2205 -113 -805 352 -435 -182 1167 -161 -954 228 -365 -748 839 414 -126 978 424 -300 551 -144
2223 -144 -644 284 -380 -562 644 461 -299 652 46 -921 354 92 -268 500 334 -778 -71 -134 -410
2242 -410 851 860 -523 427 379 -663 54 6 -852 186 217 -624 380 957 -175 421 92 -1131 -19
2261 -19 440 -280 317 365 -922 -231 253 -612 650 1116 -287 -174 163 -1023 145 279 -867 -349 199
2280 199 -213 272 862 -210 45 716 -1033 -469 472 -185 32 281 -989 -297 563 -178 285 1032 -234
2299 -234 -611 229 -866 -563 595 18 26 579 -455 -282 913 -123 -225 528 -872 -661 349 -204
2317 -204 106 1103 -189 -602 487 -65 131 1003 -206 -920 -105 -402 -529 1104 187 -150 651 -199 -588
2336 -588 636 278 -681 566 -473 -876 376 38 -395 806 86 -487 113 -205 -278 317 -64 -821 -31
2355 -31 -348 -505 366 616 -309 542 77 -737 522 321 -266 171 -209 -1040 511 698 -224 573 374 -546
2375 -546 170 173 -386 352 310 -870 -317 -200 -657 606 833 -241 306 334 -661 -305 376 -140 250 -32
2395 -32 -732 138 824 -102 317 461 -779 -199 375 -282 186 172 -650 -471 238 -77 331 1044 -55 -195
2415 -195 -143 -877 -288 849 -268 14 557 -695 -216 759 -350 79 259 -447 -597 410 -40 250 533
2434 533 -322 -604 608 -52 150 790 61 -248 298 -967 -423 892 166 202 275 -36 -535 619 -192
2453 -192 -383 743 -62 -475 175 44 -203 548 -338 -649 576 97 55 376 365 -249 401 -446 -641 745
2473 745 483 -235 261 74 -713 150 -50 -641 452 293 -263 387 13 -423 586 183 -464 374 246
2492 246 -286 389 149 -739 116 -28 -356 434 352 -385 123 -203 -684 114 282 -274 280 227 -563 39 144
2513 144 -467 201 338 -439 95 275 -478 187 495 -391 23 489 -118 492 420 -313 -254 40 -663 198 447
2534 447 -154 172 286 -747 -286 453 -107 34 408 -435 -47 499 -589 -180 517 -176 -99 686 -116 -10
2554 -10 493 -387 -292 145 -467 -170 701 -57 -328 693 -459 -212 414 39 33 634 -539 -387 572 -318
2574 -318 -62 647 -122 -290 259 60 -171 568 34 -465 122 -278 -601 692 179 -319 449 -212 -431 198
2594 198 276 -33 528 -130 -746 -34 -108 -146 671 290 -415 144 -131 -443 328 -60 -576 29 -205 -669 557
2615 557 411 -185 464 234 -495 363 320 -544 -116 -69 -593 87 369 -318 755 351 -427 -78 -159 -630 405
2636 405 89 -450 143 131 -529 132 253 -345 360 385 -578 35 316 -400 40 175 -382 227 388 -563 157
2657 157 359 -584 219 575 -171 253 555 -195 -200 242 -188 262 491 -181 -41 543 -401 -389 299 -97 140
2678 140 275 -143 18 538 -155 -70 292 -306 -97 656 -239 -62 550 -165 -449 -75 -188 -8 941 -207
2698 -207 -170 204 -503 -316 721 148 -233 537 -207 -509 388 42 -97 280 -448 -360 326 2 -324 261
2718 261 0 -584 238 77 -405 480 8 -216 -76 -144 -127 655 407 35 508 -141 -455 204 29 -109 296
2739 296 460 -371 74 -90 -330 386 222 -351 523 240 -594 257 212 44 219 89 -253 241 510 -199
2759 -199 -20 2 -567 344 535 -269 223 451 -583 203 176 -410 209 507 -390 188 164 -640 38 389 -329
2780 -329 68 436 -398 -23 351 -383 -96 230 -143 105 366 -217 -83 260 -355 36 -135 -405 58 453
2800 453 -33 -80 200 -391 -355 364 -131 177 496 -412 -250 112 -387 -89 399 -154 -343 530 -317 8 499
2821 499 -249 -49 571 -2 -73 343 -343 -374 542 -542 -148 499 39 -165 468 -137 -204 209 24 -409 166
2842 166 111 -147 145 23 -121 180 33 -135 651 193 -78 239 -318 -566 429 88 -353 370 141 -85
2862 -85 37 59 -580 360 88 -208 159 70 -468 509 340 -187 211 38 -97 308 210 -491 -113 105 -795
2883 -795 190 235 -421 170 -125 -137 -59 -64 -447 359 362 -190 13 166 -315 30 410 -273 378 154 -216 9
2905 9 287 -423 51 138 -478 -180 197 -242 169 346 -354 -8 279 -341 111 272 -202 -108 232 -531 -40
2926 -40 472 49 131 231 -392 -235 219 -501 -36 364 -269 -36 288 65 -106 386 -121 -166 78 -426 -48
2947 -48 451 72 -4 393 -106 -60 517 -3 -232 448 -189 -312 20 -421 -351 410 18 95 525 -177 -412 268
2969 268 -148 -115 333 -324 -236 444 -116 -191 237 76 -74 339 -81 -144 146 101 -541 184 54 -392 355 -79
2991 -79 47 369 156 -314 155 -125 -329 461 -71 -332 176 88 -216 301 5 -16 485 -321 -498 -76 141
3012 141 -249 146 -214 -299 510 321 -395 33 -36 -343 158 99 -323 75 324 -343 -94 60 -58 148 200
3033 200 -255 60 368 -364 -66 442 -306 -53 612 -189 -114 333 -282 68 380 -442 116 207 -218 -140 286
3054 286 -196 -36 366 -259 -217 96 -136 -112 179 76 -294 407 -249 -136 270 32 -145 482 -163 -303 582
3075 582 -176 -136 327 -238 -75 235 -118 -230 311 -1 -35 100 -201 -339 183 -252 -258 191 128 -326 128 -15
3097 -15 -298 444 -58 -307 124 -39 -304 377 50 -109 394 -188 -234 190 45 -99 523 -39 -124 381 74
3118 74 -230 438 -95 -63 210 56 -289 283 8 -275 131 68 -219 -173 0 -314 176 202 -170 195 307 -300
3140 -300 115 110 -378 58 331 -336 267 76 -388 427 -11 -473 38 260 -141 77 110 -347 -66 243 -192
3161 -192 77 475 -228 -39 150 -389 -123 91 -137 -210 346 -195 233 356 -231 149 380 -421 -61 99
3181 99 -61 -70 436 -303 99 337 -154 54 291 -88 -100 461 -84 -333 423 -123 -116 120 -325 19 278 -14
3203 -14 -182 389 -144 -140 212 114 -120 194 51 -56 260 -223 -347 370 99 -331 548 -147 -207 69 -128 -350
3225 -350 202 137 -572 280 156 -364 224 -55 -354 109 -42 -345 273 -95 -156 340 95 -124 121 138 -151
3246 -151 75 30 -180 199 -15 -302 148 72 -380 -37 8 -398 191 171 -348 110 148 -361 249 -47 -239 321
3268 321 -68 -344 61 3 -230 164 7 -456 -19 132 -413 156 310 -231 -1 83 -253 49 117 -398 146
3289 146 54 -68 267 322 -55 -35 109 -368 56 156 -215 -168 197 -364 -13 259 -277 300 355 -312 245 99
3311 99 -206 -57 154 -598 21 340 -411 99 84 -102 -16 241 -353 -322 162 -271 120 236 90 75 329 -348
3333 -348 -26 483 -45 -150 171 -352 -349 333 -330 -80 14 -195 11 318 -150 -42 485 -121 -250 -10 -134
3354 -134 -211 348 195 -377 334 42 -73 146 234 -116 286 -195 -243 271 123 -173 342 166 -73 82 -63
3375 -63 -238 234 -83 -483 331 90 -184 286 -32 -226 230 -9 -117 55 41 -389 225 -36 -493 454 -23
3396 -23 -379 223 199 -80 122 195 -338 50 166 -189 189 63 -464 52 90 -372 57 281 -117 19 306
3417 306 -308 -137 126 -332 -66 175 -154 29 283 -432 -76 321 -32 55 155 -124 -166 367 -167 -188 177
3438 177 -191 134 313 -245 334 345 -294 -190 192 -88 -21 360 -126 -91 464 -117 -496 51 15 -23 285 -261
3460 -261 138 262 -91 -328 -155 132 17 171 -107 -248 278 -354 -369 -62 -426 -214 415 185 -105 241
3480 241 -278 -28 354 -55 -100 417 -510 -311 167 39 -57 25 103 -228 229 161 -184 -13 -14 -354 267 154
3502 154 62 375 145 -264 -8 -91 -99 245 179 -68 -66 35 -237 158 99 -116 481 214 -178 65 -57 -350 350
3525 350 147 4 177 197 142 34 239 -159 8 197 63 121 104 -408 154 -332 -424 139 192 -365 24 497
3547 497 -261 -377 70 -229 157 256 -197 118 220 7 73 315 -107 -79 275 -64 151 209 -361 -229 187
3568 187 -203 -143 296 -355 -17 75 -120 -146 -9 -326 -55 174 -82 36 62 -224 74 187 -105 464 -7
3589 -7 -280 -228 -13 -265 -132 88 15 -240 534 14 -350 245 -291 -195 251 130 74 54 46 -209 102 -46 -271
3612 -271 261 -263 -70 176 -75 -228 484 -161 -71 80 511 -286 57 -333 -296 70 -150 -106 349 227 37
3633 37 283 107 -326 24 219 -96 276 49 -121 193 -45 -165 71 169 1 233 -6 -113 212 125 -367
3654 -367 104 418 -90 225 122 -76 25 462 -460 47 223 -8 -86 327 -397 -385 180 -329 216 368 -3
3675 -3 45 284 -593 -128 213 -93 -283 308 -197 194 65 -43 -95 136 -157 117 213 249 281 264 -263 -190 302
3698 302 -50 88 260 -98 -39 125 -342 -380 139 1 -68 351 -280 14 129 -94 -205 171 -263 -128 104
3719 104 -432 -300 164 145 -177 372 120 -231 409 20 -203 140 -4 -205 -117 -88 -268 297 143 -86 220
3740 220 -27 -204 69 -283 -220 107 56 -217 501 -35 -166 75 61 -403 242 -92 -253 96 121 -13 -45 -180
3762 -180 -241 247 365 -255 5 197 -287 169 131 -98 74 153 -247 206 95 -191 71 50 -230 -15 -103 -154
3784 -154 107 -142 -132 53 431 1 -55 130 -264 165 82 -292 -41 8 -241 -21 103 -141 170 283 -336
3805 -336 106 219 -228 159 381 -161 11 267 -123 -88 499 -117 -1 0 -229 -196 133 -172 92 92 -121 -37
3827 -37 222 221 216 242 -131 143 117 -44 -455 332 -165 -238 197 -21 140 170 -59 10 407 -363 -60 146 -49
3850 -49 -48 125 24 -138 254 14 -390 133 -202 255 311 -433 105 185 -104 -206 178 4 -142 243 86 -389
3872 -389 172 -181 -174 328 -6 -147 312 113 -191 136 -29 -161 352 -216 11 210 167 -389 154 91 32 205
3894 205 -23 -215 234 236 -145 193 66 -248 118 80 -238 320 56 -480 261 33 -276 94 135 -64 130
3915 130 22 -141 93 311 120 79 324 -96 22 87 -109 -104 164 -66 169 15 -52 209 140 53 -111 295
3937 295 -230 149 236 -51 422 135 -264 91 139 -160 304 80 -69 295 62 -357 -25 44 -279 -77 291
3958 291 206 -180 210 -126 -95 -25 -202 -202 -28 -178 59 115 -65 52 179 -89 -229 212 124 -62 10 95 -154
3981 -154 302 13 -142 255 -78 -12 153 -30 -92 179 67 57 293 -107 -314 36 62 -14 257 -36 -89 65
4003 65 -178 -95 -45 -263 -260 123 313 -216 -23 -54 -139 131 104 11 129 98 -260 112 4 35 323 276 -315 206
4027 206 68 -214 129 113 128 81 188 -93 172 277 -260 307 289 -227 -205 -3 -307 179 108 -88 -97 40 -167
4050 -167 258 202 -272 80 142 -190 -134 60 -278 118 88 -122 113 -149 -22 244 176 -142 -214 72 -251 -138
4072 -138 224 -294 -230 -82 -206 252 214 -158 -96 174 -313 119 100 97 260 82 86 -80 226 -198 -57 326 -344
4095 -344 -14 43 -153 -115 114 -71 -47 261 133 -131 257 -65 -237 171 -76 -192 256 -73 -137 418 -179
4116 -179 -233 127 -109 -264 427 -86 -187 311 98 -168 97 256 -18 -44 20 -134 82 230 -220 75 -291
4137 -291 -279 141 -183 -44 122 21 26 25 -48 0 305 -76 -29 56 202 -179 231 -144 -333 40 86 108 4 331
4161 331 -45 46 343 -523 136 223 -295 -112 96 -19 193 198 -180 -215 66 -199 180 143 -277 73 221 103
4183 103 -145 86 244 5 218 118 253 -114 -282 69 -31 107 41 -50 -84 71 214 -235 -83 41 -142
4204 -142 -32 110 -298 10 -2 110 -61 71 -211 -6 409 24 3 -54 148 -71 263 180 -257 337 -64
4225 -64 -95 63 5 -19 129 -414 -292 139 -38 -115 156 -25 -111 312 -80 134 266 10 -258 31 -47 107
4247 107 357 -274 -233 146 92 191 -30 -82 20 138 -6 -195 149 63 37 150 165 -250 97 77 -10 138 100
4270 100 -403 -184 83 -163 277 16 3 108 -58 95 242 36 15 266 -76 -328 -43 27 34 220 -49 -276
4292 -276 189 -71 -146 -34 197 -367 58 -169 -50 -27 410 -23 -196 166 -139 35 144 41 -63 42 -471
4313 -471 15 141 -68 514 58 -140 -177 59 -182 -46 168 -280 -307 223 41 -20 129 -62 179 -13 -175
4334 -175 -131 544 -236 205 -77 -164 -232 301 -3 59 243 -149 -9 50 207 -140 287 12 -193 119 -156 52
4356 52 31 -197 191 238 -169 -203 223 -259 117 140 -196 -177 148 268 -77 202 -40 -52 218 -100 145 180 172
4379 172 -124 83 -159 183 209 -177 -407 102 -121 -334 -122 49 -198 340 25 -55 10 -273 -30 91 41
4400 41 -18 -105 59 183 310 195 -188 158 -17 -19 179 170 145 -246 121 46 445 197 322 20 151 -38 198
4423 198 -12 -173 -100 177 -550 -213 118 43 281 125 -161 -155 242 -181 133 309 -305 -139 18 55 -67 361
4445 361 -266 -15 207 -159 71 177 97 -9 3 -183 -89 -124 -124 213 49 2 -119 121 -227 349 203 45
4467 45 5 245 226 -124 109 -38 116 146 -17 8 147 112 -317 -18 -10 -115 280 237 -2 155 -187 -240 116
4490 116 64 -153 269 -2 -147 190 -263 -109 53 151 -152 356 -217 -153 243 55 25 134 -170 -74 80 -42
4512 -42 -111 62 76 -174 61 -99 11 232 201 -259 243 -126 -222 88 203 -173 24 147 -113 289 53 -211
4534 -211 349 13 -235 -163 108 -115 270 85 -96 67 -50 235 43 90 -475 179 -22 -57 273 139 197
4555 197 -127 119 -402 172 28 -64 -127 -121 -265 125 120 12 36 68 -310 -116 341 -221 243 104 -54 57 400
4578 400 -166 74 221 -154 -80 -37 -56 165 337 -107 235 252 -12 -141 -20 -181 159 -80 -167 -92 242 -70
4600 -70 -35 277 -45 10 203 -94 -244 107 10 114 -35 -269 -24 96 96 -284 176 -250 -386 252 -77 -225
4622 -225 116 31 -97 -10 -106 64 4 256 94 209 102 -30 420 227 -204 148 224 -185 63 -165 -118 325
4644 325 28 -111 117 314 -142 111 -43 -15 302 -67 -101 138 185 -98 -198 -7 -107 44 -3 150 19
4665 19 -23 -163 23 -3 37 33 258 -7 -102 -27 14 208 317 -261 -17 125 -73 40 111 -135 275 306 -283 13
4689 13 -179 -101 166 -77 -49 -112 99 -290 -111 63 -79 172 -112 -93 -304 11 -6 -88 64 -208 299 -22
4711 -22 -88 -174 61 -73 -277 64 -131 -11 248 -125 -19 -236 -31 -122 -87 -363 -65 211 1 69 291 -9
4733 -9 -433 -51 180 65 83 -274 -292 213 -350 -221 211 -162 -263 29 -263 -155 329 -259 150 168 29 -356
4755 -356 43 54 -71 80 -106 81 62 91 49 236 -75 -465 333 83 -56 43 143 -48 15 -93 -190 187
4777 187 79 -25 -103 -38 -153 -59 -66 -145 369 -173 -240 184 36 -151 50 182 203 -126 -25 -296 181 -106 -369
4800 -369 88 -278 -138 188 198 -140 -87 158 -335 167 -109 -91 204 -8 38 190 4 220 -17 32 -529 26
4822 26 17 -49 303 118 -97 -98 124 -103 147 312 -96 -144 158 -160 -33 220 128 64 40 10 141 34 -334 23
4846 23 131 148 -26 102 3 57 86 -38 -243 16 110 -126 179 -210 -242 -86 -102 291 21 170 -50 -141 -42
4869 -42 -131 85 -72 -216 92 -48 -151 266 86 -330 318 159 148 200 -230 -7 132 -86 -98 -109 -393 -132
4891 -132 -19 -54 -31 197 -340 -235 325 -10 79 372 167 119 56 -24 -350 -159 -2 -42 90 -246 -115 82
4913 82 41 -139 -43 180 -161 -26 -37 212 -149 24 76 -46 147 -222 288 110 -158 52 242 51 -97 -1
4935 -1 -49 -84 42 -38 36 255 -86 -160 -65 -212 -282 232 -155 108 152 77 12 102 -91 -63 -88 -251 25 -40 -140
4960 -140 97 164 -107 -108 46 -51 113 242 -10 -28 143 -223 11 27 128 -206 6 92 270 147 -89 120
4982 120 49 -109 20 130 -194 40 128 -29 61 -224 -170 -171 144 53 96 178 -198 -166 244 254 -121 -134 -169 -91 184
5007 184 -49 150 195 121 56 235 42 -138 100 87 -137 -279 -140 -18 320 357 20 286 123 -234 147 -50
5029 -50 359 121 -37 185 32 -157 -20 222 66 -397 -3 221 -99 86 53 -117 19 2 -158 -134 258
5050 258 -45 206 -130 -167 139 -233 -216 -50 -114 -208 69 180 58 -66 154 -104 214 25 -187 126 29 -17
5072 -17 -209 179 138 4 237 -74 11 70 -41 113 34 282 97 5 -137 173 96 -81 -116 -109 204 141 117 -369
5096 -369 106 -162 11 63 138 144 -119 -169 -248 59 -7 -78 -96 262 19 -61 -58 75 29 -190 77 3 -127 89 -79
5121 -79 117 28 -149 369 22 132 199 -47 101 -8 -150 -101 -133 -55 -99 320 125 -256 78 82 -350 227 19
5144 19 -135 -38 4 -34 91 -115 -176 62 235 -56 288 157 -346 294 262 31 300 -330 -278 -24 76 -35
5166 -35 127 395 114 127 -29 -278 59 165 -230 -229 -215 -194 298 119 -151 -5 74 -42 -87 48 -58 97 119
5189 119 -284 -188 -128 -139 255 -231 -76 -132 209 21 28 -70 -257 250 -76 -32 22 155 16 55 86 -77 236 288
5213 288 97 -104 35 -112 35 -9 -178 -87 157 -104 36 155 -31 -18 -65 130 -33 218 16 -65 2 -331
5235 -331 -129 -50 -143 -157 440 -55 96 273 -192 154 145 -186 -19 61 -82 250 122 -244 178 379 -271 210
5257 210 202 -109 -147 396 -23 38 168 253 -103 175 217 -66 -52 16 -186 127 -129 -153 111 61 -341 -48 115
5280 115 -94 164 -172 86 159 -13 -245 -41 -345 -348 84 146 -223 64 -20 33 -112 -112 -125 155 -132 -150 17
5303 17 163 90 151 -12 -35 124 76 -73 282 61 -327 -200 59 -56 -136 -8 -47 -109 37 -179 -32 -68 -247
5326 -247 42 -89 66 27 -37 -74 233 120 -92 -75 -48 -40 150 -112 -253 300 67 -16 -93 169 -114 76 61
5349 61 170 -143 212 -336 10 97 -120 173 89 245 -72 -30 -129 349 -87 -57 254 -96 -13 -93 -57 -154 -82 16
5373 16 93 62 131 -245 -14 48 -108 98 -81 93 -114 181 -67 -32 106 -84 108 216 -63 -101 65 -308
5395 -308 -2 -16 -210 65 -60 -89 39 134 -109 -155 100 401 -64 -77 -1 -208 220 -46 21 -19 217 -147 -85
5418 -85 70 -359 208 -1 72 218 -104 -95 86 125 -226 188 241 -51 -11 55 25 -99 -15 -37 203 -74 -49 -33
5442 -33 31 -50 238 19 7 154 19 -150 -10 -29 33 10 279 -7 36 321 -227 -41 186 25 -199 -106 -82
5465 -82 -26 288 -26 -265 162 98 3 61 -67 -49 -2 -111 194 243 -89 284 -79 198 269 73 -10 -378 80
5488 80 -189 -75 15 -322 -191 -166 -23 -174 144 8 59 -36 -73 29 123 -122 207 376 -137 -21 177 -148
5510 -148 -168 91 -20 -81 -84 -107 14 46 -255 95 179 104 -43 -39 122 -24 55 -126 7 -63 -187 -32 -25 138 -115
5535 -115 -53 -27 -281 373 189 -229 231 16 -165 -314 -26 7 -64 -64 -99 127 20 26 -117 78 41 -76 4 -150
5559 -150 28 16 -221 83 134 -9 248 292 -241 147 2 79 -21 170 -50 -91 268 -152 263 78 19 -25
5581 -25 175 -33 251 8 23 106 -22 74 325 124 -151 -38 -101 -146 -168 76 -216 28 242 -29 129 221 -147
5604 -147 162 174 134 -193 133 -42 77 -78 -258 154 -140 -72 -137 343 -143 -49 95 -35 -21 74 -66 55
5626 55 251 16 -95 -112 -224 84 237 -65 -72 214 -254 -263 283 174 -96 124 -119 -117 112 22 171 148 -53
5649 -53 -206 213 19 -81 219 86 149 -20 35 276 429 191 45 -62 43 29 321 -89 101 122 -298 -322
5671 -322 25 325 -17 181 72 7 254 69 -54 53 130 -214 110 3 92 -35 151 -310 157 123 -182
5692 -182 -119 18 -75 -76 -200 -141 36 64 -178 33 30 -116 55 95 48 26 142 -211 35 71 4 -182 -148 -204 50
5717 50 12 16 163 34 66 -323 66 56 -55 -178 -227 -5 127 -65 23 -68 -78 134 196 -315 -415 -27 65 -42
5741 -42 61 -42 -92 207 -5 -121 110 -177 74 147 -99 -192 243 -33 -73 -17 -115 -189 -67 -190 -146 17 80
5764 80 28 32 -18 -200 -63 -120 -133 149 -52 38 13 17 26 49 0 -139 257 -155 -161 22 -244 -113 144 384 -70 -1
5790 -1 -13 291 236 -178 -23 64 17 -61 78 -153 -16 -83 193 -159 -23 -17 -119 -26 69 19 303 18 -268 -166
5814 -166 -63 -259 35 -102 -132 3 34 -287 -25 34 -23 36 328 -60 85 203 -47 -129 154 68 45 17 -262
5837 -262 -13 -15 137 138 -172 -109 -132 184 -105 -266 -5 19 178 -9 230 -12 166 -74 3 46 -122 176 243
5860 243 -168 -157 297 -13 -99 19 -19 39 92 -148 -73 198 41 189 180 -283 -67 6 104 -204 195 -119 74
5883 74 -20 -109 73 273 -108 33 52 110 31 487 -132 -231 75 -61 -222 97 169 -159 18 -33 -355 260 4
5906 4 25 114 6 135 -40 -97 -15 145 -15 -57 278 228 -319 -106 -229 -71 105 56 90 71 -174 -123 104 78
5930 78 -222 68 -204 -47 -71 137 -51 32 -44 3 75 106 -2 159 37 -37 237 -133 -23 44 173 20 -167
5953 -167 501 -323 10 -105 -66 2 -323 249 -10 78 -89 -99 156 -157 -102 27 -42 261 106 -157 27 291
5975 291 -92 -84 34 279 77 -208 -233 -108 200 -41 -197 -6 -234 147 92 -288 -238 113 21 -16 -130 -190 -16
5998 -16 23 -66 -67 149 -66 150 175 24 -141 156 94 -47 38 -99 -136 121 110 -146 130 200 -85 349 -167 -214
6022 -214 -24 -32 -50 160 138 -32 175 158 -20 -34 5 -82 211 -153 1 19 -51 -53 -35 -75 187 -79 -73 -242 318
6047 318 10 -130 79 -214 40 -227 64 48 266 -44 -233 113 227 -103 224 -110 -294 -38 -176 37
6067 37 247 139 -273 -118 86 64 86 129 93 131 84 -84 243 259 -41 130 54 -62 11 103 -93 85 128 -19
6091 -19 22 143 -115 -1 331 29 164 -73 -103 -81 212 -186 -119 210 -13 210 24 21 156 -3 -202 -137 46
6114 46 264 -16 -49 72 10 226 -127 -31 241 -57 -67 74 5 57 30 393 121 -154 -124 77 121 -52 -12 -36
6138 -36 -77 173 155 -28 71 -37 -96 9 43 -45 19 58 2 -125 92 139 -59 -22 151 -82 -23 -164 42 -93
6162 -93 -167 -192 -17 90 5 -5 -161 75 -73 -31 -47 -66 -177 12 216 -90 -107 -20 145 17 191 -156 -35
6185 -35 9 40 -68 -7 -86 -166 200 -22 -175 -114 212 -80 32 241 18 9 -228 -312 -132 39 -24 -73 -20 -169
6209 -169 -77 96 -139 -4 48 -151 111 -34 -163 -26 216 -26 296 -116 -51 -99 -67 -221 1 -3 150 276
6231 276 229 173 -35 381 -94 -100 -25 57 -25 44 31 -69 35 90 35 58 13 -119 76 -245 251 55 -196 148
6255 148 290 -86 -237 93 -479 -36 247 -347 179 196 45 -222 77 -93 -137 283 -169 -186 39 -351 -24
6276 -24 -161 22 -46 -128 -94 2 151 180 94 -27 39 23 111 283 -88 -141 -45 -130 259 93 -73 -39 -47 -34 -78 22
6302 22 -148 -3 -51 -48 201 -103 90 33 199 38 388 41 -300 -131 74 13 14 32 117 258 -78 -2 35 194
6326 194 -1 -26 -122 13 4 80 16 58 -126 -101 -301 -64 39 -273 205 52 -31 -71 -469 -193 56 -50 -56 81
6350 81 113 71 63 -10 24 -57 -122 242 168 13 -36 -146 -11 123 1 -42 -80 132 0 71 -52 135 -145 -34 11
6375 11 -309 -67 170 -131 140 61 22 153 -313 -40 151 123 49 87 31 -174 -158 125 -204 8 125 -90 34
6398 34 -332 -310 207 42 -126 113 -13 -287 292 -207 -57 202 8 -9 151 -171 -102 14 -11 98 40 -38
6420 -38 -23 -105 -74 -101 100 -132 -125 1 -40 150 295 92 -87 48 -41 -92 38 44 -71 292 66 -425 102 75
6444 75 -379 45 -128 -393 -11 -384 22 180 -38 -88 -80 -11 -17 -9 340 -18 -74 161 -79 227 30 -193 -153 -239
6468 -239 174 -30 188 60 -361 336 74 -302 163 -93 -77 192 -105 -232 124 -269 45 169 98 -135 -11
6489 -11 -65 -23 282 -478 -82 -72 -177 -185 -11 -245 -147 108 34 292 216 207 -66 179 -17 -32 123 195 -33 281
6513 281 47 71 -47 -61 -157 66 72 -47 211 -190 83 -164 -34 -151 -166 -234 -69 -212 -121 66 -72 -209 21
6536 21 303 -54 118 -176 160 -224 13 125 -171 127 127 135 -80 -98 -254 340 13 -76 -62 -150 -253 142 -151
6559 -151 53 -21 35 33 74 -181 -117 100 41 -80 72 123 -30 83 286 -70 129 127 24 34 127 -167 206 29
6583 29 -186 -258 143 -160 201 -132 95 67 80 -20 -97 159 -45 19 297 -20 -40 174 -224 -76 -146 -228 197
6606 197 -87 -274 33 227 6 -69 -125 100 -150 -77 -133 63 57 7 137 102 -364 63 64 -4 112 197 -155 24
6630 24 -50 -309 86 324 -1 -319 142 -108 -257 196 103 65 167 -75 -255 28 -194 47 177 -67 245
6651 245 13 -172 -132 -119 191 41 152 -49 -281 55 -265 46 228 -39 41 -2 -102 -30 -12 216 16 164
6673 164 -4 114 193 141 -6 -84 -1 -73 -52 166 -133 59 -233 101 77 214 101 198 75 74 -294 168 61
6696 61 107 -78 -246 171 19 76 124 -68 -62 -11 -25 33 -62 -138 -296 107 -125 -106 11 140 -21 62 59 -181 52
6721 52 333 -16 18 139 207 301 -136 -174 -104 -101 -235 150 341 47 -91 58 -59 -167 -73 33 299 -7 -261
6744 -261 -113 141 -84 -110 225 -111 -6 -10 -12 -21 95 135 139 31 -88 -184 123 -175 -58 -18 -81 -48 -48 158 -62
6769 -62 82 96 -37 87 -109 25 260 1 -306 -139 -60 -85 125 -85 -162 -72 51 92 46 -71 -166 157 -139
6792 -139 219 -187 -68 48 186 87 -340 186 95 -153 -133 43 -201 319 5 -112 171 136 -94 47 120 -426
6814 -426 13 93 120 96 116 -112 -19 -140 -201 -116 98 -95 -87 -19 -121 66 -85 -162 28 -73 -113 122 4 -54
6838 -54 -184 -188 -155 191 132 172 -20 181 108 31 200 47 299 -23 76 48 83 -134 16 -2 -5 196 -177 35 -139
6863 -139 175 -86 -123 51 -40 -65 140 -48 -17 -55 40 146 -110 -41 92 -137 -29 -46 -136 19 -68 59 -192
6886 -192 -258 -32 136 200 159 41 44 228 -89 -88 26 21 -61 135 -117 -162 56 118 48 0 220 35 -102 -197 -70
6911 -70 76 31 -76 -158 117 108 214 113 48 204 35 -12 -107 -417 57 44 81 -62 171 152 173 216 -64 33 53
6936 53 31 17 183 -47 -140 -96 57 -135 -37 -26 28 12 -132 115 82 -28 -78 -39 226 54 -80 125 -21 166
6960 166 341 -304 -111 -95 -182 23 201 -24 58 -76 25 93 28 186 -258 88 77 -303 96 143 37 132 -407
6983 -407 53 150 -222 143 100 -39 -164 69 23 -50 17 -187 -167 -161 -238 5 171 21 49 112 38 27 -16 -203 -61
7008 -61 172 13 140 273 68 12 246 154 -73 -31 -101 139 -77 90 -25 44 -123 -176 -130 -136 -130 216 322 211
7032 211 -68 -113 106 74 132 -236 39 265 135 142 -189 168 127 -52 73 159 -41 -209 -71 68 -10 -26 -35 -35
7056 -35 96 80 -194 205 14 -142 109 90 -87 18 -232 -199 3 89 -122 173 5 -410 70 103 -270 -107
7078 -107 23 -24 78 -31 -87 -152 -97 -116 -40 49 117 107 -85 63 -73 234 -190 -26 165 139 -117 134 -124
7101 -124 -95 203 78 -82 -38 -8 -80 -182 7 37 -104 -117 113 445 184 -97 -219 15 -172 24 -345 -95
7123 -95 -138 -198 -117 -205 -230 -115 -245 -28 -197 -50 324 -40 33 -37 -127 -141 114 192 -180 80 -107 97 68 124
7147 124 105 57 -54 -137 -86 -13 94 -221 -84 -161 -160 -128 -112 -76 201 2 8 -62 369 177 -258 148 25 -51 -114
7172 -114 -52 -14 -52 178 -220 59 55 -170 -47 103 -110 42 82 -113 -162 135 -41 42 -71 -93 109 187 134 -176
7196 -176 21 253 13 51 -73 -71 178 -249 -173 55 -84 -10 -62 -123 107 -74 248 68 -98 -139 -1 119 -236
7219 -236 34 241 -106 -71 192 163 -181 -19 179 -47 106 -121 7 -98 -92 10 162 -358 59 -268 -317 -135
7241 -135 4 -140 43 239 -151 101 40 34 -148 -69 -264 -109 -60 -145 -315 192 -150 235 204 78 132 35 -160
7264 -160 -206 106 -29 112 113 -44 315 95 34 -149 15 139 -122 260 -219 10 -26 -222 96 289 17 129
7286 129 -204 109 -91 -13 254 54 111 122 -68 108 -75 -35 29 26 -66 23 95 -197 164 121 88 -136 -121 115
7310 115 54 -83 20 -86 -16 48 -196 -118 -168 207 -218 -291 47 -155 -33 -10 118 -127 -7 7 -94 68 -13
7333 -13 152 51 101 -255 115 -267 -122 -145 149 340 148 -109 139 21 164 280 -154 -203 131 34 -131 -164
7355 -164 -18 227 215 -56 408 -35 -139 -19 -320 171 15 -50 -252 99 41 181 -130 -237 77 171 -21
7376 -21 31 261 -13 -84 234 -13 -50 108 -23 142 -29 -5 151 252 -111 55 -19 -23 -21 390 -76 -33 -25 -123 53
7401 53 -27 205 -47 1 -135 -343 286 231 -12 202 -7 -213 -18 -112 55 -33 67 -146 -38 -196 -38 129
7423 129 -1 -8 288 -208 -41 -60 45 -53 -42 -22 -125 101 72 -85 13 40 -256 -210 -9 -124 142 -76 -67 334
7447 334 136 60 -328 94 -8 72 228 -129 317 17 -82 1 257 -186 -120 37 -129 -120 41 0 42 -15 -115
7470 -115 141 146 89 94 170 -337 -267 223 -22 -50 -67 -65 66 -65 -231 -223 -147 8 85 -41 -103 -125 -82 37 -182 -15
7496 -15 -41 2 14 -179 -144 87 21 -60 81 -161 -120 89 -65 -104 104 170 61 -11 36 -43 119 -282 -9 99
7520 99 -80 -47 45 65 71 -3 100 326 413 -167 -184 -117 -162 -244 -178 270 -30 2 -196 14 141 108 73 193 -186
7545 -186 -221 71 -217 -138 28 74 -194 -55 -2 -199 -55 92 19 19 110 -237 -60 -146 24 62 56 12 78 51 -14
7570 -14 200 -241 64 -258 -67 -24 41 295 96 -216 133 124 49 10 92 34 -25 -87 12 84 -293 -59 20 -23 167
7595 167 190 -206 -73 258 -127 -147 106 33 -15 -81 -107 -85 13 -140 55 173 -79 -95 -55 -306 -188 -54 -273
7618 -273 -176 155 64 19 1 100 224 12 -253 14 -293 -313 -38 142 44 280 115 -108 -57 -227 16 -300 92
7641 92 11 -93 142 -168 -73 37 -155 42 -165 -112 -57 -214 -103 -158 11 -18 9 36 50 -135 127 -156 18
7664 18 177 -178 -168 25 59 -105 -57 12 -203 -16 58 -8 -111 -93 82 -46 76 -81 -8 -55 -200 99 214
7687 214 -36 14 -70 -175 110 -219 -300 123 18 79 -35 -179 -163 71 255 -247 -20 243 -171 -101 11 -82
7709 -82 85 -11 -147 138 -54 -313 -127 -220 66 42 -102 115 278 23 -12 344 140 -108 -12 15 -100 -51 -231
7732 -231 -3 -202 -108 -26 8 113 -69 -56 106 -142 -12 38 -76 -256 112 -2 195 103 -58 58 109 -167
7754 -167 -28 182 131 -54 -97 134 29 42 -170 16 90 67 -193 -32 27 -188 43 -50 -169 44 -10 -214 151
7777 151 -198 -39 -49 -99 -49 203 -169 -230 59 -102 87 -45 11 -62 53 8 13 147 -166 14 -66 75 -129
7800 -129 52 -8 -41 200 -88 -41 92 -73 66 76 -217 -432 109 96 110 248 -89 -218 155 -54 40 -47 -36
7823 -36 -137 229 162 -45 0 291 -74 -35 113 -292 32 -3 117 -142 177 -62 -11 -44 139 -160 74 10 89
7846 89 -75 -181 -19 -70 -68 197 23 -18 121 324 -151 161 -1 -131 109 194 -136 142 -33 18 -39 100 117
7869 117 -305 114 175 35 89 -138 -187 125 -100 -79 -7 18 110 12 -30 73 85 -14 53 -43 -98 69 -102 -142 26
7894 26 240 -159 -61 180 -55 46 108 -225 0 -153 37 40 -153 -143 -146 76 33 -231 121 -94 19 -36 49 63
7918 63 105 147 -218 201 238 -18 35 92 -125 -29 -14 170 5 161 75 113 178 109 -73 200 -23 51 17 203 91
7943 91 84 88 18 -66 11 106 -152 -270 126 189 -216 -86 -73 -36 -72 -53 61 114 -66 -201 -125 169 -30 -114 -1 -172
7969 -172 73 105 -3 -32 26 133 195 78 -112 92 -25 -75 -102 280 65 -104 252 30 216 127 -22 218
7991 218 -120 -4 -117 28 58 5 162 81 -155 55 211 9 312 312 -165 -29 101 18 65 102 36 86 79 39
8015 39 60 -197 -201 -247 -245 116 62 -131 -104 107 215 88 -49 232 -34 72 92 176 128 187 326 105 -44 197
8039 197 133 -5 -16 48 -139 -117 91 259 -193 124 60 -256 163 24 -135 -69 -104 34 365 -136 -118 -124 -102 47
8063 47 -365 -122 -158 -227 134 46 -221 -90 -18 -253 205 -2 61 -153 -52 47 -75 -128 64 100 21 169 -4
8086 -4 -8 22 -46 49 -145 51 -227 338 37 83 66 -44 136 -214 337 -151 262 148 43 -80 122 -22 234
8109 234 127 40 124 206 133 -14 113 63 76 -255 -58 36 123 -236 448 -40 -22 296 172 -108 -251 -7 27
8132 27 80 380 -3 -34 114 34 -92 12 -123 -83 -44 -144 75 158 -238 -51 0 49 -122 -207 -109 -211 60 133
8156 133 -68 -8 68 -128 202 125 194 -44 134 9 93 -296 -14 195 -372 -51 -203 163 -136 55 58 -135
8178 -135 -24 102 50 171 270 -144 -189 -134 36 -41 10 -42 271
8191B71
$$ Imaginary data points
##PAGE= N=2
##DATA TABLE= (X++(I..I)), XYDATA
0 0 0 0 0 0 0 0 0 0 0 -1 4 -8 8 -8 16 -16 23 -24 32 -40 48 -55 64 -73 88 -104 120 -137 159 -183 208 -239
32 -239 271 -305 345 -388 436 -490 546 -609 678 -754 836 -926 1022 -1131 1247 -1377 1516
49 1516 -1672 1839 -2027 2236 -2468 2727 -3020 3352 -3734 4181 -4705 5338 -6114 7097 -8384
64 -8384 10148 -12739 16918 -24824 45203 -220649 -414526 -126086 28326 212864 229294
75 229294 180271 109667 95121 78544 119578 91986 11784 -74773 -145963 -203729 -151787 -84520
87 -84520 -43339 4643 42005 36979 66440 82857 64240 51655 26508 -24539 -11896 30738
99 30738 49712 65775 42169 -48569 -113366 -138536 -137191 -75280 -4567 19013 43930 53232 32168
112 32168 59884 115945 125310 119500 86329 -6465 -88841 -137705 -177733 -161786 -108780 -68422
124 -68422 -3611 65256 88104 115359 138316 105501 73372 57823 14533 -19124 -40355 -93291
136 -93291 -129202 -128105 -124949 -76520 13070 70080 106863 122284 75722 25467 11033 -4771
148 -4771 911 26657 13236 -11242 -25397 -64906 -82247 -51730 -34204 -19413 11108 12720 11033
161 11033 34262 39585 41112 57699 45259 27204 29686 8451 -17231 -23191 -60142 -103925 -102800
174 -102800 -87400 -49754 25282 74529 91222 101759 74875 36436 31237 20674 788 -4610
186 -4610 -40861 -91834 -99849 -90210 -66371 -6755 35555 49181 67489 59743 35405 41448 40560
199 40560 19591 13166 -8475 -44621 -46948 -43374 -47736 -30179 -20735 -26202 -5898 14285 22100
212 22100 51066 63089 37997 23980 10387 -10597 -2217 7559 -8438 -17992 -35171 -66429 -62354
225 -62354 -38897 -18977 21825 50855 41191 38693 40166 25925 30241 33519 7010 -11254 -27300
238 -27300 -56658 -57537 -40919 -40155 -24722 -3102 -606 20649 52841 58617 60859 55017 16144 -11231
252 -11231 -20932 -38465 -33807 -17670 -30488 -38347 -30446 -31096 -10048 28444 40448 45459 48905 25238
266 25238 8843 10491 -1913 -6448 -1166 -21242 -36240 -28961 -31770 -25885 -4674 -3239 -142 18410
280 18410 21065 25767 42770 34742 19332 14406 -7530 -23622 -15913 -22316 -32030 -25899 -31662 -31008
294 -31008 -6431 7194 18559 42258 41690 28954 29709 16309 26 2124 -10856 -30463 -29344
307 -29344 -33639 -37452 -18650 -10276 -6865 14725 23118 22799 37815 37471 22022 18780 2508 -20142
321 -20142 -19823 -21429 -29464 -19415 -16484 -21594 -7410 2045 2583 20269 28489 19768 23126 20152 4784
336 4784 6318 2629 -14343 -14444 -16297 -27646 -20117 -13666 -18081 -4973 7435 6020 19394 30540
350 30540 23542 25420 22258 2520 -2658 -6102 -22987 -23935 -21282 -30966 -22566 -7459 -5583 9532
364 9532 25671 20980 23636 27410 14812 11848 10344 -9002 -16759 -16259 -28937 -25937 -12563 -13661
378 -13661 -5185 8825 5661 10545 22753 17633 17103 19505 4152 -3124 22 -11329 -14857 -7636
392 -7636 -16485 -19563 -10945 -13250 -7703 9145 9806 12085 22335 15755 12679 19083 8534 -1809
406 -1809 -874 -14489 -25199 -20190 -22644 -19613 -3467 -736 2336 18469 19833 17865 25559 16563
420 16563 3771 4056 -6294 -17491 -12643 -16139 -20551 -10856 -10669 -10339 5820 10246 9233 19988
434 19988 17560 7900 11714 6849 -3362 83 -4668 -14961 -10372 -12042 -17603 -5986 -2948 -6464
448 -6464 5819 11035 6869 14629 15635 7466 10805 7442 -4368 -2423 -5580 -17109 -13679 -12727 -18978
463 -18978 -8764 773 -2 11116 18680 13887 18202 17209 4895 4375 172 -15238 -15081 -12534 -19600
478 -19600 -13251 -4613 -7085 2377 12473 9656 14883 18183 7599 6818 5600 -7311 -7281 -2163 -10154
493 -10154 -9821 -4714 -11033 -6892 1407 -2425 2074 10424 3976 6141 11840 4725 5788 11383 831
508 831 -4908 -3427 -12644 -14610 -8788 -12931 -8756 2232 -373 3231 14993 12457 11995 17605 7808
523 7808 -454 679 -8418 -13737 -9626 -14675 -14070 -3408 -5081 -2350 11161 11148 9575 15623 9560
538 9560 2608 5864 -902 -7397 -3738 -9843 -14190 -6264 -7264 -7154 5134 5773 1886 8550 6736
553 6736 1793 7243 4638 -86 5596 992 -6653 -2502 -5538 -10973 -3405 -3765 -9122 -1130 1937
568 1937 253 8435 10259 6719 12176 8602 -1522 1222 -1540 -11307 -7927 -7944 -13481 -6671 -1718
583 -1718 -3004 5912 10506 6929 11752 10365 1518 4563 4276 -6726 -6787 -6202 -13472 -8397 -3208 -5406
599 -5406 1698 6493 1249 5150 8880 3618 7999 9256 -2625 -5137 -3278 -9132 -4756 1240 -2802
614 -2802 -257 796 -7687 -4624 4062 1647 6239 9729 668 -1143 3416 -561 1879 5777 -1845
629 -1845 -5596 -5312 -12998 -8672 1987 -1114 -478 5026 1033 3127 12499 10026 7452 7030 -4840
644 -4840 -11396 -8056 -10726 -6223 3397 -1703 -5964 -511 -1436 2311 13241 12359 8423 7587 -4178
659 -4178 -11385 -5699 -6279 -5016 3531 -240 -4448 798 -731 -2201 4896 3814 821 5686 1004
674 1004 -2705 4130 1945 -3568 785 -1406 -4826 2044 740 -4703 -1593 -4283 -7809 -448 2562
689 2562 3566 12786 11245 1856 2484 -1163 -7330 -2287 -1809 -6937 -2378 -3457 -8631 -1775 2571 2266
705 2266 9537 10264 3293 5810 4875 -3586 -3726 -5300 -11315 -6106 -1770 -3107 4720 8080 739 555
721 555 -282 -4464 2747 8999 3562 2216 -909 -10025 -7325 -895 120 7902 10327 -1727 -6209
736 -6209 -6311 -10112 -2519 6412 3894 5552 6950 -325 530 4728 291 531 208 -9387 -10065 -3433
752 -3433 -4375 -307 5440 691 1903 7108 3931 6124 9933 1136 -5261 -6559 -13025 -10306 1395
767 1395 2359 3153 6398 -946 -3170 1672 440 3077 9211 2324 -3782 -2098 -6372 -5660 3098 1666
783 1666 -24 3885 -879 -3634 343 -1741 -2694 2641 -872 -3091 4505 4432 2642 6019 842 -5015
799 -5015 -2115 -4191 -5939 267 -877 -4353 186 -1031 -1873 7203 9036 5020 6883 1834 -5417
814 -5417 -3901 -5433 -7874 -1214 -704 -4304 1089 2410 834 7225 6878 -61 1804 -255 -5101 -1152
830 -1152 -13 -3520 256 315 -4806 305 3447 627 3927 2789 -4866 -3231 -877 -3496 1918 5643
846 5643 1581 3618 3156 -3562 -520 1601 -4481 -3630 -1873 -6252 -1789 3105 292 3888 6827 1734
862 1734 2483 3697 -1474 -220 471 -7474 -7492 -3121 -4749 345 6042 2631 3838 5749 -369 -623
878 -623 2768 -1429 -1429 1173 -4875 -5018 551 -1871 -373 4230 183 113 3143 -1489 -1220 3268 -1523
895 -1523 -2837 1284 -1697 -828 5406 2127 109 2050 -2868 -5416 -947 -2931 -1805 4022 980
910 980 -1660 2955 988 462 5560 2553 -1023 1331 -3640 -7163 -2584 -3084 -3197 3247 2002 -470
926 -470 4848 3519 466 3678 1230 -2744 170 -2315 -5528 -265 -818 -3103 1740 1439 -1539 3513
942 3513 3017 -1136 1971 863 -3036 -86 -825 -3974 1575 2288 -1617 2018 1732 -2730 509 325
958 325 -3476 306 1739 -1988 1511 1842 -1716 2259 3456 -1339 960 1703 -3696 -2292 -1080 -4572
974 -4572 -718 1647 -1975 1224 3864 203 3250 4764 -1219 -102 806 -4771 -3797 -855 -3392 -454
990 -454 2513 -1366 1050 3961 445 1866 4357 -800 -1101 424 -4350 -3576 566 -2000 -357 3143
1006 3143 -155 1100 3927 -1260 -1586 1266 -2604 -2956 1430 -287 521 4110 83 -868 2188 -1047
1022 -1047 -1557 2163 -1716 -2962 466 -2721 -3147 2350 2055 2325 6046 2122 -860 957 -3095 -4737
1038 -4737 -568 -2250 -3093 1820 51 -1305 3192 2127 545 3970 1450 -830 2239 -1205 -4506
1053 -4506 -925 -2522 -4642 1266 1942 638 5151 3770 -1234 516 -1467 -3765 885 584 -1952
1068 -1952 2001 857 -3116 762 1718 -389 3028 2249 -2457 -489 -1619 -4625 -591 1004 -872
1083 -872 3428 4539 357 2658 2195 -2852 -2225 -2509 -4916 -401 1570 -1479 1782 2316 -1927 1115
1099 1115 3326 432 3018 3188 -3245 -3522 -3286 -5624 -1243 2643 519 3508 4669 -703 22 1629
1115 1629 -2412 -816 751 -2395 -1623 771 -1990 -400 2772 -764 889 3779 -300 -296 1758 -2986
1131 -2986 -3730 -1116 -2711 -386 4627 2197 2449 3863 -1447 -2516 -228 -2774 -2267 1972 -862 -2149
1147 -2149 1277 -978 -12 3988 1351 1072 3734 -336 -3067 -722 -3590 -4511 124 -620 -94 4497
1163 4497 2626 704 2439 -953 -2719 1265 -927 -2172 1678 -52 -2761 93 -481 -1065 3788
1178 3788 2438 -285 1424 -1630 -4655 -526 -771 -1658 3121 2446 -687 2216 747 -1738 1148 -230
1194 -230 -3099 2 -267 -2714 1386 1412 -1001 1752 1875 -1359 1783 2005 -904 503 -633 -3969
1210 -3969 -1244 -218 -2294 1480 3182 156 1565 1457 -2406 28 1297 -1276 564 1329 -2421
1225 -2421 -781 42 -2757 496 2885 -442 944 1781 -1843 -434 1081 -1761 409 2259 -1282
1240 -1282 -111 1501 -1634 -337 1587 -1946 -1019 1604 -1244 -408 1278 -1643 -193 2235 -728
1255 -728 -115 2713 -268 -269 1566 -2319 -2220 380 -1766 -1070 2033 77 168 2313 -575 -452 2574 -13
1273 -13 -846 927 -1202 -2206 342 -1811 -1470 2199 717 276 2806 -442 -1425 1353 -593 -1542 1282
1290 1282 147 -1081 1259 -895 -1991 1328 -273 -995 2069 637 -1209 1202 -656 -2270 781
1305 781 697 -301 1941 522 -1714 853 -843 -2647 1505 1134 -1097 1281 46 -2221 670 513
1321 513 -1148 1915 1620 -589 1236 -67 -3119 -435 66 -2284 676 1651 -398 1489 1149 -1566
1337 -1566 542 1020 -861 1162 1545 -1430 -194 -397 -3529 -627 1526 -153 1791 2153 -692 173
1353 173 2 -3262 -755 1608 -481 1185 1986 -1554 -842 266 -2065 -184 2010 101 644 954
1369 954 -2318 -898 836 -1220 438 3092 682 650 1277 -2451 -2273 -227 -2016 -569 2384 521
1385 521 712 2172 -1134 -1565 1108 -201 396 2311 -597 -1170 -170 -2590 -2555 1311 1014 1619 3535
1402 3535 105 -1500 227 -2191 -2279 1303 375 528 2271 -535 -1682 393 -788 -1472 1796 786
1418 786 -251 1570 -688 -2329 48 -785 -892 2068 1588 702 2219 -407 -3323 -1084 -1090 -1869 1619
1435 1619 1293 -335 1682 262 -1784 588 433 -264 2108 944 -2037 -181 -1185 -2980 -192 1187
1451 1187 446 3142 2158 -626 448 -532 -3041 -567 229 -894 1952 1471 -1199 85 471 -1441
1467 -1441 754 1377 -435 948 530 -2791 -1104 383 -845 1138 2482 230 1305 996 -2118 -1528
1483 -1528 -637 -2015 112 1394 -563 1005 1817 -436 -143 1053 -671 411 1113 -1667 -1139 344
1499 344 -2370 -1180 1016 -289 1445 3285 695 49 600 -2172 -1960 -377 -1261 223 2402 43
1515 43 -488 1320 -1009 -578 1146 -528 -735 1388 -1068 -1537 261 -780 -458 2274 26 -230 1410
1532 1410 -358 -1458 281 -1036 -1442 878 0 -339 2079 519 -437 1441 -416 -813 1266 -94
1548 -94 -1436 503 -194 -1683 187 -535 -774 2152 1703 -40 1617 -70 -1846 183 -932 -1970
1564 -1970 798 731 -794 959 283 -620 1389 723 -1314 992 310 -1705 -60 -522 -1477 861 1082
1581 1082 -220 1275 1195 -567 366 -520 -2237 14 640 -1343 441 1264 -450 976 1069 -920 431
1598 431 998 -1213 -101 168 -1792 -24 489 -1387 173 1938 216 955 1285 -684 -69 177 -1803
1615 -1803 -850 392 -1157 166 1493 -487 452 1293 -569 -260 856 -899 -528 406 -1288 -383 1222
1632 1222 -488 -177 1568 -371 -227 1152 -968 -803 428 -958 -525 1146 -349 -41 1647 -460
1648 -460 -444 975 -470 -939 769 -974 -921 979 -813 -867 1013 -312 2 1927 213 -478 1055
1665 1055 -47 -1495 246 -640 -1101 577 -253 -718 1403 397 -292 1183 56 -995 921 7
1681 7 -1259 286 -302 -1063 548 -62 -825 1334 655 -881 779 368 -1173 43 -294 -1129 620 656
1699 656 -877 904 426 -772 517 53 -1446 475 685 -952 85 308 -773 597 1063 -630
1715 -630 751 912 -1019 -51 3 -1444 -181 654 -1307 252 1006 -732 757 814 -889 453 939
1732 939 -957 -242 336 -1041 -573 97 -970 95 1472 232 692 1363 -504 -264 522 -1337 -562
1749 -562 545 -791 -223 621 -539 -170 1221 -519 13 1159 -440 -274 465 -1373 -818 739 -837
1766 -837 -32 1660 270 -63 771 -895 -926 504 -1155 -725 877 -138 -99 1235 -367 -523 1315
1783 1315 -117 -565 907 -728 -957 182 -1231 -817 1479 742 60 1385 283 -654 515 -288 -912
1800 -912 932 -329 -1039 122 -478 -774 1495 865 -352 1279 262 -997 497 -246 -1151 542 -495
1817 -495 -1147 600 427 -661 1476 448 -1073 183 138 -1151 617 382 -946 68 73 -1121 1097
1834 1097 1363 -152 881 149 -1486 -261 -445 -1177 542 509 -811 739 746 -464 1039 1020 -1011 -103
1852 -103 136 -1496 -339 187 -1017 202 1208 -290 690 1144 -626 211 344 -1671 -549 553 -750
1869 -750 -30 659 -746 344 1051 -278 426 993 -1032 -658 72 -977 -563 1071 -371 -378 1074 -383
1887 -383 152 1173 -640 -491 467 -938 -720 1065 -182 -186 727 -754 -205 1264 242 39 811 -1060
1905 -1060 -916 160 -1019 -667 1432 548 -183 745 -488 -539 855 -312 -566 469 -708 -1060 655
1922 655 -315 -321 1332 396 -432 1050 -1 -661 144 -575 -1207 610 142 -142 1144 369 -719 635
1940 635 103 -686 882 78 -1166 119 -532 -911 898 572 -421 1128 372 -837 -71 46 -751 495
1958 495 -42 -1174 655 344 -297 688 615 -700 110 347 -785 123 552 -1012 -290 -74 -794 866
1976 866 1313 -28 519 159 -1549 -158 229 -416 455 688 -1000 35 407 -718 668 1313 -656
1993 -656 -112 482 -1044 -172 630 -689 167 916 -505 -61 896 -279 12 194 -1334 -394 1080 -227
2011 -227 252 896 -499 -262 617 -552 174 1225 -520 -628 450 -1154 -433 771 -258 -175 1134
2028 1134 -22 -321 533 -300 -684 75 -559 -596 782 -120 -308 756 -645 -594 1010 441 -108 1129
2046 1129 -245 -1195 -146 -647 -702 1624 748 -277 853 -195 -565 431 -94 -664 533 -409 -624 453
2064 453 128 -597 894 114 -762 739 360 -286 279 -315 -1415 41 122 -117 1212 671 -470 376
2082 376 22 -1094 368 521 -359 134 29 -758 603 462 -738 435 417 -430 286 740 -701 -117
2100 -117 -218 -1580 -261 732 403 1101 863 -1100 -468 -144 -941 456 1070 -439 -18 -239 -1484 64
2118 64 1010 -397 450 520 -909 -212 592 -613 203 462 -711 -578 708 -82 906 1019 -570 -726 117
2137 117 -780 79 1049 -328 -360 239 -1211 -677 997 679 510 1039 -567 -736 255 -719 -136 601 -276
2156 -276 -683 1134 -190 -6 1175 -179 -460 339 -554 -211 1152 -197 -945 56 -276 -604 1194
2173 1194 568 446 737 -687 -1400 -132 -103 -218 900 -110 -717 616 211 -406 1036 318 -454 90
2191 90 -392 -732 674 41 -711 423 -300 -441 1242 865 -272 570 -388 -1449 -98 153 -316 1088
2209 1088 457 -747 -15 298 -651 523 663 -396 29 131 -888 -110 203 -700 16 441 -353 880
2227 880 771 -358 -108 146 -917 -100 379 -384 445 441 -787 -58 509 -425 498 1014 -768 -322 290
2246 290 -803 -281 206 -516 152 656 -100 411 879 -555 -297 -90 -947 -606 771 -198 -174 522 -741
2265 -741 -81 418 -86 266 1024 -455 -756 12 -655 -194 786 -492 -255 827 -135 48 970 -312 -489
2284 -489 104 -828 -610 987 242 -4 321 -443 -463 615 179 -179 805 -193 -1242 -79 -389 -113 929
2303 929 431 -721 255 -67 -560 917 -26 -459 858 -567 -616 336 240 -198 378 -266 -1205 649 412
2322 412 11 687 -193 -949 191 -62 -517 796 368 -424 106 -29 -470 618 273 -381 -31 68 -781
2341 -781 404 158 -581 523 95 -720 297 641 -159 427 368 -828 23 455 -516 510 628 -849
2359 -849 -185 146 -463 231 745 -409 -48 136 -780 -41 655 -173 -38 407 -810 66 553 -248 185
2378 185 380 -833 -201 222 -265 236 682 -576 -425 573 -443 306 636 -265 -140 184 -783 -205 623
2397 623 -127 -32 422 -484 -322 839 -105 -143 83 -523 -548 342 -188 -12 1183 -284 -553 209 -85 -337
2417 -337 827 -60 -282 303 -331 -496 747 257 -327 587 -440 -519 487 387 -178 666 -153 -648 391
2436 391 108 -59 670 160 -949 24 -523 -398 793 127 -618 -70 -375 -748 243 138 8 435 -52
2455 -52 -567 169 246 -200 141 7 -708 276 428 -223 495 66 -747 -108 179 -726 530 489 -212 38 185
2476 185 -776 513 434 -185 295 181 -420 256 112 -789 249 326 -448 190 498 -280 186 243 -403 -84
2496 -84 344 -302 413 521 -872 -64 306 -537 52 860 -370 -242 168 -853 -147 315 -436 20 514
2515 514 -57 -1 335 -307 -64 160 -587 -166 467 -117 13 649 -451 -376 520 -19 -45 394 -350 -473 125
2536 125 -464 -191 566 230 -128 372 -206 -317 436 -450 -309 544 87 -345 530 171 -225 572 -264 -252
2556 -252 338 -362 -480 392 19 -487 97 -170 -513 547 517 10 400 -30 -720 326 132 -541 205 -199
2576 -199 -740 274 400 -21 745 223 -473 246 13 -809 361 -121 -782 200 -115 -224 599 423 -85
2595 -85 274 170 -816 -94 131 -440 259 -5 -393 -2 437 -91 416 464 -195 273 -167 -888 -101 322 -665
2616 -665 107 590 -222 396 690 -106 240 75 -545 -212 74 -265 110 489 -395 106 389 121 215 556
2636 556 -371 -359 -198 -394 -216 325 106 136 404 -368 258 799 -261 -262 343 -258 -183 -45 -490 22 395
2657 395 -311 -240 531 183 -20 296 -418 -210 -56 -247 -365 361 -183 2 582 -350 -117 557 112 -252
2677 -252 86 -212 -210 308 -47 -421 609 287 -101 717 -38 -371 138 -216 -807 5 -115 -325 596 102
2697 102 -289 184 37 -47 519 293 -782 -78 -405 -823 200 297 -115 481 312 -338 414 -61 -269 6
2717 6 -56 -696 72 -21 -560 429 86 -402 218 149 -214 91 -41 -488 -102 -283 -452 101 440 -71 575 256
2739 256 -682 106 42 -668 328 132 -411 77 196 -252 151 386 -368 73 661 -338 30 291 -330 -197
2759 -197 193 -335 169 405 -133 133 211 -631 -129 30 -245 -86 648 -463 -92 169 -300 -123 385 -7
2779 -7 22 440 -580 -270 460 -378 -267 361 -239 109 464 4 -341 528 -262 -174 357 -116 -170 513 -226
2800 -226 -49 419 -208 -3 662 48 -201 361 -132 -658 -18 -228 -181 688 -98 98 350 -90 -428 16
2820 16 -188 -370 712 14 -480 69 39 -198 104 -97 -194 431 -265 -232 -37 107 -188 370 85 -123 314
2841 314 322 -25 371 -105 -272 178 88 -238 284 453 -352 4 54 -248 500 589 -46 21 66 -434 157 -85
2863 -85 -458 178 155 -633 -112 255 -426 229 -26 -392 92 316 -97 64 118 -528 80 85 -336 140 443 -101
2885 -101 -188 151 -504 -113 247 -270 312 381 -78 138 90 -155 -93 371 -156 -282 323 -279 -108 437 -433
2906 -433 -133 214 -109 -22 603 90 -246 261 -554 -408 350 174 45 249 -147 -301 91 -186 -309 109
2926 109 -392 -90 406 -476 -54 408 26 -46 287 17 -364 443 -87 -580 449 89 -554 -133 -37 -98 516
2947 516 -99 -213 188 -18 -88 105 -32 -272 533 -80 -420 211 110 -66 511 111 -256 339 -183 -514
2967 -514 -75 -72 -113 248 151 -468 281 222 -437 272 158 -346 203 293 -366 -164 229 -222 235 211 -167 320
2989 320 0 -395 95 91 -276 41 236 -337 42 70 -228 -40 -22 -403 -60 40 -208 38 77 -370 75 359
3011 359 -44 -3 398 -335 -21 197 -378 -16 350 -250 -128 554 -176 130 656 -163 -9 230 -388 4
3031 4 347 -613 -196 271 -175 87 273 -215 -239 457 -125 -331 295 -195 -182 142 -94 -135 356 -226 -6 669
3053 669 -160 -142 256 -317 -296 377 23 -327 311 -39 53 493 77 -254 340 -160 -361 118 -247 -352 199
3074 199 -19 -184 252 71 -64 203 -298 -208 217 -73 -281 215 95 -79 404 219 -98 415 105 -246
3094 -246 -68 -74 -334 416 -71 -344 162 228 -131 -42 100 -297 327 5 -571 -29 251 -274 283 331 -257 68
3116 68 -202 -502 305 -39 -495 275 283 -460 205 156 -410 -44 151 -309 91 439 -618 11 70 -285 14
3137 14 331 -349 47 365 -100 46 621 -345 62 437 -207 167 297 -278 -318 303 -84 150 124 -65 20
3158 20 202 -276 -212 182 -264 -53 597 -364 54 383 -31 -175 96 0 -147 282 -116 -233 286 -193 -255
3179 -255 449 -92 -139 222 -230 -330 339 35 -174 157 4 -262 447 -17 -130 186 -113 -196 530 -85 -561
3200 -561 169 73 -172 317 -195 -186 398 -102 -257 237 70 -267 548 -215 -303 331 115 -190 114 370 -335
3221 -335 201 83 -384 377 -99 -595 203 -19 -231 245 -25 -398 180 45 -441 85 283 -268 7 -6
3241 -6 -144 105 211 -159 194 112 -231 35 138 -92 262 311 -418 -83 94 -230 148 54 4 37 446 -279
3263 -279 182 311 -336 266 199 -261 -96 598 -401 -101 228 -442 388 655 -219 -130 172 -269 46 236 -420
3284 -420 -254 463 -399 -194 320 -156 53 129 -417 -396 293 -281 -295 100 -164 98 214 -71 77 462 -127
3305 -127 -93 53 -280 -299 240 -197 -298 427 -121 -39 41 34 -126 181 -6 -27 -75 -118 -401 389 -90 129 436
3328 436 -115 -206 83 17 77 327 -258 -100 330 71 -276 301 11 -4 287 72 -519 230 290 -371 -70 -210
3350 -210 -205 267 155 -245 353 268 -96 -1 -63 -600 246 -39 -172 261 16 -192 236 224 -314 252 -161 -594
3372 -594 -88 202 -741 -4 423 -173 149 435 -202 209 300 -463 17 -49 -279 -81 283 -154 156 165 -130
3393 -130 233 442 -251 39 296 -219 -169 50 -573 -75 501 30 350 500 -151 14 287 -558 -11 472
3413 472 -455 86 200 -279 -40 693 -114 -300 306 -354 -204 335 -305 -132 36 -142 -185 445 236 112
3433 112 305 -187 -356 220 -336 -108 334 2 -121 132 -430 -209 318 -75 -63 232 -150 -242 173 -191 -302
3454 -302 641 -108 -397 393 258 -114 120 240 -60 265 99 -97 315 -53 -131 200 27 -331 303 -39
3474 -39 -56 261 -50 -477 126 105 33 104 13 -374 279 9 -526 297 61 -467 147 75 -53 331 149 -258
3496 -258 89 65 -281 281 350 -122 -74 225 -634 -173 192 53 278 67 -337 55 -347 -221 45 175 23
3517 23 237 523 -385 -280 292 -482 14 320 -389 34 297 -95 44 318 -72 52 260 -132 164 205 -456
3538 -456 -101 -69 -94 0 189 64 111 301 -173 -116 252 -181 115 296 -94 -131 362 -379 -8 184 -376 -40
3560 -40 504 -143 -135 -24 -60 -208 66 -23 41 170 -72 -122 -277 -322 -321 113 -144 -87 454 44 -316 113 -222 -184
3584 -184 602 -54 44 409 -108 -100 -80 -259 -239 331 -4 -300 225 -151 -335 -33 74 -297 41 168 165 35
3606 35 -44 -404 259 77 64 184 214 163 60 71 -64 -75 89 -157 420 372 -218 203 70 -88 320 78 -146
3629 -146 43 -73 -197 -22 -150 -302 -98 -10 -162 241 33 -250 -153 -188 -234 28 371 -190 -57 155 -230
3650 -230 132 205 -258 50 85 101 -117 301 33 -174 402 -223 18 484 -28 -75 113 -278 -102 -23 -31 75
3672 75 306 -197 -424 475 -198 -67 465 -110 -113 318 -50 12 225 -152 -181 259 103 -199 187 -18 -11 400
3694 400 159 -382 380 216 -43 -22 -251 -220 231 -149 82 382 65 -29 311 77 -98 311 179 -247 407
3715 407 154 21 110 -166 -216 148 32 6 227 -165 -61 293 221 -197 233 118 -139 543 47 -560 38
3736 38 -208 -146 164 129 -275 -159 -17 -438 10 174 -378 29 221 -156 85 -57 -259 237 163 -206 254
3757 254 119 -229 -79 -102 -275 149 -122 15 172 442 -8 46 291 -48 81 -9 -165 -37 73 9 -332
3778 -332 52 -126 186 87 3 48 18 -205 -100 139 -165 82 22 -282 -29 47 29 17 26 -61 35 221 -224 -332
3802 -332 -137 -404 -70 292 -162 -193 -115 -179 -21 419 -269 -17 188 -160 -150 229 73 11 123 -104 -187 172
3824 172 -25 -233 158 -33 -326 -13 -79 -65 144 191 -186 65 -24 -25 172 -168 60 74 93 -389 32 54 -189
3847 -189 75 149 -140 185 -85 0 201 -40 -286 177 174 -173 86 -98 -126 132 -120 -44 -152 213 -209 134
3869 134 -32 86 -10 14 -323 -386 -175 -239 -12 260 35 218 262 21 19 -52 -168 89 132 -94 116 -75 -220
3892 -220 89 77 13 -93 218 -310 -229 301 -69 54 67 -204 142 -13 -294 103 123 -285 -91 -149 -282 -141
3914 -141 302 -146 -57 -55 -404 75 281 -11 4 132 -322 -433 -21 -64 -31 379 30 -24 201 86 -144 196
3936 196 45 -8 216 -153 60 85 -5 -12 47 -82 -20 80 -138 -225 261 137 -130 208 -87 -44 206 32 -105
3959 -105 55 77 -180 44 -60 -463 314 -258 -37 568 -41 -10 91 -224 -177 78 158 -110 141 49 -262 36
3981 36 208 -230 -13 -42 46 337 102 -89 376 11 -119 116 42 -145 134 40 -59 101 317 -67 154 442
4003 442 -354 438 92 -129 -55 167 -222 -94 90 -373 87 216 -439 -235 233 -329 -50 184 -361 -134
4023 -134 263 -129 -63 19 -18 -37 51 -285 320 -6 -322 263 434 -132 -49 34 -154 45 108 -3 3 153 -40
4046 -40 -130 -29 -44 368 323 -193 -58 309 -237 125 72 -29 46 181 -249 68 181 -94 61 41 -79 -264
4068 -264 236 83 -228 291 -120 -3 209 233 -5 54 -17 -167 64 265 -46 95 49 4 23 53 -114 102
4090 102 -139 28 277 103 -433 12 61 0 440 35 -236 6 -139 -155 -41 50 -393 330 167 -40 261
4111 261 3 -61 20 -10 -41 31 100 -327 126 -79 -18 86 57 -37 216 283 -387 83 -10 -221 33 45 -7 -18 257
4136 257 -132 80 -136 -262 153 121 -342 63 163 -20 248 -109 -122 142 114 -39 305 84 -82 -99 -100 45
4158 45 113 231 -171 175 157 110 -129 148 -163 -114 -33 -180 -50 175 55 0 176 -131 135 299 -177 230
4180 230 325 -224 -184 -38 -362 167 104 87 -13 -148 38 303 435 -88 37 -23 -148 -84 33 162 -146 318
4202 318 6 -169 -118 -65 -128 73 -293 56 46 -157 -160 250 -87 -36 135 -231 -147 -80 68 -297 102 -232 -162
4225 -162 137 209 -234 41 1 -260 -167 8 -99 122 -32 -289 44 -63 60 88 -218 -92 332 -66 -184
4246 -184 177 122 -146 -201 -6 -225 -102 -38 2 31 325 -143 -152 124 58 67 19 -42 173 270 -22 127 22 -204
4270 -204 -53 100 -250 39 162 -14 250 183 -390 37 300 168 240 170 -153 -79 -5 -174 -227 239 -240 -150
4292 -150 368 -79 48 274 -56 -171 142 -205 232 185 -166 -149 -10 -196 140 156 -186 -256 135 -37 -50 85
4314 85 -132 -43 52 -109 -49 186 -54 -210 268 -65 3 20 -30 -249 125 128 -48 215 -140 -111 -112 -250 -204 45
4338 45 -216 -223 76 -7 97 -161 -124 38 121 45 -170 208 10 -224 232 67 123 227 -199 -92 -78 -96 -278
4361 -278 277 96 -66 183 -186 -71 61 1 -286 62 -20 -115 254 19 -207 -186 -265 -379 30 155 -324 -53
4383 -53 161 -89 -190 90 -123 181 190 -44 -20 354 -196 30 137 -85 -168 32 -73 -66 167 141 308 99 -254
4406 -254 29 73 -19 130 31 -323 -141 -198 -121 379 -17 -18 97 -173 -278 132 289 126 -73 182 -436 -85
4428 -85 347 193 191 -81 -340 -47 62 -114 79 217 -180 -131 91 -6 222 96 -148 -271 -12 -232 -42 -159
4450 -159 120 -84 339 -253 -178 -7 160 -3 164 -162 -81 90 205 -155 180 92 -54 132 -16 -220 162
4471 162 46 -354 65 -259 -63 420 -42 -450 282 -83 -79 198 181 -84 36 276 -266 -43 52 9 74 56
4493 56 -283 176 4 -4 404 102 -66 141 21 -180 190 69 -119 204 225 -10 254 43 -190 63 128 -82
4515 -82 48 213 -295 -25 -17 -140 13 126 -228 154 316 -360 114 217 -196 -74 0 -223 -23 11 -81 330
4537 330 169 150 189 -29 4 -126 166 -92 263 206 -109 -2 107 -14 154 59 -163 107 -48 -311 99 72
4559 72 4 241 -68 -147 -179 346 -151 -184 303 32 -74 78 -4 -76 -122 -201 -6 275 -157 119 140 85 -271 66
4583 66 -91 171 159 83 66 83 -184 -71 264 37 -272 114 65 -191 -51 182 -120 -185 209 -474 203 -82
4605 -82 10 -60 -39 -177 108 -61 274 139 -252 63 168 -164 -342 147 190 -290 172 75 -131 26 195 -43
4627 -43 267 45 -59 143 62 -2 282 37 -66 -47 22 1 -10 -46 -224 227 119 -252 -128 111 -289 -93 -13
4650 -13 -336 283 120 122 95 252 0 -9 94 -137 -154 68 -193 318 49 -61 56 -55 -234 100 187 -77 -67
4673 -67 321 84 -266 293 -79 -132 -75 -139 -162 70 4 -89 46 -140 -124 -35 -94 277 -99 -198 43 146 93 -224
4697 -224 197 27 -120 85 42 -44 65 -37 -43 181 13 47 157 -21 -45 215 111 -218 77 227 25 190
4719 190 -157 -234 170 68 -141 40 -30 3 344 -141 -242 91 -91 -183 178 85 -272 -14 128 -230 -50 217
4741 217 49 91 -32 -232 180 93 -370 125 190 -6 109 29 143 137 201 -9 97 -92 73 138 60 26 -6 290
4765 290 -190 54 -100 227 264 -11 -74 -192 158 -199 267 150 7 -24 148 -214 222 160 -313 -189 -90 -46
4787 -46 84 -56 -210 128 4 -237 52 186 -303 -21 54 -390 -8 94 -160 102 168 88 82 33 -249 35
4809 35 231 -214 -133 157 8 23 69 -17 64 221 117 -182 50 -167 53 70 -203 -96 94 -264 -41 134
4831 134 -459 -58 107 -288 -83 -9 -52 219 138 -278 -57 103 -15 30 242 -202 -166 -109 87 112 112 -322 -34
4854 -34 133 -174 -84 287 9 -63 7 -57 -177 288 123 -249 -39 -48 11 171 155 -397 380 166 -176 -53 -237
4877 -237 -133 -100 8 -217 94 88 100 438 12 8 140 -216 -57 134 -7 -233 366 9 18 76 97 -183 129
4900 129 -256 -331 -148 -24 96 -17 -13 -265 182 151 -256 57 -34 -326 82 3 76 170 69 -111 -41 137 215
4923 215 -139 176 133 -136 -90 -310 150 168 103 -12 3 -17 -27 69 22 24 26 -97 -216 191 -57 18 267 -195 -24
4948 -24 95 82 -222 380 -128 13 117 -170 -24 266 -68 173 183 -40 19 -42 159 69 174 69 -133 75
4970 75 -68 -87 124 -274 -29 -61 266 -76 352 -94 -279 60 75 34 -100 -7 -276 126 -6 -76 50 -21 -238
4993 -238 6 -222 -2 410 43 -74 -69 -173 126 -11 -143 -94 197 241 -84 -255 -77 -79 138 114 -189 92
5015 92 -231 240 67 4 -223 -17 18 -74 -29 179 -340 145 20 134 342 204 24 146 -90 -97 65 -126
5037 -126 -80 266 270 -466 -11 49 15 -102 -45 -97 -118 126 -165 48 185 -133 150 163 157 309 84 -230 5 23
5061 23 -179 -65 94 -201 -40 257 -211 -125 176 -28 329 46 -335 214 74 120 -63 334 -5 -150 13
5082 13 50 171 93 -120 -352 -213 -239 45 38 5 20 101 31 118 116 -115 64 -137 19 -4 -79 -7 -36 166 4 -21
5108 -21 -127 0 -182 313 -33 -393 213 -187 -51 348 164 -33 148 -91 -51 47 -172 -201 -51 -49 -175 289
5130 289 312 113 -3 -39 188 182 17 -71 152 143 -289 20 221 -32 -86 -103 -243 234 -229 -143 23 11 196 -26
5154 -26 -166 107 -42 -106 -184 88 38 -116 -57 -138 -38 222 -75 57 23 216 2 -67 140 -299 -216 -191 -277 -24
5178 -24 217 188 45 68 -293 -82 -142 -43 -4 66 8 10 276 -134 -55 45 4 -46 350 -94 -101 9 105 152 -192 -111
5204 -111 -80 -58 -266 -30 128 48 -154 67 53 103 178 -225 -127 92 0 -154 70 -34 115 -91 -70 -164 -149 -23
5228 -23 -161 266 -151 -120 -169 -153 -1 37 -320 -140 -197 -135 -332 71 15 -530 76 121 79 318 84 -260 215
5251 215 101 -32 -3 -65 -24 -20 129 -261 -18 -35 -88 8 -204 46 9 -70 -147 67 -212 -174 8 -135 -192 125
5275 125 91 -180 -32 -184 -56 -53 -1 80 -6 -79 -183 -138 -56 -165 -88 112 -214 123 61 -68 256 42 27 106
5299 106 114 -107 -283 -119 -101 -134 -32 -60 9 7 32 -35 173 -89 41 178 -5 -93 34 -54 174 50 -88 -208
5323 -208 67 -169 -18 230 81 -77 -76 39 -112 36 -88 54 72 97 -19 289 83 -154 428 -82 -156 245
5345 245 -51 54 378 31 6 180 9 -50 -197 -111 -149 -168 -197 -210 13 153 37 92 79 148 96 222 -66 98
5369 98 -164 32 92 -237 108 110 -75 -162 124 -31 18 204 -260 -63 166 32 229 46 132 -40 203 75
5391 75 -98 -126 40 -169 128 104 -129 -188 -5 -377 -235 197 -35 -41 251 29 240 158 45 186 119 7 140
5414 140 408 -308 49 193 14 -49 217 69 262 -128 -207 -149 88 -398 -169 206 -159 77 193 -104 6
5435 6 277 -43 240 175 -66 363 -12 34 104 122 -223 -123 -86 -46 -74 -6 141 -66 -35 -202 -32 241 89 -27
5459 -27 16 -145 -211 61 -24 103 82 -130 -88 58 -176 -37 154 98 -55 83 137 80 155 -55 -169 -61 92
5482 92 -133 354 -80 63 -48 5 -103 -44 -28 -71 -81 273 -61 -100 -145 174 -63 169 33 -71 76 21 61
5505 61 -200 91 104 133 -99 -36 102 35 44 14 -211 348 75 -155 10 -218 223 89 145 -11 -209 -3 -366
5528 -366 128 -132 29 -203 -157 -381 -205 -276 -207 28 140 -170 58 115 -269 38 174 36 -33 8 -146 60
5550 60 239 -63 50 189 -182 23 95 95 -298 317 -162 22 92 154 -54 143 -16 14 11 -266 -67 32 293
5573 293 127 -12 12 -202 163 -437 6 -7 -105 -40 154 -183 18 261 -156 -1 25 -43 -69 55 -16 35 275
5596 275 -74 125 121 49 -122 251 2 -140 124 -169 -57 -134 -200 -125 280 -97 -163 113 76 305 -41 127 -288
5619 -288 77 -116 -78 -28 -185 -78 209 -19 -242 48 280 22 71 107 -104 120 53 -78 248 1 90 165
5641 165 -59 96 398 39 4 170 -1 -13 94 64 122 45 226 -73 202 -161 -284 47 192 233 314 24
5663 24 -207 -72 -72 -13 200 119 -23 68 -86 37 179 37 56 -29 205 -107 67 -8 8 74 -157 31 -11 60
5687 60 112 151 -49 -209 -60 156 -76 354 277 -53 180 78 -68 7 78 -193 -226 116 174 150 43 -232 -110
5710 -110 191 196 -204 10 -141 -111 12 -115 -284 142 232 -192 360 -96 103 -98 -222 -230 190 174 24 0 -169
5733 -169 204 85 -164 112 111 71 -38 55 96 -63 503 -99 -48 249 155 183 339 -36 -27 -127 103 0 365
5756 365 161 -225 212 139 -68 -203 92 -201 62 -97 -2 198 85 -175 134 -241 -249 -84 -157 -30 362 -161
5778 -161 -170 155 -79 -104 120 -37 -93 -13 49 -114 -157 35 -77 100 -166 -362 -8 5 -81 71 55 130 89 12
5802 12 -10 57 310 -343 -238 81 -149 65 117 3 -118 441 -155 -224 127 -11 -114 -162 -152 -229 8 -257 -99
5825 -99 89 50 87 22 120 -209 150 -54 196 -81 -58 -89 193 243 -69 344 33 -127 151 -64 -32 281 36
5848 36 -100 208 -151 -93 96 131 -358 -193 63 -25 11 -190 -33 -147 95 -65 90 -156 154 -6 33 32 107
5871 107 -3 13 208 -99 19 -211 -1 -262 -190 -14 -103 12 16 -120 88 82 -240 183 309 -65 17 117 -20
5894 -20 230 -145 -71 42 -179 -77 7 -17 -143 151 34 -189 -4 98 -223 110 -64 -24 303 151 -396 79
5916 79 6 -200 140 83 -94 60 57 -92 -66 -168 -34 -36 252 -297 -126 -34 61 77 178 -7 25 -257 42 -53
5940 -53 54 -116 -65 131 -72 182 95 62 266 252 3 -132 238 -164 18 23 -105 18 178 168 174 32 -12 -81
5964 -81 229 -155 119 -37 -46 14 112 -8 58 176 210 16 66 -86 10 85 189 -117 -28 -112 -81 130 38 10 3 55
5990 55 -165 112 -78 -235 33 65 -76 -20 -183 -230 -44 -8 -30 39 -279 -144 246 314 -35 76 19 -34 132
6013 132 54 -141 84 -14 -213 138 -175 -112 1 -36 -154 89 -110 -265 -141 235 -142 -206 -147 -287 63 104
6035 104 -138 234 -80 -67 174 9 -121 -25 -134 -94 35 171 71 2 237 -106 -1 -173 135 296 -200
6056 -200 45 -1 -97 -182 147 -9 -44 264 -110 42 131 -195 276 -55 117 -104 -5 -10 59 -32 -43 68 51 358
6080 358 -37 236 -102 -33 410 95 -244 -119 318 -129 96 301 37 -141 78 -99 -60 16 -73 -211 69
6101 69 -251 -58 61 -74 -58 30 219 -194 -71 -65 2 157 -291 -156 241 -121 -231 283 22 -177 29 242
6123 242 -94 -60 -199 -116 165 49 62 119 -120 -70 -26 -157 -17 141 22 -263 105 117 -86 -20 289 96 -97
6146 -97 -80 162 47 -24 -138 61 -60 51 -50 -28 -68 -11 -36 -52 186 -192 -83 -46 110 -5 68 3 -224 -36
6170 -36 -102 -17 147 158 -138 110 252 107 82 -156 19 -172 -76 136 35 -127 125 63 -133 -60 -283 -180 -34
6193 -34 23 200 -212 128 104 -30 -25 357 5 -81 -18 25 230 70 42 -116 79 -104 -60 17 -365 169 390 -158
6217 -158 207 60 -216 82 -13 -1 -73 4 37 -216 148 -56 -73 127 -8 -36 -165 -54 -120 32 -49 -186 246
6240 246 22 0 289 -213 -160 56 -66 158 35 43 -135 -234 242 -195 131 15 3 -63 247 -152 1 -31 -170
6263 -170 -57 -6 61 -10 168 -77 46 143 343 291 -228 82 246 27 20 -79 -102 38 164 85 -26 -115 153 -62
6287 -62 -158 -162 -165 172 23 -57 56 62 -40 -145 261 16 79 -155 -305 -37 -220 -81 253 133 -18 208 190 -17
6311 -17 27 332 129 48 43 -140 -82 -8 -203 -20 -16 -94 -95 345 66 159 -72 32 7 -119 -310 -68 346 196 129
6336 129 90 -331 64 355 25 -324 86 -108 -108 360 -9 5 77 -109 -59 242 -229 72 34 -12 95 -279 139
6359 139 -9 53 97 13 123 -89 196 22 161 -74 -54 229 -180 33 -308 -143 -167 -273 -207 224 275 -25
6381 -25 89 43 183 -95 8 -81 65 -100 50 156 -122 135 -105 -313 -154 45 197 -276 48 303 -30
6402 -30 296 -67 44 -78 -87 -324 -129 19 137 -29 -106 -153 -19 141 -36 -54 -313 -58 -72 219 4 -84 -294
6425 -294 -263 -59 -81 -269 -134 64 -152 6 4 -84 -30 37 -60 -41 -73 32 93 146 -212 -1 -15 -14 90 162 90 124
6451 124 50 -224 -123 182 0 157 482 45 -69 -71 21 -306 76 -6 166 122 -120 100 102 -133 -47 78 -241
6474 -241 -54 272 -187 -180 46 -126 -3 225 -338 -37 -45 -90 -186 14 26 -94 239 -42 -77 55 6 -338 321
6497 321 384 24 -216 -286 -73 34 102 -81 115 -77 234 32 192 -423 -257 -66 -143 148 105 -16 -53 -22
6519 -22 -10 167 -8 -172 134 48 -226 98 -86 46 -40 -32 -251 38 37 -236 84 -38 -17 11 59 -33 152 280
6543 280 -289 -345 -46 -13 5 20 -113 133 73 -109 132 32 -338 -102 -28 -99 115 -20 -84 31 -23 33 -113
6566 -113 235 -220 -159 76 19 107 226 -29 -79 37 48 97 -307 185 -54 83 -25 72 258 76 -195 -76
6588 -76 102 229 138 205 7 130 195 -180 301 -178 4 171 -219 -240 -165 119 222 237 114 36 90 -151 -39
6611 -39 256 -104 -108 305 143 83 77 -37 5 206 -122 -353 -118 -45 -21 55 268 274 164 -223 -80 127 18 104
6635 104 -20 -75 -29 214 -202 76 300 55 14 148 -4 -97 -82 -37 -187 52 -299 -234 169 -66 79 189
6657 189 -89 -22 -2 92 -192 -83 149 -136 1 -148 12 399 32 121 13 245 47 163 -297 -403 107
6678 107 11 -267 -20 10 147 -110 -45 -76 135 41 -458 75 -95 -100 113 2 -174 -48 199 39 -142 -14
6700 -14 -177 -103 128 -176 -12 191 -108 -135 16 -26 -54 -2 -249 -85 122 0 69 -17 -72 -34 -206 205 -88
6723 -88 187 -150 12 66 -76 -11 9 -166 -85 38 19 207 57 -283 -330 56 98 312 -47 198 -245 327 363
6746 363 -127 -115 -104 -215 20 119 154 51 30 -33 10 -195 -81 -148 -7 82 209 124 1 -136 145 68 181 266
6770 266 -73 179 -195 -34 -52 -120 -250 75 -140 -77 175 274 99 136 22 -65 -116 166 36 -50 -65 -100 242
6793 242 64 -5 5 -76 -213 73 191 5 21 151 24 70 140 -52 -187 21 198 50 63 -19 -67 49 -255
6816 -255 -31 -136 -31 -150 205 -41 -265 -112 102 91 -186 -15 307 87 36 -83 176 -267 -54 25 114
6837 114 -51 115 -109 33 126 198 -30 117 52 -18 137 -198 149 34 -165 -43 391 123 -99 188 107 -72
6859 -72 -73 69 -108 94 -124 -164 161 -13 -113 -25 -34 -4 181 -150 218 28 -111 -92 214 -7 -423 13 -20
6882 -20 1 55 -11 -172 -138 155 -141 206 186 -78 19 -269 -113 -21 149 -100 -59 312 146 221 83 -82 39
6905 39 -168 -170 80 -24 10 34 -133 -150 -46 112 251 113 55 192 -84 247 158 94 -154 -215 -11 53 -355 14
6929 14 -115 -172 219 -92 -110 -56 71 -273 43 -177 103 76 97 -127 79 -37 196 21 13 -85 181 277 -64
6952 -64 151 -130 -98 -119 183 -156 -70 -91 -114 -145 133 -9 -75 62 452 -76 66 50 -415 299 66 -99 54
6975 54 12 -112 133 -146 -94 -188 226 13 -20 -140 -139 13 -184 -27 36 -220 -247 -8 162 -190 -169 172 -61
6998 -61 7 7 -157 -52 194 -18 -56 -61 79 -112 308 -47 -122 152 -79 -35 43 -64 28 -165 220 -145 86 -231
7022 -231 -22 -252 -102 295 365 211 441 73 -52 174 -244 -285 11 -11 -114 -40 77 -8 173 -145 173 315
7044 315 -16 -175 -35 -59 -5 169 -128 -137 -20 -161 -75 12 109 20 -238 256 -109 -173 50 41 133 -129 17 41
7068 41 168 -319 232 119 -24 82 202 110 -193 91 -79 -6 202 -69 -175 196 -326 84 27 147 -174
7089 -174 -74 -300 34 -155 -51 -109 -78 -156 49 -4 90 -7 123 102 16 156 18 -219 4 -66 66 -28 -40 47
7113 47 -122 -79 -187 -106 222 -30 -7 214 2 188 -43 -16 179 -54 -78 6 20 52 -37 -187 -93 5 -87 31
7137 31 315 56 -227 141 74 106 474 -128 -78 124 -246 53 292 77 141 -100 -148 -81 -109 122 -145 -157 16
7160 16 -44 -143 115 -337 122 144 -301 -198 -95 -49 21 6 -54 12 -184 -112 27 -45 9 142 64 -58 147 -242
7184 -242 -19 296 -31 -111 -264 -116 -88 50 -38 -102 108 197 -236 -14 149 149 -97 -55 19 -4 69 -138 -53 15
7208 15 241 140 33 17 -30 116 104 -147 196 -190 -214 -254 -359 -126 13 -23 -30 -64 106 -183 37 -161 -146 246
7232 246 133 -251 -108 -170 204 201 -226 -43 154 -61 -180 71 194 200 26 -122 282 201 30 117 20 93 235
7255 235 290 -102 -77 -201 -11 142 357 -13 -217 12 165 -190 302 -135 37 253 -119 -132 23 154 -69
7276 -69 89 40 -91 -154 56 -226 -93 135 139 -182 -121 16 371 64 70 28 -68 -9 -80 -8 -25 163 61 91 208
7301 208 307 -61 -104 333 -245 248 -241 -21 -11 55 -16 -92 159 250 110 61 26 58 1 -123 -46 -37 35 181 210
7326 210 -114 -225 19 63 -69 71 155 118 150 238 -46 -29 -58 -137 26 105 -211 147 -230 168 128 -72 55
7349 55 77 60 -128 -157 143 -18 176 -236 -95 61 26 310 69 -79 -100 124 80 -57 19 -60 87 -112 52
7372 52 34 -82 -46 14 -41 -66 -22 218 -46 -110 72 56 23 92 -133 166 97 7 -93 226 -88 89 99 357 -39
7397 -39 95 110 33 20 237 221 139 49 -83 90 141 -139 -2 89 77 -30 159 -209 -84 43 9 151 176 -14
7421 -14 162 19 83 93 260 48 -24 149 -214 -4 131 -138 74 -102 19 -41 283 138 1 -91 -194 -85
7443 -85 64 50 88 49 -2 307 -9 -236 -69 36 -127 -145 -120 15 13 58 -30 -260 219 -209 -71 36 29 41 196
7468 196 148 164 15 -176 -57 41 -81 -294 -55 295 140 274 -217 -152 -21 119 142 -45 153 -6 188 -113
7490 -113 170 38 120 -76 100 130 124 107 33 54 -168 -161 100 83 -107 -75 -139 -87 75 -75 -197 -98 12 48 -114
7515 -114 236 59 -162 108 7 -52 112 110 -261 -56 -232 121 -114 259 114 150 78 0 132 -78 -43 342
7537 342 243 -401 286 202 5 -76 51 -37 115 -14 129 352 372 -8 -172 -44 -79 279 -62 6 10 376 -139
7560 -139 -71 301 -79 63 137 36 -12 -82 193 -89 -177 -152 174 -19 8 148 16 73 47 46 -174 -181 130 14
7584 14 55 -97 -93 116 -69 -75 -40 -31 -252 -46 405 -146 217 44 -273 154 12 43 33 330 55 52 -4 -84 188
7609 188 137 -57 -89 97 -325 -159 199 241 -143 151 -22 148 324 -79 46 187 112 -128 81 -24 36 -47
7631 -47 4 -113 28 34 -257 -139 -98 160 40 119 189 145 83 -264 53 -41 -120 0 291 -226 12 6 116 23 -21
7656 -21 7 -59 229 -35 -30 -5 -81 104 -19 201 112 -34 -186 3 105 210 189 -182 -213 482 -134 40 33 90
7680 90 -36 -42 57 -228 54 53 -393 36 -25 -175 -240 47 88 74 212 -73 198 92 -185 268 53 -108 -26 190
7704 190 2 10 -45 59 75 163 -522 49 -2 95 111 276 -125 -14 117 54 -5 -3 -85 -97 24 -137 -102 -21 -83 171
7730 171 195 -25 -63 -47 -367 -178 -65 -37 95 96 -120 104 197 -51 114 -203 -115 96 -90 -68 49 81 50 -29
7754 -29 149 199 -129 171 48 108 162 15 75 45 -86 277 -69 -44 65 197 -100 -24 -163 243 -126 -22 -178
7777 -178 -8 -25 -95 -143 -183 168 -170 -105 23 -117 147 93 -154 397 113 -40 32 122 -300 -73 180 236 -71
7800 -71 40 35 237 161 -133 -179 40 -25 120 242 63 -36 1 -291 -93 56 -34 -44 37 -66 242 24 -173 150
7824 150 -75 -343 -33 -89 -173 -134 42 3 -158 -135 34 -50 141 205 66 122 121 -210 49 -130 -6 -37 -134 -226
7848 -226 90 -103 -78 -90 -137 -60 1 25 -197 -236 -143 5 239 -178 161 64 50 -50 -125 -82 -102 -66 102 164 55
7873 55 -13 196 -89 -46 -160 291 -100 85 152 58 330 -3 -287 -65 -217 -264 21 101 -85 48 -21 -200 23
7896 23 -236 -45 -50 -68 53 -192 210 9 107 25 7 121 -50 -74 28 -124 32 -187 -170 33 223 21 72
7919 72 185 -105 -381 -95 -154 318 136 242 53 16 169 257 -13 -214 181 -141 -129 -259 72 -144 -34 -37
7941 -37 92 -125 157 -140 200 9 -10 272 -154 -42 -149 266 -170 27 -19 -9 124 103 125 -200 -148 35
7963 35 216 125 -28 68 -124 -54 194 10 -147 142 -36 -232 -92 -16 -129 184 -43 -184 -45 -89 -138 27
7985 27 311 -16 119 -113 18 119 113 182 347 -125 -15 235 47 -41 -179 233 -154 43 143 72 105 13 -153
8008 -153 -304 119 -179 187 -127 196 278 -53 238 32 -46 -163 58 0 60 163 125 29 56 -451 88 101 73
8031 73 -35 144 86 57 53 -10 -11 -10 135 -142 47 215 151 162 26 -14 45 43 -91 -92 -50 -263 17 102 12 -72 60
8058 60 7 -16 -31 -232 -87 -78 -125 172 -27 -163 56 114 29 -112 122 40 48 216 155 -41 -180 -105 212 108 -14
8083 -14 82 -34 10 78 74 169 -151 -235 -86 -105 -163 -186 222 135 2 -148 -103 -163 181 107 177 97 -27 -163 -48 -69
8109 -69 -32 145 254 -80 -103 186 -332 -87 -9 153 14 224 -243 -158 51 88 -115 98 51 -6 77 -68 13
8132 13 61 -46 -26 26 -35 -20 52 -101 -72 89 -340 -157 207 101 -215 -173 -44 -163 43 -28 -124 -159 -111 -29 -176
8157 -176 -60 57 78 -143 30 -108 13 -145 -123 119 -18 -38 -63 -447 -4 -27 -236 159 30 360 122 -18
8179 -18 10 21 349 -1 -88 -188 -179 -16 46 -256 -25 51
8191E1
##END NTUPLES=NMR FID
##END=
