##TITLE=1H_Pr PpO2
 200.13Hz, DCDCl3.
 8 sc
 17.7.2026
##JCAMPDX= 6.0         $$ Bruker NMR JCAMP-DX V2.0
##DATA TYPE= NMR FID
##DATA CLASS= NTUPLES
##ORIGIN= UXNMR, Bruker Analytische Messtechnik GmbH
##OWNER= pz
$$ XWIN-NMR		Version 3.5
$$ Fri Jul 17 13:11:01 2026 Russian Standard Time (UT+4h)  she@DPX200
##.OBSERVE FREQUENCY= 200.1313
##.OBSERVE NUCLEUS= ^1H
##.DELAY= (6, 6)
##.ACQUISITION MODE= SIMULTANEOUS
##.ACQUISITION SCHEME= undefined
##.AVERAGES= 8
##.DIGITISER RES= 18
##SPECTROMETER/DATA SYSTEM= spect
##.PULSE SEQUENCE= zg30
##.SOLVENT NAME= DMSO
##.SHIFT REFERENCE= (INTERNAL, DMSO, 0, 14.3821)
##AUDIT TRAIL= $$ (NUMBER, WHEN, WHO, WHERE, WHAT)
$$ ##TITLE= Audit trail, XWIN-NMR		Version 3.5
$$ ##JCAMPDX= 5.01
$$ ##ORIGIN= Bruker BioSpin GmbH
$$ ##OWNER= she
$$ F:/spectra/data/she/nmr/H-C/1/audita.txt
$$ ##AUDIT TRAIL=  $$ (NUMBER, WHEN, WHO, WHERE, WHAT)
(   1,<2026-07-17 13:08:43.20 +0400>,<she>,<DPX200>,
      <created by zg, POWCHK disabled, PULCHK disabled
       configuration hash MD5:
       00 E9 B6 7A A2 85 ED C7 34 08 36 98 17 FE 4E 26
       data hash MD5: 16K
       8A AA D1 E8 8A 29 54 68 A7 CE 92 07 23 A6 74 06>)
$$ ##END=
$$ 
$$ hash MD5
$$ 9E 38 A5 44 21 1E E7 3F 57 BA 2C B0 6F 32 0D D7
##$RELAX= 
##$RELAX= 
##$RELAX= 
##$RELAX= 
##$RELAX= 
##$RELAX= 
$$ Bruker specific parameters
$$ --------------------------
##$DU= <F:/spectra>
##$EXPNO= 1
##$NAME= <H-C>
##$PROCNO= 1
##$TYPE= <nmr>
##$USER= <she>
##$AMP= (0..31)
100 100 100 100 100 100 100 100 100 100 100 100 100 100 100 100 100 100 
100 100 100 100 100 100 100 100 100 100 100 100 100 100 
##$AQSEQ= 0
##$AQ_mod= 1
##$AUNM= <au_zg>
##$AUTOPOS= <>
##$BF1= 200.13
##$BF2= 200.13
##$BF3= 200.13
##$BF4= 200.13
##$BF5= 200.13
##$BF6= 200.13
##$BF7= 200.13
##$BF8= 200.13
##$BYTORDA= 1
##$CFDGTYP= 0
##$CFRGTYP= 5
##$CHEMSTR= <none>
##$CNST= (0..31)
1 1 145 1 1 1 1 1 1 1 1 1 1 1 1 1 1 1 1 1 1 1 1 1 1 1 1 1 1 1 1 1 
##$CPDPRG= <>
##$CPDPRG1= <>
##$CPDPRG2= <>
##$CPDPRG3= <>
##$CPDPRG4= <mlev>
##$CPDPRG5= <mlev>
##$CPDPRG6= <mlev>
##$CPDPRG7= <mlev>
##$CPDPRG8= <mlev>
##$CPDPRGB= <>
##$CPDPRGT= <>
##$D= (0..31)
0 0.7 0 0 0 0 0 0 0 0 0 0.03 0 0 0 0 0 0 0 0 0 0 0 0 0 0 0 0 0 0 0 0 
##$DATE= 1784279322
##$DBL= (0..7)
120 120 120 120 120 120 120 120 
##$DBP= (0..7)
150 150 150 150 150 150 150 150 
##$DBP07= 0
##$DBPNAM0= <>
##$DBPNAM1= <>
##$DBPNAM2= <>
##$DBPNAM3= <>
##$DBPNAM4= <>
##$DBPNAM5= <>
##$DBPNAM6= <>
##$DBPNAM7= <>
##$DBPOAL= (0..7)
0.5 0.5 0.5 0.5 0.5 0.5 0.5 0.5 
##$DBPOFFS= (0..7)
0 0 0 0 0 0 0 0 
##$DE= 6
##$DECBNUC= <off>
##$DECIM= 32
##$DECNUC= <off>
##$DECSTAT= 4
##$DIGMOD= 1
##$DIGTYP= 9
##$DL= (0..7)
0 120 120 120 120 120 120 120 
##$DP= (0..7)
150 150 150 150 150 150 150 150 
##$DP07= 0
##$DPNAME0= <>
##$DPNAME1= <>
##$DPNAME2= <>
##$DPNAME3= <>
##$DPNAME4= <>
##$DPNAME5= <>
##$DPNAME6= <>
##$DPNAME7= <>
##$DPOAL= (0..7)
0.5 0.5 0.5 0.5 0.5 0.5 0.5 0.5 
##$DPOFFS= (0..7)
0 0 0 0 0 0 0 0 
##$DQDMODE= 0
##$DR= 18
##$DS= 0
##$DSLIST= <SSSSSSSSSSSSSSS>
##$DSPFIRM= 0
$$ [...]
##$SUBNAM0= <"">
##$SUBNAM1= <"">
##$SUBNAM2= <"">
##$SUBNAM3= <"">
##$SUBNAM4= <"">
##$SUBNAM5= <"">
##$SUBNAM6= <"">
##$SUBNAM7= <"">
##$SUBNAM8= <"">
##$SUBNAM9= <"">
##$SW= 18.0517328524113
##$SWIBOX= (0..15)
0 0 2 0 0 0 0 0 0 0 0 0 0 0 0 0 
##$SW_h= 3612.71676300578
##$TD= 16384
##$TD0= 1
##$TE= 0
##$TE2= 300
##$TE3= 300
##$TEG= 300
##$TL= (0..7)
0 120 120 120 120 120 120 120 
##$TP= (0..7)
150 150 150 150 150 150 150 150 
##$TP07= 0
##$TPNAME0= <>
##$TPNAME1= <>
##$TPNAME2= <>
##$TPNAME3= <>
##$TPNAME4= <>
##$TPNAME5= <>
##$TPNAME6= <>
##$TPNAME7= <>
##$TPOAL= (0..7)
0.5 0.5 0.5 0.5 0.5 0.5 0.5 0.5 
##$TPOFFS= (0..7)
0 0 0 0 0 0 0 0 
##$TUNHIN= 0
##$TUNHOUT= 0
##$TUNXOUT= 0
##$USERA1= <user>
##$USERA2= <user>
##$USERA3= <user>
##$USERA4= <user>
##$USERA5= <user>
##$V9= 5
##$VALIST= <valist>
##$VCLIST= <CCCCCCCCCCCCCCC>
##$VD= 0
##$VDLIST= <DDDDDDDDDDDDDDD>
##$VPLIST= <PPPPPPPPPPPPPPP>
##$VTLIST= <TTTTTTTTTTTTTTT>
##$WBST= 1024
##$WBSW= 4
##$XGAIN= (0..3)
0 0 0 0 
##$XL= 0
##$YL= 0
##$YMAX_a= 631468
##$YMIN_a= -655783
##$ZGOPTNS= <>
##$ZL1= 120
##$ZL2= 120
##$ZL3= 120
##$ZL4= 120
##$ABSF1= 10
##$ABSF2= 0
##$ABSG= 5
##$ABSL= 3
##$ALPHA= 0
##$AQORDER= 0
##$ASSFAC= 0
##$ASSFACI= 0
##$ASSFACX= 0
##$ASSWID= 0
##$AUNMP= <proc_1d>
##$AZFE= 0.1
##$AZFW= 0.1
##$BCFW= 1
##$BC_mod= 2
##$BYTORDP= 1
##$COROFFS= 0
##$CY= -3
##$DATMOD= 1
##$DC= 2
##$DFILT= <>
##$DTYPP= 0
##$F1P= 0
##$F2P= 0
##$FCOR= 0.5
##$FTSIZE= 0
##$FT_mod= 4
##$GAMMA= 1
##$GB= 0.15
##$INTBC= 1
##$INTSCL= 1
##$ISEN= 128
##$LB= 0.25
##$LEV0= 0
##$LPBIN= 0
##$MAXI= 10000
##$MC2= 0
##$MEAN= 0
##$ME_mod= 0
##$MI= 1.114404
##$NCOEF= 0
##$NC_proc= 0
##$NLEV= 6
##$NOISF1= 3.799351
##$NOISF2= 2.8
##$NSP= 1
##$NTH_PI= 0
##$NZP= 0
##$OFFSET= 14.38212
##$PC= 1
##$PHC0= -4220.044
##$PHC1= 12.5923
##$PH_mod= 1
##$PKNL= yes
##$PPARMOD= 0
##$PSCAL= 0
##$PSIGN= 0
##$REVERSE= no
##$SF= 200.129724274929
##$SI= 16384
##$SIGF1= 3
##$SIGF2= 2
##$SINO= 400
##$SIOLD= 16384
##$SREGLST= <1H.CDCl3>
##$SSB= 0
##$STSI= 0
##$STSR= 0
##$SW_p= 3205.1282051282
##$SYMM= 0
##$S_DEV= 0
##$TDeff= 0
##$TDoff= 0
##$TI= <>
##$TILT= no
##$TM1= 0
##$TM2= 0
##$TOPLEV= 0
##$USERP1= <user>
##$USERP2= <user>
##$USERP3= <user>
##$USERP4= <user>
##$USERP5= <user>
##$WDW= 1
##$XDIM= 8192
##$YMAX_p= 0
##$YMIN_p= 0
$$ End of Bruker specific parameters
$$ ---------------------------------
##NTUPLES= NMR FID
##VAR_NAME=  TIME,          FID/REAL,        FID/IMAG
##SYMBOL=    X,             R,               I
##VAR_TYPE=  INDEPENDENT,   DEPENDENT,       DEPENDENT
##VAR_FORM=  AFFN,          ASDF,            ASDF
##VAR_DIM=   8192,          8192,            8192
##UNITS=     SECONDS,       ARBITRARY UNITS, ARBITRARY UNITS
##FACTOR=    0.0002768,     1,               1
##FIRST=     0,             0,               0
##LAST=      2.2672688,     0,               0
##MIN=       0,             -655783,         0
##MAX=       2.2672688,     631468,          0
$$ Real data points
##PAGE= N=1
##DATA TABLE= (X++(R..R)), XYDATA
$$ [...]
2078b63K078N7k948r25J906P02k492k196K189K321r75k221J517K601l2k112N29
$$ -263 1815 1872 -1076 -2001 -95 607 -1885 -4081 -1892 429 -546 -2767 -1250 1351 1319 -793 -264
2095b64L152M27k365j212J407J223j441k241N85J657j107k891k10K668J080k738
$$ -264 2888 3315 950 -262 1145 2368 927 -1314 -729 928 -179 -3070 -3280 -612 468 -2270
2111b270n19K831J494j636p79J669K498q37k991N95K610k83k426j279J577O89
$$ -2270 -2789 42 1536 -100 -879 790 3288 2451 -540 55 2665 2382 -44 -1323 254 943
2127I43k917j420J952J929j319k157O72L014J00j951M06K505J034k134j112K100
$$ 943 -1974 -3394 -1442 487 -832 -2989 -2317 697 797 -1154 -748 1757 2791 657 -455 1645
2143A645J849k085k218O36J370j062k378j08K207K68k401n01K037J538r68j368
$$ 1645 3494 1409 -809 -173 1197 135 -2243 -2351 -144 124 -2277 -2778 -741 797 -171 -1539
2159a539J580K276r14j711O81K383J84l047p27K174n2j957j533J094J633j697
$$ -1539 41 2317 1403 -308 373 2756 2940 -107 -834 1340 1288 -669 -2202 -1108 525 -1172
2175a172k012J014K416Q0j731J89K075J140j701o65K132J180j379j861K37K152
$$ -1172 -3184 -2170 246 326 -1405 -1216 859 1999 298 -367 1765 2945 1566 -295 -58 2094
2191B094j001k708J70J849l00k206p82K074J268j692o30J219J932k15j474N86
$$ 2094 1093 -1615 -1445 404 104 -2102 -2884 -810 458 -1234 -1864 -645 1287 1072 -402 184
2207A84K278J66k244n51J792M42k031j593Q98J114j472j405N23J698m4j761J11
$$ 184 2462 2628 384 -167 1625 2067 36 -1557 -659 455 -1017 -2422 -1899 -201 -245 -2006 -1895
2224a895K528N15j299j36J480J216r42j465O90J295m65j864p30J486M78k650n42
$$ -1895 633 1148 -151 -287 1193 2409 1467 2 692 1987 1522 -342 -1072 414 892 -1758 -2300
2241b300J608P60j358q07J042J809l23p59p0K065K99j482l55J666K13j389j077
$$ -2300 -692 68 -1290 -2097 -1055 754 431 -328 -398 1667 1966 484 129 1795 2008 619 -458
2258d58O20N67j168j559K99J298o6j546k14K421J78j060O0J579O96p83n19P63
$$ -458 162 729 -439 -1998 -1699 -401 -467 -2013 -2227 194 372 -688 -628 951 1647 864 345 1108
2276A108R10l33j646l45J223j67j651p69J083O65j789m92J000J052k08r28N01
$$ 1108 2018 1685 39 -306 917 750 -901 -1670 -587 78 -1711 -2203 -1203 -151 -359 -1287 -786
2293g86J954L63j139k04J293O19j273q10O99N79j043j367j47J065l15j103l33
$$ -786 1168 1531 392 188 1481 2100 827 17 716 1295 252 -1115 -1262 -197 -512 -1615 -1948
2310a948J431K17q00J53J096R84o62n18Q35R62m36l94m52O70J50j944k56R45k24
$$ -1948 -517 -300 -1100 -947 149 1133 471 -47 788 1750 1314 920 468 1138 1288 -656 -912 33 -191
2329a91j002p09O21O97l12k63K58Q52N45l16m05J441N02q32n18N93L34n64q39
$$ -191 -1193 -1902 -1281 -584 -896 -1159 -901 -49 496 180 -225 1216 1718 886 368 961 1295 731 -108
2348a08k00K32j14q94m72O82J63k76o93J386N46k24k2M86P78K63o27k10M18Q2
$$ -108 -308 -76 -190 -1084 -1556 -874 -711 -987 -1680 -294 252 28 6 492 1270 1533 906 696 1114 1196
2368A196o68n37Q0K30j118m49L31J09l61o8L15K15Q29j40K37N45K98j70l87O29
$$ 1196 528 -9 71 301 -817 -1266 -935 -826 -1187 -1255 -940 -725 104 -36 201 746 1044 874 487 1116
2388A116L55m54m97o0l47J14q61o04K49J76j32l59L02O35R7p4N40J19N13J01K23
$$ 1116 1471 1017 520 460 113 227 -634 -1238 -989 -813 -945 -1304 -1002 -367 -270 -344 196 315 828 929 1152
2409A152k5J92j64o26qJ44n28o81k18K2j86o55K91K48M40K13N3j0Q64K05Q2Q6
$$ 1152 1127 1319 1155 529 521 665 137 -544 -762 -740 -926 -1581 -1290 -1042 -602 -389 -336 -346 518 723 805 891
2431H91j85O17j25o42k88K35m33n33m42K81j24n28J01J27L41Q5K2M31M95N16n31
$$ 891 706 1323 1198 556 268 503 70 -463 -905 -624 -748 -1276 -1175 -1048 -707 -622 -600 -169 326 842 311
2452C11L38N72L65r71K7J8J09m93o05j00m20J59m38j71K88K86N1n5P96M37K0m51
$$ 311 649 1221 1586 615 642 660 769 276 -329 -429 -849 -690 -1128 -1299 -1011 -725 -674 -729 67 504 524 73
2474G3N45Q49l75l30j80K60K18o97o99R1m5n29o69K07O54j07k97L69P01N08n2
$$ 73 618 1467 1092 762 582 842 1060 363 -336 -245 -290 -819 -1488 -1281 -627 -734 -1031 -662 39 547 495
2495D95k73Q18M33o02k73J05L14k35j160M1K02J46j053l24M89L44k89m00O32O62
$$ 495 222 1040 1473 871 598 703 1017 782 -378 -337 -135 11 -1042 -1366 -877 -533 -822 -1222 -590 72
2515G2O5l85L05J069J02n53k96O64J28n95p08J88M89j040q23L12N64J11p45j83
$$ 72 137 -248 57 1126 1228 675 379 1043 1171 576 -132 56 545 -495 -1318 -1006 -442 -331 -1076 -1259
2535a259Q48Q07n33l34J050M84l31m96L60P63j50q83k89L98J74j223p53Q18M71
$$ -1259 -411 396 -137 -471 579 1063 732 236 596 1359 1209 326 37 435 609 -614 -1367 -549 -78
2554g8n97r85P12P27J58q57M31J388j44n63J77P30N07r90p55O79M14q54j049L2
$$ -78 -675 -1660 -948 -221 -63 -920 -489 899 755 192 369 1099 1606 616 -139 540 954 100 -949 -917
2574i17P00K09j395n4Q99R44p39o67J020J160m27r22O46J209m61q07n62J283J7
$$ -917 -217 -8 -1403 -1457 -558 386 -353 -1020 0 1160 733 -189 457 1666 1205 398 -164 1119 1136
2593A136j454k80J73M90q66q92P09J270q68n24J04J368K66o58m9J177L12n61r51
$$ 1136 -318 -598 -425 65 -801 -1693 -984 286 -582 -1106 -1002 366 632 -26 -75 1102 1414 853 -98
2612i8Q56N11n27j509J09R20j13j315K5Q53N08j050n97J206P98p7j202N77J403
$$ -98 758 1269 742 -767 -658 262 149 -1166 -1141 -288 220 -830 -1427 -221 577 500 -702 -125 1278
2631A278j68j014R1Q19K37r87j059P08O54j092o86K05R54m91q38L76J206K51q82
$$ 1278 1110 96 187 1006 1243 256 -803 -95 559 -533 -1219 -1014 -60 -551 -1389 -1013 193 444 -438
2650d38P6J182M64o88n55R74O05p32j125MR98k87j321m48J105K94j193o95J438
$$ -438 -362 820 1284 596 41 1015 1620 888 -237 -233 765 478 -843 -1291 -186 108 -1085 -1780 -342
2669c42O90m37p12O31J026l5p03J15P42L97j343l81N95O85q07j007j1P81m38p59
$$ -342 348 -89 -801 -170 856 821 118 233 975 1372 29 -352 243 928 121 -886 -897 -116 -554 -1313
2689a313K26J052N8n20n23J190Q80p20l92R21N35p08o46K92Q71l77j353l60P36
$$ -1313 -1087 -35 23 -497 -1020 170 1050 330 -62 859 1394 686 40 332 1203 826 -527 -887 -151
2708a51J98o80n49O36N90m71r53Q16J100mo26q8J281K02j150m4P25K66j145o06
$$ -151 47 -633 -1182 -546 44 -427 -1380 -564 536 532 -94 -182 1099 1301 151 107 832 1098 -47 -653
2728f53L81M37n27q14K45P29j7q14oJ369L48n57m12Q97Q46n35j022K74J176m66
$$ -653 -272 165 -362 -1176 -931 -202 -219 -1033 -1039 330 678 121 -291 606 1452 917 -105 169 1345 879
2748H79j007o05Q24J73n75p82M59N06n68o82O48J174l07o99K00R58M01o98o20
$$ 879 -128 -733 91 264 -311 -1093 -634 -128 -696 -1378 -730 444 137 -562 -362 596 997 299 -321
2767c21J318P2o64l57j36P07q70q77L71M06Jm10j74P24L54p46j77Q93R02l10m65
$$ -321 997 1069 405 48 -88 619 -251 -1128 -757 -351 -350 -760 -934 -210 144 -602 -779 114 1016 706 241
2788B41%Q57M7r82j05N75J28j178o78M62P15n95o36N04O65l98j87K22R23M62p31
$$ 241 241 1098 1145 163 58 633 761 -417 -1095 -633 82 -513 -1149 -645 20 -378 -565 -343 580 1042 311
2809C11l55Q59K14o77l33K73L02m20m97q2N43J01r38l89M60K83k56kL46J002m37
$$ 311 -44 815 1029 352 19 292 594 174 -323 -405 138 239 -699 -1088 -628 -345 -601 -603 -257 745 308
2830C08k66M83M88P9r02J24M39N6o31p59O69j7m92q31M52P79l78l12K57M62M67
$$ 308 42 525 1013 1092 190 314 753 809 178 -581 88 71 -421 -1252 -800 -21 -399 -711 -454 8 475
2851D75o64k90R55K83k40k75j97O63l64o15pK97p7n14m65M67K92o37P6M89R24
$$ 475 -189 -479 476 759 519 244 47 710 346 -269 -276 21 -56 -570 -1035 -568 -276 -913 -837 -348 576
2872E76l76k60J92N22L08q03L85L12k82m25n10M69K07p23p04M55L95j92l30N2
$$ 576 200 -60 132 654 962 159 544 856 574 149 -361 108 315 -408 -1112 -657 -262 -454 -784 -732
2892g32O17K29l70j59N36M00j02k66L74L00l70l05L02j62j40l83l68K7M12m04
$$ -732 -115 114 -256 -415 121 521 419 153 527 827 457 152 454 292 152 -231 -599 -572 -160 -564
2912e64m5K81L59m34k46L43O26J57N9j93L48rl91l21N45l50J06o87j92K39p7k36
$$ -564 -609 -328 31 -403 -649 -306 320 477 536 343 691 682 291 -30 515 165 271 -416 -608 -369 -446 -682
2934f82J16L95K89m50o0P03O9j31j52L39L87k10r8m93O49l77n81J20j24J05j95
$$ -682 -566 -171 118 -332 -392 311 380 249 97 436 823 613 515 22 671 294 -287 -167 -291 -186 -381
2955c81l9k54M18o1j03j3K95L31l25kM99L21l1k25l5J99l10k70j34l6L5l73p2
$$ -381 -420 -674 -256 -317 -420 -433 -138 193 -132 -134 365 686 655 430 395 594 284 14 -120 -156 -121 -494 -566
2978e66J63J46j85jk21N52J8J23K43J45J94j87L7Q4q1k00l84KO4j10k65j23L1
$$ -566 -403 -257 -442 -443 -664 -112 -94 29 272 417 611 424 461 545 464 264 -120 -118 -54 -164 -429 -552 -521
3001e21K44j40k67N83j24q6K66M34jN9Q3k53M87k61Q5o73o2J22k6k46mM8j87q0
$$ -521 -277 -417 -684 -101 -225 -311 -45 389 388 447 530 277 764 503 588 -85 -147 -25 -51 -297 -301 -253 -440 -520
3025e20J2K41L79o9j12K19K70J11l08J24J53P5k38l83L94l49l25j94J51K42r7
$$ -520 -508 -267 112 43 -69 150 420 531 223 347 500 575 337 -46 348 -1 -326 -520 -369 -127 -224
3046b24k70j29N85j43Mj49N63K1J89j11J55L51n00l06J72j25k09m9l57N49j99
$$ -224 -494 -623 -38 -181 -177 -326 237 258 447 336 491 842 342 36 208 83 -126 -175 -532 17 -182
3067a82k14k34J80L02j58j12L40O3M41k56R6K49R8o04o2M01j44O7n22j84N78m46
$$ -182 -396 -630 -450 -148 -306 -418 -78 -15 426 170 266 515 613 9 -53 348 204 271 -251 -435 143 -303
3089c03m71K65J11L45n84L14K08L66j99k25L32K43J42j95l56L25J13m00k87j87
$$ -303 -774 -509 -398 -53 -637 -323 -115 251 52 -173 159 402 544 349 -7 318 431 31 -256 -443
3109d43M82k74n49K33L00o9k17M55K46J06o71M49L92R6r0l69L67l1r2o43N42l53
$$ -443 39 -235 -784 -551 -251 -320 -537 -82 164 270 -401 48 440 536 446 77 444 413 321 -322 220 -133
3131a33K54o34j86K85K36j95j33M15L25k39J45j17N93j23l12K25N6K61l25o48
$$ -133 121 -513 -699 -414 -178 -373 -506 -91 234 -5 140 23 616 493 181 406 462 723 398 -250
3151b50J57M01n00K6k88K67j08q7l35Q87J10l71j19M06K33M9m87K41K46l9m3m93
$$ -250 -93 308 -192 -166 -454 -187 -295 -382 -717 170 280 -91 -210 196 429 478 -9 232 478 439 396 -97
3173i7J50J38o54L5o0M18k03l23L71J10J12n02N96K42j0j90o9K83K98n22J48J87
$$ -97 53 191 -463 -428 -488 -70 -273 -596 -225 -115 -3 -505 91 333 323 133 64 347 645 123 271 458
3195D58j81k88k80N5J26K39j005M41J03L19m10m7O16K19k05k57M94O3R4n54J75
$$ 458 277 -11 -291 -236 -110 129 -876 -435 -332 -13 -423 -470 146 365 160 -97 397 460 554 0 175
3216A75L71j66p25P4L69r4l98k10L90j43L2n82Q86L58q0k81k2L91K4O5l12K93
$$ 175 546 380 -345 -271 98 4 -394 -604 -214 -357 -325 -907 -21 337 257 -24 -46 345 369 434 122 415
3238D15K54n47l97J71J75j18p02J45M18L9j27k07M73J70k54n9Q2N38m9j96k1K68
$$ 415 669 122 -275 -104 71 -47 -749 -604 -186 -147 -274 -481 -8 162 -92 -151 -69 469 420 224 203 471
3260D71j27k05l05o3L10Lp27L44L13m18N1j43P51j1p62M73K31L91m80l63K97M39
$$ 471 344 139 -166 -229 81 84 -643 -299 14 -404 -353 -496 255 244 -518 -45 186 577 97 -266 31 470
3282D70k38m42K31K86l92l51k9J71N1j81r0L72K41m25j06L15L74r7j42N00j71
$$ 470 232 -210 21 307 -85 -436 -465 -294 -243 -424 -514 -142 99 -326 -432 -117 257 160 18 518 347
3303C47J09m18m37O61R8n14j68Q9J23l92l1J49N20j92k1m5M42O7j68l19L49O29
$$ 347 456 38 -399 262 360 -154 -322 -233 -110 -502 -533 -384 136 -56 -77 -122 320 387 219 -100 249 878
3325H78m98k50J58J57l98j94J21j01J06k70l41L73K00j67p2K83O4L50n92J27L61
$$ 878 380 130 288 445 47 -147 -26 -127 -21 -291 -632 -259 -59 -226 -298 -15 49 399 -193 -66 295
3346B95L78l04l91J83L16l94n1l31L52l39j74j67N05l34J9O1L75J92j08K6N16
$$ 295 673 369 -22 161 477 83 32 -299 53 -286 -460 -627 -122 -456 -437 -376 -1 191 83 109 625
3367F25l56L89l87P5j44K38m59j68L05j1l41k93M12J48m20r9N17K3j08j45K58
$$ 625 269 658 271 346 202 440 -19 -187 118 107 -234 -527 -115 33 -387 -486 31 54 -54 -199 59
3388E9L36Kl02mJ68K68j58l69o1m5m2r0RM5j38q2j43L91j3l5Q7K87L21j66j93
$$ 59 395 397 95 91 259 527 369 0 -61 -106 -148 -238 -229 -184 -322 -404 -547 -156 -169 -204 -117 170 491 325 132
3413A32J17L79l05m5l14J01R3l57m70L84N57n14j31R0J44R3j35l0K84M15l56k16
$$ 132 249 628 323 278 -36 65 158 -199 -669 -285 272 -242 -373 -283 -139 -46 -181 -211 73 488 132 -84
3435h4M64K24k98J8k97m1L75o03o5J97j48p8J38N5J13k10l63L95M43j47j09OM43
$$ -84 380 604 306 324 27 -14 361 -242 -307 -110 -258 -336 -198 -143 -30 -240 -603 -208 235 88 -21 -15 428
3458D28k06k52J22M45l68k81j75J10N02o10n5L6R8M9J40l15J29N73k31m78P79
$$ 428 222 -30 92 537 169 -112 -287 -177 325 -285 -340 -304 -206 -157 -17 -332 -203 370 139 -339 440
3479D40o1j92j63J78J64j59l94PR3Q6j41m94L08J55k06j03J46M24J44j52j0J44
$$ 440 379 187 24 202 366 207 -187 -180 -87 -1 -142 -636 -328 -173 -379 -482 -336 88 232 80 70 214
3501B14M50m98R0r7L81j85l94J12K2j01j14j64k8J90L1k42l57R27k04j9J49J75
$$ 214 664 166 256 159 540 355 -39 73 95 -6 -120 -284 -312 -122 -91 -333 -690 237 33 14 163 338
3523C38n8j88M08o7r5Oj70k83K03o1j44l45J83J15l2l72M21R0k63J83K03K54M7
$$ 338 280 92 500 433 338 344 174 -109 94 33 -111 -456 -273 -158 -190 -562 -141 -51 -314 -131 72 326 373
3546C73k88O9L05j14k16j53Q1k33L07k26j14k28K40j22k17M59j13J33k04O49j72
$$ 373 85 154 459 345 129 -24 57 -176 131 -95 -209 -437 -197 -319 -536 -77 -190 -57 -261 388 216
3567B16k0k78N65Q0l76K78m02J27j00j4j31n3j41j03j61M00k46M41k05JJ83R6
$$ 216 196 -82 483 563 187 465 63 190 90 76 -55 -108 -249 -352 -513 -113 -359 82 -123 -122 61 157
3589A57k48M35r2O4j93N7K11k45m04L40k24Q6o7k78J32lL23j56j36K96JnL4p0
$$ 157 -91 344 252 316 123 180 391 146 -258 82 -142 -56 -123 -401 -269 -272 51 -105 -241 55 56 51 85 15
3613A5L25K6k17J90Q9m26k06K62j83j90j80K04ORo4m6K64J55K72l96K81k98N19
$$ 15 340 366 149 339 428 2 -204 58 -125 -315 -495 -291 -285 -276 -340 -386 -122 33 305 -91 190 -108 411
3636D11l81K99q3J59k41l27L24k25P3k33K45k62J57l55J14M25J92k46j81K45L28
$$ 411 30 329 246 405 164 -163 161 -64 9 -224 21 -241 -84 -439 -325 100 292 46 -135 110 438
3657D38k23k1N9J28k23j17OK0j98K0o6n0R9k60QK20L4M3n1L2K80J57K07j06J1
$$ 438 215 194 253 381 158 41 47 67 -131 -111 -177 -227 -128 -388 -380 -160 -126 -83 -134 -102 178 335 542 436 447
3682D47l02j4P7j44j86M51n01q5K61K8k64r1K14%J89l74pL10L05k28jL10k83J78
$$ 447 145 131 208 64 -122 329 -172 -257 4 32 -232 -323 -109 -109 80 -294 -301 9 314 86 85 395 112 290
3706B90j54K59k87m1O5l46J9Kk59j07M75j22j78j15N11N8R5l4M6K57J22l82k54
$$ 290 136 395 108 67 132 -214 -195 -193 -452 -559 -84 -206 -384 -499 12 70 165 131 177 434 556 174 -80
3729h0K61k64J53j36J2l45L17k77L10L4k69J8j68M46P6j98J98M5j4M8l04N31j63
$$ -80 181 -83 70 -66 -54 -399 -82 -359 -49 -15 -284 -266 -434 12 88 -110 88 133 119 167 -137 394 231
3752B31m28rR1J68J10n81R5K1K09J96l69J18K66l0J9M9K11j36l6J34p9O9j66j90
$$ 231 -197 -206 -115 53 163 -418 -323 -302 -93 103 -266 -148 118 88 107 156 367 231 195 329 250 319 153 -37
3776c7M3R0l05k77L33j40J23k67J54L95L4m12M12J26J61m06L4J40K24j23m77K10
$$ -37 6 96 -209 -486 -153 -293 -170 -437 -283 112 146 -266 146 272 433 27 61 201 425 302 -175 35
3798C5j53J35J20n16J50q1L5n6K01r3J89j00O4K72J01p8K31n3l03m2R8P4n5j77
$$ 35 -118 17 137 -379 -229 -310 -275 -331 -130 -223 -34 -134 -70 202 303 225 456 403 100 58 156 230 175 -2
3822bKr1k04L03m81j33K48J23o0ON19j27R9j89J89L50l36PJ8ok2k80j84J46J10
$$ -2 0 -91 -295 8 -473 -606 -358 -235 -295 -289 230 103 202 13 202 552 216 223 241 235 213 -67 -251 -105 5
3847Ek97K1J04nk06J92J2j9Q6J80k16L67L01m17K41k67K81k80m0j30J19j28k83
$$ 5 -292 -271 -167 -172 -378 -186 -174 -193 -107 73 -143 224 525 108 349 82 363 83 43 -87 32 -96 -379
3870c79K37j94L00o13N99j10K82o6l63L62J10K50j01j68J91J81l27l85K79o3l44
$$ -379 -142 -336 -36 -649 -50 -160 122 56 -307 55 165 415 314 146 337 518 191 -194 85 22 -322
3891c22j42K87M06l92m13M01J25K49m34J51L12L0P8k68N36k70r2k45J47K04m52
$$ -322 -464 -177 229 -163 -576 -175 -50 199 -235 -84 228 258 336 68 604 334 242 -3 144 348 -104
3912a04q7k6K62Ql63M9J07K01n1j30R2K58Oo7L57k1l1m28j45K90j7l19K9j02n2
$$ -104 -191 -217 45 53 -310 -261 -154 47 -4 -134 -42 216 222 155 512 491 460 32 -113 177 160 -159 -130 -232 -284
3937b84N35m94j09J92R4k65K06J97J77R7n50M01L20o3l25O1j13mj23N4K5m9j24
$$ -284 251 -243 -352 -160 -66 -331 -125 72 249 346 -204 197 517 454 129 190 77 73 -50 4 29 -20 -144
3960a44o4J18J67k47j87M51l0j56J73k2J20K01j94M14l57k8l08j46K01m9k35P2
$$ -144 -208 -90 77 -170 -357 94 64 -92 81 59 179 380 186 600 243 215 -93 -239 -38 -87 -322 -250
3982b50q0J36m1L6m9K06O8q3N4J58K39r8l34J79k0k5j14n6Q1K63q39J05L89j01
$$ -250 -330 -194 -235 -199 -248 -42 26 -57 -3 155 394 296 -38 141 121 96 -18 -74 7 270 -569 -464 -75 -176
4006a76K12o87L43K62K4j05K37J09k17K46j88K24J5j37L5q9l2j0p1k09L53l92
$$ -176 36 -651 -308 -46 -22 -127 110 219 2 248 60 284 299 162 197 108 76 66 -5 -214 139 -253
4028b53K8n0pJ26K32l32J07R1K40j9k81K93J81K7l72P2N4k84q0K49j01j43k19
$$ -253 -225 -275 -282 -156 76 -256 -149 -58 182 163 -118 175 356 383 11 83 137 -147 -227 22 -79 -222 -441
4051d41J9M87j63P9j20Q4J73j90J32J95N9j12j73J12J8j49k08p6M63l47J26n40
$$ -441 -422 65 -98 -19 -139 -55 118 -72 60 255 314 202 29 141 159 10 -198 -274 189 -158 -32 -572
4073e72N87n2l62L55p8K82j06q9j40N08K9l70K79P9j04P5m59o0J89J28n5l94K91
$$ -572 15 -37 -399 -44 -122 160 54 -35 -175 333 362 -8 271 350 246 321 -138 -198 -9 119 64 -330 -39
4096c9lJ12j00o9K31p2r2Q4K73L1m3J56k75J39k73k9j22jk29q3L00p2O3p9J74
$$ -39 -42 70 -30 -99 132 60 -32 52 325 356 313 469 194 333 60 31 -91 -92 -321 -404 -104 -176 -113 -192 -18
4121a8K63j92l1j97L17L5k89O9K54K46k19q7j40j29J41j20l20L87j52l2K58j59
$$ -18 245 53 22 -175 142 177 -112 -43 211 457 238 151 11 -118 23 -97 -417 -30 -182 -214 44 -115
4143a15Rn9J46K13P2l5m8j29L88k14m04K83n5L70n70j39M5K11r5k48L03J28j03
$$ -115 -106 -165 -19 194 266 231 183 54 442 228 -176 107 52 422 -148 -287 -242 -31 -126 -374 -71 57 -46
4166d6K11k45L24l1J90k64jL34q1k55Q9o6j57k53O7k25L76m32K16K67R0j19j16
$$ -46 165 -80 244 213 403 139 138 472 391 136 225 159 2 -251 -184 -409 -33 -465 -249 18 108 -11 -127
4189a27m3K81j0N0q9K65j20j10k12j8K51J5k20j36R8K06k79K31n5n4k54J85K27
$$ -127 -170 111 101 151 62 327 207 97 -115 -133 118 133 -87 -223 -125 81 -198 33 -22 -76 -330 -145 82
4212H2j51j7j72K86L83k7l60L22j92J15j78j00k14L87k25k64Q2R5q8K1J09ro0
$$ 82 -69 -86 -258 28 411 384 24 346 154 269 91 -9 -223 164 -61 -325 -243 -148 -236 -215 -106 -115 -175
4235a75R7J11L7L7j70M7K74N7m72NM34j3k03l66Q4J27k76K01pL38j7j52j92K02
$$ -175 -78 33 70 107 -63 -16 258 315 -157 -152 282 269 66 -300 -216 -89 -365 -164 -171 167 150 -2 -194 8
4259HJ31K08l00L93k21k54J92N1k07j2m7k26J35J25J06l55K02j59J98k24q9M40
$$ 8 139 347 47 440 219 -35 157 208 1 -11 -58 -284 -149 -24 82 -273 -71 -230 -32 -256 -345 95
4281I5K40j90N6k31M79k09l17K68l6k17m1jj80K42k57L97k67j50J62o4J23J18
$$ 95 335 145 201 -30 449 240 -77 191 155 -62 -103 -104 -284 -42 -299 98 -169 -319 -157 -221 -98 20
4303B0L8lj39J39R8J29l50J43J9R0q08Q02m13J78k15o6L72k10K07k72K38K28j99
$$ 20 58 55 -84 55 153 282 -68 75 94 184 -624 178 -235 -57 -272 -338 34 -176 31 -241 -3 225 26
4326B6Q6k8J89k5q4K58l21n9m30L45m5MJ10k87J97l8m9P3k48L53jQ3o8M15l10
$$ 26 112 84 273 248 164 422 101 42 -388 -43 -88 -84 26 -261 -64 -102 -151 -78 -326 27 26 109 41 456 146
4351A46P3j10K65l09K86l86N5q2J1j55k17K47J47j57M6l8J53p2J87o4j9L01j74
$$ 146 219 109 374 65 351 -35 20 -62 -51 -206 -423 -176 -29 -186 -140 -178 -25 -97 90 26 7 308 134
4374A34J34J28R7l88j4j94N7l35M12k32n7n5J50J3k18L95j06jK95L1p2R9j00k11
$$ 134 268 396 493 105 91 -103 -46 -381 31 -201 -258 -313 -163 -150 -368 27 -79 -80 215 246 174 273 173 -38
4398c8R6J09k31K73j56k96K1K85l26rm4J14J77l14K96l1J31k32K34k35K59J08
$$ -38 58 167 -64 209 53 -243 -222 63 -263 -272 -316 -202 -25 -339 -43 -74 57 -175 59 -176 83 191
4420A91kl20J95K53k67k2J4K3j87k98L85R3l57Q6K02N4k27M56k48K95k51J67k18
$$ 191 189 -131 64 317 50 28 42 65 -122 -420 -35 58 -299 -213 -11 43 -184 272 24 319 68 235 17
4443A7K48J66j88l52O1R9m13J60m54M90n8J83K24k94J17j22J38mj36J50J07k32
$$ 17 265 431 243 -109 -48 51 -362 -202 -656 -166 -224 -41 183 -111 6 -116 22 18 -118 32 139 -93
4465i3L61j14M02m66k53K34j16j2k40n1J90J14m18J97L35j80P4L16m0k32J75n4
$$ -93 268 154 556 90 -163 71 -45 -57 -297 -348 -158 -44 -462 -265 70 -110 -36 280 240 8 183 129
4487A29L2j0P9j74k22lK43l84J46Q5j41j57K56o0l2K58j94J59P9K5J4J62l6k9
$$ 129 161 151 230 56 -166 -169 74 -310 -164 -79 -220 -377 -121 -181 -213 45 -149 10 89 114 128 290 254 225
4511B25j31J76J41k90k18l10K57j30J62M6Jj30L44k57j24L38o2K45K4j7M0r5r
$$ 225 94 270 411 121 -97 -407 -150 -280 -118 -72 -71 -201 143 -114 -238 100 38 283 307 290 330 235 226
4534B26r3Q1j64j13j17K68J11l30J46k82K60j14K06j98N29n1l57J02K74j62jk50
$$ 226 133 214 50 -63 -180 88 199 -131 15 -267 -7 -121 85 -113 416 365 8 110 384 222 221 -29
4556b9M09k39j02k68P5k26K94k66RK36j29j6k0M99j4k1J16J96l13j25j46L58o8
$$ -29 380 141 39 -229 -154 -380 -86 -352 -343 -107 -236 -252 -272 227 213 192 308 504 191 66 -80 278 210
4579B10N2k62j37J58j17j32J44j34j7K75k59L69j37J17j22m7J32J05k4L7j31o7
$$ 210 262 0 -137 21 -96 -228 -84 -218 -235 40 -219 150 13 130 8 -39 93 198 174 211 80 13
4601A3J34k47j23M25m11O78l97j76J20j05k0L00m5j76l02L61K02j40L19k36j26
$$ 13 147 -100 -223 202 -209 469 72 -104 16 -89 -109 191 146 -30 -332 29 231 91 410 174 48
4622D8K24k38j28J69L0l99J81j72j41M28k15L8P3j86K28M0K67l04K4L63q5j25
$$ 48 272 34 -94 75 105 -294 -113 -285 -426 2 -213 -175 -102 -288 -60 -20 247 -57 -33 330 245 120
4644A20n7K72k53Q3j47j38J13Qm6j98O2r9J73L94k22j05K48N7l00j00K70Q8l34
$$ 120 63 335 82 165 18 -120 -7 1 -45 -243 -181 -280 -107 287 65 -40 208 265 -35 -135 135 223 -111
4667a11J18q0p6L95m03r4J38ol43K92j43K53P4l18K51J54j83J87n3r2k1K19o1
$$ -111 7 -73 -149 246 -157 -251 -113 -119 -462 -170 -313 -60 14 -304 -53 101 -82 105 52 -40 -61 158 97
4690I7j1L4m97M83n7k4J9m67N30m56j84L18K87J79j90j71J70J14J37j41p7o8J65
$$ 97 86 120 -377 106 49 25 44 -423 107 -349 -533 -215 72 251 61 -110 60 174 311 170 93 25 190
4713A90k29j61K04J51m13k8j15K54l5r6K98P0k35J81l4n4J3M42m11L15k96O07
$$ 190 -39 -200 4 155 -258 -286 -401 -147 -182 -278 20 90 -145 36 2 -52 -39 403 -8 307 11 618
4735F18o05k41M05j11R2n38K92K78k71j73J52K90j21Pl10O39j18m8j53J80j34
$$ 618 13 -228 177 66 158 -380 -88 190 -81 -254 -102 188 67 74 -236 403 285 237 84 264 130
4756A30J27p6k75Q0J01j93l08M36L5l93L03K74j25j82j03M51k81L38l56K05M3
$$ 130 257 181 -94 -14 87 -106 -414 22 57 -336 -33 241 116 -66 -169 282 1 339 -17 188 231
4777B31j92O6k1k8K6j5j55M3qJ02l60O6J53k3l9R6K75k10J70J55j11n3J5NJ69
$$ 231 39 105 84 56 82 67 -88 -45 -53 49 -311 -245 -92 -115 -154 -58 217 7 177 332 221 168 183 188 357
4802C57k43Kj84J27j71K85j67l86L31j09K01m1k40K34L02m90K33J20J13J3J65
$$ 357 114 116 -68 59 -112 173 6 -380 -49 -158 43 2 -238 -4 298 -192 41 161 274 287 452
4823D52l49l17L30k89Q5K08k81K12k48J77k02oJ45K68o8m2j14N0J78j86K33n3
$$ 452 103 -214 116 -173 -88 120 -161 51 -197 -20 -222 -228 -83 185 117 75 -39 11 189 3 236 183
4845A83n6jj91J73m47L87m5l50L76l4r3q8J01K07j12P3q9J57q8J27n8k00M43j48
$$ 183 127 126 -65 108 -339 48 3 -347 29 -5 -98 -186 -85 122 10 83 -6 151 63 190 132 -68 375 227
4869B27j70n9k28K72q3k72K67J71N8k20p6L34n73L57r0J04L9O8J11l16Oj23J80
$$ 227 57 -2 -230 42 -41 -313 -46 125 183 -37 -113 221 -352 5 -85 19 58 126 237 -79 -73 -196 -16
4892a6J38m9j25L8j3K8j65L14k95j91n5K52J43j62L13j26k38M14j50O0j69M4p0
$$ -16 122 73 -52 -14 -27 1 -164 150 -145 -336 -391 -139 4 -158 155 29 -209 205 55 115 -54 -10 -80
4915h0J68jj47p9Q5J4K8j73K49k10J42m4K63j93j10Q8J34M64o79J27J91k39j25
$$ -80 88 87 -60 -139 -54 -40 -12 -185 64 -146 -4 -48 215 22 -88 0 134 598 -81 46 237 -2 -127
4938a27L01l58O4J90m7r5J16j19k33Q0L63j48K91l60K33l02K15k2J55Jj74O3j73
$$ -127 174 -184 -120 70 23 -72 44 -75 -308 -228 135 -13 278 -82 151 -151 64 42 197 198 24 87 -86
4961h6J35O4Q2l38J79j67m0j72o9L41p9K75j71K23M8j81j99N05j77j59M6j19J72
$$ -86 49 113 195 -143 36 -131 -171 -343 -412 -71 -150 125 -46 177 225 44 -155 350 173 14 60 -59 113
4984A13j03m8N4k19N8M4k9k8K48J76l66N36k88j44L03j21J78j58K8j36M2j57j20
$$ 113 10 -38 16 -203 -145 -101 -130 -158 90 266 -100 436 148 4 307 186 364 206 234 98 140 -17 -137
5007a37K40p0n7O6j22m2K42j12j15o2K30l1J15j83J83J50k38J99n26J98K88j74
$$ -137 103 33 -24 42 -80 -122 120 8 -107 -169 61 30 145 -38 145 295 57 256 -270 -72 216 42
5029D2M9k10r4J25J03J9Km8n2J59J33k28L8J0O0l0l3Jr7m3J17K7P0j61R6l4o0
$$ 42 91 -119 -213 -88 15 34 36 -12 -64 95 228 0 38 48 108 78 45 46 -51 -94 23 50 120 -41 55 21 -39
5056c9k37K21k8K7o8K7J68j53K22l27K92k56J78J34j33r1R8j30j99J87K52N8n22
$$ -39 -276 -55 -83 -56 -124 -97 71 -82 140 -187 105 -151 27 161 28 -63 35 -95 -294 -107 145 203 -319
5079c19J64n3M02J35k85l3j12L10j46%no0J19j74RoN5K9q5r9JQ0R6m55M27M8O3
$$ -319 -155 -208 194 329 44 11 -101 209 63 63 58 -2 117 -57 -48 -54 1 30 -55 -154 -153 -73 23 -432 -5 43 106
5106A06n4j31j72J72J96q1L85l39J26j78J81j61K39n04o5K3L45m6k68K71l39O23
$$ 106 52 -79 -251 -79 117 36 421 82 208 30 211 50 289 -215 -280 -257 88 42 -226 45 -294 329
5128C29k83r6J59J70k08%L54j14j91k3K2l71N48m96J69j55K82j60j22J29k27R2
$$ 329 46 -50 109 279 71 71 425 311 120 97 119 -252 296 -200 -31 -186 96 -64 -186 -57 -284 -192
5150a92J5L78r2O9k37R9M2J91Nj29k23J44l1J60j70q0J57k67l8J02j3J31k1Q6
$$ -192 -177 201 109 178 -59 40 82 273 278 149 -74 70 39 199 29 -51 106 -161 -199 -97 -110 21 0 86
5174H6J52j37j92K04K46l21k39L24k00L51m93K99k03K10l17j6K66q2N0O0k8Q3
$$ 86 238 101 -91 113 359 38 -201 123 -77 274 -219 80 -123 87 -230 -246 20 -62 -12 48 20 103
5196A03p2P4j10M4J41q3R6l3ok72J2M4K08j92k56mOK31Q%K30j15k7j03P6J70J17
$$ 103 31 105 -5 39 180 97 193 160 154 -118 -106 -62 146 -46 -302 -306 -300 -69 -61 -61 169 54 27 -76 0 170 287
5223B87k39J50M9j93n0Q8l36M5O6LJ60j16j59J95J44j78P6j56L54k10J17R9j47
$$ 287 48 198 247 54 4 92 -244 -199 -133 -130 30 -86 -245 -50 94 -84 -8 -164 190 -20 97 196 49
5246D9J78j98K03j65O2j70J61j46k78M59r0j50J13l31K67K4p0M6J24N6jm01L68
$$ 49 227 29 232 67 129 -41 120 -26 -304 155 65 -85 28 -303 -36 -12 -82 -36 88 144 143 -258 110
5269A10J04j93L10n08K51j41M6J2N7j45Q9Jj02J28l26J53J33P4N9L8j41l0q7K95
$$ 110 214 21 331 -177 74 -67 -21 -9 48 -97 -8 -7 -109 19 -307 -154 -21 53 112 150 9 -21 -108 187
5293A87j49l74K89Q5n7R2k2j0j48j16M53q9O9j28k38M44k44q2K69j14k81Q9J07
$$ 187 38 -336 -47 38 -19 73 51 41 -107 -223 230 141 210 82 -156 288 44 -38 231 117 -164 -75 32
5316C2l9L3n8j3J76k05M4j42J11l6k60K89K50j16O9ml11K38j45q6L57O6l58L71
$$ 32 -7 26 -32 -45 131 -74 -30 -172 -61 -97 -357 -68 182 66 135 131 -180 58 -87 -173 184 250 -108 263
5340B63k31m00M06M3j85O7K9j93K74k54K29p5J9j6J01o2M1m1K50j25j44LK1J21
$$ 263 32 -368 38 81 -104 -37 -8 -201 73 -181 48 -27 -8 -24 77 15 56 15 265 140 -4 -1 20 141
5364A41k38J62j37j69K0j83L57K07j89K7J94k54K71j16q8N8L47l91J90k36j48
$$ 141 -97 65 -72 -241 -221 -404 -47 160 -29 -2 192 -62 209 93 5 63 410 19 209 -27 -175
5385a75N6j00O9L5J94k56l9J81K39j93R9l50K52K41o8j78L08m43M6L35m39LJ05
$$ -175 -119 -219 -150 -115 79 -177 -216 -35 204 11 110 -240 12 253 185 7 315 -128 -82 253 -186 -183 -78
5408g8L9j04J6Q3k00M65j34j04P6j23J03J36l74K70Nj50J95Q0J9k09p8j10NK25
$$ -78 -39 -143 -127 -44 -244 221 87 -17 59 -64 39 175 -199 71 76 -74 121 201 220 11 -67 -177 -172 53
5432E3Q2qjo1L3k19J4J17K33k13J22n3j55K10k21R7j56K21L6k38J82j69R4O1j86
$$ 53 135 127 126 65 98 -121 -107 10 243 30 152 99 -56 154 -67 30 -126 95 131 -107 75 -94 0 61 -125
5457a25M5R0j37j18K17R5L1q8J70j65r6J71J39J07m25j73J08K53kk43K60K2l39
$$ -125 -80 10 -127 -245 -28 67 98 10 180 15 -81 90 229 336 -89 -262 -154 99 97 -146 114 136 -203
5480b03K3O27m35l18K01k7J61J38j18k06J09l1J10m5lJ0r9O2J39j55j37j78L93
$$ -203 -180 447 12 -306 -105 -132 29 167 49 -157 -48 -79 31 -14 -17 -7 -106 -44 95 -60 -197 -375 18
5503A8q8q4J18j11J97m2o0P2j09M28l44P9l2K54k26k1k63Q5o1qK54qJ2p0m3K74
$$ 18 -70 -154 -36 -147 50 8 -52 20 -89 339 -5 74 42 296 70 49 -214 -129 -190 -198 56 48 60 -10 -53 221
5529B21l99M82k73R0j21j6j71P9K39pj26K54p5k10j07N0j14L98k81J06olL6Q6
$$ 221 -178 304 31 121 0 -16 -187 -108 131 124 -2 252 177 -33 -140 -90 -204 194 -87 19 13 10 46 132
5553A32j0l73L52k1J2k58L23k66n4N30l60J37j32k0J44k78P6q8NJ90j02%j62L43
$$ 132 122 -251 101 80 92 -166 157 -109 -163 367 7 144 12 -8 136 -142 -66 -154 -149 41 -61 -61 -223 120
5577A20j3J3k9j30N2k08L28k85j08M59j08r3K97j17r7l19J08J07j18Q5J35j64
$$ 120 107 120 91 -39 13 -195 133 -152 -260 199 91 -2 295 178 81 -238 -130 -23 -141 -56 79 -85
5599h5L01Om70J79K37k49L9k2J15K4k78M77m78J22j62N42n09J84k6J36j50PN4
$$ -85 216 222 -248 -69 168 -81 -42 -64 51 75 -203 274 -204 -82 -244 298 -211 -27 -53 83 -67 -60 -6
5622fq6K45N5k71K56j90k00K51j28j1p6N5J84j6k8k1R3j69j83M3L27P4l66M09
$$ -6 -92 153 208 -63 193 3 -197 54 -74 -85 -161 -106 78 62 34 13 106 -63 -246 -203 124 198 -168 241
5646B41R1o5o6k76J4J12j02j71R9m0p9K63P3j55qk1L12j07j77o6L68J77l05k03
$$ 241 332 267 201 -75 -61 51 -51 -222 -123 -163 -242 21 94 -61 -69 -90 222 115 -62 -128 240 417 112 -91
5670i1K10k28k25L51q5j85J15K04j57K33j58k5j01K00J43K8k2j96K0K59m18j21
$$ -91 119 -109 -334 17 -68 -253 -138 66 -91 142 -16 -41 -142 58 201 229 207 11 31 290 -128 -249
5692b49K94j20q2NK60N6k18J69j91q4J87o3j38K04M0qm2k1l4M8rJ00l17L46k14
$$ -249 45 -75 -157 -152 108 164 -54 115 -76 -160 27 -36 -174 30 70 62 20 -1 -35 13 4 104 -213 133 -81
5717h1P2J59j46L5j47J15j74l9K32K64o16M63J18l3j06j48K14j03k4J10j00NR5
$$ -81 -9 150 4 39 -108 7 -167 -206 26 290 -326 137 255 222 116 -32 182 79 55 165 65 70 165
5740A65j38J36j54K0j31J66j80p4K93q6K16J62l73l4J25K5q0j73K18M4Q0j10j15
$$ 165 27 163 9 29 -102 64 -116 -190 103 17 233 395 22 -12 113 138 58 -115 103 147 227 117 2
5763Bo3L0j3Kj52J39m8K32j14k91L56j55J32J52q6j38q9J74n6k1K8P8k40J11J04
$$ 2 -61 -31 -44 -42 -194 -55 -103 129 15 -276 80 -75 57 209 123 -15 -104 70 14 -7 21 99 -141 -30 74
5788G4j57j02J94K20j83j09R1r0M9J5K2n0J93l39K61j03k1k24J36o0L93l41j50
$$ 74 -83 -185 9 229 46 -63 28 -62 -13 2 24 -26 167 -172 89 -14 -35 -259 -123 -183 210 -131 -281
5811b81K19N9j10kL07k37K01j35n4J44k85K29r7K00p3Lj57j2n9k49K94j04RJ21
$$ -281 -62 -3 -113 -115 192 -45 156 21 -33 111 -174 55 -42 158 85 88 -69 -81 -140 -389 -95 -199 -190 -69
5835f9N9n0R8Q6j61L98j42r2R3k21L9J27j97N2K19m58k4J28J93k64K48j28n5j66
$$ -69 -10 -60 38 124 -37 361 219 127 220 -1 38 165 -32 20 239 -219 -243 -115 78 -186 62 -66 -121 -287
5859b87M67k18n8J11k13K72r9o5J06l19M92k6j10k17N9L2K40k16k36N04q4m3J28
$$ -287 180 -38 -96 15 -198 74 -25 -90 16 -303 189 163 53 -164 -105 -73 167 -49 -285 219 135 92 220
5882B20k96j32J2K35J51k4j97J96l76M49k88k40J52J86k8O8j35q1j31K67r2P6
$$ 220 -76 -208 -196 39 190 166 -31 165 -211 238 -50 -290 -138 48 20 88 -47 -128 -259 8 -84 -8
5904hL09l52J97k49m1J07P4J01k87J36k4J57L6j35l47J77K87j04O1K6j02o2R6
$$ -8 301 -51 146 -103 -144 -37 37 138 -149 -13 -37 120 156 21 -326 -149 138 34 95 121 19 -43 53
5927E3p8J16p4%P9j05j22M7J68j10K5L5k21N51n18k9Q2rq4M04m34L1J07l7j96
$$ 53 -25 91 17 17 96 -9 -131 -84 84 -26 -1 34 -187 364 -154 -183 -101 -110 -194 210 -224 -193 -86 -123 -319
5952c19N35L2m22K42J9O6pk90k17K20L23k80j90L33O8k13j14K52K50n62M65k87
$$ -319 216 248 -174 68 87 153 146 -144 -361 -141 182 -98 -288 45 113 -100 -214 38 288 -274 191 -96
5974i6J62K23k15q4K3k74N25k54n8j3o8n0J7p8P0J94L2PmpP7j39J16k28J63J06
$$ -96 66 289 74 -10 13 -261 264 10 -48 -61 -129 -179 -162 -240 -170 24 56 63 59 52 129 -10 106 -122 41 147
6000A47j08k44L37j89j65O8L77q2k40p6J46m7j19K26K97n20K54J14Rk2j31M0k29
$$ 147 39 -205 132 -57 -222 -154 223 141 -99 -175 -29 -76 -195 31 328 -192 62 176 185 163 32 72 -157
6023a57K89q0j05K9k33M6K51l5k69K56j09J5n9J08M2RJ03j1o7k00j8J15J01J7
$$ -157 132 52 -53 -24 -257 -211 40 5 -264 -8 -117 -102 -161 -53 -11 -2 101 90 23 -177 -195 -80 21 38
6047C8q5k23J05J30j56N1R7K85j51n37M18M66m83J20k74L7L91j59j3k29J79m0
$$ 38 -47 -270 -165 -35 -191 -140 -43 242 91 -446 -28 438 -45 75 -199 -162 229 70 57 -172 7 -33
6069c3j45J27M6k9m6n3P5j13J00L0J09jO2j45J04O5J65r1l96m3K95j73l3m3j53
$$ -33 -178 -51 -5 -34 -80 -133 -58 -171 -71 -41 68 67 129 -16 88 153 318 227 -169 -212 83 -90 -123 -166 -319
6094c19K25L11o6j16j72Q0o6K61K45k55k45J55O2k4j05J31j24j18L10l16K18r1
$$ -319 -94 217 151 35 -137 -57 -123 138 383 128 -117 38 100 76 -29 102 -22 -140 170 -146 72 -19
6116a9J80j34k57J41j11J92m4J10k44J49N5r4L48j54r5Okk7l6k8K0n0m2J36N4
$$ -19 161 27 -230 -89 -200 -8 -52 58 -186 -37 18 -76 272 118 23 29 27 0 -36 -64 -44 -94 -136 0 54
6141E4j78K24k91K48n3k10O2Q4n4J60M5j65J40P4j28j84K80q9q8K8j26J41P0J79
$$ 54 -124 100 -191 57 4 -206 -144 -60 -114 46 91 -74 66 140 12 -172 108 19 -69 -41 -167 -26 44 223
6165B23l62J81R7k46J42J57j14j27K46j75J89k95J83J8j33j77J92K11k07k33Q6
$$ 223 -139 42 139 -107 35 192 78 -49 197 22 211 -84 99 117 -16 -193 -1 210 3 -230 -144
6186a44L2K13j4k22rJ40j2J11j74K4j28L68j79k43K47K56j64q9ol3J02N1m18k36
$$ -144 -112 101 87 -135 -144 -4 -16 95 -79 -55 -183 185 6 -237 10 266 102 13 7 -26 76 127 -291 -527
6210e27J78N30j20q4l6j75M00j54L9J53J20k60M8p8l9N8j51m1j7o5Q5J21Q2j00
$$ -527 -349 181 61 -23 -59 -234 166 12 51 204 324 64 112 34 -5 53 -98 -139 -156 -221 -136 -15 67 -33
6234c3J51j31J15N4m10J98R7J5P3K60j39l44J20J70k38J23j53R0r4O7j3M3J3q0
$$ -33 118 -13 102 156 -254 -56 41 56 129 389 250 -94 26 196 -42 81 -72 18 -76 -9 -22 21 34 -46
6258d6j40L53q4K5j98n4K08P5l4k7j42k37L66k27K15J60k08k56K92J1qj60L27
$$ -46 -186 167 83 108 -90 -144 64 139 105 78 -64 -301 65 -162 53 213 5 -251 41 52 44 -116 211
6281B11k46R2ol4N3K0L26l48n2k18K22J34k13r7j09J02K2l9J69k88N34J3m05L05
$$ 211 -35 57 51 17 70 90 416 68 16 -202 20 154 -59 -156 -265 -163 -141 -180 -11 -299 235 248 -157 148
6305A48j97q3j9L15N6o8j21J27j80r7J23m50M11j43J46P5p9l2J59l54L39oK8k6
$$ 148 -49 -132 -151 164 220 152 31 158 -22 -119 4 -446 -35 -178 -32 43 -36 -68 91 -263 76 70 98 72
6329G2J11j85L92j89j11k4N8n6j62K38j15j18kM8K39kNq1o8J96l94J52L8O4k42
$$ 72 183 -2 390 201 90 66 124 68 -94 144 29 -89 -91 -43 196 194 199 118 50 246 -148 4 42 106 -136
6354a36Q0J30o7K79l51j21P9o4M8K31p4k36K45j92M0J23k52L3J20P6J94q3K96
$$ -136 -56 74 7 286 -65 -186 -107 -171 -123 108 34 -202 43 -149 -109 14 -238 -205 -85 -9 185 102 398
6377C98j68k32p5j86K71j69L3M14j59k8j70J44k20K0L66l09j31L24k00J7P7K93
$$ 398 230 -2 -77 -263 8 -161 -128 286 127 99 -71 73 -147 -127 239 -70 -201 123 -77 -60 17 310
6399C10j44J7j2o7nj88L6k7K2K6j5j64K18J50J00j56J40m7j32J77j92O9j89l8
$$ 310 166 183 171 104 99 -89 -53 -80 -58 -32 -47 -211 7 157 257 101 241 194 62 239 47 116 -73 -111
6423a11L83j96k54OJ3J58k18R2K47o7Nk00L32kOj98k3O2L06k37N0l29Q7K93k33
$$ -111 272 76 -178 -172 -159 -1 -219 -127 120 53 58 -142 190 188 194 -4 -27 35 341 104 154 -175 -88 205 -28
6448b8L9k2J72N5k33P7j71K9r7J35p6K14J45k75J14j00LJ44j33j91L56j61Q0P7
$$ -28 11 -11 161 216 -17 60 -111 -82 -179 -44 -120 94 239 -36 78 -22 -19 125 -8 -199 157 -4 76 153
6472A53N9k34j23K60j11J53l03O2M8L3Q0R7l01J48J42l76N71l74P3K50k71j08
$$ 153 212 -22 -145 115 4 157 -146 -84 -36 -3 77 174 -127 21 163 -213 358 -16 57 307 36 -72
6494g2K12k40K72k12j96J95j5o5L19n01K30L40l22P8r6L4L86k97N2K2j61J28q6
$$ -72 140 -100 172 -40 -236 -41 -56 -121 198 -303 -73 267 -55 23 -73 -39 347 50 102 124 -37 91 5
6517Ej73O8k36L80j98L37k22J4K21k47M03m08r6L90k37P6J80m41L02P5J1m63J11
$$ 5 -168 -100 -336 44 -154 183 -39 -25 196 -51 352 -56 -152 238 1 77 257 -184 118 193 204 -259 -148
6540a48R1K44k58j93K48K0R3j78L28ll03J48J08R6j94K72k82P6l94K41k3Q9j61
$$ -148 -57 187 -71 -264 -16 4 97 -81 247 244 -59 89 197 293 99 371 89 165 -229 12 -11 78 -83
6563h3M3Q6P1k04J00J61m28L22L15m35J34P1jj35L72j99j67J32j74O2n8o6j9j20
$$ -83 -40 46 117 -87 13 174 -254 68 383 -52 82 153 152 17 389 190 23 155 -19 43 -15 -81 -100 -220
6587b20M1K3J24n1J12l33M53K3k39p4m1M13j51J16j25K14m63rR8M26k01k79j26
$$ -220 -179 -156 -32 -83 29 -304 149 172 -67 -141 -182 231 80 196 71 285 -178 -187 -89 337 136 -143 -269
6610b69P1Q0K48k79P1K22l49J79M1M7j8j79K38J09l29J42m1M1j09q7J67l35Q8
$$ -269 -198 -118 130 -149 -78 144 -205 -26 15 62 44 -135 103 212 -117 25 -16 25 -84 -171 -4 -339 -251
6633b51J98N6j0M5j89K96L0j69k07L77l12J58J00P7j77J54l70L9M2J99j44j7j36
$$ -251 -53 3 -7 38 -151 145 175 6 -201 176 -136 22 122 199 22 176 -194 -155 -113 86 -58 -75 -211
6656b11R2j00J28L5k80P04l84N0L92k89j55M8l8P2n5J0p7o2p3K55j37K50r7n6
$$ -211 -119 -219 -91 -56 -336 368 -16 34 426 137 -18 30 -8 64 9 19 -58 -120 -193 62 -75 175 78 22
6680B2j30j44p2J61M44l65J24r1N6k11L24n6L48l92O6o8k27L48l02K38k38J26
$$ 22 -108 -252 -324 -163 281 -84 40 -51 5 -206 118 62 410 18 84 16 -211 137 -165 73 -165 -39
6702c9l00M34j50k24J05L72j42K12m6l25K06L8J99m08Q8R8j06k26k15N44l36K04
$$ -39 -339 95 -55 -279 -174 198 56 268 222 -103 103 141 340 -68 20 118 12 -214 -429 115 -221 -17
6724a7J02k00J55J23p9m2J65p7K05m48O2R4J31j85j36J33n7p7J95j50K34k21O6
$$ -17 85 -115 40 163 84 42 207 130 335 -113 -51 43 174 -11 -147 -14 -71 -148 47 -103 131 -90 -24
6747b4N8k07K84m82O90j07j31j84L57l46K87r1N1l23K71p9k43J99R6j50J48r4
$$ -24 34 -173 111 -371 319 212 81 -103 254 -92 195 104 155 -168 103 24 -219 -20 76 -74 74 -20
6769b0n4K8O0Jj65M15j81p8J79J29j79r1L57j52j33m01K68O0j20J6j89L77l01
$$ -20 -74 -46 14 15 -150 265 84 6 185 314 135 44 401 249 116 -285 -17 43 -77 -61 -250 127 -174
6792a74p8L65k58J42K00j31j54O7j33K21P5j55j88PK60M6k12q8r4K17k36K59J
$$ -174 -252 113 -145 -3 197 66 -88 -21 -154 67 142 -13 -201 -194 66 112 -100 -188 -282 -65 -301 -42 -41
6815d1j00J75l3O5k43L75j46P3J32l78J57O7j45j92K72o4J65k47p4J79k81N30
$$ -41 -141 34 1 66 -177 198 52 125 257 -121 36 103 -42 -234 38 -26 139 -108 -182 -3 -284 246
6837B46k47K36Q9m10Q4k12L59j59J82j13J26l13K14j57l8Jj29M02k25J44m8j41
$$ 246 -1 235 324 -86 -2 -214 145 -14 168 55 181 -132 82 -75 -113 -112 -241 161 -64 80 32 -109
6859a09n3K68j82M69n37M18J8l55J79N2P9k01j20l8J33m8j70j73J97M0P3J59L5
$$ -109 -162 106 -76 393 -144 274 292 -63 116 168 247 46 -74 -112 21 -27 -197 -370 -173 -133 -60 99 134
6882A34j78j35J73J20K4k69J9L87k20O0K79m49L95j81l25n0J55q3p2K09Q1p6n7
$$ 134 -44 -179 -6 114 138 -131 -112 275 55 115 394 -55 340 159 -166 -216 -61 -144 -216 -7 74 -2 -59
6905e9J39j75M02l57J60O8k31K74k55N3l33L60k00K12l32J93j13M7J43j62J67
$$ -59 80 -95 307 -50 110 178 -53 221 -34 19 -314 46 -154 58 -274 -81 -194 -147 -4 -166 1
6926Al5j16K7K05j72j8K63Q3K0k2m61M43m4j17J00q1k38K69l50J67N0j49L24j44
$$ 1 -34 -150 -123 82 -90 -108 155 238 258 236 -225 218 174 57 157 76 -162 107 -243 -76 -26 -175 149 5
6950Ej27j95L54k04L37R1n49J82J37j35K75l29J72J18j90K00l31K44L9k22L0K45
$$ 5 -122 -317 37 -167 170 261 -288 -106 31 -104 171 -158 14 132 -58 142 -189 55 94 -128 -98 147
6972A47l65R3M1K93Q0k09J89P2m49J11J11M6J33j9k31L3k06m0J24jn9J17j58J18
$$ 147 -218 -125 -84 209 289 80 269 341 -108 3 114 160 293 274 43 76 -130 -170 -46 -47 -106 11 -147 -29
6996b9K13k46l7K66n9l9n6J28j58J27k12K14K1j83k7J07k20j02j21M69j32K06
$$ -29 184 -62 -99 167 108 69 13 141 -17 110 -102 112 133 -50 -77 30 -190 -292 -413 56 -76 130
7018A30l14J23J06L8j09l0m2K5J00Q4k58L48k23K6l5J19l81K63j38K6l14O26l09
$$ 130 -184 -61 45 83 -26 -56 -98 -73 27 111 -147 201 -22 4 -31 88 -293 -30 -168 -142 -456 170 -139
7041a39J84K65l58Q4l5j59L1K68p4K67m81J25j96L02j12l87L27n4m0Q3j21L4J18
$$ -139 45 310 -48 36 1 -158 -127 141 67 334 -147 -22 -218 84 -28 -415 -88 -142 -182 -99 -220 -186 -68
7064f8P3j06k0K29%J0J3j34J78k12o6k7J96l42N6Q0j47j12L53k64K67J6nK5K05
$$ -68 5 -101 -121 108 108 118 131 -3 175 -37 -103 -130 66 -276 -220 -140 -287 -399 -46 -310 -43 -27 -32 -7 198
7089A98n0J4j6r1j17p9L61m86K11k5L73l27R1k68p6J68Q6J30k84L92k06J95l59
$$ 198 148 162 146 55 -62 -141 220 -266 -55 -80 293 -34 57 -211 -287 -119 -33 97 -187 205 -1 194 -165
7112a65K53l9J77o6j46J52o2p5m0k33K37J32k32j63J09K69J01j40J24J77k86L18
$$ -165 88 49 226 160 14 166 104 29 -11 -244 -7 125 -107 -270 -161 108 209 69 193 370 84 402
7134D02k64j0N3m1k18J97Pl5Q7m00K03K20l03j3k39M03j75P0K20O7k52P5K53k61
$$ 402 138 128 181 140 -78 119 126 91 178 -222 -19 201 -102 -115 -354 49 -126 -56 164 231 -21 54 307 46
7158D6k23R4J03j46K26J66m34%j5Q0k6J97j31L0N2QK09q0n7n7J28o9p9p0L38k63
$$ 46 -177 -83 20 -126 100 266 -168 -168 -183 -103 -129 68 -63 -33 19 27 236 156 99 42 170 101 22 -48 290 27
7184B7J16Q0k15j33O1J8j88J06J55r9K21j26j42K9L96k94R6R1m8j10p2nK43k07
$$ 27 143 223 8 -125 -64 -46 -234 -128 27 -72 149 23 -119 -90 306 12 108 199 151 41 -31 -36 207 0
7208@k72K91p9j55J50m5j14Q8oL06k68m9J86J20K19m49L19L4k27J82o2n9j35k7
$$ 0 -272 19 -60 -215 -65 -110 -224 -136 -142 164 -104 -153 33 153 372 -77 242 276 49 231 169 110 -25 -52
7232e2J36k37L5J59Ol39K23K07k51n5J19j10j3Q5L34j33j33J23j53k13K17k50
$$ -52 84 -153 -118 41 47 -292 -69 138 -113 -168 -49 -159 -172 -87 247 114 -19 104 -49 -262 -45 -295
7254b95O3k7K17J00r5l28M10j66K14j20j89L22k55J95j91L59M1l31L3RJ32j70
$$ -295 -232 -259 -42 58 -37 -365 45 -121 93 -27 -216 106 -149 46 -145 214 255 -76 -43 -34 98 -72
7276g2j63K05K2p0l3L6j0J69j76Q1J12m7k41K45K11K2l10J1n4K0j03K56q3O7K10
$$ -72 -235 -30 -8 -78 -111 -75 -85 84 -92 -11 101 54 -187 58 269 291 -19 -8 -62 -42 -145 111 28 95 305
7301C05m87j58M04L8p1L5ml56L21Pk8NL67k80j08m1KL09l33N0N5j31p9R5J07l03
$$ 305 -182 -340 64 102 31 66 62 -294 27 34 6 11 378 98 -10 -51 -49 260 -73 -23 32 -99 -178 -83 24 -279
7327b79n3J96p0J91oJK23j74j55M20l12K02p5k53L97m16j7k5J42K3j58Q4n9J78
$$ -279 -332 -136 -206 -15 -21 -20 203 29 -126 294 -18 184 109 -144 253 -163 -180 -205 -63 -40 -198 -114 -173 5
7351EK00j82K13k48J68j9J85k90R4o5J9j43J23J9K3j37K40l44K74j86j67K41R0
$$ 5 205 23 236 -12 156 137 322 32 126 61 80 -63 60 79 102 -35 205 -139 135 -51 -218 23 113
7374A13l26L65MP3k14j55L10o3j11J46j62J84l10K96l11QL31m8j2R6j50j66K44
$$ 113 -213 152 156 229 15 -140 170 107 -4 142 -20 164 -146 150 -161 -153 178 130 118 214 64 -102 142
7397A42j74r9J0L04m9J42m54N9q1R5J74k37J31M64m96R2j61J79l57K74J26oj50
$$ 142 -32 -131 -121 183 134 276 -178 -119 -200 -105 69 -168 -37 427 -69 23 -138 41 -316 -42 84 78 -72
7420g2R8j28p8J27j04L76j61J3l4k78K47Q4R6o5k20q0J30J68M6k19j64J1M31J6
$$ -72 26 -102 -180 -53 -157 219 58 71 37 -241 6 90 186 121 -99 -179 -49 119 165 -54 -218 -207 224 240
7444B40n2m9j1o9l56L21K15j25j94j32L91m49J79mJ06n5LO8m5j27k1J33q6R1L02
$$ 240 188 139 128 59 -297 24 239 114 -80 -212 179 -270 -91 -95 11 -44 -41 27 -18 -145 -166 -33 -119 -28 274
7469B74j46K99m47N3n8NK15j91j24J13r6J61Rj05qJ22m85K99N7k69M34J51q2j03
$$ 274 128 427 -20 33 -25 -20 195 4 -120 -7 -103 58 67 -38 -46 76 -409 -110 -53 -322 112 263 181 78
7493G8J23j99J23k6j5J21j71k53K79k07jJ10R7O8j07j03k5N0k09L72j01k3rL4
$$ 78 201 2 125 99 84 205 34 -219 60 -147 -148 -38 59 127 20 -83 -108 -58 -267 105 4 -19 -28 6
7517Fj46L72k42N4j09M5k45N3q2J49j62K04MJ67J50l44K01j7m9K77j11k32N8j70
$$ 6 -140 232 -10 44 -65 -20 -265 -212 -294 -145 -307 -103 -99 68 218 -126 75 58 9 286 175 -57 1 -169
7541a69J16jJ24k40l4N6P6K00o4k75J86j09K52k33K11K07k80J73k83J03l6J87
$$ -169 -53 -54 70 -170 -204 -148 -72 128 64 -211 -25 -134 118 -115 96 303 23 196 -87 16 -20 167
7563A67q4k58K83N9r6j01l24K99K48m55Q5N6lK6O9L15l2k29L2J11l35P1P5o5J64
$$ 167 83 -175 108 167 71 -30 -354 -55 193 -262 -177 -121 -124 -98 -29 286 254 25 57 168 -167 -96 -21 -86 78
7588G8J36k72j25j1K63l01L34m9K4R7Q7j64l2l1J24j13k29j41K65M9K04Q6l25
$$ 78 214 -58 -183 -194 69 -232 102 53 77 174 261 97 65 34 158 45 -184 -325 -60 -11 193 279 -46
7611d6O7K6j13J16J10m11K28Qj77L57j29p7L59j14q4J76l17J22Rj58J03j53r1
$$ -46 21 47 -66 50 160 -251 -23 -15 -192 165 36 -41 318 204 120 296 -21 101 110 -48 55 -98 -189
7634a89l2K87k57K27m3Q1J4J84l92j84K60Q3L0q8K22j05O7mj40k75M7K03KJ34
$$ -189 -221 66 -191 36 -7 74 88 272 -120 -304 -44 39 69 -19 203 98 165 161 21 -254 -207 -4 -2 132
7658A32m64L06k99J86L54k76l9%k8L68j64k20N8O8r0J95j50p1p0J74M0J75k55
$$ 132 -332 -26 -325 -139 215 -61 -100 -100 -128 240 76 -144 -86 -18 -108 87 -63 -134 -204 -30 10 185 -70
7681g0m7K6j00j02K61qj39K90N9PP5k9k36J44Mj74j57J79j80J00P2n6J7p3j0M
$$ -70 -117 -91 -191 -293 -32 -40 -179 111 170 177 252 223 -13 131 135 -39 -196 -17 -197 -97 -25 -81 -64 -137 -147 -143
7707a43K88j46j61J11j03K97j65L5nP8J27J96l23J09P2k07j20O6j23Q5J35j90
$$ -143 145 -1 -162 -51 -154 143 -22 13 8 86 213 409 86 195 267 60 -60 6 -117 -32 103 -87
7729h7Q8K4O6l39K62k13L26k45K64q8K24l49m9J89p3R0J07k85K22l08J52J39m65
$$ -87 1 25 91 -248 14 -199 127 -118 146 58 282 -67 -116 73 0 90 197 -88 134 -174 -22 117 -348
7752c48M11j30J64k36j86O72l51n5L38l05J8L6K32l65M12k47r4r0J98k32O4O8
$$ -348 63 -67 97 -139 -325 347 -4 -59 279 -26 -8 28 260 -105 307 60 -34 -124 74 -158 -94 -26
7774b6J12Q4j56K25q0r1r2p9J37L8k37K07K0K53l42k4N4j30M1M5R7j48p3N5K0
$$ -26 86 170 14 239 159 68 -24 -103 34 72 -165 42 62 315 -27 -51 3 -127 -86 -41 56 -92 -165 -110 -90
7799i0J27N9J3q1J23q6L11m84l6M43j94j36k31K14k35J52L50k34m2k01K14J33
$$ -90 37 96 109 28 151 65 376 -108 -144 299 105 -31 -262 -48 -283 -131 219 -15 -57 -258 -44 89
7821H9j52J71j52J89r5j41O9J48J41m33R7K28j12K13m06Nr4l6K38J32o05M87K06
$$ 89 -63 108 -44 145 50 -91 -22 126 267 -166 -69 159 47 260 -146 -141 -235 -271 -33 99 -506 -19 187
7844A87l97l5L46l37M78l9k64J44J23j24J8l78J25J2N1M2J78j47n3K53l07O3l12
$$ 187 -210 -245 101 -236 242 203 -61 83 206 82 100 -278 -153 -141 -90 -48 130 -17 -70 183 -124 -61 -373
7867c73L08L1J01qr8L05k81L46k74P1q5Q7l84L49k07P8j40J40k96M89l04K38J02
$$ -373 -65 -34 67 59 -39 266 -15 331 57 128 43 130 -254 95 -112 -34 -174 -34 -330 159 -145 93 195
7890A95j61k4K4L39l35M40o57j14N18j45J6N8k71r0j8M85k08p0j65J08K53J26
$$ 195 34 10 34 373 38 478 -179 -293 225 80 96 154 -117 -207 -225 260 52 -18 -183 -75 178 304
7912C04m44K39k7J10k10K13m16J97K56n16J70K05j16J02Rl94K59K2m9OK55j46
$$ 304 -140 99 72 182 -28 185 -231 -34 222 -294 -124 81 -35 67 76 -318 -59 -37 -86 -80 175 29
7934B9J52J6l22K96r7J81j66J53J09m95J00K29M4k39P8j68QK0K52k33M29j84k41
$$ 29 181 197 -125 171 74 255 89 242 351 -144 -44 185 229 -10 68 -100 -92 -72 180 -53 376 192 -49
7957d9J42q8n1r7K06L25j63j43k31P9k3P6k5K35k81m1p8P3M59m34j35L12J20o2
$$ -49 93 5 -46 -143 63 388 225 82 -149 -70 -93 -17 -42 193 -88 -129 -207 -134 325 -109 -244 68 188 126
7981A26J1k88J99J48l80K70k39J67l8n9R5j80L02k33K00rr1P9j27J43j3k2o2L38
$$ 126 137 -151 48 196 -184 86 -153 14 -24 -83 12 -168 134 -99 101 92 1 80 -47 96 83 61 -1 337
8005C37k92M0J97m75J2N14k69j22r3J23o9P4K15j54j3k67lL43k27K99N8k52J49
$$ 337 45 85 282 -193 -181 333 64 -58 -151 -28 -97 -23 192 38 25 -242 -245 98 -129 170 228 -24 125
8028A25Q4p3P4p1k55j2K51j62j11M73k72q8q0m7p7J1M82l54J40q9J36N4k35K00
$$ 125 209 136 210 139 -116 -128 123 -39 -150 323 51 -37 -117 -164 -241 -230 252 -102 38 -51 85 139 -96 104
8052A04N7j54j14R7j10N9k24R7J37o3K34j24j03J22R7m49K18Q1J61M2r9J50m57
$$ 104 161 7 -107 -10 -120 -61 -285 -188 -51 -114 120 -4 -107 15 112 -337 -119 -38 123 165 66 216 -241
8075b41J34J85k72N1J69j21P1L3j32J81j57L03k57P3j60jL21QL5L5j76k06L98
$$ -241 -107 78 -194 -143 26 -95 -24 9 -123 58 -99 204 -53 20 -140 -141 180 188 223 258 82 -124 274
8098B74k27j75P7n2L48J23k95j46J6r0J35J92M8k86N7j78K28J58k37j11L22n60
$$ 274 47 -128 -51 -103 245 368 73 -73 -57 -147 -12 180 228 -58 -1 -179 49 207 -30 -141 181 -379
8120c79N74jO2n40K24M1O1Q2k20J59r8r8k7p9M41k29J59k52n2J18J44k88J09q3
$$ -379 195 194 256 -284 -60 -19 42 124 -96 63 -35 -133 -160 -239 202 -27 132 -120 -172 -54 90 -198 -89 -172
8144a72L61k32R1R5k47q6J91qJ7J3k01K79l44J94L55m38R3J13k62N72p59M07J78
$$ -172 189 -43 48 143 -104 -190 1 -7 10 23 -178 101 -243 -49 306 -132 -39 74 -188 384 -375 32 210
8167B10k28k29L62k47J15K08k35R0j03Rl1k9L40k8l70L01k09J81o8q6N9J81m13
$$ 210 -18 -247 115 -132 -17 191 -44 46 -57 -48 -79 -108 232 204 -166 135 -74 107 39 -47 12 193 -220
8190b20L80
$$ -220 160
8191A60
$$ Imaginary data points
##PAGE= N=2
##DATA TABLE= (X++(I..I)), XYDATA
0@%%%%%%oJ4qQj6K4l2M0m8N6p2Q8j12J36j60J95k35K75l23L79m38N08n88O78p74
$$ 0 0 0 0 0 0 0 -6 8 0 8 -8 16 -16 24 -24 32 -40 48 -64 72 -88 107 -128 147 -176 203 -235 273 -315 363 -411
31d11Q79j000J136j286J448j627J825k042K277k534K818l129L468l836M238m680
$$ -411 468 -532 604 -682 766 -861 964 -1078 1199 -1335 1483 -1646 1822 -2014 2224 -2456
47b456N162n688O267o904P607q383R247j0216J1304j2537J3950j5589J7514j9811
$$ -2456 2706 -2982 3285 -3619 3988 -4395 4852 -5364 5940 -6597 7353 -8236 9278 -10533
61a0533K2612k6113L0638l6738M5450n8990Q3024j38127M85576M1861j094443
$$ -10533 12079 -14034 16604 -20134 25316 -33674 49350 -88777 396799 438660 -655783
72f55783M23505O92546l07007n35530L51241K33946k45815p1595J47541j94004
$$ -655783 -232278 460268 153261 -382269 -31028 202918 -42897 -114492 33049 -160955
82a60955L1691M00159q8460n50671J79703N98027k04477o02528K82733N74690
$$ -160955 -129264 270895 182435 -368236 -188533 409494 205017 -397511 -114778 459912
92D59912l02037n31482K84023L85401k48739k37901K05581N8271j83111N6424
$$ 459912 157875 -373607 -89584 295817 47078 -190823 14758 73029 -110082 -53658
102e3658J33552j66977n0841K69289m570l21478O3543L36276p6221k78774J23622
$$ -53658 79894 -87083 -137924 131365 126795 -194683 -131140 205136 128915 -149859 -26237
113b6237K25932j64901j84431J78689J20260j80995o1230J50865k5994j64308
$$ -26237 199695 34794 -149637 29052 149312 -31683 -92913 57952 31958 -132350
123a32350O1801J67795p7500j55663R2227J36320r4172r1886J10050Q1860p7642
$$ -132350 -70549 97246 19746 -135917 -43690 92630 -1542 -93428 16622 98482 20840
134B0840l9280N4658j5372m1295P5323L0942j33122l5226J40338j386j64779J4124
$$ 20840 -18440 36218 20846 -20449 54874 85816 -47306 -82532 57806 56420 -108359 -94235
146i4235J76550k3992j85606K1954J82411p799j43345K6227J28989j9034j00167
$$ -94235 82315 58323 -127283 -105329 77082 69283 -74062 -47835 81154 62120 -38047
157c8047K6971P5512k9515l2476L4248l3481o0468P0442N1468j21343m6476J49394
$$ -38047 -11076 64436 34921 2445 36693 3212 -57256 13186 64654 -56689 -103165 46229
169D6229J3971j83229J9715K06829m1003j84808Q2671J65094r4943j16207J15416
$$ 46229 60200 -123029 -103314 103515 62512 -122296 -39625 125469 30526 -85681 29735
180B9735Q1787j09880m1200Q6541j4265p2345M4705L3076q5858j2863R2507k6545
$$ 29735 111522 1642 -39558 46983 32718 -39627 5078 38154 -47704 -60567 31940 5395
192E395j04017O6618J14639r5557j04468J33919J06492j35172p7715J44471O1183
$$ 5395 -98622 -32004 82635 -12922 -117390 16529 123021 -12151 -89866 54605 115788
203A15788j30667l7341J04458N647p9294L967K4951k9542O481K6169n0126l0584
$$ 115788 -14879 -52220 52238 57885 -21409 -17442 7509 -22033 -15552 10617 -39509 -70093
215g0093Q2122L3345j00501k2509J25218L0149j14435j5173J15734K0547j01885
$$ -70093 12029 45374 -55127 -77636 47582 77731 -36704 -51877 63857 84404 -17481
226a7481k1223Q4857J6820p1247k3952L0860O853j4133j1338j5777N959L4627
$$ -17481 -38704 46153 62973 -8274 -32226 -1366 5487 -8646 -19984 -35761 -29802 4825
238D825m578n3211J4282Q5543n373q4816J9451R1408j3779p5941J5248O3250j7499
$$ 4825 247 -52964 -38682 46861 41488 -43328 -23877 67531 53752 -22189 -6941 56309 38810
251C8810n8319K395K8216l692j7331j6727o755J9499J0926k2828j0158L2648K5452
$$ 38810 -19509 -17114 11102 7410 -9921 -26648 -33403 -13904 -2978 -25806 -35964 -3316 22136
264B2136k4861k2594L6311L5394k4665k6181K1123K3694j9997l0835J0696K0052
$$ 22136 -2725 -25319 10992 46386 21721 -4460 16663 40357 20360 -10475 221 20273
276B0273k0395k4885N769P929m196q456k317J3093J1898m718o418J1433K3592
$$ 20273 -122 -25007 -19238 -11309 -15505 -23961 -26278 -13185 -1287 -6005 -12423 -990 22602
289B2602K96k1045Q975K7288j0565k9013J751K1800l267l4548j1499K4648K482
$$ 22602 22898 1853 10828 38116 27551 -1462 289 22089 18822 -15726 -27225 -2577 -95
302i5k7562p337J8969J4522q674j4291J2541K5889P077j4232j0730K3623K5942
$$ -95 -27657 -34994 -16025 -1503 -10177 -24468 -11927 13962 21039 6807 -3923 19700 45642
315D5642k6313l0663K3362K4199k6314l3513Q235K2167j2200k4786K404J3143
$$ 45642 19329 -11334 12028 36227 9913 -23600 -15365 6802 -5398 -30184 -27780 -14637
327a4637P484k192j3492N937L0352N694j9231k8K4205J0500k1428j2205J8625
$$ -14637 -7153 -9345 -22837 -16900 13452 19146 -85 -113 24092 34592 13164 959 19584
340A9584N589k0785j2272J109K757n055j1955j842O808J989k98k649L732J7257
$$ 19584 25173 4388 -7884 -6775 -4018 -9073 -21028 -22870 -16062 -14073 -14371 -17020 -13288 3969
354C969O574n771J734R635P612l561r167L469M581j0798r199j944l763l469m487
$$ 3969 10543 4772 6506 16141 23753 20192 11025 14494 19075 8277 -922 -2866 -6629 -10098 -14585
369a4585l863q11N04N574J374m162J2515J4396o236l529J3988R793o954o880O536
$$ -14585 -18448 -19259 -18755 -13181 -11807 -15969 -3454 10942 4706 1177 15165 24958 18004 11124 17660
384A7660K539j2908p185N62m718l289m346j0650K365R359l045q215P444J8386
$$ 17660 20199 7291 106 668 -4050 -7339 -11685 -22335 -19970 -10611 -13656 -21871 -14427 3959
398C959K531j2104O907K0293O54j0989M22R815J349j4915j2609N910N513j0551
$$ 3959 6490 -5614 1293 21586 22240 11251 11673 21488 22837 7922 -4687 1223 6736 -3815
412c815j5493l474J0624K718j2498j884J6658J0571p674o857J6802J9514p411
$$ -3815 -19308 -22782 -12158 -9440 -21938 -23822 -7164 3407 -4267 -11124 5678 25192 17781
425A7781j3516Q207J3953l898j8043p250J2196J762k1627j4009J2259J0576j4350
$$ 17781 4265 12472 26425 22527 4484 -2766 9430 11192 -10435 -24444 -12185 -1609 -15959
438a5959j5151J2472J8415l242j0010N544J9130J0354j2592r190J8098J6968j7047
$$ -15959 -31110 -18638 -223 -3465 -13475 -7931 11199 21553 8961 -229 17869 34837 17790
451A7790k2996J0254J7377j5821k5563L597J4360m903j7955n756J8312J5584j4656
$$ 17790 -5206 5048 22425 6604 -18959 -15362 -1002 -5905 -23860 -29616 -11304 4280 -10376
464a0376j4813K0545K6456q023j9411J3342K3723p633k0792K05J5024L438k2205
$$ -10376 -25189 -4644 21812 13789 -5622 7720 31443 23810 3018 3223 18247 21685 -520
477e20k0138J2507J6821j8786k5739J2613K7443q832k5500J0837L1040L308j9111
$$ -520 -20658 -8151 8670 -10116 -35855 -23242 4201 -4631 -30131 -19294 11746 15054 -4057
490d057k197K4125J7103j9336k1240J6001K2025j5660l1221J101K5706m721l5460
$$ -4057 -6254 17871 34974 15638 -5602 10399 32424 16764 -14457 -13356 12350 7629 -27831
503b7831p042K9214J3000k5318j8981K5783L0470j4830k3211J9067L2018m115
$$ -27831 -34873 -5659 7341 -17977 -36958 -11175 19295 4465 -18746 321 32339 28224
515B8224l0385l596L2778J1263l3500k4219J9616K1319k4931l4270J8012L1825
$$ 28224 -2161 -5757 27021 38284 4784 -19435 181 21500 -3431 -37701 -19689 12136
527A2136j7122l3143Q052L3975J1319k2584j1564K7043K3602j7487k4167J7706
$$ 12136 -4986 -38129 -30077 3898 15217 -7367 -18931 8112 31714 14227 -9940 7766
539G766L4721j3909m2355J776L1697k457l2415j3429K2096J5875k7824k5827K6669
$$ 7766 42487 28578 -13777 -12001 19696 17239 -15176 -28605 -6509 9366 -18458 -44285 -17616
552a7616L5288j3354l2370J4297L9447m552k8609Q884K8637J814k3831j8189J3323
$$ -17616 17672 4318 -28052 -13755 25692 21140 -7469 1415 30052 31866 8035 -10154 3169
565C169K2122j6096l1040L403K5454o745l5859J051M0910P016l4715p675L3604
$$ 3169 25291 9195 -21845 -18442 7012 267 -35592 -34541 6369 13385 -21330 -29005 4599
578D599K0493k2481j4883L1204K1853k8898k3991J8943K0536j0576k5063m308
$$ 4599 25092 2611 -12272 18932 40785 11887 -12104 6839 27375 16799 -8264 -12572
590a2572J2725n9j7767j3567J7113K7952j6550l8981J8539M9020o601l8757J2603
$$ -12572 153 94 -17673 -31240 -14127 13825 -2725 -41706 -23167 25853 19252 -19505 -6902
603f902M6967p450n0920M985N1960J781m6991j6281K6135J0957k4624j7360J2963
$$ -6902 40065 32615 -18305 -13320 38640 40421 -6570 -22851 3284 14241 -10383 -27743 -14780
616a4780J6750r86k4642j9198L5369M5303k8485m7201L3107N7130k9843n6195
$$ -14780 1970 984 -23658 -42856 -7487 37816 9331 -37870 -4763 52367 22524 -33671
628c3671L5824O1066l5822o0718J9156L8854j2888k8865k375J1289N237o674j7265
$$ -33671 2153 63219 27397 -33321 -14165 24689 11801 -17064 -19439 -8150 -2913 -9587 -26852
641b6852k430L4959K1757l7946k5214M5789L4686l7635k9878M2577L3594m6204
$$ -26852 -29282 5677 27434 -10512 -35726 10063 44749 7114 -22764 19813 53407 7203
653G203m0053L8526L1335l5904k9790K0778J3742k0479j2128J2158R212L895J922
$$ 7203 -32850 5676 37011 1107 -28683 -7905 5837 -14642 -26770 -14612 -5400 -1505 417
666D17j4596k707L2252J2444l0713l974L9305K462m7505p121M9148O341n2094
$$ 417 -14179 -16886 15366 27810 -2903 -6877 32428 34890 -12615 -19736 29412 35753 -16341
679a6341j4762L6804O120l7178q496L4187J0661k7465j0868J8674J6602M854m663
$$ -16341 -31103 5701 11821 -25357 -33853 334 10995 -16470 -27338 -8664 7938 12792 8129
692H129j0477P307K1998o618l0211P845L9114j2057n3296K092M5264n540m5339
$$ 8129 -2348 4959 26957 20339 -9872 -2027 37087 25030 -28266 -26174 19090 13550 -31789
705c1789J079L9020j449l6544O43L5568J0502j8453n769J3110R813r61m092m576
$$ -31789 -30710 8310 6861 -29683 -29040 6528 17030 -1423 -7192 5918 15731 14770 10678 6102
719F102L717J1771q617k9975K809L2412q685m1671N204L8955j1593l9110J8552
$$ 6102 9819 21590 12973 -17002 -14193 18219 9534 -32137 -26933 12022 429 -38681 -20129
732b0129M1273j5635k7816K0553K3819j2970r504J5251N368j2256q25J077j1355
$$ -20129 21144 5509 -22307 -1754 22065 9095 -409 14842 20210 7954 7129 8206 -3149
745c149K806J1488j5929k1171J5307J8610k2691j9827L1138K4758l2703j9846
$$ -3149 -343 11145 -4784 -25955 -10648 7962 -14729 -34556 -3418 21340 -11363 -31209
757c1209M0017K3646l0586j4482L0670J3553k5423j1513J4129L443p212m945j2618
$$ -31209 8808 32454 1868 -12614 18056 31609 6186 -5327 8802 12245 5033 88 -12530
770a2530m083J7974Q11k7537k601L4647P433l6927n069M5425J2545l5765q671
$$ -12530 -16613 1361 2172 -25365 -27966 6681 14114 -22813 -27882 17543 30088 -5677 -14348
783a4348L3932J2816k6564j4395J9318R935j6475j2823j452M740P880q746j8689
$$ -14348 19584 32400 5836 -8559 10759 20694 4219 -8604 -10056 -5316 2564 -6182 -24871
796b4871N254K4108j206k6357L880L7388J866l1561L732L1277O35k2562k875J5852
$$ -24871 -19617 4491 3285 -23072 -19192 18196 20062 -11499 -7767 23510 24145 1583 -1292 14560
810A4560K228j6405p257L765K831j956r917o791R965Q073q748p108J0761J4949
$$ 14560 16788 383 -6874 -3109 -278 -2234 -12151 -18942 -8977 -904 -9652 -16760 -5999 8950
824H950l926j2151J0689J6877o864j2974N823J1563n396j6032r68J0296m111j3268
$$ 8950 5024 -7127 3562 20439 13575 601 6424 17987 12591 -3441 -4409 5887 1776 -11492
838a1492k270N614K990m662n395O161J0166pm929J031J2167P668j0420n887J1981
$$ -11492 -13762 -8148 -5158 -9820 -15215 -9054 1112 1105 -3824 -2793 9374 17042 6622 735 12716
853A2716N592j1329j0519M530Q800r708j5345M487Q829m654q470K88R780N759
$$ 12716 18308 6979 -3540 990 9790 82 -15263 -10776 -1947 -6601 -15071 -14783 -5003 756
867G56n305k497Q430R518O28p900J69J1969K64j3335l133P358J140j1635r171
$$ 756 -4549 -7046 1384 10902 11530 3630 3799 15768 16032 2697 -436 6922 8062 -3573 -12744
882a2744O462N753q973o751N594P623l35n967L803J0858L309m109j234M759P193
$$ -12744 -6282 -529 -9502 -16253 -10659 -3036 -3371 -9338 -5535 5323 8632 4523 3289 8048 15241
897A5241k391j0652N51Q422m373j3442l502R513O88j3317l620J0065L235m208
$$ 15241 12850 2198 2749 11171 6798 -6644 -10146 -633 55 -13262 -16882 -6817 -3582 -7790
911g790p75N198P035J972k707k46N930P038l759r854J934Q282o577j2022O61O634
$$ -7790 -8565 -3367 3668 5640 2933 2687 8617 15655 11896 2042 3976 12258 5681 -6341 -5680 954
927I54l951j0679O07P687r90k861K019L271M160L698j094l6O568M674n250o281
$$ 954 -2997 -13676 -13069 -5382 -6372 -9233 -7214 -3943 217 3915 2821 2785 9353 14027 8777 2496
943B496N632M470r519q143M002K792p244p210K438N606j870m520K667N972L271
$$ 2496 8128 12598 3079 -5064 -1062 1730 -5514 -12724 -10286 -4680 -6550 -11070 -8403 -2431 840
958H40j94r00N075O941j370n931P61O767o39j0567m003O517n21j0516n493O408
$$ 840 646 -254 4821 11762 10392 4461 5222 11989 11350 783 -3220 3297 2776 -7740 -13233 -6825
974f825M669n978n757N780Q240L70l727J183Q985N529o171m401O275O570n858
$$ -6825 -2156 -8134 -13891 -8111 129 499 -3228 -2045 6940 12469 6298 1897 8172 14742 8884
989H884j0830J824O928n477j0767q80O577R27q009l537P857P296k663m814M866
$$ 8884 -1946 -122 6806 1329 -9438 -10318 -3741 -2814 -10823 -14360 -6503 793 -1870 -6684 -1818
1004a818J0867J015q103J418R729M15r946l911N994J568r017p475L419L559l493
$$ -1818 9049 10064 1961 3379 13108 13523 3577 -334 5660 7228 -1789 -9264 -5845 -2286 -5779
1019e779o155k10Q381L533p216m44J0800P006n433n954Q398R090o850q494L841
$$ -5779 -11934 -12144 -3763 -230 -7446 -7890 2910 9916 4483 -1471 6927 16017 9167 673 4514
1034D514M847l945r904l128O477Q41q525n151N250P259k233p371N782J1588p20
$$ 4514 9361 5416 -4488 -7616 -1139 -298 -8823 -13974 -8724 -1465 -3698 -11069 -5287 6301 5581
1049E581p030K454J0262L596r696n178P810L555q635q400J543O911m068j2010
$$ 5581 -1449 1005 11267 14863 5167 -11 7799 11354 2719 -5681 -4138 2773 -1295 -13305
1063a3305N42R878J315p444k945R574R217n267n581Q149Q576k354p773m8R188
$$ -13305 -12763 -2885 -1570 -9014 -11959 -2385 6832 1565 -4016 4133 12709 10355 2582 2534 11722
1078A1722p47j1775l684O130J950q379q629M818Q289m924p827M634R867J630p247
$$ 11722 10975 -800 -4484 1646 3596 -4783 -13412 -8594 -305 -5229 -13056 -8422 1445 3075 -4172
1093d172M15J2023M034q247k613O454M882n722r457K070O582m686j0274k030P295
$$ -4172 -3757 8266 12300 4053 1440 7894 12776 7054 -2403 -333 6249 1563 -8711 -10741 -3446
1108c446L171r393m843J0566P031n790m522P284J1043l071q906M492R537j466
$$ -3446 -275 -9668 -14511 -3945 3086 -2704 -7226 58 11101 8030 -876 3616 13153 11687
1122A1687r376l855N524L934r275r120M492O633m157j0442J627J3077R62r900
$$ 11687 2311 -1544 3980 7914 -1361 -10481 -5989 644 -3513 -13955 -12328 749 1711 -8189
1136h189L19J1658N212n477m425P100Q202o060r046K242P487j801j2172m102Q582
$$ -8189 -7870 3788 9000 3523 -902 6198 14400 8340 -706 1536 9023 7222 -4950 -9052 -470
1151d70J252r569l958O958O273m040p113N854J1413k71p240M71J0169L389r970
$$ -470 782 -8787 -12745 -5787 486 -3554 -10667 -4813 6600 6329 -911 -440 9729 13118 3148
1166C148m206R182L121r356r250L651P451m791j0455O68Q918Q17q031j876J0795
$$ 3148 -1058 8124 11245 1889 -7361 -3710 3741 -1050 -11505 -10837 -1919 -1102 -9133 -11009 -214
1181b14P345n789n316P362Q470k214q976J267R433j315j2492l618P829K647r706
$$ -214 7131 1342 -3974 3388 11858 9644 668 1935 11368 10053 -2439 -6057 1772 4419 -5287
1196e287p145O444N769n287n829M230R521J460p745k31J0672M525p083l039O425
$$ -5287 -12432 -5988 -219 -5506 -11335 -7105 2416 3876 -3869 -4100 6572 11097 4014 975 7400
1211G400M356o962q480L079O358l899j0228j301P910N49q866n54R976L538o503
$$ 7400 11756 4794 -3686 -607 5751 1852 -8376 -9677 -1767 -1218 -10084 -10638 -662 2876 -3627
1226c627k607P323P867k156n726J727P445j52r911k708Q840J301j1363o529O314
$$ -3627 -6234 1089 8956 6800 1074 2801 10246 10094 183 -2525 6315 7616 -3747 -10276 -3962
1241c962M825n998o593M305P673j300n783J624J0020M119o813l346P591N210n583
$$ -3962 863 -5135 -11728 -7423 250 -1050 -6833 -5209 4811 8930 2117 -1229 6362 11572 5989
1256E989o466K505N806l442j0142j541O737J168q330l756P657M483n926k797O765
$$ 5989 -477 2028 7834 4392 -5750 -7291 -554 614 -7716 -11472 -3815 668 -5258 -8055 -1290
1271a290O836j298m388J024P312J253n823k855M455L392p161q144L765N350m883
$$ -1290 5546 4248 -140 884 8196 9449 3626 771 5226 8618 1457 -6687 -2922 2428 -2455
1286b455p231J710N974O15n986Q7Q788K887m400j603N520N257k257m998J674L391
$$ -2455 -9686 -7976 -2002 -1387 -7373 -7286 1502 4389 -11 -1614 3906 9163 6906 1908 3582 6973
1302F973j288n822l687M181K594p855n378N623M385m571m708N292O965j909m200
$$ 6973 5685 -137 -3824 357 2951 -4904 -10282 -4659 -274 -4845 -9553 -4261 2704 795 -3405
1317c405L999O244J077m142k644M703L132n931n279K122L676l316p885j17O150
$$ -3405 594 6838 7915 3773 1129 5832 8964 3033 -2246 -124 3552 236 -7649 -7766 -1616
1332a616M97o224k013P082N441m873m071Q075O327m412l845L168N123j399n995
$$ -1616 -1119 -7343 -9356 -2274 3167 -1706 -5777 2298 8625 4213 368 3536 8659 7260 1265
1347A265j828L482O39m814n761J261O277k735p915K328Q069P22n440j47Q593L619
$$ 1265 -563 2919 3558 -1256 -7017 -5756 521 -2214 -10129 -7801 268 990 -4450 -4597 3996 7615
1363G615o152j549O278K929m088m915J495L372k781n427j447J702K224m056m751
$$ 7615 1463 -86 6192 9121 5033 118 1613 4985 2204 -3223 -4670 -2968 -744 -4800 -9551
1378i551M205O154k851m415L879P396k57n934K502P645j372n573o13L096Q29m507
$$ -9551 -5346 808 -2043 -6458 -2579 4817 4560 -1374 1128 8773 7401 1828 1215 4311 5140 633
1394F33m608J468K578k812m031m37M639J787m458j183O748M225l038l092M405
$$ 633 -3975 -2507 71 -2741 -6772 -7209 -2570 -783 -5241 -6424 324 4549 1511 -1581 2824
1409B824O300l557n553K951M174k810n687j284L113On069k779K659L142p75m686
$$ 2824 9124 5567 14 2965 7139 4329 -1358 -2642 471 477 -4592 -7371 -4712 -1570 -2345 -7031
1425g031K075P224O28m673Q57O132K717m691l147M845K652m762m985J213L539
$$ -7031 -4956 2268 2896 -1777 -920 5212 7929 3238 91 4936 7588 2826 -2159 -946 2593
1440B593k203o964r2M846M86m263j245M400M142j967k428L489N349j70m705l77
$$ 2593 390 -6574 -6666 -1820 -1334 -5597 -6842 -2442 1700 -267 -2695 794 6143 5973 1268 891
1456H91N425J373o427l132L746J386n224n086K476M671k874m779J636N423J017
$$ 891 6316 7689 1262 -1870 1876 3262 -1962 -7048 -4572 99 -2775 -7554 -5918 -495 522
1471E22k999J02N281K903k679k728K643M532j218o633n39M961j484o372j624M477
$$ 522 -2477 -2375 2906 5809 3130 402 3045 7577 6359 -274 -813 4148 2664 -3708 -5332 -855
1487h55J241o092k297M694L611j899k511K695N001K51l029J56N196J971m877m283
$$ -855 386 -5706 -8003 -3309 302 -1597 -4108 -1413 3588 3839 810 966 6162 8133 3256 -1027
1503a027K984L506m548n764J861M244k810o359Q20O575Q76m627n63N023L560k315
$$ -1027 1957 5463 915 -4849 -2988 1256 -1554 -7913 -7093 -518 358 -4269 -4832 191 3751 1436
1519A436k132L691M720j935n042r87M860J519o783l919M249K183n956m343M293
$$ 1436 -696 2995 7715 5780 738 -249 4611 6130 -653 -4572 -323 1860 -4096 -8439 -4146
1534d146N548l512m870L289N806L28k820K17M649K440m475k996L647L704l333
$$ -4146 1402 -2110 -6980 -3691 2115 2443 -377 -160 4489 6929 2454 -542 3105 6809 3476
1549C476n908J24M281j805o052k72M898J482m934k753N851M640k840k651L309
$$ 3476 -2432 -2308 1973 168 -5884 -6156 -1258 224 -4710 -7463 -1612 3028 188 -2463 846
1564H46N004j287m251J057M458J16m886l324K442K578l952n133K686M111k741
$$ 846 5850 4563 312 1369 5827 5943 1057 -2267 175 2753 -1199 -6332 -3646 465 -2276
1579b276m739J669O080J214m474K92N169K079k899j955L444L739l555n091J443
$$ -2276 -7015 -5346 734 1948 -2526 -2234 2935 5014 2115 160 3604 7343 3788 -1303 140
1594A40K806j189m405k106L323J067m189k390M135M315k354l823L186O281j315
$$ 140 2946 1757 -2648 -4754 -1431 -364 -4553 -6943 -2808 1507 -847 -4670 -1484 4797 3482
1609C482l763J612M005O67m496k481K888K332l861m405R96L464j840n105J227
$$ 3482 -281 1331 5336 6003 1507 -974 1914 4246 385 -4020 -3024 440 -1400 -6505 -5278
1624e278M856j61k747l41L987L393j482k778K641L961j368m618O54M138j424n391
$$ -5278 -422 -583 -3330 -3671 316 3709 2227 -551 2090 6051 4683 65 719 4857 3433 -1958
1640a958j127K840J57l540j990K038L528j543l048J813M701O23k829l15M801J370
$$ -1958 -3085 -245 -88 -3628 -5618 -3580 -52 -1595 -4643 -2830 1871 2494 -335 -650 4151 5521
1656E521l742j383K327J987k491m532M90L445k178m432M99L384j71k971j27L556
$$ 5521 1779 396 2723 4710 2219 -2313 -1823 1622 -556 -4988 -4489 -1105 -1276 -4247 -4374 -818
1672h18K315r77j380J449M160r9l834J79L908p05m289j355K234O52l331k592J525
$$ -818 1497 520 -860 589 4749 4650 816 995 4903 4198 -91 -1446 788 1440 -1891 -4483 -2958
1689b958K290j304k903J098M057N94k992Q68M083R92j422j459J627K089j646l174
$$ -2958 -668 -1972 -4875 -3777 280 874 -2118 -1250 2833 3825 2403 944 2571 4660 3014 -160
1705a60j00K353j129m216n50K901k59k904m19K259J977p01j397J812L710J53k588
$$ -160 -260 2093 964 -3252 -3802 -901 -1160 -4064 -4483 -2224 -247 -948 -2345 -533 3177 3330 742
1722G42j87L742M37l836r54J771L31k816j833J92J763q92k660K41K929O67j828
$$ 742 555 4297 4734 898 -56 1715 2046 -770 -2603 -2411 -648 -1540 -4200 -3959 -1030 -363 -2191
1739b191k14L719J607j635q13J820J676m96k568k38K098q53l303j383J992L06
$$ -2191 -2405 1314 2921 1286 473 2293 3969 3473 905 667 2765 1912 -1391 -2774 -782 -476
1755d76k193j419J546J655j090m85Q87K754P34j397n9K759P98j886j007J203N63
$$ -476 -2669 -4088 -2542 -887 -1977 -2462 -1575 1179 1913 516 457 3216 4014 2128 1121 2324 2887
1772B887j823k255J51J016r96k339m79J814J247k016k34K380J662m65m48J587
$$ 2887 1064 -1191 -1040 -24 -1020 -3359 -3838 -2024 -777 -2793 -3027 -647 1015 550 102 1689
1788A689J405K44j251p65O96J246k294k378J688N9k259j336N01J088j51q61M61
$$ 1689 3094 3338 2087 1322 2018 3264 970 -1408 280 339 -1920 -3256 -2755 -1667 -1818 -2679 -2218
1805b218J492J414m29k97J585J529r23o36J121j03m59j304r47K66J39j870j633
$$ -2218 -726 688 259 -38 1547 3076 2153 1517 2638 2535 2076 772 -175 91 230 -1640 -3273
1822c273R53J198j159j160J555K035o34m6J077R71J023m08p94J184P97j324j725
$$ -3273 -2320 -1122 -2281 -3441 -1886 149 -485 -531 546 1517 2540 2132 1338 2522 3319 1995 270
1839B70j23J052j202k294l6O73Lp64r41J537J964o01j044J922J876k39j002P26
$$ 270 147 1199 -3 -2297 -2333 -1660 -1657 -2421 -3362 -1825 139 -462 -1506 416 2292 2053 1051 1777
1857A777Q67M36j952o96M64L16r42k415l44J695q58j998Q76J560N88o86j30J843
$$ 1777 2644 3080 1128 432 896 1212 270 -2145 -2489 -794 -1652 -3650 -2774 -1214 -626 -1312 -1442 401
1875D01J564l34n14L77J605K9k280l3J249r77j902q45M32K89q29j398N11K139
$$ 401 1965 1631 1117 1494 3099 3128 848 815 2064 1087 -815 -1660 -1228 -939 -1768 -3166 -2655 -516
1893e16k13j162L34K593O37j414L97J881M89p89j149J26R67j004k409l42J537
$$ -516 -729 -1891 -1557 1036 1673 259 656 2537 3026 2237 1088 1214 2181 1177 -1232 -1574 -37
1910c7n25k220o89K272P53j798o0J389J889J21j457O76K899p8k170j00J601L19
$$ -37 -562 -2782 -3471 -1199 -446 -2244 -2304 -915 974 1095 -362 314 3213 3135 965 865 2466 2785
1928B785k453j428O57Q32j415j668R7J540M17j909J3K569P96j035k58J862J773
$$ 2785 332 -1096 -439 393 -1022 -2690 -2593 -1053 -636 -2545 -2532 37 833 -202 -460 1402 3175
1945C175r72j427M56J695m46k693r11J875J2k886j300J895Q52j524j039J473K472
$$ 3175 2203 776 1232 2927 2481 -212 -1123 752 764 -2122 -3422 -1527 -675 -2199 -3238 -1765 707
1962G07k24j472O63K651K93j705o58K276J140k695j671J103J063j244k744L01
$$ 707 483 -989 -326 2325 2618 913 255 2531 3671 976 -695 408 1471 227 -2517 -2216
1978b216J980l14k358n16K686J726j689j113K649J787j225r71P07K033m60k431
$$ -2216 -236 -550 -2908 -3424 -738 988 -701 -1814 835 2622 1397 426 1133 3166 2706 275
1994B75q57K114j14k262j814J703J333j965j931J588J858M30k268K33L230Q16
$$ 275 -582 1532 1418 -844 -2658 -955 378 -1587 -3518 -1930 -72 358 -1910 -1677 1553 2369
2010B369j889q94K966J338k184k248J562J262j596k200l74J539M07k650m74K200
$$ 2369 480 -414 2552 3890 1706 -542 1020 2282 686 -1514 -1888 -349 58 -2592 -3066 -866
2026h66J329k041j386K600K600q44k055J073K743j57k625n15K539N02l338j817
$$ -866 463 -1578 -2964 -364 2236 1392 -663 410 3153 2996 371 -144 2395 2897 -441 -2258
2042b258J943J097j888k012O36K439n86k435M22L161J423j751j175K314K160j752
$$ -2258 -315 782 -1106 -3118 -2482 -43 -629 -3064 -2642 519 1942 191 -984 1330 3490 1738
2058A738j787J277J914j320l364N6K625l96k651r54K063Q21k027j497K437K388
$$ 1738 -49 1228 3142 1822 -1542 -1486 1139 743 -1908 -2862 -799 22 -2005 -3502 -1065 1323
2074A323q62j856R04K846N45k183l70K338O08k876k094J956J736k091l254J256
$$ 1323 461 -1395 -491 2355 2900 717 347 2685 3293 417 -1677 279 2015 -76 -3330 -2074
2090b074K104o84k583O22K801R92k279o18K411J922q26j826J270J968j329k356
$$ -2074 30 -654 -3237 -2615 186 1178 -1101 -1719 692 2614 1788 -38 1232 3200 1871 -485
2106d85o3K430J08l354j810K467J169k298j311J770J827o51j923R56L202K04j999
$$ -485 -548 1882 1990 -1364 -3174 -707 462 -1836 -3147 -1377 450 -201 -2124 -1168 2034 2238 239
2123B39j34K285N80j873j778J863J300k102k579J71K071o0k887K71K465Q2j731
$$ 239 105 2390 2970 1097 -681 1182 2482 380 -2199 -2028 43 -17 -2904 -2633 -168 -86 -1817
2140a817l96K790J712j684j542J917J807n40k169Q1K229n42k572j236J642Q23
$$ -1817 -2213 577 2289 605 -937 980 2787 2247 78 159 2388 1846 -726 -1962 -320 503
2156E03j676j641J245K036j188j626J011K712J59k440P7K792P04j857o32J210
$$ 503 -1173 -2814 -1569 467 -721 -2347 -1336 1376 1535 -905 -828 1964 2668 811 179 1389
2172A389Q53j650j930N42K219j591j953k93J696Q38k224j09K096J215j044r10
$$ 1389 2242 592 -1338 -796 1423 -168 -2121 -2414 -718 120 -2104 -2213 -117 1098 54 -856
2188h56J144K580o60k254N28K000n19k368n01J697L12k061j626J126J338r25j143
$$ -856 288 2868 2208 -46 482 2482 1963 -405 -906 791 1103 -958 -2584 -1458 -120 -1045 -2188
2205b188L85J979L95j996N07K440J117j931q42J589J102j564j289N91J149r62
$$ -2188 -1803 176 571 -1425 -918 1522 2639 708 -134 1455 2557 993 -296 295 1444 482
2221D82k269l59J979j91j762n20J791J051p46q98J293J893k58j235L46J256M61
$$ 482 -1787 -2146 -167 -358 -2120 -2640 -849 202 -544 -1442 -149 1744 1486 251 597 1853 2314
2238B314j665j125J587K06j754j305J045Q41j194j314K70J637L13j171M0J805
$$ 2314 649 -476 1111 1317 -437 -1742 -697 144 -1050 -2364 -2094 -457 -144 -1315 -1275 530
2254E30J262j466m18J307J182j129j096L04J418r26j755n15J198K00j991m16J327
$$ 530 1792 326 -92 1215 2397 1268 172 476 1894 968 -787 -1302 -104 96 -1895 -2311 -984
2271i84R87j249k84R37J090L35q31K42J587M10j487p34J289M94j836m94L40O85
$$ -984 3 -1246 -1530 -593 497 832 1 243 1830 2240 753 19 1308 1802 -34 -528 -188 497
2289D97j022j389K33J070K02p69l50J584O43q90k67J487P09k59j000L55O46k9
$$ 497 -525 -1914 -1681 -611 -409 -1178 -1528 56 699 -191 -458 1029 1738 1479 479 834 1480 1451
2307A451j627l52J088j92j562n98J106o7m03p72J107Q93j69k64L36Q72R49r49
$$ 1451 -176 -528 560 368 -1194 -1792 -686 -753 -1156 -1928 -821 72 -97 -361 -25 847 1796 847
2325H47m1R15J40j557j85J37L39q69j110K32N33k09q02Q7P72O44n43K08Q96N33
$$ 847 806 1721 1861 304 119 256 595 -274 -1384 -1152 -619 -828 -1630 -1543 -771 -127 -670 -462 434 967
2345I67j80j69L09M89J68q21m28K39J48j119q09O67j84o28O6K49K17M87o47L52
$$ 967 787 618 927 1416 1584 763 335 574 722 -397 -1206 -539 -723 -1351 -1285 -1036 -819 -332 -979 -627
2365f27J039N00m75K51M83L98m29o65L79O6p86m10l72J00j01m48m15N39K06J57
$$ -627 412 912 437 688 1171 1569 1140 475 854 920 134 -276 -648 -548 -649 -1097 -1512 -973 -767 -610
2385f10l47O82P61j33mL70K72K13J2p60K70K41o86n49Nk35k53m06j06K71p5K96
$$ -610 -957 -275 486 353 349 719 991 1204 1216 456 726 967 281 -268 -263 -498 -751 -1157 -1263 -992 -1067 -771
2407g71l3M93P54k9q0K58P79l58k69K99k7l7p82j62k67r7k46n72j40M04L90m17
$$ -771 -804 -311 443 414 334 592 1371 1013 744 1043 1016 979 197 35 -232 -329 -575 -1147 -1287 -883 -493 -910
2429i10R4M05K98N24K18P7K93J40j66q1M29q4r99n34M45n08l04j48l98M88K54
$$ -910 -816 -411 -113 411 629 706 999 1139 973 892 1321 1237 238 -296 149 -359 -663 -811 -1209 -721 -467
2450d67n67N1O21M61j31J24N66O16m21j31J55L90o20m35j39j17J72q69n52N46
$$ -467 -1034 -983 -362 99 -32 92 658 1274 853 722 877 1267 647 212 73 -44 128 -741 -1293 -747
2470g47J29m85j66N69O70o4k88K91Q77L70l17l71N62J94n60k73K9j31l12j046
$$ -747 -618 -1103 -1269 -700 -30 -94 -382 -91 786 1156 839 468 1030 1224 664 391 420 289 -23 -1069
2490a069M56j95J91o04J1L71Q64l89m01P81Q37q5k38N2M84L81r97j73J41J61n66
$$ -1069 -613 -808 -617 -1221 -1210 -839 25 -364 -765 16 853 768 530 582 1066 1447 450 277 418 579 13
2511A3j150N77J71j23q98L12N84MJ7l3J067L09m46k28O54O59m29p21L2M38m31
$$ 13 -1137 -560 -389 -512 -1410 -1098 -514 -510 -493 -526 541 850 404 176 830 1489 1060 339 371 809 378
2532C78r02r0M37r0q68l78J001J75m38l16O87J076j59l43J43P13K19o46l47N46
$$ 378 -524 -614 -177 -267 -1135 -1513 -512 -337 -775 -1091 -404 672 513 170 313 1026 1245 599 252 798
2552G98L96r91q55L36M96n90j093L61R20m5j004K09J210N64p37l92J192O72m76
$$ 798 1194 203 -652 -316 180 -410 -1503 -1142 -222 -267 -1271 -1062 148 712 -25 -417 775 1447 971
2571I71m50j52Q23j15j332k59P34J27j006q54O18Q70m26r15O85R03j47n04J07
$$ 971 521 369 1192 1077 -255 -514 220 347 -659 -1513 -895 -25 -451 -1366 -681 222 75 -429 -322
2590c22J438L15j054l90J053L37o08j051L41R65j250q70J58N46K18j234J27Q97
$$ -322 1116 1431 377 -13 1040 1377 769 -282 59 1024 -226 -1096 -938 -392 -174 -1408 -1281 -384
2608c84O67p34l75J186J121p17q65N88R97k08j203r6P09J55j343o39Q61P3o55
$$ -384 283 -451 -826 360 1481 764 -101 487 1484 1276 73 -23 686 841 -502 -1141 -280 -207 -862
2627h62q31M69J373j84j052M21J391P9m82o36J300O60q67j103P59O62j023r88
$$ -862 -1693 -1224 149 -35 -1087 -666 725 804 322 -314 986 1646 779 -324 435 1097 74 -914
2645i14J68Q80j36j317l50R63N50l73n91Q63J311o61p06K58J310K33j421qJ195
$$ -914 -746 134 -2 -1319 -1669 -706 -156 -529 -1120 -257 1054 393 -313 -55 1255 1488 67 59 1254
2664A254j23j248n95Q70J44o59j212M68J255p17o36M18J213Q4j048K11J608J56
$$ 1254 1131 -117 -712 158 302 -357 -1569 -1101 154 -563 -1199 -781 432 516 -532 -321 1287 1443
2682A443o05o90M12O06l89j354M97O72m21j060k05P75N02q84m57N81J129k33j108
$$ 1443 838 148 560 1166 777 -577 -80 592 171 -889 -1094 -319 183 -701 -1158 -577 552 319 -789
2701g89P43J403K19j574J91P02M22r83q16Q61K23q84q80L69J068n35r17L51P68
$$ -789 -46 1357 1576 2 193 895 1317 334 -482 379 602 -282 -1162 -793 275 -260 -1177 -826 -58
2720e8J18m11rQ78L37l61o10P22O00l53q54j20P87j02j275r6P09K44q38n43N59
$$ -58 60 -351 -360 518 855 494 -116 606 1206 853 -1 -121 666 564 -711 -807 -98 146 -692 -1235 -676
2741f76R54l49q50P57J151k40m81j05J010n3q86r5J80O40o89j126N57M35l25r90
$$ -676 278 -71 -921 -164 987 747 266 161 1171 1118 232 137 317 957 268 -858 -301 134 -191 -1181
2761a181J33Q11L17o36j21J034N01n30n19Q76O95n70q41N94K75k60o06l96L09
$$ -1181 -1048 -237 80 -556 -677 357 858 328 -191 685 1380 810 -31 563 838 578 -28 -424 -115
2780a15L16j018l49M41R25n49o26M36R40J02q69L30P87M97p68l05K06O13o14o53
$$ -115 201 -817 -1166 -725 200 -349 -975 -539 401 503 -366 -36 751 1248 480 175 381 994 380 -273
2800b73N9O91o89q02K69L52J77n71j42P29M74k5n40L83R10n30k69J76O54k34p63
$$ -273 -214 477 -212 -1014 -745 -393 -216 -787 -929 -200 274 249 -291 92 1002 472 203 379 1033 799 36
2821C6l77O14j9p56l81L06L82l80p51N80Q71m02k68K12P23L86p98J03N97M21p81
$$ 36 -341 273 254 -502 -883 -577 -195 -575 -1326 -746 125 -277 -545 -333 390 776 -22 81 678 1099 318
2842C18o76N46L63l67p19k17O60j81k97k58M09K46j29l64P05M83J21o07L30O16
$$ 318 -358 188 551 184 -535 -752 -92 -273 -570 -828 -419 -173 -302 -666 39 522 643 36 366 982
2862I82j02m42n15N24L0p47l40K76J20l98m53J06P45m3k61K81N06pq9l6N62L03
$$ 982 880 438 -77 447 477 -270 -610 -334 -214 -612 -1065 -959 -214 -257 -518 -237 269 262 173 137 699 1002
2884A002o26j59K85m8l15m57r1L70R6p66j92K67O02l21k34L54M60j94J7K81K56
$$ 1002 376 217 502 454 139 -318 -409 -39 57 -709 -901 -634 -32 -353 -587 -233 227 33 50 331 587
2905E87n8k10m07L52M05p28j50J54Q0j70n59J37Q6K9k80J21M69M09j24k95L63
$$ 587 529 319 -88 264 669 -59 -209 -55 25 -145 -704 -567 -481 -452 -732 -611 -142 267 143 -152 211
2926B11K71K78m12j5O66m02o23l06M64j02l90Kl61K18n3n7L35K60O8k68K98K21
$$ 211 482 760 348 333 999 597 -26 -332 132 30 -360 -358 -719 -501 -554 -611 -276 -16 52 -216 82 303
2948C03L78j96M6J49M6l21m65N7K65m48l31M5k6L10l80l33M46Q2J76P0J36L08
$$ 303 681 485 531 680 726 405 -60 -3 262 -186 -517 -472 -498 -188 -568 -901 -455 -373 -197 -127 9 317
2970C17J79l25M04J38k65k8m05n3K54l46l36q5J92L5k98Q8k8M01j07n3L11M93
$$ 317 496 171 575 713 448 420 15 -38 216 -130 -466 -551 -359 -324 -622 -534 -562 -161 -268 -321 -10 483
2992D83k20o6k14O50j48j04k70J13K37n00j19j56Pj05k46O9L59o8j23L51Q3L77
$$ 483 263 197 -17 633 485 381 111 224 461 -39 -158 -314 -307 -412 -658 -589 -230 -298 -421 -70 13 390
3014C90m0k4n8K41j68p8j61K74j63m02j77J35J25l97k15M95k3m35L06J92K55R9
$$ 390 350 326 268 509 341 263 102 376 213 -189 -366 -231 -106 -503 -718 -223 -246 -681 -375 -183 72 171
3036A71j4Q7m0M23l85n9q6M94l38n42L71j25l01k24j89L98J63j82J08o5L46J48
$$ 171 157 244 204 627 242 183 97 591 253 -289 82 -43 -344 -568 -757 -359 -196 -378 -270 -335 11 159
3058A59J9j61N85k73L16k88M17m17j81l25Q8j03k18k29J17J67j61j5K72K73%j97
$$ 159 178 17 602 329 645 357 774 357 176 -149 -61 -164 -382 -611 -494 -327 -488 -503 -231 42 42 -155
3080a55J07L03L87k24j95P3K91l1o72%M12k53l39l13J79J15j25k15M92L41j33
$$ -155 -48 255 642 418 223 296 587 556 -116 -116 296 43 -296 -609 -430 -315 -440 -655 -163 178 45
3101D5j50M0N82k3l66n7M02P0k72m05J42K95j61q15K36Q4Q6n57L51L11l4J48q1
$$ 45 -105 -65 517 494 128 71 473 543 271 -134 8 303 142 -673 -437 -353 -267 -824 -473 -162 -196 -48 -129
3124a29L77K01l2m35L42J45Q3n06k39L70Ol59m36L46K12l53k19q0N86l05K9L6
$$ -129 248 449 417 -18 324 469 552 46 -193 177 183 -176 -612 -266 -54 -407 -626 -706 -120 -425 -396 -360
3146c60O54j3L21l40l3L66j60m49J59M14m66n22J48L30r4p78J18K96L34l47q6
$$ -360 294 281 602 262 229 595 435 -14 145 559 93 -429 -281 49 -45 -823 -705 -409 -75 -422 -508
3167e08M20L82l87L00o4M66P0o83J16J25K0k09l03K92R3k23n27M73m2k40j03J79
$$ -508 -88 294 -93 207 143 609 679 -4 112 237 257 48 -255 37 130 -93 -620 -147 -189 -429 -532 -353
3189c53L65K78l49J92K53K94j12l35j13L73j10l96K2J68k71l27l10M67L15m13
$$ -353 12 290 -59 133 386 680 568 233 120 493 383 -13 9 177 -94 -421 -731 -264 51 -362
3209c62o5k6N08j10kK2M45K82n34k6M83p3k17l19L56k79r9m79J55M21k00m50R4
$$ -362 -427 -453 55 -55 -57 -35 410 692 158 132 615 542 325 6 362 83 -16 -495 -340 81 -119 -569 -475
3232d75M07K75m19j26N46Q3O7l05J34N81m34l92K76l8K75n99l01L83k16j19q3
$$ -475 -68 207 -212 -338 208 291 358 53 187 768 334 -58 218 180 455 -144 -445 -62 -278 -397 -480
3253d80j21O61l47k68K64K31N40l00K25K26j8m78l08N96Q2l33n44N9N03n03l27
$$ -480 -601 60 -287 -555 -291 -60 480 180 405 631 613 135 -173 423 505 172 -372 -313 190 -313 -640
3274f40J14L95L2k39J54K92k2K9P5o2K95K9o62L27J33j24j23j84J59J33m94ml6
$$ -640 -526 -131 -99 -338 -184 108 86 115 190 128 423 452 -210 117 250 126 3 -181 -22 111 -383 -387 -423
3297d23M07K1n65J53O46n6l17J15M17M81n73l56O31K3m76q5L4j42j23k34k24N95
$$ -423 -16 5 -560 -407 239 183 -134 -19 398 879 306 -50 581 604 128 43 77 -65 -188 -422 -646 -51
3319e1k07rj98K74M54r9j15o1O36j78j60L19m98M85j77m35j01N0k40m16N83L56
$$ -51 -258 -267 -465 -191 263 164 49 -12 624 446 286 605 107 592 415 -20 -121 -71 -311 -727 -144 212
3341B12n03j02J00N9N27m92J84K11K95l52L7J09K78j27m66r3K47J11n18J70J7
$$ 212 -291 -393 -293 -234 293 -199 -15 196 491 139 176 285 563 436 -30 -123 124 235 -283 -113 -96
3362i6k21j31N0M93N4j97k47K96K26o7o2K50K71k86k52j14K53k1j42l29J95N4
$$ -96 -317 -448 -398 95 149 -48 -295 1 227 160 98 348 619 333 81 -33 220 199 57 -272 -77 -23
3384b3n0n12K33K62r2l81J58M19K70J32n36M45J92k0k77j58J70R9l88m89N32j54
$$ -23 -73 -585 -352 -90 -182 -563 -405 14 284 416 -120 325 517 497 220 62 232 331 -57 -546 -14 -168
3406a68Q1n37N37m18m3L54k30R17k48l24O4M66j0k57n6L54k03K08o86J62j71J08
$$ -168 -87 -624 -87 -505 -548 -194 -424 493 245 -79 -15 451 441 184 128 482 279 487 -199 -37 -208 -100
3428a00l67KK13Ll53J90N04P8j6m46M39L21k79L28m88K03l6j91j56K0K12n9m54
$$ -100 -467 -465 -252 -249 -602 -412 92 170 154 -292 147 468 189 517 29 232 196 5 -151 -131 81 22 -432
3451d32K18J54l46J30K05K52l65L40m79Q73j59j95k51N44K0k17l07J13j35K6l73
$$ -432 -214 -60 -406 -276 -71 181 -184 156 -323 550 391 196 -55 489 509 292 -15 98 -37 -11 -384
3472c84p1K39K95j87n68K09N20p8j36J78k6J76O1j9N4N3r3k20k12L64m00oK17
$$ -384 -455 -216 79 -108 -676 -467 53 -25 -161 17 -9 167 228 209 263 316 223 3 -209 155 -245 -251 -34
3495c4m9j16J07k92L11l59L77N8K32j5j25K77j67R3k2j33KK32k51m08J24J63m2
$$ -34 -83 -199 -92 -384 -73 -432 -55 3 235 220 95 372 205 298 276 143 145 377 126 -282 -158 5 -37
3518c7n90rL56L9O5Q8j42J32K60L5l3J1L20l38L0L6M0q1n21J72M30j95o39mK15
$$ -37 -627 -636 -280 -241 -176 -88 -230 -98 162 197 164 175 495 157 187 223 263 182 -339 -167 263 68 -571 -575 -360
3543c60K95n4j27K09J58q9J35k82O39k50n5k98M63j30j34k12K08P1l21k85P4J63
$$ -360 -65 -119 -246 -37 121 32 167 -115 524 274 219 -79 384 254 120 -92 116 187 -134 -419 -345 -182
3565a82nk4J48Q2n0L2o3K49J91j67j24L78j54j35j53j41N2rl55L12l12J49J57
$$ -182 -187 -211 -63 19 -31 1 -62 187 378 211 87 465 311 176 23 -118 -66 -75 -430 -118 -430 -281 -124
3588a24j12k60L92J49l1J18J11k9J02k10J9L34m64Q8L2p8J82o12L73j23l4l00
$$ -124 -236 -496 -104 45 14 132 243 214 316 106 125 459 -5 83 115 37 219 -393 -20 -143 -177 -477
3610d77r1K54K01K4J50k64L28J12o2K87n5J23l61k5K14l20l28j26J12K34l41K09
$$ -477 -568 -314 -113 -89 61 -203 125 237 175 462 407 530 169 144 358 38 -290 -416 -304 -70 -411 -202
3632b02N0M9O0k61J50K07J67j54oK18J38P6m40N7K14l31p8r1j07M55m04m8P6M6
$$ -202 -152 -103 -43 -304 -154 53 220 66 60 278 416 492 52 109 323 -8 -86 -177 -284 171 -233 -281 -205 -159
3656a59k66J81K70K16n2J01k73K22M37n2n38R3k23K81k37j83K46r2o1j86K56m57
$$ -159 -425 -244 26 242 190 291 18 240 677 625 87 180 -43 238 1 -182 64 -28 -89 -275 -19 -476
3678d76K36Q3J23J92j22k61J26M01J71j78j46O7J5l62n4L39k28rm03O50k25pl75
$$ -476 -240 -157 -34 158 36 -225 -99 302 473 295 149 216 231 -131 -185 154 -74 -83 -486 164 -61 -68 -443
3701d43k1L18K03j28K38J8J54l4k45K78J69m72n7K18j03l38P3m50N72j26k36r3
$$ -443 -464 -146 57 -71 167 185 339 305 60 338 507 35 -22 196 93 -245 -172 -622 -50 -176 -412 -505
3723e05J28K68p8l20O12J23j75L45l42K40J3j19l21J55M54p62p5K19n3k48J7O5
$$ -505 -377 -109 -187 -507 105 228 53 398 56 296 309 190 -131 24 478 -284 -359 -140 -193 -441 -424 -359
3745c59p9L91J30l76L75J65k6q4N9J53K0j28j92K29O8j78m29K02j20j21K4k54
$$ -359 -438 -47 83 -293 82 247 221 137 196 349 369 241 49 278 346 168 -261 -59 -179 -300 -276 -530
3767e30L48j15J24L38P9j27R1q3N19q0n50J45m8J46l42j13R9K41m01p0j08q5N05
$$ -530 -182 -297 -173 165 244 117 208 125 644 564 14 159 111 257 -85 -198 -99 142 -259 -329 -437 -522 -17
3790a7m24L09N0PJ28Q9J49J7k6P7l41J57J51j35j79l5J78l07p7R0r4j13K41k62
$$ -17 -441 -132 -82 -75 53 142 291 308 282 359 18 175 326 191 12 -23 155 -152 -229 -139 -233 -346 -105 -367
3814c67M73k41k8m6O94m2m40N4m0N65l16k57j84m3M6k04P9p4P9KJ01q3M13k5j36
$$ -367 106 -135 -163 -209 485 443 3 57 17 582 266 9 -175 -218 -172 -376 -297 -371 -292 -290 -189 -272 141 116 -20
3839b0j10L87j71J40O5j18J96m29K39j02m2J16o00K25J23J29n76K45K15J20j55
$$ -20 -130 257 86 226 291 173 369 -60 179 77 35 151 -449 -224 -101 28 -548 -303 -88 32 -123
3860a23j1L49j37J23o6K20K42k42j95j52j0N4j71L2l67L27k3%k05L38j07n3K24
$$ -123 -134 215 78 201 135 355 597 355 160 8 -2 52 -119 -87 -454 -127 -150 -150 -355 -17 -124 -177 47
3883D7K10j45M6k34L81L6j40j81KK00k82O5k67K41L4l86K8K51k56p5K14N53l85
$$ 47 257 112 158 -76 305 341 201 20 22 222 -60 5 -262 -21 13 -373 -345 -94 -350 -425 -211 342 -43
3906d3J88j21J56R9K0l21K60L6l6n3l12L97n56K72j04K2n7L0j58J32K22N3l94
$$ -43 145 24 180 279 299 -22 238 274 238 185 -127 270 -286 -14 -118 -96 -153 -123 -281 -149 73 126 -268
3929b68M93M4j92Q9L1l2K02k23r2j37j9k4j96k7L56l94L00j93O1M59l92J4K69
$$ -268 225 269 77 166 197 165 367 144 52 -85 -104 -128 -324 -351 5 -389 -89 -282 -221 238 -154 -140 129
3952A29J70j58pJ8j7K29k95N7L09k32j64k40l4J42k30r8M77j37J40l72M84J79
$$ 129 299 141 134 152 135 364 69 126 435 203 39 -201 -235 -93 -323 -421 56 -81 59 -313 171 350
3974C50k65K0m8K2L42k9n49O9J63j32q7p7K90q4l31N6j43K79j07K89l18N43j1
$$ 350 85 105 57 79 421 392 -157 -88 75 -57 -144 -221 69 -15 -346 -290 -433 -154 -261 28 -290 253 242
3997B42k56P0r1L55K7j45PM2Q2p34J29L83j66m83J96K97K2l84J87j3L98J42l46
$$ 242 -14 56 -35 320 347 202 209 251 333 -401 -272 111 -55 -538 -342 -45 -23 -407 -220 -233 165 307 -39
4020c9R7M15k29J62j06o9J55o07K64l11J26o0n2J02R8j74J39k56K55J63p7M7j4
$$ -39 58 473 244 406 300 231 386 -221 43 -268 -142 -202 -254 -152 -54 -228 -89 -345 -90 73 -4 43 29
4043B9L75k52J20J89m69O9k85J74j9q4j52L85k41r2M0K09j13L74m51J45L45O7
$$ 29 404 152 272 461 -8 61 -224 -50 -69 -153 -305 80 -161 -253 -213 -4 -117 257 -194 -49 296 363
4065C63n8k33j49K12j50q7K93n3j49p5J3l1J4j89P2J27K07r7k94K37M88l48k05
$$ 363 305 72 -77 135 -15 -102 191 138 -11 -86 -73 -104 -90 -279 -207 -80 127 30 -264 -27 461 113 -92
4088i2K67j55J46J31l37L96j36j34j34l02L25l49J03KJ31K1J84l81P9K78k03K45
$$ -92 175 20 166 297 -40 356 220 86 -48 -350 -25 -374 -271 -269 -138 -117 67 -314 -235 43 -160 85
4110H5J7j15L91l21j29L03Nk42k3J6k27J66k37K2K18j62kP3J75J73J43m64J38
$$ 85 102 -13 378 57 -72 231 236 -6 -29 -13 -240 -74 -311 -289 -71 -233 -235 -162 13 186 329 -135 3
4133CL05j7j57k76M71j96Jl70K32Q0k02j85R4M4P1p9J45O8J60k39j59N71k78j41
$$ 3 308 291 134 -142 329 133 134 -236 -4 76 -126 -311 -217 -173 -102 -181 -36 32 192 -47 -206 365 87 -54
4157e4J15nK85k27l70L32l7k86j38N8J93J43m61K63O2r8J46j6L56J52R4p81K56
$$ -54 61 56 341 114 -256 76 39 -247 -385 -327 -134 9 -452 -189 -127 -225 -79 -95 261 413 507 -274 -18
4180a8J82K60l33K0J24jm39k71P3L05O1k56J24K6K41k40L00k84J26L45o0k0J28
$$ -18 164 424 91 111 235 234 -205 -476 -403 -98 -37 -293 -169 -143 98 -142 158 -126 0 345 285 265 393
4203C93j5l57j08K95k48Q9l7m67M14K7j13k43N90k63q1P3R4J06%O4ljj0j90J11
$$ 393 378 21 -87 208 -40 49 12 -455 -41 -14 -127 -370 220 -43 -124 -51 43 149 149 213 210 209 199 9 120
4228A20j19J54m29J41K69k92p5n0r3M98j41m8m7L82j2k67J06K16j51k57K0L80
$$ 120 1 155 -274 -133 136 -156 -231 -281 -374 124 -17 -65 -112 270 258 -9 97 313 162 -95 -75 305
4250C05m14M0j08O8j90K32k59J90k73K52m8j19J14K79j35N4L66o8n2r3N1j81q8
$$ 305 -109 -69 -177 -109 -299 -67 -326 -136 -409 -157 -205 -324 -210 69 -66 -12 354 286 234 141 192 11 -77
4273g7J69k31L04k76j11j04L41j92j00J57K21p7q9Qj03K79R5O5j96J75K7k22j66
$$ -77 92 -139 165 -111 -222 -326 15 -177 -277 -120 101 24 -65 -57 -160 119 214 279 83 258 285 63 -103
4296a03K27k21k2j58M0P0J46j55L8M8J4l5R8J14J49l7J05j71R6k13K34l40O4l8
$$ -103 124 -97 -119 -277 -237 -167 -21 -176 -138 -90 -76 -111 -13 101 250 213 318 147 243 30 264 -76 -12 -50
4320e0l0k02J24r5n3N6O3K94k19j86M7M49k53o3K37L10k17k35K8j33J36K6l31
$$ -50 -80 -282 -158 -253 -306 -250 -187 107 -112 -298 -251 198 -55 -118 119 429 212 -23 5 -128 8 34 -297
4343b97L37l62J29m02N30j35R5Oj63O49k46j15Q9l7K03l04K34q8L53j70j95k76
$$ -297 40 -322 -193 -595 -65 -200 -105 -99 -262 387 141 26 115 78 281 -23 211 123 476 306 111 -165
4365a65L9j51j54K36J45O7j76k01K92K75j2j40K06j35K03R1n19K64j21k21J28
$$ -165 -126 -277 -431 -195 -50 17 -159 -360 -68 207 195 55 261 126 329 420 -99 165 44 -177 -49
4386d9mq5j61L8L6O6OJ79j35j7K59j41J57M4j33L14l20J06j12M3R2j86j15J78
$$ -49 -53 -138 -299 -261 -225 -159 -153 26 -109 -126 133 -8 149 193 60 374 54 160 48 91 183 -3 -118 60
4410F0j57q7k7Q4p6q9Q7K4J49J63j15M4J14J4P9M2k61R4O9L8k90O5J2l77J67k79
$$ 60 -97 -184 -211 -127 -203 -292 -205 -181 -32 131 16 60 174 188 267 309 48 142 211 249 -41 24 36 -341 -174 -453
4436d53K74k05N3N60k73J22P0J06oq4K20n63L62J5K9l46N4j8j36J64j31j73J8
$$ -453 -179 -384 -331 229 -44 78 148 254 248 164 384 -179 183 198 227 -119 -65 -83 -219 -55 -186 -359 -341
4459c41J52j28Q7j51L82n0K37J55l11j81K01J15J53k60o3n5R8q4j96PL56k10j41
$$ -341 -189 -317 -230 -381 1 -49 188 343 32 -149 52 167 320 60 -3 -58 40 -44 -240 -233 123 -87 -228
4482b28K12m8L0K97n17Q8K46J66M7l5J50l3j80J99j61R1m29j47l6O7K65m06J36
$$ -228 -16 -64 -34 263 -254 -166 80 246 293 258 408 375 195 394 233 324 -105 -252 -288 -221 44 -362 -226
4505b26J34o3K66o5j11L38l28L61J54j48j89m3L09l00k99J81k99M20j41N0lj81
$$ -226 -92 -155 111 46 -65 273 -55 306 460 312 123 80 389 89 -210 -29 -328 92 -49 1 -2 -183
4527a83J12q3L9M36k20J30j80J4j02K11J61j73o0J04j34k13r9J62j5J1l02K08
$$ -183 -71 -154 -115 321 101 231 51 65 -37 174 335 162 102 206 72 -141 -240 -78 -93 -82 -384 -176
4549a76J93l38M05k54J33J07K58k02J95L3j06p3J73l07M0p5j24m8l6L0J0J01j19
$$ -176 17 -321 84 -170 -37 70 328 126 321 354 248 175 348 41 81 6 -118 -166 -202 -172 -162 -61 -180
4572a80K90j20k7j57J68J68RJ04j82K40j88J40k12j41K68j91j74l8P3l1J57r4
$$ -180 110 -10 -37 -194 -26 142 151 255 73 313 125 265 53 -88 180 -11 -185 -223 -150 -181 -24 -118
4594a18K55l18J84J00k19L46Kl06M9K54qn4J24l22L31m32p9K37o1k91K19M4k38
$$ -118 137 -181 3 103 -116 230 232 -74 -25 229 221 167 291 -31 300 -132 -211 26 -35 -326 -107 -63 -301
4617c01J16j95K60o9J09j63N26j41P9K0J8l24J84l47n9J68J29K45l84K28j13Q6
$$ -301 -185 -380 -120 -189 -80 -243 283 142 221 241 259 -65 119 -228 -287 -119 10 255 -129 99 -14 72
4639G2p9j91L87j19k00L54L8r6j33LK42r2R7j25m6m9j29p8p9K11j52O1kk26O99
$$ 72 -7 -198 189 70 -130 224 262 166 33 36 278 186 283 158 112 63 -66 -144 -223 -12 -164 -103 -105 -331 368
4664C68j87j71j6J53j24J33LL7o9J98l32P3N1J11k49l14P8J92L8p8M3K04l36m
$$ 368 181 10 -6 147 23 156 159 196 127 325 -7 66 117 228 -21 -335 -257 -65 -27 -105 -62 142 -194 -198
4688a98L20J19k25r5J24N3K21l44J88j77K8M3l40j3l5N43n36K98K16m89O4J80
$$ -198 122 241 16 -79 45 98 319 -25 163 -14 14 57 -283 -296 -331 212 -324 -26 190 -299 -235 -55
4710e5k5J31K92l50nK05P1j50Q5O9k6k48k27J76J53n04L01k10M41k30J16l05K56
$$ -55 -80 51 343 -7 -12 193 264 114 199 268 242 -6 -233 -57 96 -408 -107 -317 124 -106 10 -295 -39
4733c9R2K3K49n9j63k06m9K67l5L0l2j46K66k09N7l30j0J82L7k5L35o4j80j77
$$ -39 53 76 325 266 103 -103 -152 115 80 110 78 -68 198 -11 46 -284 -294 -112 -75 -100 235 171 -9 -186
4757a86L87q8J54k23J00Q3K2l65Q8J34j39N7j24k34l5J83J2J94O0Nk37K79L7P8
$$ -186 201 113 267 44 144 227 249 -116 -28 106 -33 24 -100 -334 -369 -186 -174 20 80 85 -152 127 164 242
4781B42o4k44J73K06j72l93K24l13L57R4k81L05k56k0j7rJ08MoJ88j4j5J38J08
$$ 242 178 -66 107 313 141 -252 -28 -341 16 110 -171 134 -122 -142 -159 -168 -60 -56 -62 126 112 97 235 343
4805C43j04j54K8O7m5j96k41K43k80L15J45k58nJ5Q0M6J60q9LK99m32J91J66j20
$$ 343 239 85 113 180 135 -61 -302 -59 -339 -24 121 -137 -142 -127 -47 -1 159 70 73 372 -60 131 297 177
4829A77j99j24R5k30J76k80M57J60m18o8j20M36k09oLQ0L77m50J21L53k18J74
$$ 177 -22 -146 -51 -281 -105 -385 72 232 -186 -254 -374 62 -147 -153 -150 -70 307 -143 -22 331 113 287
4851B87k67K51l07K64j42j36o5j62K80k43J60L8Q1q3R1o0J70J68j75j31J61R3
$$ 287 20 271 -36 228 86 -50 -115 -277 3 -240 -80 -42 39 -44 47 -13 157 325 150 19 180 273
4873B73j79l4o9j27K99k07j40J62j64J15J35j06jm06M84L3n4M9j62M20m45J61
$$ 273 94 60 -9 -136 163 -44 -184 -22 -186 -71 64 -42 -43 -449 35 68 14 63 -99 321 -124 37
4895C7j03R3m8q3J30j05r0L47l19J1j47j86L35J00j6R3O8J02p0K1Q5l8J0k77K98
$$ 37 -66 27 -21 -104 26 -79 -169 178 -141 -130 -277 -463 -128 -28 -44 49 117 219 149 170 255 217 227 -50 248
4920B48k92q1J66M5k73N7J69j11J50j10J51k19RN5J00l55M22r7J65Q7l76L44m19
$$ 248 -44 -125 41 86 -187 -130 39 -72 78 -32 119 -100 -91 -36 64 -291 131 34 199 286 -90 254 -165
4943a65O1m4K12j59l1k81K44K92l62K40j1l76k2M95K22Rj04J49k47J23Km44N49
$$ -165 -104 -148 64 -95 -126 -407 -163 129 -233 7 -4 -380 -402 93 315 324 220 369 122 245 247 -197 352
4966C52l43r1J52k59J67O9m1k59K34j62K96n4k36J41J96Q8p5j34J8k82J71p2K04
$$ 352 9 -82 70 -189 -22 47 6 -253 -19 -181 115 61 -175 -34 162 250 175 41 59 -223 -52 -124 80
4989H0j79J75O7k45l55M1N1K55j06L67M5JLk4K46l42J52N4k00k18J46R8j72q9
$$ 80 -99 76 143 -102 -457 -416 -365 -110 -216 151 196 197 200 176 422 80 232 286 86 -132 14 112 -60 -149
5013a49j4k62K71Jj59NM31k33L04k27K44M3l42rj35L94O6j57m7r8J2K69l08k84
$$ -149 -163 -425 -154 -153 -312 -307 124 -109 195 -32 212 255 -87 -96 -231 163 229 72 25 -73 -61 208 -100 -384
5037c84M19j49j56J78j28J16q4J35R5J14O8k07K5J43n9lK86j87k5l15O4M9k79
$$ -384 35 -114 -270 -92 -220 -104 -188 -53 42 156 224 17 42 185 126 123 409 222 197 -118 -54 -5 -284
5060b84K34k38K9J46j81K44l0j1K02L1N7q0j23K92l26q2L65j49l24N8j80N6N66
$$ -284 -50 -288 -259 -113 -294 -50 -80 -91 111 142 199 119 -4 288 -38 -120 245 96 -228 -170 -350 -294 272
5083B72k07p7k21J05J20M3n7N7q9L27l85L14k32J9K84l17M2j32j2j42M64k28J03
$$ 272 65 -12 -233 -128 -8 35 -22 35 -54 273 -112 202 -30 -11 273 -44 -2 -134 -146 -288 176 -52 51
5106E1k0Qqj27P6k2o5N8j70M05p8J40k84K8J37p3l2m4j70j65K91J62l50K36j25
$$ 51 31 39 31 -96 -20 -42 -107 -49 -219 186 108 248 -36 -8 129 56 24 -20 -190 -355 -64 98 -252 -16 -141
5131a41L43k39m6J04j80J39j73L86j0kR3k57l7r8R8M5K1Rr7k16K91l71J34J42
$$ -141 202 -37 -83 21 -159 -20 -193 193 183 181 274 17 -20 -118 -20 25 46 55 -42 -258 33 -338 -204 -62
5155f2J16k27O4L17j34j12K46Q7k86K45l9k00k12K71k29j40J56j47L4J37m8R5
$$ -62 54 -173 -109 208 74 -38 208 295 9 254 215 15 -197 74 -155 -295 -139 -286 -252 -115 -163 -68
$$ [...]
8191A03
##END NTUPLES=NMR FID
##END=
