##TITLE=1H_Pr Pip
 CDCl3,8 sc, 
 4.03.2021
##JCAMPDX= 6.0         $$ Bruker NMR JCAMP-DX V2.0
##DATA TYPE= NMR FID
##DATA CLASS= NTUPLES
##ORIGIN= UXNMR, Bruker Analytische Messtechnik GmbH
##OWNER= root
$$ XWIN-NMR		Version 3.5
$$ Thu Mar  4 13:18:09 2021 Russian Standard Time (UT+4h)  she@DPX200
##.OBSERVE FREQUENCY= 200.1315066352
##.OBSERVE NUCLEUS= ^1H
##.DELAY= (6, 6)
##.ACQUISITION MODE= SIMULTANEOUS
##.ACQUISITION SCHEME= undefined
##.AVERAGES= 8
##.DIGITISER RES= 18
##SPECTROMETER/DATA SYSTEM= spect
##.PULSE SEQUENCE= zg30
##.SOLVENT NAME= CD3CN
##.SHIFT REFERENCE= (INTERNAL, CD3CN, 0, 15.7039)
##AUDIT TRAIL= $$ (NUMBER, WHEN, WHO, WHERE, WHAT)
$$ ##TITLE= Audit trail, XWIN-NMR		Version 3.5
$$ ##JCAMPDX= 5.01
$$ ##ORIGIN= Bruker BioSpin GmbH
$$ ##OWNER= she
$$ F:/spectra/data/she/nmr/H-F/1/audita.txt
$$ ##AUDIT TRAIL=  $$ (NUMBER, WHEN, WHO, WHERE, WHAT)
(   1,<2021-03-04 13:17:09.06 +0400>,<she>,<DPX200>,
      <created by zg, POWCHK disabled, PULCHK disabled
       configuration hash MD5:
       00 E9 B6 7A A2 85 ED C7 34 08 36 98 17 FE 4E 26
       data hash MD5: 16K
       2A 24 6E 4D 62 C1 C0 CE 3B 6B EB C1 FB 8D EE D4>)
$$ ##END=
$$ 
$$ hash MD5
$$ 09 19 7E 45 C4 39 FB 72 20 B6 EB C2 DC 83 95 6A
##$RELAX= 
##$RELAX= 
##$RELAX= 
##$RELAX= 
##$RELAX= 
##$RELAX= 
$$ Bruker specific parameters
$$ --------------------------
##$DU= <F:/spectra>
##$EXPNO= 1
##$NAME= <H-F>
##$PROCNO= 1
##$TYPE= <nmr>
##$USER= <she>
##$AMP= (0..31)
100 100 100 100 100 100 100 100 100 100 100 100 100 100 100 100 100 100 
100 100 100 100 100 100 100 100 100 100 100 100 100 100 
##$AQSEQ= 0
##$AQ_mod= 1
##$AUNM= <au_zg>
##$AUTOPOS= <>
##$BF1= 200.13
##$BF2= 200.13
##$BF3= 200.13
##$BF4= 200.13
##$BF5= 200.13
##$BF6= 200.13
##$BF7= 200.13
##$BF8= 200.13
##$BYTORDA= 1
##$CFDGTYP= 0
##$CFRGTYP= 5
##$CHEMSTR= <none>
##$CNST= (0..31)
1 1 145 1 1 1 1 1 1 1 1 1 1 1 1 1 1 1 1 1 1 1 1 1 1 1 1 1 1 1 1 1 
##$CPDPRG= <>
##$CPDPRG1= <>
##$CPDPRG2= <>
##$CPDPRG3= <>
##$CPDPRG4= <mlev>
##$CPDPRG5= <mlev>
##$CPDPRG6= <mlev>
##$CPDPRG7= <mlev>
##$CPDPRG8= <mlev>
##$CPDPRGB= <>
##$CPDPRGT= <>
##$D= (0..31)
0 1.2 0 0 0 0 0 0 0 0.06 0 0.03 0 0 0 0 0.0002 0 0 0 0 0 0 0 0 0 0 0 0 
0 0 0 
##$DATE= 1614849428
##$DBL= (0..7)
120 120 120 120 120 120 120 120 
##$DBP= (0..7)
150 150 150 150 150 150 150 150 
##$DBP07= 0
##$DBPNAM0= <>
##$DBPNAM1= <>
##$DBPNAM2= <>
##$DBPNAM3= <>
##$DBPNAM4= <>
##$DBPNAM5= <>
##$DBPNAM6= <>
##$DBPNAM7= <>
##$DBPOAL= (0..7)
0.5 0.5 0.5 0.5 0.5 0.5 0.5 0.5 
##$DBPOFFS= (0..7)
0 0 0 0 0 0 0 0 
##$DE= 6
##$DECBNUC= <off>
##$DECIM= 32
##$DECNUC= <off>
##$DECSTAT= 4
##$DIGMOD= 1
##$DIGTYP= 9
##$DL= (0..7)
0 120 120 120 120 120 120 120 
##$DP= (0..7)
150 150 150 150 150 150 150 150 
##$DP07= 0
##$DPNAME0= <>
##$DPNAME1= <>
##$DPNAME2= <>
##$DPNAME3= <>
##$DPNAME4= <>
##$DPNAME5= <>
##$DPNAME6= <>
##$DPNAME7= <>
##$DPOAL= (0..7)
0.5 0.5 0.5 0.5 0.5 0.5 0.5 0.5 
##$DPOFFS= (0..7)
0 0 0 0 0 0 0 0 
##$DQDMODE= 0
##$DR= 18
##$DS= 0
##$DSLIST= <SSSSSSSSSSSSSSS>
$$ [...]
##$SUBNAM2= <"">
##$SUBNAM3= <"">
##$SUBNAM4= <"">
##$SUBNAM5= <"">
##$SUBNAM6= <"">
##$SUBNAM7= <"">
##$SUBNAM8= <"">
##$SUBNAM9= <"">
##$SW= 16.9725356469052
##$SWIBOX= (0..15)
0 0 2 0 0 0 0 0 0 0 0 0 0 0 0 0 
##$SW_h= 3396.73913043478
##$TD= 16384
##$TD0= 1
##$TE= 0
##$TE2= 300
##$TE3= 300
##$TEG= 300
##$TL= (0..7)
0 120 120 120 120 120 120 120 
##$TP= (0..7)
150 150 150 150 150 150 150 150 
##$TP07= 0
##$TPNAME0= <>
##$TPNAME1= <>
##$TPNAME2= <>
##$TPNAME3= <>
##$TPNAME4= <>
##$TPNAME5= <>
##$TPNAME6= <>
##$TPNAME7= <>
##$TPOAL= (0..7)
0.5 0.5 0.5 0.5 0.5 0.5 0.5 0.5 
##$TPOFFS= (0..7)
0 0 0 0 0 0 0 0 
##$TUNHIN= 0
##$TUNHOUT= 0
##$TUNXOUT= 0
##$USERA1= <user>
##$USERA2= <user>
##$USERA3= <user>
##$USERA4= <user>
##$USERA5= <user>
##$V9= 5
##$VALIST= <valist>
##$VCLIST= <CCCCCCCCCCCCCCC>
##$VD= 0
##$VDLIST= <DDDDDDDDDDDDDDD>
##$VPLIST= <PPPPPPPPPPPPPPP>
##$VTLIST= <TTTTTTTTTTTTTTT>
##$WBST= 1024
##$WBSW= 4
##$XGAIN= (0..3)
0 0 0 0 
##$XL= 0
##$YL= 0
##$YMAX_a= 281372
##$YMIN_a= -247249
##$ZGOPTNS= <>
##$ZL1= 120
##$ZL2= 120
##$ZL3= 120
##$ZL4= 120
##$ABSF1= 10
##$ABSF2= 0
##$ABSG= 5
##$ABSL= 3
##$ALPHA= 0
##$AQORDER= 0
##$ASSFAC= 0
##$ASSFACI= 0
##$ASSFACX= 0
##$ASSWID= 0
##$AUNMP= <proc_1d>
##$AZFE= 0.1
##$AZFW= 0.1
##$BCFW= 1
##$BC_mod= 2
##$BYTORDP= 1
##$COROFFS= 0
##$CY= 11.3945322036743
##$DATMOD= 1
##$DC= 2
##$DFILT= <>
##$DTYPP= 0
##$F1P= 15.9154993809931
##$F2P= -4.1035820241983
##$FCOR= 0.5
##$FTSIZE= 0
##$FT_mod= 4
##$GAMMA= 1
##$GB= 0.15
##$INTBC= 1
##$INTSCL= 1
##$ISEN= 128
##$LB= 0.24
##$LEV0= 0
##$LPBIN= 0
##$MAXI= 10000
##$MC2= 0
##$MEAN= 0
##$ME_mod= 0
##$MI= 1.114404
##$NCOEF= 0
##$NC_proc= 0
##$NLEV= 6
##$NOISF1= 3.799351
##$NOISF2= 2.8
##$NSP= 1
##$NTH_PI= 0
##$NZP= 0
##$OFFSET= 15.70392
##$PC= 1
##$PHC0= -11123.43
##$PHC1= 13.00094
##$PH_mod= 1
##$PKNL= yes
##$PPARMOD= 0
##$PSCAL= 0
##$PSIGN= 0
##$REVERSE= no
##$SF= 200.130013532006
##$SI= 16384
##$SIGF1= 3
##$SIGF2= 2
##$SINO= 400
##$SIOLD= 16384
##$SREGLST= <1H.CDCl3>
##$SSB= 0
##$STSI= 0
##$STSR= 0
##$SW_p= 3612.71676300578
##$SYMM= 0
##$S_DEV= 0
##$TDeff= 0
##$TDoff= 0
##$TI= <>
##$TILT= no
##$TM1= 0
##$TM2= 0
##$TOPLEV= 0
##$USERP1= <user>
##$USERP2= <user>
##$USERP3= <user>
##$USERP4= <user>
##$USERP5= <user>
##$WDW= 1
##$XDIM= 8192
##$YMAX_p= 0
##$YMIN_p= 0
$$ End of Bruker specific parameters
$$ ---------------------------------
##NTUPLES= NMR FID
##VAR_NAME=  TIME,          FID/REAL,        FID/IMAG
##SYMBOL=    X,             R,               I
##VAR_TYPE=  INDEPENDENT,   DEPENDENT,       DEPENDENT
##VAR_FORM=  AFFN,          ASDF,            ASDF
##VAR_DIM=   8192,          8192,            8192
##UNITS=     SECONDS,       ARBITRARY UNITS, ARBITRARY UNITS
##FACTOR=    0.0002944,     1,               1
##FIRST=     0,             0,               0
##LAST=      2.4114304,     0,               0
##MIN=       0,             -247249,         0
##MAX=       2.4114304,     281372,          0
$$ Real data points
##PAGE= N=1
##DATA TABLE= (X++(R..R)), XYDATA
0@%%%%%%%%%%qJ6j6J6j6K4l2M0m8N6p2Q8j04J20j36J60j88K16k49K85l28L74m22
33b24M77n38O07o83P65q56R54j060J177j305J446j598J765j950K151k368K605
50A365k870L163l486L847m251M706n225N821o514P331q313R517j1031J3007j5698
65h631J9583k5702L6740o2523K23835R8070n28621K71845K15323k75883q6036
76a22000J78236Q502j02737j2305J20132l6023r1440L7876M0904p9291l8150J03179
88F883J330j04564J41531O1941j47439P5774O8707j20701K9473n4n0811O7496
100B9566j8815l1613M6173m702M22l5242l9501N1503k8816n5940O1790K5317j9434
113a9292K2833L8679k0888k8167N2144l9473o5942R0162j3659p4735Q4532N123
$$ y = [0, 0, 0, 0, 0, 0, 0, 0, 0, 0, 0, -8, 8, -8, 8, -8, 16, -16, 24, -24, 32, -40, 48, -56, 64, -72, 88, -100, 116, -133, 152, -176, 198, -224, 253, -285, 322, -361, 404, -452, 502, -558, 619, -686, 760, -838, 927, -1023, 1128, -1240, 1365, -1505, 1658, -1828, 2019, -2232, 2474, -2751, 3070, -3444, 3887, -4426, 5091, -5940, 7067, -8631, 10952, -14750, 21990, -40533, 183302, 281372, -247249, 24596, 239919, -35964, -122000, 56236, 64738, -37999, -50304, 69828, 33805, -57635, -19759, 21145, -58146, -96296, 6883, 8213, -96351, 45180, 107121, -40318, 35456, 104163, -16538, 12935, 12881, -37930, 29566, 10751, -20862, 25311, 20609, 21031, -14211, -53712, -2209, -31025, -86965, -25175, 142, -19292, 3541, 42220, 21332, -6835, 45309, 5836, -60106, 30056, 16397, -58338, 26194, 31317]
125C1317l1255K8251o0777K6715M2774j08600R539Q9118l4000k2303L2609K6680
137C0068Q182l0945k0529K1666K3802n2531l4333R9276o593r1028P5976K7144
149E0155p6941K5254o93k6748L1895j6976L791K7615j1301K2595o049k9492K9938
162B3043m891l6509J2281J9487r607j7522K7745N657m8976L0175J3664o1287K4576
175b2164L5117k7505j125J9042L2606j3377n1915N2110J9911p6632J7925M0589
187B4582k5608m730J0341r90k709n253j1524k1981J8097J7384l7139J4561M3733
200A8764n475j1392m284K7627R070n9670J2178N3306m1969j2121L7902m058q327
213A1551r572o567j9j6306m686R77j108J8115P379J105Q570K877R664j8117j2144
$$ y = [31317, 62, 28313, -32464, -5749, 37025, -71575, -62036, 27082, -6918, -29221, 3388, 30068, 38250, 7305, -13224, 8442, 32244, -20287, -54620, 44656, 38063, -52965, 23011, 50155, -26786, -1532, -2225, -28973, 2922, -14054, -10263, 17352, 6051, 28646, 22597, -6895, 23043, 18152, -18357, -6076, 13411, 3804, -13718, 14027, 19684, -29292, 883, 14547, -46740, -22164, 12953, -14552, -15677, 3365, 35971, 22594, -29321, 22789, 42700, -33932, -16007, 24582, -1026, -5756, 4585, 3595, 886, -4367, -15891, -37872, -19775, -2391, -39530, -24969, 18764, 13289, 1897, -2387, 25240, 34310, -25360, -13182, 40124, -1845, -13966, 23936, 19878, 11551, 1979, -4588, -4607, -20913, -25599, -24622, -25730, -7615, -236, 869, 9439, 12316, 21980, 3863, -8281]
228h281K7965j3923j2561L1257l099o555J2554j3101q191r697j0738M717k1852
241c1505J246L4057q408j6150K4573K1159k2303k5575K5566J6872l3915J138K9994
254A6749O735o909j4004J3999R927l4905j2550J2844o508o26l738P28K7271l282
268E731j9619P476J2502p334j8625P234K2565m108p121J1752R128k332j6893m678
282d322J0027j5493o328J1115l467N954P229o739M349Q33p432K387l549n84R873
297C853L344M78N66O539O79j3017p155M176R18p432p228J4781J6612j8705o521
312h112J9322j22j7859p384J4203J2331j4293o611K4128O601j9602p539Q494J656
326E213j6768q208J1132J0273m171p073R851J1965j0585j3904P074P210m686o303
$$ y = [-8281, 19684, 5761, -6800, 24457, 21358, 14803, 27357, 14256, 6065, -3632, -14370, -9653, -31505, -30259, 3798, -4610, -20760, 3813, 24972, 2669, -22906, 2660, 19532, -14383, -13245, 16749, 23484, 16575, 2571, 16570, 26497, -8408, -20958, -8114, -14622, -15248, -18986, -18258, 9013, 5731, -13888, -6412, 6090, -1244, -19869, -12635, 9930, 5822, -1299, 10453, 19581, 17249, 356, -4322, 5705, -9788, -16116, -5001, -8468, -2514, 4715, -2024, 2325, 3158, -4274, -1887, -5436, -6020, 3853, 7197, 7675, 8241, 14780, 15459, 2442, -4713, -537, 381, -7051, -14279, 502, 17114, -1591, -8112, 11210, 11088, -6771, -14155, 48, 12379, -1914, -8525, 15603, 22204, 2602, -4937, 3557, 5213, -11555, -19763, -8631, 1642, -2529, -9602, 249, 12214, 1629, -12275, -5201, 2009, -2677, -8980]
340h980Q170J6379l401r431M778L050j2384r266O40n89j199K013M911K572K320
355d17J232j505m814j900N756k93k477Q318J1534P90n546J028L810p474j4372
370f330l087O459M62q994K083J5418j72j1463k257P014J316j1199l524J7428J0135
385A3289p943L48J2328P675j5147j4607R688L657j6619o961J3423Q636j0098r035
399a1366J2242L542j5667n611P254P249m859j856J5936N757o668L401n79m712
413D063l62o903r22K953j389L054m39k012N20k963k672n327j767R602r21k979
429h464J1258M883J527m461n871J0864j899j7769N595J4105l403j0693K965J5327
443A3964q486j8675Q541N538o205m862J421J6150K587j2984Q515P584q889l792
$$ y = [-8980, -810, 15569, 12168, 2737, 7515, 10565, -1819, -11085, -10445, -11034, -12233, -10220, -5309, -2737, -417, 815, -690, -5504, -7404, -1648, -1941, -4418, 3900, 15434, 16224, 10678, 11706, 15516, 8042, -6330, -9417, -2958, -2496, -11490, -9407, 6011, 5839, -5624, -7881, -867, 449, -10750, -14274, 3154, 13289, 5346, 5694, 18022, 25697, 10550, -4057, 5631, 9288, -7331, -14292, -869, 7767, -2331, -11366, 876, 4418, -11249, -16860, -9606, -2357, -7216, -9072, 6864, 12621, 5953, 9354, 8775, 4063, 3701, -3202, -4124, -1171, -2560, 494, 55, -1957, -1437, -4400, -7072, -12399, -14166, -4564, -5485, -8464, 2794, 7677, 9204, 4743, -1128, 9736, 7837, -9932, -4337, 9768, 6365, -4328, -1363, 13964, 5478, -13197, -4656, 882, -5323, -10185, -8764, 7386, 9973, -3011, 5504, 13088, 4199, 407]
457D07l482L815K960m687K820J448M628J064j4667K352Q284j3661j784O926K734
472h43O457o517K686J2548j0039r083M847J196n550n403J0397N007j2398R642
486B947N270j6892L203L465o678p86p91J1104O617j1601O988J2409r074j0339
500d158P2J1414p296j5299J6698Q099j1961K320r22J456K374j8393K042J5983
514B429p422l729P864J1305R97j1140N887N221r715n55k939L151R734j3378L017
529G27J3228j4023l106K295o375J061k456O62O810n86O327J162m203O869n464
544B928j555K849q866R476M571j2242Q773L701j0085L16m544j783o70n162P066
559e227j806J370J1735r242K29J0976r585k743L251J487P049j0063M78J8386q734
$$ y = [407, -3075, 740, 3700, -987, 1833, 3281, 7909, 8973, -5694, -3342, 4942, -8719, -10503, -3577, -843, 5614, -903, 1783, 14331, 4292, -4791, 56, 1252, -4298, -9701, 696, 5703, -6695, 2947, 8217, -8675, -5472, -2007, -8685, -9471, -10262, 842, 7459, -4142, 2846, 15255, 6181, -4158, -4086, 7328, 32, -15267, 1431, 9530, -2431, -111, -1033, 423, 2797, -15596, -13554, 2429, -4993, -8722, -858, 10447, 11444, 304, 6191, 11412, 1697, 1142, -1797, 1354, 11088, -2290, 727, 13955, -68, -3174, -879, -7254, -6193, -8649, -7987, -1177, -1763, 4564, 5726, 1523, 8392, 2928, 1373, 4222, -4644, 4832, 9403, -2839, 5934, 9635, -450, -134, -4678, -6461, -7131, -12293, -5227, -7033, -5663, 6072, -3170, -2941, 8035, -1550, -4293, -1042, 445, 7494, -2569, -2091, 16295, 7561]
574G561j2840L721N375m387j6067O648J5541j2694l09J0472k911L958p936k812
588f680J4044r238o129J3544J197m78j420m42O333q916m858L700o619M317L43
603a302l040Q818l916o6O498j1418J184O083q195N347J473p86Q558n101m20K987
619F704p650J621m929l366J0496o836k967J2306p30l652m870K210Q528j4090l817
634a1042J4657j409k028O67P19Q385j0234o671Q745p110j873L348l884R316J387
649B973p555O767J264l321l711l716J0967j600p907J0156K617q85j420o984O158
664C803k841j1432Q582m42l572P605k304K914P40n641N859k907n759P639o46J34
680A732L595m4N047o114n111P973p408n979K807J25N221m254m359J2847k993q874
$$ y = [7561, -5279, -1558, 3817, -570, -16637, -9989, 5552, -7142, -7451, 3021, 110, 4068, -3868, -6680, 7364, -1874, -8003, 5541, 6738, 6260, 4840, 4398, 10731, 1815, -3043, 657, -5962, -1645, -1302, -4342, 4476, 560, 494, 6992, -4426, -3242, 2841, -5354, -7, 1466, 680, 9238, 4137, 3717, 6704, -946, 675, -4254, -7620, 2876, -3960, -6927, 5379, 4649, 997, -3873, -1663, 6865, -7225, -11042, 3615, 2206, 178, 845, 1564, 9949, -285, -6956, 1789, -5321, -7194, -3846, -7730, 1586, 2973, -4582, 2185, 3449, 128, -3583, -7299, 3668, 2068, -5839, 4317, 6934, 6049, 4629, -2355, 3803, 962, -10470, -1888, -2330, -5902, 1703, -601, 2313, 3053, -2588, 3271, 364, -5395, 2244, 1598, 1732, 5327, 5283, 10330, 4216, -895, 7078, -330, -6309, -3502, -3377, 1844, -2410, -6769, 6078, 3085, -5789]
696e789L246o08M019k619n607J2852L054p430L083J756J39n716p576Q012r19p211
712g314M447R70K966o65p374N299M10n907K808j456M115O406o653N177N924o507
728B646J21k306l49P38n756M333L431n252M284L64m452J191l518J536r20l461
744g370R405Q52m338P014J371k602j427m609N354j049p541N851K823q7j294l867
760a514M725J57r782J350L796J86j011k100R638K449r748L246L334m115k917k364
776d670M937K871o104L692L516l525J5m246R4J749m039J644K977P43L287k022
792I19N19K792n320p86N83k133K344k50J011K854k719P81J132n625O93J304j496
809c397R01J71N440J879m834K784K573m261k580j011L267R94n028L443M910k958
$$ y = [-5789, -2543, -3151, 868, -1751, -7358, 5494, 8548, 1118, 4201, 5957, 6096, 380, -7196, 816, -103, -7314, -2867, -1897, 1069, 404, -6970, -1671, -1261, -7168, -4360, -5816, -1701, 4705, -1948, 3229, 9153, 2646, 2767, 461, 112, 850, -4906, -573, 2858, -2394, 1890, 2254, -2198, -1007, -4525, -2989, -3909, -7370, 2035, 2887, -1451, 5563, 6934, 4332, 2905, -1704, 3650, 2601, -4940, 911, 3734, 3647, 2353, -1514, 3211, 3368, -6414, -5064, -1268, -1082, -2093, -4193, 5445, 7894, -1854, 1392, 4726, 611, -2306, -4670, 267, 3138, -2966, 726, 4242, 717, 732, -3514, -3420, -1671, -5710, -4066, -1089, -346, 2941, 919, 1438, 4230, -1090, -1876, -1293, -3426, -1082, -1332, -321, 2533, -186, 595, 1727, -3898, -3205, -1901, -3397, -2496, -2325, 3115, 4994, 160, 2944, 5517, 1256, -1324, -2335, 932, 1926, -3102, 341, 5251, 2293]
825B293k216j759K092L2o419J286O202j13j109Q81M528J332p168l14M519l278
841G89k881R20L581J317m119Q75K539l691l176J5J87N41j203K777L165q37J353
858B152Q41k084o54o48n23R46j061J662K660j918j066k31J33l020l785K159K310
875b127j796O15L643K417q82k833J448K138l284k117K857L333r82j090J867J389
891D596k346l399j647J183P03m019J024O024J20l232J418L618k207l812j4L485
907A495N96k322J229M899r49m510J267N94l536k203R60O05K77R14J553L30k52
924I47o55p00m15j332k0K762n18j27L096M68k260j593J85M2l211j800L093K052
942A4p65j050K269L200m506l525M526q8l546P38L706K378j667j675K366N3k944
$$ y = [2293, 77, -1682, 410, 442, -5977, -4691, 1511, 1398, 289, 1170, 5698, 7030, -138, -452, 4067, 789, -2092, -1172, 2409, 3726, -393, 482, 3021, -670, -3846, -3831, -3644, -3103, -4306, -1529, 1636, 799, 2152, 2993, 909, 255, -393, -916, 30, -1031, 631, 3291, 1373, 307, 76, 209, -2811, -6596, -4437, -2127, -3923, -3308, 335, 2752, 1870, -963, 485, 2623, -661, -2778, 79, 3412, 2430, 1340, 3207, 4596, 2250, -1149, -2796, -1613, -910, -4929, -3905, 2119, 2239, -993, 425, 4043, 1836, -1976, -1990, 1495, 2091, -231, 998, 5897, 4948, 438, 1705, 2299, -1237, -3440, -2480, -1875, -1598, -684, 869, 1199, 947, 292, -408, -823, -2155, -2175, 587, 69, -58, 3038, 3506, 1246, -347, -162, -120, -3331, -5131, -2038, 14, -751, -1801, 468, 3668, -838, -4363, 163, 75, -3471, -2733, 973, 3351, 1684, 9, 2375, 2428, -516]
959e16l082J043L229k828r45M916K15r05K33k238K212l59m371K247L386j98p77
976A262J141J929j535k985l2n02q97j78p66L736L39k313L098l06l280J550o24
993c63j485J115Q54K458o11r63L122j859k942o28q28J356k301j626N842L54l673
1010b178J604J116R0l229j795M586k18j564K062J509K592k308m074L791m87n234
1026c737J032O91J888O65l353L653J781l807j238P17J364r16k255N004J829k606
1042G12K600o86k86L06m217J430O38k702K267J168j290K000j258n00n38k271K214
1059d13p37j315L816M91M91N69j859K322j405m605K290K39l62J70j509M279J94
1076B656m695J245L38j394m67k055L981K486m105K687K194r53j234l260K419J117
$$ y = [-516, -3598, -2555, 674, -2154, -3099, 1817, 2032, 1127, 1360, -878, 1334, 975, -3396, -1149, 2237, 2039, 1262, 2403, 4332, 2797, -188, -220, -722, -1619, -1797, -2563, 1173, 1512, -801, 2297, 1991, -1289, 261, -363, -1848, -733, 121, 2579, 1968, 1005, 4127, 2268, -674, -1302, -2130, -774, -3075, -4701, 1141, 1495, -2178, -574, 542, 632, -2597, -4392, 194, -24, -1588, 474, 1983, 4575, 2267, -1807, 1984, 1497, -3737, -2705, -2014, -126, 539, -2814, 839, 2620, -1187, -2425, -1708, -344, -1260, -3515, 1489, 3318, 712, 3312, 2626, 2340, 2646, -1571, -141, 497, -2205, 62, 1230, -60, 1940, 682, 182, -356, -2627, -413, -1150, -2465, 1351, 1842, 2333, 2902, 1043, 3365, 1960, -2645, -355, -116, -478, -308, -1817, 2462, 2656, -2039, -794, -456, -1850, -2317, -4372, -391, 2095, -2010, 677, 2871, 1918, 684, -2576, -157, 960]
1092I60m401J846K533l12N87k544K101J307n692J246J218j347K103o93J363L329
1108C604k940O75O22l336J817j317p58K619j550K272P30k580J601j121j808J100
1124c70k227J748K292k893L521J404k365Q00j849P78R34m734J766L448j908N99
1140I44q44J666J182n938R83K039k118J92L58K300K559m276J708K825m004k13
1156f37r29O94K132l441J530L354k340r2m01j893J504k364j54K550j835K693R78
1173A349j203K154k085m59J255k989J557J218k006K948m89p04J611l522Q29R14
1189C78l667J298R77N90J979j842J191K793l156q38j07M89J650l265J480L989
1205C939k618m79M53j057J119m066m11M516k880m20K800O77Q51k825o68L367k958
$$ y = [960, -3441, -1595, 938, 626, 1213, -1331, 770, 2077, -3615, -2369, -1151, -2498, -395, -1088, 275, 3604, 664, 1339, 1961, -1375, 442, -875, -1633, 986, -564, 1708, 2438, -142, 1459, 338, -1470, -370, -2597, -849, 1443, -1450, 2071, 3475, 1110, 1910, 61, 839, 1773, -2961, -1195, 2253, 345, 944, 100, 1766, 2948, -2990, -2007, 32, -2086, -1894, -1536, 764, 3323, -953, 755, 3580, -424, -637, -1566, -872, 1260, -2181, -651, 2703, 363, 271, -130, -2023, -519, -2883, -3037, -487, -2322, 371, 1349, 146, 2300, 215, -244, 1011, -1978, -421, 797, -1209, 1739, 1250, 546, 2157, -1365, -536, 378, -3289, -1991, -1014, -424, 1555, -287, 904, 3697, 541, -297, -404, 85, 1735, -1530, -50, 3939, 1321, 842, 1295, 238, 1357, -2709, -3120, 1396, -1484, -1904, 896, 1573, 2424, -401, -1069, 2298, -660]
1222f60j356J924m01K172j035n56K678k670o00P32k683O97L81r63L099j143q3
1239d67K338k742N52J11k071J594n35M26K559j850P59J533k028J24j911j47K241
1256D86k770M36K699k14R12j410m28K707l231j634K728n39Q01k13j5L624k524
1273A415k194J964p34j120j068Q8L529j514j496L199m69r25j135j103K630j628
1289e61j335L256k32k8O14j527J170j170k164J524r75k56J793q57J371K10j156
1306c23R55j544p69J584j358O91Q47J01J924j390j186J568j442j046K29n61J669
1323e1n51r38L139m26j452k61k64R38j171j269K906P86j134R28P9J170j432k734
1341a737K141l20j584P90P35J333m06j471J467L30k442L40k19J195M75j193K235
$$ y = [-660, -2016, -92, -493, 1679, 644, 88, 2766, 96, -504, 228, -2455, -1758, -1377, -2340, 759, -384, -467, 1871, -871, -319, -208, -2279, -685, -1220, -794, 1765, -85, 674, 2207, 179, 303, -1608, -1755, 486, -2284, -1848, 851, 637, 1549, 139, -289, 2418, -813, -2447, 281, -258, 543, 330, 315, 3939, 1415, -779, 1185, 451, -669, -1737, -1649, 1880, 366, -1130, 2069, 1600, 675, -460, -1563, 1067, -561, -1896, 1360, 1128, 1100, 1714, 187, 1357, 187, -1977, -453, -1428, -1684, 109, -748, 623, 833, -323, 632, -912, -1681, -97, -1455, -764, 83, 184, 2108, 718, -468, 1100, -342, -1388, -1159, -1720, -51, -602, -1540, 1599, 1173, -279, -540, -804, 134, -1037, -2306, 600, 1386, 252, 1180, 1259, 2429, 997, -1737, 404, 84, -1500, -710, 25, 1358, 952, -519, 948, 1278, -1164, -824, -1043, 152, 627, -566, 1669]
1358A669O07j259L48o44n24k28j255Q00N91o18J208j35j43j73r05L22p31j075
1376b145J830K95o70J477N47k2j015p28Q27p52j528N41J348M95j066J11J655o85
1394E15k124K30O78k20l38J77J838Q25j270OP86j84j787m00R98N76o56L37R06
1413H93L44n32j286L24O64j250n23J348L26P8M45M98L8p85p19K91k87l51J01O51
1433B68O08m92N87o0o83p09Q1l56m03N82J157R1m18M1J204q03j633L17O06k68
1453b83r31M15J941j63j769O80N05p69r49l56J061L51q23J132J142l43r42l47
1471d48N10j53j010M68M18K81Q7k3N49L18j231p63L89m89O61J80K55Q23qj18L56
1492A052q79k67j96o8K07K3O55P73r85Q51q0j196k74n39M83M55j123Q87J333j48
$$ y = [1669, 2276, 1017, 1365, 721, 197, -31, -1286, -486, 105, -513, 695, 560, 417, 244, -661, -339, -1070, -2145, -315, -20, -690, 787, 1334, 1312, 297, -431, 396, -356, -1884, -1343, 5, 500, -566, -455, 1200, 515, -1609, -1379, -701, -921, -1259, -1082, 756, 1581, 311, 317, 1103, 919, -868, -1268, -270, 306, -350, -13, 893, 1237, 705, -581, -257, 407, -843, -1366, -18, 308, 386, 831, 1329, 1367, 582, -137, 154, -133, -484, -383, 268, 876, 384, 971, 911, 228, -481, -400, -756, -1159, -577, 580, 671, 253, 294, 1498, 695, -938, -621, -15, -283, -1214, -799, 1142, 979, -790, -110, 395, -374, -1323, -1679, -618, -267, -1090, 42, 1184, 841, -101, -448, 62, -91, -1101, -633, -215, 66, 153, 130, 679, 997, -234, -997, -608, -1097, -436, -256, -1, 822, 814, 696, 1052, 173, -94, -290, -358, -151, -128, 527, 1300, 315, 1166, 1086, -110, -384, -923, -440, 15, -1108, -221, 1112, 964]
1512I64o90K74K39n92j668J084R60o92J67L26Q13o9j781J48J042j555k56K82P30
1531b74Q95j130N90R59j305l09j1k26P28p50J57J635o92r5N53n95Lp40n22J020
1551a09n52L14R65p10M37K26n74L42j237L93Q48p48M54P69l43O54r24l09Q97j720
1571i27R5P27p2M85l24M19J257j293p89M59k23L0o97K45K240j402J42Q42m77n6
1591F81j169k99J175r03o26J654l75L75l69o09J455j367p25J038l16K8L54j42
1609a40J345p81q52Q67r85q7J81p46J148j85l13J471q91j83N15j274L83M4m16
1628h99J479o50M6J244j064km1n77N55o63l14J482n07J27P03q13Q43q06j179J202
1648A66m37k24N77r8J471o61r95J362q25q91N22m90R71k04q76J506j4q18J12n69
$$ y = [964, 274, 548, 787, 195, -1473, -389, 571, -121, 46, 372, 1185, 1116, -665, -517, 525, -1030, -1286, -1004, -274, 621, -509, 81, 1040, -265, -574, -585, -811, -83, -833, -676, 959, 267, 172, 725, 130, 133, -607, -1129, -109, -661, -347, 618, -92, 345, 571, -3, 339, -898, -505, 343, -405, 49, 818, 475, 1129, 205, -104, 793, -927, -832, -105, -177, 308, -16, 403, 1660, 367, -422, 37, -186, -156, -853, -608, 1632, 230, 372, 1214, 737, 681, -488, -787, 388, -515, -1141, 513, 138, 513, 144, -465, 990, -377, -1102, -64, -380, -352, 2, -140, 1205, 424, -428, 439, -546, -633, -452, -1198, -50, -235, -548, 923, 32, -151, 364, -910, -527, -483, -899, 580, -70, -24, 1220, 156, 154, 113, -464, 91, -572, -886, 596, 89, 216, 919, 106, 949, 143, -1036, 166, -271, -495, 82, -16, 1455, 794, -201, 1161, 336, -555, -33, -523, 448, 244, -632, 874, 860, 42, 154, -415]
1668d15M48k12j461J840R1n33J067m60K40l13r37P54n08r69J269j52J95L56n71
1687b71R45o75j074J164p05n76J341p99J291l46o19J300q43o88M40l55K12L26
1705F8p56J557l62o62O02o54Mk1p30J205J8o26J103m04O15l35j166Q67J5j166
1725h28Q30P9K27M44r66R48J79j391N71l57j72L75m52J028K05q62P51l30o75M76
1745H0l95KL11o61J049L32j013J188p19l40P1r67Q64o1p45J270J70j49j15n27
1765c55N04M1j094M75L60k52N67m43P26K24j471P80nr26N31k79Q01O69j244N50
1785A59N88o82K2m50M03J66p05M42O43k80K43k67j71L68j329P67M53p24P75k33
1805A88j02P47q83L3K19o39K99r2q7N51j36K68L64j026N73j85o57M06l61K09O58
$$ y = [-415, 33, -179, -1640, 200, 291, -242, 825, 365, 605, 292, -645, 109, -399, -1368, -99, -251, -56, 300, -271, 674, -1, -1075, 89, -616, -1192, 149, -650, 641, 295, -324, 976, 133, -555, -115, -470, -258, 68, -688, 869, 507, -155, 447, -207, -203, -224, -954, 251, 269, -357, 746, 342, 957, 622, -544, 323, 338, -828, 2, 81, 308, 752, -214, 734, 913, -478, 93, -264, -436, -61, -513, 515, 720, -142, 609, 279, -396, 80, -315, -313, -2, -663, 386, 718, -295, 893, 174, -166, -95, -1062, -198, -259, -1004, 266, 436, 287, 172, -355, 149, 190, -904, -429, -69, -321, 246, -197, 529, 753, -718, 62, 57, -869, -338, -617, 184, 853, -391, 159, 747, 65, 87, -363, 40, 206, -499, -57, 586, 306, 549, 282, 111, 479, -850, -83, 370, -354, 421, 188, 86, 833, -50, -17, 202, -437, -138, -230, -317, 234, 98, 366, 730, -296, 277, 92, -565, -159, -520, -311, 347]
1826C47o95P09K60q23J40j54j07K30p73M16J029p65L64n9J13J95j141L63L69o19
1846f01K86L76j7M01k83l52M69q41K92K10l61O41j56j14P37l64k42J04p00M20
1866i5k87P6O70m20L54K50l26m5j14l10N51q11L66L58j26K71L76n43L19n12j87
1887a85K18l20j29O45j41K84m93J58M56q62j04L32J15m58K53K91M11m12k23N73
1907D09m33k98j17P4O30m35j08O86l29l0j47k02K81l78k18M14M8L02Q7r0K89m30
1929En3J85j28l69K51J57L88q1m80P00o00j91k5m4J51j7J86O83m99k66L22k36
1951C9Q1j64m1K21J47m32O86k92j0p3o8K9k64l36N08J54k64o7K60N11n23k07K22
1974A17j44k79o0J46N04l53k65O33j52m92q8K93j51j87K46K79K21l34K37n3j92
$$ y = [347, -348, 361, 621, -202, -62, -216, -323, -93, -866, -450, 579, -186, 178, 119, 232, 427, -714, -351, 18, -601, -315, 61, 44, 445, 162, -190, 279, -562, -270, -60, -421, 220, 64, -50, 687, 323, 81, 185, -515, -95, -382, -306, 364, -56, 298, 548, 222, 177, 63, -247, 304, -507, -141, 217, 91, 362, 738, 195, 514, 2, -185, 33, -287, -416, 229, 88, 372, -121, 37, 493, -369, -473, -141, -26, -484, -231, 60, 471, 59, -164, 409, -24, -322, -439, -365, 265, -170, -278, 408, 79, 49, -98, -300, -19, -397, -615, -201, -153, 149, 236, 146, 435, 5, -48, 137, 9, -360, -109, 48, 436, 355, -125, 575, -25, -216, -241, -285, -134, -151, 35, 718, 219, -47, 275, 39, 120, -44, -85, 136, 283, -149, 537, 245, 235, 162, 94, 123, -141, -477, 31, 185, -79, -146, 114, 625, 102, -105, 117, -27, -306, -366, -220, 284, -69, -334, 299, 147, -345, -433, -140, -291, -478, -232, 47, 268, -66, 171, 118, -74]
1995g4m9P5K07k39k63Q87k61p7k13J65l9j99k94J97K07j22K06J58j4l44J25N5
2017I4m5k25J27J04j14K03Q1K56n1l87j87L32k15J2L2N7L77m15K17m0j44j57j85
2040b73J95R6p7J4M17m0m00J08L3p3k84j16J30J5J18K62N2K26m22l3J90j85l94
2063d41J96M42k21QK71q6k30p2Jm0r3K39j98J38j68L08M40m10l50K90k51J39k2
2086a10K47J07R0l99M19j89j45K4l00M78l78m6J18L52k28J06j34J79Pm45N9L58
2108A70l61K95M7L89j88l02K43m94Q2N8m40M55J27J01N7k58Oj04k8k77M06j46
2130a62jL28k39M24j59m47K50j45p9K12k23J68L42l15P8J06n2k36k13J37M40j70
2152D4J9m5J62J22l60J36P2k90J20j15J25K38l64K46L75o01K22k58j00K09OJJ15
$$ y = [-74, -123, -48, 159, -80, -343, 544, 283, 206, -7, 158, 119, -80, -374, -177, 30, -92, 114, 272, 258, -86, 39, 94, 49, -176, -49, 55, -59, 144, 225, 481, 430, 43, -144, 188, -27, -15, 17, 74, 451, 36, 253, 213, 69, -88, -273, -78, 18, -59, -45, 372, 332, -68, 40, 73, 0, -284, -400, -270, -255, -137, 125, 177, 403, -19, -52, 138, -47, -441, -245, 197, -24, -16, 255, 169, -61, -133, -132, -172, -265, -26, -224, -86, -254, 54, 494, 84, -266, 24, -227, -88, -110, 137, 244, 334, -65, 354, 165, 20, 44, -256, 222, -156, -202, -84, 268, 40, 146, 12, 191, 198, -247, -188, 170, -191, 104, 151, 540, 352, 50, 293, -201, -119, -61, -501, -46, 81, 182, 239, -19, -13, -117, -145, -422, -16, -162, -163, 165, -74, 350, 191, -256, -6, -151, -230, -18, -241, -73, 269, -46, 32, 138, 86, -150, -363, -226, 214, 44, 63, 18, 180, 302, -58, 78, 150, -140, -20, -135, -10, 228, -136, 110, 485, -116, 106, -152, -252, -43, -37, -36, 79]
2175G9K93J1j40r4N2m12n8J86J28mL28l61K49m95K54J6m08L41m8j37J86R7l6J93
2199B20j64J25M2m15K33j27N7k1j76J88K36m14K41j59j02K02l79J35J64j6N37
2220D07p8j07j89m56Q1L20j24J75J32j27J33k41K22R4m28j56N41n58K74J59k48
2241a74O29o10L30J69l79K61k31l54L99k7m0K8n7M81l51l76K87j60n1K03j19K57
2263A15J78q8O3n98K01L04o44K30M98j49Kj57J20k6k87O5J94n45L22J86j64O90
2285E10p26N3L33j47P4m28J28L77m12K52K50j92J43k75k6Rj87l1L11p9k7M22k23
2308A09K11m80j45N07k83QJ87p7K2R5O4J75j78l09J07j57J23j31P3K64O7l4P9
2331B97k03j58R5k52M23j60k81M41j42l7K45m43K76k73j96P31n83L08Q4Nj63P1
$$ y = [79, 372, 383, 243, 149, 201, -211, -269, -83, 45, 41, 369, 8, 257, -238, 16, 32, -376, -35, -83, -220, -34, 63, 27, 220, 56, 181, 223, -192, 41, -86, -29, -50, -226, -38, 198, -216, 25, -134, -236, -34, -413, -278, -114, -130, 407, 329, 222, 33, -423, -342, -22, -146, 29, 161, 34, 167, -74, 148, 242, -186, -342, 199, -359, -85, 74, -174, 455, -155, 175, 344, -35, 226, -5, -359, 40, 13, -27, 1, -56, 425, 74, -302, -15, -175, -226, -23, -142, 115, 293, 205, 268, -330, -129, 175, -469, -239, 259, 110, 112, -45, 75, 49, -238, -173, 21, -524, -202, -16, -180, 510, -216, -163, 170, 23, 97, -331, -203, 174, -238, 14, 264, 72, 215, -60, -86, -77, -264, -295, 16, -63, -90, 332, 109, 320, -160, -305, 202, -81, -73, 114, 37, 59, 154, 218, 393, 215, -94, 13, -144, -21, -152, -79, 185, 252, 218, 297, 94, -64, 31, -221, 202, 42, -239, 202, 60, 23, 268, -175, 101, -172, -368, 363, -220, 88, 172, 177, 14, 85]
2353H5l25J90K5m8N2J78j34%kL24m37k36K87j63M8M3k5K00m0k6J45k04O9j87K10
2378B9K8j54j88O11j00q0K15j73k23k6j46L89l67P4J11K7po8o2L64k26k84K49
2401gl5J55j53J53K87M4o56K10j63R5J3j34L83k85j88K86Q6n9j95O4J07J13k66
2424a45L71l71J62J51j66N9l84P4J70j17j09K75K47P6j49k66J51k84j11K78j40
2445b28N1K74Qp2p3m2L11k09k48L42j59M8O1k65M80l37Q5n1j11K65r7l10K31N1
2469EO3J86j07K24k10m81L90j41rK03l01M57l90p9J12K37j31j18j33o3L67L4K44
2492C59j28K0o0j36k16M4qN1J35j01JN9j46P4j53M66l89k34K55QL92l27jO7j3
2517A9l3M7r4j25j08J79J48N9j02K78k46k61L3J17J41J98k97m6K02j36K61R4l52
$$ y = [85, -240, -50, -25, -73, -21, 157, 23, 23, 21, 345, -92, -328, -41, -204, -156, -113, -138, 62, 22, -4, 141, -63, 6, -181, 29, 57, -97, -285, 326, 226, 146, 361, 188, -35, -61, -207, 182, -185, -111, 0, 27, 20, -48, -110, 254, 28, -256, -7, -42, 113, -40, 113, 400, 444, -212, -2, -165, -70, -57, -191, 192, -93, -281, 5, 91, 32, -163, -99, 8, 121, -145, 226, -145, 17, 168, 2, 61, -323, -249, -79, -196, -305, -30, 217, 293, 144, -122, 29, -255, -366, -88, -228, -177, 97, 105, 33, -40, -82, 229, 20, -228, 114, -45, 3, 64, -201, 279, -58, 27, -24, -135, 130, 33, -277, -46, 5, 68, 254, 147, 371, 161, -320, 70, -71, -80, 123, -178, 279, -111, -190, -78, 159, 28, -90, -223, -286, 81, 115, 359, 231, 251, 191, 55, -161, -117, -125, -74, 61, -40, -39, 20, -126, -52, -205, 261, -128, -362, -107, -99, 293, -34, -35, 32, 19, -14, 33, -61, -186, -294, -115, 33, 92, -10, 268, 22, -239, -206, -89, 52, 250, -47, -93, 109, -27, 234, 328, -24]
2540b4k51J98L76k24O3J84m20J44j08PK3j4j72Q8O8o9L39l28J74NJ36j62j51q8
2564b06J08J75K02k88P5k26J29j42l2RK09J6k16M57k99N7m6J59j5o1j30J65m8
2587E2lJ16k97J66n3O2Kk28K39j67R7J22O0j70J18J19m33K17mq3Q6r7L52j6j27
2612A30K6n9J41j55r8L63n56J73K9j07J49K37k15lj85q4K01k67L94M9j10J58k55
2635d4J95J75m30l35K68L2P2k08J48L41k41K81k49j39L27o10M62K09m24K57j89
2656a02rJ26J25l21l8K1N2nR0OJ73K8k3J01j43m6o8K17l75K27K18j58K4k6l3l7
2682B4j13j28M20j58j98L42j27L13j60j29k83M1J46M2J68o0l6J18M4k07k48L74
2704A85k08j56Q4j4j89M97j63j37NO7K2j56J46N0r3K78l0k45L61l86R5m30J86
$$ y = [-24, -275, -77, 299, 75, 138, 322, -98, 46, -62, -55, -32, -46, -218, -130, -62, -131, 208, -120, 54, 59, 195, 33, -118, -206, -98, 77, 279, -9, 66, -160, -31, -173, -205, -196, 13, 29, -187, 270, -29, 28, -18, 141, 126, 65, -65, 100, 52, 49, 165, -132, 34, -19, 43, 45, -183, 56, -111, -14, 108, 168, -2, 116, 235, -198, 19, 15, -68, 18, -79, 273, 257, 130, 156, 97, 238, 83, -15, 348, -208, -35, -6, -113, 36, 273, 58, 55, -130, -214, -13, -280, 114, 163, 53, 211, -44, 151, 326, -104, -439, -171, -139, -67, -275, -127, 214, -27, 254, 5, -134, 193, -417, 45, 254, -170, 87, -102, -111, 15, 140, -181, -219, -198, -146, -151, -61, -55, 118, 146, 123, 224, 81, 35, -33, 184, -191, 36, 254, 96, 120, 94, 61, 24, -89, -217, 203, 45, -153, 189, 62, 375, 215, 86, -197, -156, -10, 32, 200, 140, 104, 222, 266, 59, -189, 185, -23, -179, -95, -109, -298, 199, 36, -101, -96, -29, -7, -163, -17, 33, -60, 218, 188, -57, 304, -82, 13, -417, -231]
2727b31M41q7j65r8Q6O7o8J68j04J17j81K30l13J26l7q4J80K70k63J16j55m6M2
2750A1j89K06J12j85M3J78k46k2L70j74k38j07J96J14K4N2p3o0q3k7J58P5k61
2773a26o3K41N7k6j86J44k7p3O2j29O7o5J31J76j88n4L03l72J35K7J21k11J8K20
2797A82j42n0j68P8J5k7L51n68K85J97l18L81k88J40K15l32J96j98j87L53j53
2818c8P2j46mJ08j01q5L73l60J0J29k09M11n2J4p9k9J16ql37J22J53J48O2k44
2842B6ko9j05J71k15J93n4j1m7J50J61p9j44J72p4p9k09J75M7R2k21O7J31k14
2866a38m9k41K06J24K09j57K72j29q9M5J03r9j3P3j5k93K22K24m6l73K66j86k4
2889a08K25l76J39j2K19K02m45L39j6Jj48n4M3j60K64j65J19PQ0pj91o7L0m8J2
$$ y = [-231, 210, 123, -42, -140, -54, 13, -55, 113, 9, 126, -55, 175, -138, -12, -49, -133, 47, 317, 54, 170, 15, -31, 11, -178, 28, 140, -45, -2, 176, -70, -92, 278, 104, -134, -241, -45, 69, 93, 145, 72, 12, -71, -98, 60, 135, -126, -189, 52, 109, 83, -103, 41, 14, -59, 3, -126, -59, -124, 7, 183, -5, -59, 244, -128, 7, 34, 155, -56, -38, 182, 40, -10, -178, -100, -85, -112, 239, -329, -44, 153, -165, 216, -72, 68, 283, -49, 147, -51, -238, 115, -38, 34, -112, -116, -8, -109, -194, 179, -181, -171, -42, -251, 160, 108, 122, 43, 14, 130, 122, -215, -93, 60, 208, 270, 26, 24, -45, -150, 21, -194, -1, -55, -66, -113, 37, 198, 119, -25, 147, 73, -6, -215, -40, 7, 99, -122, -55, 76, -138, -187, -428, -222, -98, 111, -46, 226, 97, 8, 53, 156, 57, 44, 117, 102, -191, 31, 255, 209, -164, 102, -84, -108, 117, -259, -120, -132, 87, 289, -156, 183, 167, 168, 20, -34, 9, -151, 113, -52, 67, 74, 154, 147, -44, -111, -81, -129, -117]
2914a17N7K65j75qK4j04j00J63k5N1R2k83L27N9j84n0O3R7k34n8j04M20p4k4o6
2939A2o5J61k95K59j26oK61q6o1N8k05P5J14l40J51L7r2R4lj06Q0J49Rm6J7o8
2965b2m8k26L31m0p6K41L1j19j23J91l22r6K6K08P4Q5q6j42K09q3QN2J08k52J16
2990D5P9j9j63L12j93j9j55l74M23L2J74k9l25Q2j12K96j16j03J66k74P6K39P4
3013A16Kj92J79Kj36l16J29K46m0j21J78n9k1J85o5j16q9R5qq9J93J55j80j25
3037g7K96k51k49M03%m24K62N6K87k22n3K31l19J74l16J50J56k27J66N1N9n1k89
3060a87J48K07L9j62j68PJ45j4J08k29R2Q6r2j55J53j00JK04j36K70j96J38L3
3083A92k88J1J10l4Q1J8P5o2K4K00l20l49R9K77nk6M4j34R5K44k81OK19j55j61
$$ y = [-117, -60, 205, 30, 22, 46, -58, -158, 5, -20, 31, 123, -160, 167, 226, 42, -8, 55, 152, -82, -140, -244, 176, 102, 78, 12, -53, 108, -187, 72, -54, -60, 201, 115, 54, 112, -93, -18, 96, -244, -93, -56, -148, -54, -57, -163, -83, 66, 75, 29, 46, -22, -70, -296, 35, -5, -81, 160, 191, 72, -51, 140, -182, -278, -252, -44, 30, 115, 29, -113, 96, 13, 21, 73, 181, -71, 45, 124, 105, -58, 254, 61, 42, -113, -487, -64, -32, 142, 113, -212, -130, -242, 54, -62, -165, 1, -273, -197, 42, 116, 118, -74, 105, 107, -29, -345, -216, 30, -10, -131, 47, -12, -33, 152, 87, -29, -118, -23, -31, -120, 73, 228, 48, -77, 219, -32, -281, 122, 122, -302, -40, 16, 303, 81, 28, 259, -60, 114, -202, -52, 104, -123, 43, 94, 153, 102, -187, -39, 168, 207, 45, -123, -116, 29, 15, 123, -106, -14, 72, -20, -175, -22, -122, -121, 83, -53, 217, 21, 159, 192, -96, -85, 25, -9, 72, 90, 165, 103, 127, 327, 7, -342, -243, 34, 29, 3, 47, -87, 8, 252, -29, -23, 196, 41, -120]
3108a20L8L24l37J09N9qK0k22n4OJ55k24M67jJ04m9l82pj1L8Q3k2oK44q2J4l38
3135b02K37K4K9j4q6n3J30j57Q9Q7Q0j72k00J5K94j85m2k9J32q2N5l31N00j14
3159Ek02j59K82L6Q0rj79P5P9N5j14M2oJ85j53j79J03l5O5k4n0J9rm9j68J22J94
3186FJ0Qj44K51mK8J63j17l1k87R1j85M9K14j25R6qk26J19K11k12K9m7K83j8j41
3212A3R3j92J56Q8m8p3Nk7P8l12M25k75J12q8l0p8J59l07J16J57J71j16J01J55
3236B83k75j30R7j13J06j35J57k15J89R5J10k31L27m16M0j13L76l83N8J08KJ69
3258A06j46K80l79J0K5q0K26L6r7K17k54m8L3jJ45q8P2j06J17L53k65l9o8k06
3282a57K00J5r7k58M72j65j9J30k61J25j1Q9q1R7%j22j66J43J32o5p3k00J58J57
$$ y = [-120, -82, 242, -95, 14, 73, 65, 85, -137, -191, -185, -30, -254, 213, 212, 316, 267, -115, -122, -133, -95, -12, -34, -40, 204, 122, 136, -202, 35, 59, 88, 74, -12, -65, 65, -92, -3, 84, 164, -8, -208, -193, 101, -84, -126, -155, -23, -105, -50, -381, 119, 5, -197, -356, -74, -38, 42, 33, -146, -71, 8, 63, -51, -9, -15, 170, 17, -162, -59, -94, -29, -53, -103, -84, -93, -142, -310, -188, 6, 16, 24, -120, 131, 127, 155, 318, 201, 170, -117, -26, -211, -162, 52, -73, 23, 15, -211, -92, 119, -93, -64, -111, 172, 154, 13, 106, -86, 70, 158, 110, 37, 42, 15, 93, -219, 206, -69, 43, -45, -75, -153, 6, -301, -185, -28, 143, 27, 128, 283, 8, -122, -25, -138, -32, -167, -10, -225, -36, 59, 169, -62, 265, -151, -111, -224, 152, -231, -173, -65, -63, 106, -40, 240, -139, -129, -104, -184, 42, 78, -19, 198, -56, -104, -71, -72, 73, -15, 57, -49, 68, 421, 156, 117, 49, -157, 43, 58, -39, -297, 175, 10, -9, 121, -140, -15, -26, 63, -18, 79, 79, -43, -209, -66, 66, 1, -72, -272, -114, 43]
3306D3k05K49j3M5J05j27o3j30K1Pj36k9L96k31L1R6j29k09J00J00k6K40j29J23
3330A29J7j14J03Q5l48J36k16J91j65K53l9MOm2j26P5J61k75N01l21Lp0P4n6O7
3355C3j68K34j97J64L0l94M17r2k51K24j45O3K13o1j73P2M3J5k5j13L67l88J30
3378bj8M9j90J2j43M35p5k62K14j79J13K75l25K12j36k55M04q7jO0J5p6j22J21
3402C9o0j50R8j85N80l38m5J4J57l36J43Qj28K68J7N3j19pk36J70K21l38k6R1
3426a09j16P5L92K44l84o4K0N2j50R2j26l3j4P7rJ15Q0j94l1q4K05Q1p3j18j39
3451b11J06p6K60jl47J96jK66N3k20p8J15j69J35M4j59Q1j08J51k97K97R2k34
3474a05J05j63L13m0m5J08q9j25O9o0M6J57j06l4qm1j12J69K9j06J17n2p5p7K51
$$ y = [43, -162, 87, 74, 119, 224, 97, 34, -96, -75, -68, -204, -233, 163, -68, -37, 59, -70, -279, -179, -79, -105, 135, 6, 129, 146, 32, 135, 220, -128, 8, -208, -17, -182, 71, 32, 36, 42, 0, -126, -51, 110, -165, 336, 15, 18, -52, 22, -34, 33, -135, 99, -98, 66, 96, -298, 119, 27, -224, 0, -145, -82, 131, 70, -103, -31, 12, 27, 2, -111, 256, -132, -2, -20, 29, -161, -149, -292, 143, 68, -194, 20, -159, -46, 229, -96, 116, -20, -275, 129, 42, 41, 101, 116, 40, -82, 39, -21, -171, -73, -258, 322, -16, -61, -47, 110, -226, -83, -75, -203, 65, 82, 135, 16, 9, -227, -57, 164, -174, -200, -109, -225, -150, 242, 486, 102, 38, 58, 110, -40, 52, -74, -107, -121, -44, -53, 62, 142, -52, -83, -167, 38, 119, 46, -72, -211, -105, -181, 79, 78, -269, -73, -74, 192, 245, 25, -53, 62, -107, 28, 72, -87, -6, -114, 37, -260, 37, 129, -105, 0, -163, 150, 110, 65, 173, 84, -41, 28, -32, 14, 171, 65, 31, 23, -18, -130, 39, 68, -38, 79, 27, -48, -125, 126]
3499A26k76M8Q5j55J91j10K60J17j37l53J78J96j66Lj20K28l5l34M95Qk20o6J86
3522A49q1O8lm13K08L32l50J24o3j29J63RJ46k81P6K1K07l8k09j64J73k0l7L6
3546g6J44J7j03k6K86k98K43r0k08J09q8r0K54l9J8KJ31k24p1n4K18j19q8K30
3570G8j26Q5j95M19j15j56L4R8j70K54k92J73j22J5l7K08j19QQ7j46K5l29N37
3593B14j65k01L27j40k11K28j02M6q3j09K42Jj58k1Q0r4K89k09J66j04j95P2j71
3616b98M79k77k1J41j11l1J21j6q0L60j84j56J82j06O4p1L%RR5k4k3K0L6p3R4
3642A33k08J48q0j54J2M40k54j39P4j79L57j87OM2k3K41m60J52r6M39k33K8j92
3665a33J40k1J62j14P1l33J92R0rQ7m00J34K54n8j42L1K04k34o0K25J01j67j11
$$ y = [126, -150, -102, -17, -172, 19, -91, 169, 286, 149, -204, -26, 170, 4, 7, -113, 115, 80, -254, 241, 249, 29, -37, 149, 68, 136, 133, -280, -72, 260, -90, 34, -29, -158, 5, 14, 160, -121, -45, -24, 183, 145, -64, -228, -55, -75, -112, -76, 68, 85, -18, -44, 242, -56, 187, 97, -111, -2, -90, -180, 74, 35, 53, 55, 186, -38, -109, -163, 55, -64, -152, 78, -48, 37, -158, 261, 146, -10, 24, 122, -48, 206, -86, 87, -35, -20, -57, 151, 32, 40, 127, -19, 6, -323, 214, 49, -152, 175, 35, -176, 52, -50, -4, -87, -196, 46, 47, -111, -132, -52, -146, 143, -66, 100, -4, -199, -127, -298, 181, -96, -117, 24, -87, -118, 3, -13, -93, 267, 83, -73, 109, 3, 67, -4, -1, -1, 8, 103, 79, 56, 76, 112, 39, 133, -75, 73, -7, -161, -149, 291, 37, -102, -28, -207, 150, -37, -31, 11, -12, 229, -231, -79, -175, 264, 31, 59, -133, 7, -14, 148, 34, 105, -228, -36, 54, 45, 132, -268, -134, 120, 62, -80, -49, 155, -79, -139, 86, 187, 20, -91]
3688i1k9J5q4J55o9N8J92l63M07k80N3O0j72j24J88J94j23K04k41J27j74J76J2
3711I1j00K23j08o6j29K15J77n03J33M9K14k81K51lk55K28p6l07J25K44k78L30
3733A74j08k4j34J10K5k22K60k21m3O7O5Q0q6k4J79L9k83J86o0n4P9q3L70k13
3757G9n0O4k2N2k16J56l8Mk07J26L49l47J58m3Q0Q9j43k72R5K38j40L9KK08m04
3782a43K32k11K06j44M10k26k41J48j58K92j12O9j64l0J2M4P0j00J58K21l66Q4
3804E1r2J29j33o9K4K17j42J61j21N1j36K3J40j80K98j63k26K26J33j38J83j24
3826A12j25j54J64q4J06PO8k4l20J56O4N1J50l04mj14K55o1j1L01l18LJ06K0m7
3851cn4K13J89k55j36L4J4k01K5J15N4P9o2R8j79J47jn5J7pn0j62K02k1rqpO3
$$ y = [-91, -120, -105, -189, -34, -103, -45, 147, -216, 191, -89, -36, 24, -148, -272, -84, 110, -13, 191, -50, 77, -97, 79, 91, -9, 214, 106, 40, -89, 126, 303, -200, -67, -18, 196, -85, 166, 163, -92, 136, 60, -247, -122, 122, -156, 174, 66, 42, -92, 18, 43, -179, 81, -140, -183, -116, -51, 29, -57, -81, 98, 137, -146, 40, -20, -74, 5, -78, 292, 79, 29, 93, 71, 123, -93, 63, 25, 29, -178, -52, 297, -50, 108, 65, 145, 234, 91, -181, -86, 152, 12, 51, 53, 261, -143, 89, -122, 84, -60, 350, 124, -117, 31, -127, 165, 53, 122, -42, -72, -60, -16, 54, -46, 112, 333, -33, 51, -41, 88, -45, -114, -90, 127, -15, 146, 25, 76, -60, -37, 103, -77, 221, 58, -168, 58, 191, 53, 236, 112, -13, -167, -3, -87, 19, 26, 94, 70, -250, -94, -30, 21, 171, -133, -137, -251, 4, -57, -68, 233, -85, -82, 24, 44, -3, -57, 156, 345, 90, -46, -12, 2, -199, -174, -59, -5, 74, 12, 110, -69, 78, 77, 22, 39, 32, -18, -180, 22, 1, -8, -16, -23, 40]
3879D0j0J08j65l0K61k99R6R8j21R9j37N9L9j47OO1j03J47O2q6L43k76j4J20l02
3904a51J34L4Q2k3L7j0J02nk00q0N3J27j40k9P5J13n9n3J3jJ01j94L33k80N6p6
3930d1J95k34K8j15L35k03P2q8p8K27j49J61J26m99J68R9l27N22k28J39k50J92
3952E2j00L0N3L6j70K28j80J75j61m2p8N9M01k97m3J56l02Q0J4l0O4K57N2j70
3976H4j30J35l9j18K41k49K88k25Qq7M2o6j5J13M5P6r4j51J33j77J44J7J51j64
4000c8j34K27k4J62j47J79j51k1j90k4J61O1j39l7K18j85j80L05q4R5j53K42j21
4023B2j30R0j08J32L3O9J14k27RQ8q3k12J11R6j08J11o9m2l9K09j69J02J26j20
4047Ek95M35P2m65j5J63K25r7j29r1K86k50J07J71j18k7j1J58k9l37L60j62J87
$$ y = [40, 30, 138, -27, -57, 204, -95, 1, 99, -22, 77, -60, -1, 38, -109, -103, -42, -145, 2, 64, -22, 321, 45, 31, 151, -151, -17, 17, 99, 76, 113, 103, 205, 200, 0, -80, -27, 100, -40, -69, 6, 119, 60, 7, 20, 19, 120, -74, 259, -21, 35, -41, 154, -80, -52, -167, 168, -35, 37, -51, -129, 98, -51, 110, 236, -263, -95, 4, -323, 199, -29, 110, -140, 52, -48, -18, 35, 71, -99, 129, -51, 124, -37, -79, -157, -98, 303, 6, -37, 119, -183, -103, -89, -119, -55, 202, 254, 84, -46, 89, 50, -68, 173, -76, 212, -13, -5, -92, -50, -116, -131, -18, 27, 103, 9, -142, -9, -186, -42, -25, 126, -38, -172, 55, 31, 193, 46, 225, 74, 53, -137, -161, 0, 61, -78, -115, 103, -82, -262, 43, -41, 54, -99, 143, 22, -108, -18, -126, 6, 39, 108, 222, -5, 4, 92, 9, -203, -92, 4, -104, 7, -62, -104, -143, 66, -103, -1, 125, 5, -290, 145, 217, -248, -263, -100, 125, 28, -101, -192, 94, -156, -49, 122, 4, -23, -34, 124, 95, -242, 118, -44, 143]
4070A43j42On3l5J39l9J08L9j75L6j46K44p0K2j53N12n15L2L3kj16O4kJ18j15
4095f7L25p3m27K05l0j0Q4J31k14n1K63j54l9N4l2mj5K36j32p0J01l1l60L93r1
4120hj00R5r5j13M08l14K89j94J56l97J39J71j26L0j3o4K9jJ63k79J94rO9k76
4144b46L15k6o7m0M4n6J73q1O2k63M40l11J26l8r9MK12l84M18j2j65J75k35P7
4168B3q1J94m23OM02K3l2j53K22k42q6j10K20J3k60L63J07l09K70m12K38Nl3J02
4192D7OK18j87j6k67L60j00O0j62j59L81l37J7J7J90j08k1K12k34J19j02Q0K67
4215B81j1k92J21kL4l09J05J56J25l81J74nK14rj38o1j40L26K4j35k82J72J98
4238A65k48K21j47O1J42l03K01rp9j65m2J05M45l53J27r2k3j23J61K5R9j68M4
$$ y = [143, 1, 7, -46, -81, 58, 19, 127, 166, -9, 27, -119, 125, 55, 77, -76, 436, -79, -47, -14, -16, -132, -68, -70, 48, -67, 258, 185, -242, -37, -67, -77, 7, 138, -76, -127, 136, -18, -57, -3, -35, -39, -54, 182, 50, -20, 81, 50, -310, 83, -8, -108, -13, -108, -221, 187, -127, 162, -32, 124, -273, -134, 37, -89, -59, -72, -136, -107, -108, 55, -224, -30, -39, 30, -246, 69, 43, -24, -64, -20, -76, 97, 16, 78, -185, 255, -56, 70, 32, -67, -63, 149, -235, 183, 171, 6, 181, -54, 23, -58, 136, -287, -281, 121, 144, 112, -41, 181, -61, -147, -257, -37, -24, -284, 79, 186, -123, 147, -265, -27, -22, -55, 47, 53, 271, 84, 68, -199, 161, 61, 121, -41, -200, 181, -156, -139, -122, 68, -40, -61, 151, -83, 36, -66, 14, 281, 270, -22, 99, 97, 131, -178, -73, 83, 208, -173, 1, -4, 210, 201, 63, 2, -138, 188, 212, 77, -205, -33, 165, -83, 138, -9, 52, 194, -109, 92, 83, 4, -161, -203, -98, 347, -6, 121, 29, 6, -117, 44, 69, 168, 0, 44]
4261D4R2j18n7K01o4n0qJ2qL5j55K93k11j60K11K4k48R8J09l14L65l72p6L64K2
4286B9J11j85r0K59j26l9J48o8J45l1j48k70L04L1k02K30n2j05K06q7J12k57K9
4309e6j23J46J33j84j8J64K7j63p0j8K45rJ1R1j97j0r9L18k52J88q2r7O8R6p5
4334C4p8M9j1J23k0k48J25P8j51J83K0P3k90O6L8K10l03K91j29N1o9kq4K23j96
4359a7K36k47N2p8K06k84J09j02J69L3j75K7Q5O2p5J5M0K28k34l8p6o4J69j38
4383i7q9K33l59J63K98j42k79M37l2N0j93J35o4jq7M1O0j17j20K97r4K92n07j3
4407a88K30J96k50J29n7r4K06j53j88J93M1k29L74j67N3q7J7P3r0j07j08J53J65
4430A12j36j64J87O1k1m5L5j62K8L40l98L8n6K73N1Mj67n8KL6k32K79K58l22q7
$$ y = [44, 136, 18, -39, 162, 98, 48, 40, 52, 44, 79, -76, 217, 6, -154, 57, 81, -167, -69, 40, -274, 91, -281, -357, 7, 29, 140, -45, -135, 124, -2, -41, 107, 39, 184, 153, 5, -265, 39, 70, -132, 98, 46, -59, 147, 60, 172, -85, -56, -179, -33, 100, -84, -102, 62, 89, -74, -144, -162, 83, 74, 85, 176, -21, -31, -130, 188, -64, 124, 42, -55, 13, 109, 34, -44, 5, -6, 117, 97, -151, -26, 52, -99, 84, 104, 177, -113, -47, -9, 201, -102, 189, 60, 111, 42, 40, -44, 179, -17, 219, -28, 24, -54, 152, -132, -23, -125, 44, 77, -98, -71, 14, 76, 1, 16, 56, 284, 50, 12, -64, -128, 41, -97, -186, 47, -312, -149, 149, 7, -272, 165, 133, 183, -10, 125, 61, 60, -27, 14, 74, -43, -163, 134, 40, 332, -175, -188, 42, 238, -12, 117, 60, -34, 172, 19, -169, 24, 65, -164, 210, 43, 96, 9, 26, 99, 9, -98, -206, -53, 112, -24, -188, -1, 60, 39, -6, 29, -133, -105, 235, -163, -125, -181, 92, 143, 147, -20, -78, -76, -40, -272, 7, 265, -57, -144]
4455a44lK51m9j14N0RJ22lk25j06L13j21K40r6n1P7j73l2R1J3K03l40O9q2K91
4480A90j12p8j61J57L2Q7qk12J51j9k24J98J7J0om5J01l5j78OK29k94K97m10K09
4505i8J80k47K02J11p9k20K21J72k23N3k37K17j96j5K39j96M0Q0J7N5O2M1j63
4528A6k1j21k31L98r2j98L25j41J15k04J74n2K07J33k10j51j2j8j7J91k26j4J15
4551c4L9m6K72j53k7o9n6M2qR5N2p0j19Nq4P9K59k50r6J32k2R9j88J50l8J68k22
4578i0J61j13k01J72Q0k23K85j86J2JM86m77P3L93k73M0P6j96J0j12n0j5k8J86
4602A1j24J96l4Jk23K89k88j5j0Q8R2l49N68l45O0K78k17J39J7Lj45p0lp5K26
4627G0q9L4k6J84R6k56n2J12K47n62K53n7K63l6r9j05m4j6r5J73K8P9j70J0q2
$$ y = [-144, -147, 104, 55, -59, -9, 0, 122, 119, -106, -212, 101, -20, 220, 124, 73, 150, -23, -55, 36, 49, 252, -88, -19, -101, 190, 78, 0, -161, -4, 28, 115, 107, -105, 46, 27, -197, 1, 18, 28, 22, -23, 78, 43, -135, -129, 100, -194, 103, -307, -98, 82, -165, 37, 148, 69, -151, 70, 242, 19, 72, -165, 52, -144, -159, 80, -116, -76, 4, 21, 76, 138, 179, 16, -5, -126, -357, 41, -51, -249, 76, -65, 50, -154, 20, -32, 175, 308, 98, -53, -65, -83, -100, 91, -135, -149, -34, 5, -41, 231, 78, 51, -18, -74, -32, -40, 55, 107, 37, -82, -77, -161, -82, 177, -73, -169, -37, -59, 40, -148, 2, -36, 132, -90, 71, -42, -243, -71, 9, -214, 71, -115, -103, -102, 384, -93, -20, 373, 100, 140, 216, 20, 30, -82, -132, -147, -175, 11, -113, 83, 49, 50, -173, 116, -172, -187, -197, -109, -17, -366, 202, -143, -83, 195, -22, 117, 134, 137, -8, -78, -81, -156, 70, -19, 15, -11, 173, 269, 13, -39, 73, 320, -242, 11, -46, 217, 181, 82, -23, -67, -83, -178, -5, 23, 102, -68, -58, -140]
4652a40K68j71k60L29Mj63K46J12m21K24P3j66L29k29J21k63R0P0r4J72k56K06
4674H1j73N5P5k1J12j84K71j70M4k34k5K80l0M2J5k91K00k12J70L4M1L6l95K18
4698f1K1J5j32N6K16n3l4r3J8L48k55j07P2K11j1j25q6j55L1l2lK28p3k52K51
4723er6Q9j33K7q0M56j51j93j19K42j19N9j46K47oM7j14N4K34l66J49m5j68K35
4747I8j16N3K0Kp6K91j96l2o2j27L5J06r9N7J06l7j10j75K68N6k82o4J96j08K71
4772G5Rj4J5J98k46K06j78k99L92j65O6J7j1p9k6l8P5k9p1p0J37J87k93K25l6
4797D7M4n6k8K2j2p9j28L31k82K99O9j19j28J61k62N0Q1J68m90M14k26M9K8j14
4821a61K3J05J85m2k55K98M2m11L35j41o5J02N9j72J56J26k65J55j20P0O2l57
$$ y = [-140, 128, -43, -303, 26, 30, -133, 113, 225, -196, 28, 101, -65, 264, 35, 156, -107, -17, 53, -41, 131, -125, 81, -92, -37, 38, 17, 129, -55, 216, 46, 90, -144, -169, 111, 81, 123, 138, -153, 47, -165, 5, 39, 80, 116, -279, -61, -40, -25, -157, -101, 115, 62, 28, -65, -47, 301, 46, -61, 11, 222, 211, 86, 0, -155, -124, -156, -159, 69, -4, -256, -5, -101, -12, -145, -118, -198, 258, 107, -86, -205, 37, -82, -23, -169, 78, 72, 119, 5, 59, 293, -73, 76, 31, -137, 98, -18, 35, 55, 57, -19, 272, 76, 44, -18, -145, -110, -4, -103, -46, 60, 23, -87, -262, 6, 62, -220, -284, -88, -196, 75, 84, 70, 85, 283, 37, 243, 65, -234, 158, -7, 59, 76, 65, -14, -40, -78, -3, -32, -103, -173, -36, 151, -142, 83, 47, 91, 35, 7, 29, 17, -62, -190, 141, -141, 158, 227, 108, -20, 141, -121, -71, 10, 178, -312, 102, -124, -75, -47, -161, -138, -33, 152, 110, -145, 153, 195, -216, 119, -22, -87, 15, 74, -98, 58, 184, -81, 74, -46, 24, 86, -271]
4843b71K56k42J61L11q9m4j93K38M3j3k90p7R9j7J94j31n3L46j84n1M4r3K11q2
4867G3M7j55j7K85j20p4L7j32M9p9N4kk13K54J0M3k11j24K56k0pj09J68j12J05
4892FK97l63L7j15J00j13n1J79J14kk26N3L37m91K65l0J6N7KJ58m57K94n2k2J45
4917A38k48N6m8J09l7mL0j8Q3O3m2L5j9k71J28J23K0j50j1l1K48q5N0j52m9j54
4943b36L07K8j69l1K71o1M5j13l36M78j13j62M11n19J87L0k8L6j72m8L27L1K2
4966A85k02j07J80j72Q7l05L49n6j35K17j57L66n4k41k9J46k00J12m2R8K0Nj28
4989f3L02l95K76j27O6J18n26L91k4J65Q8k33nJ37q0j13R2K0k5J5j93K24l28J46
5013g2Q6J72k76K99k56K5K03k26j7J9N1J24l19mK94J01j65J23j35j21j87Q1K35
$$ y = [-271, -15, -257, -96, 215, 126, 82, -111, 127, 170, 157, -133, -210, -111, -128, 66, -65, -118, 228, 44, -7, 37, -56, 155, 73, 120, -35, -52, 233, 113, 39, 76, -56, -7, -86, -32, -34, -247, 7, 17, 60, -151, -275, -19, -39, -46, -155, 13, -99, 6, 303, -60, -23, -138, -38, -151, -202, -23, 91, 89, -137, -84, 253, -238, 27, -3, 13, 70, 72, 230, -227, 67, 15, -7, 138, -110, -54, -102, 7, -30, -34, -4, -22, 61, 124, 82, 117, 98, -173, -45, 78, 98, -52, -63, -94, 154, 69, 119, -33, -82, -236, 71, 99, -70, -101, 170, 109, 154, 41, -295, 183, 70, -92, 319, -200, -13, 17, -11, 25, -147, -195, 132, 163, 185, -17, -124, 56, -116, -29, -334, 15, -41, -176, 41, -116, 250, 196, -45, -74, 72, -128, -16, -58, 40, 60, 65, -63, 239, -156, 120, -7, 59, 177, -349, 42, 18, 183, 271, 38, 33, 170, 90, -23, 69, 89, 64, 79, -114, 110, -218, -72, 14, 186, -90, 209, -47, -22, 181, -45, -62, -43, 8, 132, -187, -191, 103, 204, 39, 162, 27, -94, -281, -200, 35]
5036C5p4J7k4l3J75r0k24M12j28q3O0j05k03L82j29o1J36j32K1J57k78N8Q9K4
5060Bm4j15J53j7Rm8Q5J38K9k36J38k16J21Lj04J45K01l36O9J45j09l7OK02j48
5085C6J24j71K3k6L6O2P2p6k39L03l14J30mJ18j36J69j11k41N90l61Q2K18l26
5108d2J41j34J91j53j24J88Q6k9l24J49K74l66J03R6J31k09J53l24M59j78k50
5129a62J12J03j88n1K76l16K01l2P5m3j58J36J43j18J53k04K72k52K12j60K00
5150A99j21k6P1n0m2j59K23l01K00p4M32m00J75j17k6K48j28j05N4L3Q2k31k4
5173h7M0J12j01k0J75j74n5J40k75L43k66M6J36J61k94J53Qj18j27Q5m5Q4J82
5196A03l52R2K27l42M0O5J25K5j5m3J70p5o2J57l40J53R2k60K14J4M8Lq9o6K55
$$ y = [35, -39, -22, -46, -79, 96, 6, -218, 194, 66, -17, 43, -62, -265, 117, -12, -73, 63, -69, -48, 109, -169, -111, -22, 2, -42, -157, -4, -21, -12, -60, 25, 163, 192, -44, 94, -122, -1, 2, -102, 43, 244, -92, -23, 122, 13, -24, -18, 184, 36, 160, -11, 12, -14, 22, 84, 156, 80, -159, 144, -170, -40, -44, 74, -62, 107, -4, -245, 345, -16, 66, 284, -42, 99, -35, 156, 3, -121, 67, 153, 124, -200, -51, 223, -143, -40, 56, 187, -22, 131, -193, 266, 88, -162, -50, 53, -135, -186, 90, -226, -25, -57, 18, -25, -183, -47, 96, -22, 131, -73, 199, -53, 159, -1, 199, 78, 52, 123, 73, 31, -128, 95, -206, -6, -80, 352, -48, 127, 10, -16, 232, 104, -1, 53, 86, 168, -63, -87, -47, 65, -36, -56, 119, -55, -110, 30, -245, 98, -168, -122, 14, 175, -119, 34, 42, -76, -203, -118, -163, -79, 103, -249, -157, 70, -272, -232, -167, -42, -17, -32, -75, 95, 20, -42, 115, -225, -72, 20, -240, -26, -12, 36, 39, -50, -116, 139]
5221A39k00m6K90k06r0Q5J8k26k7L20J13k36J03Oj18pJ0k0J1L9K02M6j78K8j17
5246f1P3K32j69jr6LK04j00O0k72K39Q3j94p8r8K48r8K1n3l2J01j7n9K9L33m13
5272a15np0L30p5M0n7j57L9J14m1k16J27M3j01O9K01j99J15q5k34Q6K52J0q7q2
5297i8M38l87o9K59k9j48o4m3J30J9J09j81J11n5j25j33K90N7R7j75J75k17P7
5320C8J60p1j03n4j48j69L46k21J76N4j12J55R7j17N5m2q2O7K0N6p2j41M9R5K01
5345B37j90k88L23Jm2j19J41N1k69l2J3J28N3j1p3L7J72O0l12p4J66J02MRlj05
5371b1k58M71j26j6M9j26J8p7K83k05pLN0j08J16j78K69j42L11n38J1J70p2K46
5395A23k91K2k8Q6K30m8j67J07r4k33M25l02L24k07K65k41J98k02j33J38j60K80
$$ y = [139, -61, -107, 183, -23, -113, -28, -10, -236, -263, 57, 170, -66, 37, 43, -75, -82, -72, -92, -81, -42, 160, 206, 28, 56, -61, 12, 244, 75, 74, -22, -19, 185, 85, 145, -127, 112, 195, 1, -77, -175, 73, -25, -4, -57, -89, 12, -5, -64, -35, 298, -115, -120, -190, 140, 65, 105, 48, -109, -70, 44, 3, -213, -86, -43, -144, -75, 126, -73, 42, -43, -277, -191, 61, 71, -16, -98, 340, -47, -116, 143, 114, -34, -98, -141, -11, 8, 117, -64, 47, -8, -133, -266, 24, 81, 178, 3, 178, -39, 38, 198, 127, 24, -30, -178, -347, -1, -222, -46, 8, -104, 51, 148, 31, 86, 44, -38, 29, 49, 105, 33, -108, -59, 36, 237, 47, -241, 82, 83, 41, -78, 63, 114, -155, -187, -174, -46, 7, -4, -77, -40, 132, 192, -120, -194, -28, 74, 78, 87, 84, -21, -279, 192, 66, 50, 99, -27, -9, -86, 197, -8, -15, -12, 38, -70, 46, -132, 137, -5, 306, -232, -221, -51, -123, 123, -168, -146, -174, -88, 142, 94, -73, 34, -60, -293, 132, -170, 154, -53, 212, -29, 169, -33, -166, -28, -188, 92]
5417I2J02j53Q5j80J95j09P8n4j38J00q0P9o1K01l18K92j66J62j83k71M06k36
5439a57J35P2o6R6r8J14o1l07M36j3k99K50M3M3j67M7P4k11J21K23l20K08j55
5462Hj77J2K46p1p1J0nP2j58J19R1m02L76O9l90L44j09j85K39P7Rj85K33r0k0
5487D2j32K16l04K09L4M6K0l82L36m5q7P2k56K01J9j3k5Q2R9l20J51J13j52N6
5511b0P8n4j4j00J37r2L42l28o8L08k02J1n9j00K19J03n1k5J37r4J4j14j01j14
5535a87K59j91L4j04L52k84Q5J71j17Q8k92J27Q2M0K0Q9j49k27J85O5L2n5J37
5558A60J42m57N6q9L16n7m6l3qk1Q4L4l0j10P8%N8k04K53j92k4po3K71j16J44
5584A39k54J67j04P3k34L03k37K17k4j7j89k5k6l5K93l9n3K6j41L13l31L05p3
$$ y = [92, 194, 41, 126, -54, 141, 32, 110, 56, -82, 18, -62, 17, -44, 157, -161, 131, -35, 127, -56, -327, 79, -157, -22, 50, -16, 80, -18, 96, 35, -272, 164, 151, -148, 102, 145, 188, 21, 68, 142, -69, 52, 275, -45, 163, 8, -169, -157, 89, 18, -53, -43, -48, 24, -134, -15, 76, -326, 50, 119, -271, 73, -36, -221, 18, 95, 104, -81, 152, 62, 42, -90, 126, -178, 31, 65, 111, 131, -251, 85, 40, -47, 25, -231, -30, -11, -24, -49, 33, 132, -188, -37, 76, -76, -20, 58, 4, -10, -110, 27, -65, 277, -51, -119, 189, -13, -2, -61, -161, 58, 161, 110, 85, 222, 128, 142, 28, -73, -187, 72, -119, -85, -189, 163, -121, -36, 135, 18, 106, -186, -59, 23, 63, 83, 172, 23, -204, -19, 46, 78, 23, 160, 302, -155, -99, -188, 128, 71, 25, -8, -16, -37, 47, 81, 51, -59, 19, 19, 77, -127, 126, -66, -90, -97, -160, 111, -5, 139, -115, 52, -52, 21, -213, 90, -147, 70, 46, 29, -160, -185, -211, -246, 47, 8, -45, -19, -160, 153, -178, 127, 54]
5607E4M10n79J61k6p4J41M6j26N6j53o0L27l48J07J8l4J27j34J19qo0J37k38J20
5631a7k90N02j26m5j34J28J02j11O7J4k38J54j18Q4k7j7j22L56k28J89k86O6O1
5654c6J20j49J08J7Q6m3j83l7O9J23k7j3n0N4P4J1l13M7K46p1n9J2l9Q3K9m11
5680c52O13m08O5O8n2J30k4j42J52j59J99j07j73K24Q5n6k41L30k64K97j49k42
5702b06K84q7Pk09K40l8Q2j4k26%K35k64K65r5l6M7k48J98J29J62m73J77o1L1
5726a00K15k2j65PM9K7j07J86j0j51K49nj94j0r1J19j5j06J06j36j88M81N7k00
5750dJ62l15P8J21J75k52P8o7J57j86J11Rn1O3j53O5M4j81R6m3J35M5j83L32j74
5775F2J52J8o5l27K10j09R3j48K19j83L6j28K28Nj17j11K60K06n20L11P3l46J14
$$ y = [54, 464, -115, 46, 20, -54, 87, 133, 7, 63, -90, -150, 177, -171, -64, -46, -80, 47, -87, 32, 24, -36, 101, -137, -17, -307, 195, 69, 24, -110, 18, 120, 9, 76, 90, -148, 6, -112, -28, -55, -72, -194, 162, -66, 123, -163, -97, -36, 84, -65, 43, 60, 146, 103, -80, -117, -48, 75, 48, 35, -15, 39, 113, 124, -189, -142, 104, 33, -26, -14, -53, 30, 59, -352, 261, -147, -82, -14, -66, 64, 40, -102, 50, -109, 90, -17, -190, 34, 119, 63, -178, 152, -112, 185, 36, -206, 78, -9, -2, -211, 29, -9, 73, 59, -167, -167, 68, -196, 69, -26, -62, -15, -263, -65, 64, 226, -247, -70, -131, -100, 115, 93, -72, -65, -16, 11, -96, 90, 80, -71, 178, 173, -21, -31, -122, -3, -18, -124, -18, -154, -342, 139, 196, -4, 158, -157, -79, 42, 217, -35, 43, -24, 133, -53, 58, 67, 16, 79, -74, -9, 35, -146, -50, -93, 42, 87, -96, 236, 62, 214, 232, 167, -160, 50, -59, 34, -114, 105, -78, -42, -170, 58, 63, -54, -165, 95, 301, -219, 92, 165, -181, -67]
5798f7K24j82r1K03j47J6O7lk5j83R0j15L35j95J05r7J26j16J82l06j75L13P8
5821C7p3Q2l1k26L19l47J23N8M7o5p8K56k29J93j12o7Q0l9K21r5J20k36m4L9n
5846g2K19K8k72K09j13Q5J42l41R6J31j53l4o8Q2N8r1R4q5J55l51J6J86J33j30
5870g6n6Jp8K65O8r1k55q3J70O1J11O5Kj94J15N2P7j53J26k81M10k73j07J16O3
5895E5k16R3PJ19j60J98N2k67J16M4l4O5Kj15L4k7k1J06K22l34L76m54K00Q1p6
5920F6O9j02k08K21J7r4m2K52k44K97j97kK28j68k64L4J22p3O1L5J56k13J4J28
5944I3n6Q9M4l12kn1J78Pk5M0MJ15l11J59q2j6K00j50N4J58k15K97j92J97j10
5969A13m0j71J49k10m4J73j46J69k9k8R5M8J44k47Q2O3J26lk05Q7j80J27P9k15
$$ y = [-67, 157, -25, -116, 87, -60, -44, 23, 20, -5, -188, -98, -213, 122, -73, 32, -65, 61, -55, 127, -179, -354, -41, 37, -36, 46, 15, -211, 108, -239, -116, -58, -11, -76, -154, 102, -127, 66, -46, -113, -33, -72, 149, 54, 174, -62, -106, -67, -72, 147, 175, -97, 112, -1, 84, 226, -115, -19, 112, -41, -75, -143, -61, -3, -94, 0, -85, 70, -281, -265, -79, 54, -76, -132, -131, -209, 56, 124, 33, -222, -305, -135, -74, 37, 102, 104, -90, 25, 77, 154, 1, 127, -154, 256, -17, -124, -8, 55, -161, -68, -61, 58, -102, 96, 148, -119, -3, 41, 7, 72, 74, -41, -7, -34, -55, 51, 273, -61, 315, -139, 61, 142, 66, 135, 33, -175, 46, 63, -31, -73, 179, -65, 232, 35, 33, 261, 93, -171, -137, -15, -88, -27, 8, 164, -49, -35, 93, 37, 126, 170, -142, -144, -195, -17, -10, -35, 5, 9, 124, -187, -28, -110, -126, 74, -76, -22, 136, -79, 218, 26, 223, 113, 73, -98, 51, -159, -203, -30, -176, -7, -36, -64, 31, 79, 223, -24, 58, 121, 247, 244, 39, 126, -54, 73, 152, -63]
5993f3J63N0j81J3Q3N1k76P8K22q8j24K85m09L28J2m8k18J51J35k59r9L98l44
6016a40J47K76m41J76n1K39k23o1J98j75RJ02k4m1K2J61j11k71Q8K3J54o6P8j43
6040g4J51R5j67J43l65L72k09J76m1j45J72l0Qk53J98j52K27m1p5j51l8K12J58
6063A71l09J91j34J48p6L7j29j5j19J74J77k12q1L00j63K48k46%j53M3L2J07n
6086a4J16r7k16n3M06q5r7O7L5j30N7K24j01k04R0N4p8K36l34%J08n2K00m06L02
6111B8q2J61k28K08j16N4j02J45j17J70k40L6L4K6L3j41J05K2n1J48l20J68k8
6134h7p6N1j66L16M6o2K13j05Ol43J60j04K07p3j8O7n4J78j69l8O4k02K02j27
6158a14J55K1p6J32k66K25J35k48J09l3j36J2KK16m4j6J01j87j21J94l5l1j47
$$ y = [-63, 100, 150, -31, -18, 65, 116, -160, -82, 140, 52, -72, 213, -196, 132, 144, 96, -122, 29, 164, -95, -194, 204, -140, 7, 283, -158, 18, -33, 206, -17, -78, 120, -55, -46, 56, 32, -9, 13, 174, 63, -208, -120, -97, 57, -9, 69, -74, 77, 172, 5, 148, -217, 155, -54, 122, 81, -64, 108, 78, 86, -167, 31, -121, 106, 65, -10, -161, -199, 13, 171, -138, 53, -81, 67, -9, 28, -101, -116, -235, -61, 116, -96, -177, 123, -40, 208, -38, -38, -191, -148, -116, -9, -14, 102, 5, -211, -264, 142, 57, -40, 27, 62, -68, -11, 213, 112, -92, -2, 52, -26, 210, -124, -124, -16, -68, 132, -274, 28, -54, 107, -121, 87, -29, 25, -77, 68, -49, 121, -119, -83, -49, -23, 10, -131, -26, -4, -55, 93, -227, -59, -87, -163, -112, -278, 38, 84, 22, 235, 130, 136, -207, -47, -151, 56, -17, -35, 32, -22, 156, -13, -51, 13, -189, 13, -114, 41, 62, -14, 118, -148, 77, 212, -36, 73, 40, -96, -84, -82, 134, 90, 74, 175, -12, -133, 61, 26, -5, -152]
6181a52J27P6K2k19K86k20J69j67J77Lk15J81o0n7N5j68rJ09n2L0k7J33%O7j74
6206h5M8m7j11J51j1J2J92k86K03j15q2K78j59L9k26k5L14J13j63MK49l31M4J36
6230A42k56P7J49j39r2O2k7J37r0J26K5j43k35K52J12m8j50K23j7j83OR5M6K3
6254I5J02p6p0j70J02M9l6LP0j02J76j62j16j2J73O6j75p8K52j9j43Q2N1j77J50
6279C5M0j75R5j21J80r6J65k07J23n9R1m9n6J9r9RJ39lj5P3j42L5o0N6k2K47l08
6306a05J83R7k89R1O5J7J25j88Q6R7q8L9l09J52M9P0lk54L29k54R4k71K56Q4k04
6331a31K25k1j14j29J10J08Mk68K86m01L05K19k89N6KO2J35j80j66K15j44l3K79
6354A30M0k63J41j24R0P0K1k38K75l39J57M2O0K20j37j8k20L1J58L7k77o6J23
$$ y = [-152, -25, 51, 73, -146, 140, -80, 89, -78, 99, 102, -113, 68, 8, -49, 6, -162, -171, -62, -114, -84, -111, 22, 22, 89, -85, -37, -84, -195, -44, -55, -43, 149, -137, 66, -49, -131, 147, -12, 27, -199, -224, 90, 203, 40, 44, 293, -38, 6, 142, -114, -37, 112, -27, -119, -57, -84, 53, -37, 89, 114, -29, -264, -12, 100, 52, -98, 125, 108, -75, -69, 26, 72, 95, 197, 121, 51, -119, -17, 32, -4, -1, 69, -33, 143, -19, -135, -147, 26, 92, -83, -161, 91, 72, -71, 11, 62, -115, 35, 75, -100, -5, -126, 54, -42, 123, -84, 39, -20, 71, 22, -34, -15, -114, -105, 34, 31, 16, 89, -53, -18, -78, -22, -44, 203, -105, 78, 175, -114, -23, 42, 59, 184, -4, 82, 179, 91, 130, -179, -27, 22, 92, 89, -165, 164, -90, 4, -267, -11, 73, -131, 94, 73, -41, -170, -60, 48, 52, -216, 70, -331, -26, 193, -96, -40, -38, 24, 159, -21, -187, 28, -116, -149, 130, 170, -93, 48, -76, 14, 84, 105, -133, 142, -197, -40, 2, 62, 282, 145, 127, -93, -62, 96, 133, -144, -210, -87]
6377h7J85r3j81K41k51K03m9K49m8n6j84K24m3l07K09j50P1j67P0jJ40J63j99
6400f1Kk32L04L2j11L02l62R1m3J44J24q6m5j00jJ81k0j15J98k42j05K06r3k8
6424f0J23j83K49Nk08j72J95O6L5P7j58j51K68m6l6L7k00M2K56j32L0j7K6n3o7
6449g4J12J08k79J34N9j43J62P6k27k60L04l23K46K5l03L22P9J4j51J28j66M03
6471B46r9k32N4j2J64k58r8L60j0o3j44n2L9K12l68J93O1l7R0J6j13K4N4Q5L2
6496A44j4J0j43K08n2q7M4k27R6J11j16n6N1n9J6pK33j63j15O7J57k03Q1K59m89
6521b54N23k02J07k14J67j32Pn0J69q3k68J89J91m5P0j36j82K80k01J85m8j08
6543c5o2M6l2K99p8k6j78k11L22o3J93k06J53l34J71J71j19J36k43j4K14J42j57
$$ y = [-87, 98, 5, -176, 65, -186, 17, -32, 217, 169, 113, -71, 153, 110, -197, 12, -138, -67, -234, -164, -165, -25, 138, -61, -59, -291, 13, 45, -66, 236, -126, -35, -78, 66, 190, 104, 59, -41, -42, 139, 119, 4, 202, -40, -145, 61, -32, -60, 63, -120, 129, 134, -74, -246, -51, 15, 50, 127, -31, -182, 86, 40, 4, 41, -159, -117, 139, 7, 37, 20, 46, -7, -74, 38, 146, -133, 1, 60, -83, 79, 155, -72, -332, -28, -351, -105, -80, -383, -61, 18, 32, -119, 9, -157, 246, 147, -85, -31, -43, 121, -137, -235, 125, 115, 52, -92, -144, -105, 107, -261, -68, -7, -44, 46, 62, -51, -27, 27, 112, 144, 130, 140, -3, 205, 153, 66, 110, -117, -21, 90, -26, -82, -31, -90, -74, -81, 152, -11, -126, -59, 98, -105, -24, 235, -254, 269, 67, 174, -40, 127, -5, 2, -48, 121, 38, -230, -41, 150, 105, 175, 39, -143, 137, -64, 121, 73, -35, -97, -51, -83, 216, 138, 112, -66, -277, 45, -18, 175, -31, 122, -212, -41, 130, 11, 147, -96, -110, 104, 246, 89]
6566H9j42l7j2k1Q5Jk20M01K6J1j70p4J38J32j07M0o8m8m8m7k2K70k27J60l3j53
6592g6K57j60O8k2O6l8oj22J03J30k44J6k77L52N0p9M7M9j27M5N3l94L55Q9k89
6617a54K22O6j67J06k67J56P6M0p1J5p4K0k00K43Oj05J88k11J87R5j40J83j64
6640E0k74M63l36R7N4L2j34J50j39j46J17N6O8K14m16J48l25K54o1L97k30J92
6662B31k66K3l3k23L23j72K22k48P3RJ97j36J40Pj82q8K12j57k0Q2m9k8R2P0J06
6687A85m09L29k15K54j90K37k40J29L6Oj30J2j06j96K81K41l12o7R7l7J89j65
6709g1N2j17K08j95K44O2qk22j80J14Ml9L75k66J62r6MJ4k01j7L7P9k6O2n2J57
6735H4k40L30n1j20J65j54J27J03k05L4j81L58j46j40J40pMO2m61NL81j01O5M
$$ y = [89, -53, -90, -102, -123, -38, -37, -257, 144, 170, 181, 11, -63, 75, 207, 100, 140, 72, 24, -24, -71, -93, 177, -50, 110, 77, -76, 181, 21, 89, 67, 133, 95, 89, -33, 70, 200, -44, -28, -305, 47, 97, 18, 65, 114, -13, 32, 85, -309, 46, 135, -154, 68, 134, -33, 73, -194, -38, 38, 78, 7, 22, -52, -32, -232, 11, 17, -88, 100, -111, 76, 171, 31, 214, 50, -224, 239, -97, 0, 54, 86, -48, 102, -37, -183, -66, -10, 58, 272, -144, 4, -321, -67, -128, 269, 39, 231, -35, -12, -45, -268, 55, -117, 105, -143, -70, -61, 136, 0, 140, 147, -35, -123, 89, -68, -88, -6, -55, -83, 9, 79, 185, -224, 105, -110, 144, -46, 191, -49, 80, 116, 122, -8, 4, -102, -298, -17, 224, -88, -155, -58, -95, 94, -71, -19, -136, 72, -123, 121, 183, 175, -47, -227, -113, -109, -148, 227, -39, 123, 27, 31, 45, -156, -173, -136, -57, -83, -21, -73, 84, -156, 174, 123, 3, 168, 14, 141, 244, 39, 73, -108, 250, 104, -36, 104, 97, 101, 163, -298, -293, 88, -13, 52, 56]
6759E6j05J46j03m9pQM2j53L65k30j04N6J96k83K91l94M92l65K1J57q6r3J54J54
6783A66j90J07j93K33j36l3j28J90J7J49k45k01L76j03J2nJ64k76l3nJ79k34L0
6806a59Q4q4J85m3J33j24O5JnO0r5K5r3k6K84O5k14l75K38J47P3o2j5L1j92J17
6832B1J29j69n4M02l89l1m5p0L44j23p5j67K31r3K17k88N4J70J3l4r9jj13O5O2
6857d3j12K18J31L1j65L5n5J12j01m3J18r6m9k47K34%p0O1j07K98j70l02K75J71
6881A24q4L6j44N6J44j87k3K01p2k4j38M1kJ44j56L69m72j9J05n3J26J01n3k79
6905b59L90k4Q6k98R9o3p5P5%M3j40R1K93o7k17M4r4J11J57k34Q7K17k65q0J27
6930DKQ9K2j3k21J73oJ07o9J40l61O6J29m7J51k12M2L9k42L95q5m1p4R9N6j85
$$ y = [56, -49, 97, -6, -55, -62, -54, -12, -165, 200, -30, -134, -78, 118, -165, 126, -268, 224, -141, -120, 37, -49, -142, 12, 166, -24, 83, -110, 123, -13, -46, -174, 16, 33, 182, -63, -264, 112, 9, 21, 16, 180, -96, -129, -134, 45, -189, -159, -75, -159, 26, -17, 116, -8, 57, 58, 53, 113, 18, 43, -50, -76, 208, 273, 59, -316, -78, 69, 142, 80, 65, 96, -96, 21, 150, -19, -73, 329, -60, -91, -136, -206, 138, 15, -60, -227, 4, -89, 128, -160, -106, 64, 77, 43, -56, -57, -170, -105, -43, -155, 63, 194, 225, 60, 95, 40, 152, 51, 8, 126, 30, -19, -266, -32, -32, -102, -41, -148, 150, -20, -322, -47, 124, 40, 76, -68, -12, 132, -55, -78, 123, 51, 27, -111, -70, -72, 72, -84, 285, -187, -206, -101, -154, -28, 73, 20, -259, 131, 107, 193, -105, -6, -69, -144, -69, -69, -26, -166, -75, 218, 151, -66, -22, -116, -5, 152, -82, 5, 222, -43, -123, 4, 6, 95, 117, 104, -117, 56, 50, 157, 88, 228, -133, -67, 62, 15, 166, -46, -4, 35, -207, 188, 103, 62, -12, 87, 143, -42]
6956d2K37K7k39N9O2k0j85K88j69o1J87j49j46J61k03J61J98l0l56K09J41pP9
6979B02l45L4K27N0p0k37L2oO3J34k13J2N7J48r9J70r4m1Q4m6j67J26j51J18M2
7004C0n7%K30k61J85j1L2k00L10l66R9K49l49K26k03J75M0KN3J83m41J69j21j06
7028a32P8J15p5l7J57M4j94J35KM5k93J80j18R1J11J7q8n6J8j20r6J80J02l07
7052b41K42O0j89RL14k92N1J48j51O2j44k8J06J64K3k52K36j07r7J49M2j12m1
7075d8q3J07k82K12J4Q2k48M06k12q7K77m7l22K08J50k68J96j46L5n3J52P0l11
7098a98L64n7J17j90j50M03j08k61J77L4m25K3N70k98l2J29k6l2N9k78J48p2P9
7121b4p2K1k1j13N17k29j57K17j71O9qj7M7j01J5j87L95k31J79J56m88K10p7j53
$$ y = [-42, 195, 222, -17, 42, 104, 84, -101, 187, 18, -43, 144, -5, -151, 10, -193, -32, 166, 136, -220, -11, 130, 123, 202, -143, -109, 118, 168, 98, -139, -107, -113, -50, 84, -129, -117, -60, 88, -11, 159, 65, 24, 108, 62, -105, 21, -130, -12, 30, -27, -27, 203, -58, 127, 116, 148, -52, 258, -108, -9, 240, -109, 117, -86, 89, 129, 131, 184, 367, -74, 95, -26, -132, -54, 61, -14, -51, 106, 150, -44, 91, 93, 138, -155, 25, -93, -2, 109, 126, 38, -18, 0, -120, -216, -36, 66, -241, 1, 61, -128, -119, 195, -97, -46, 102, -49, 13, -131, -159, -53, 111, 134, -118, 118, 11, -86, 63, 105, -7, -48, -131, -24, -306, -94, -80, 2, -246, 160, -52, -139, 138, 91, -231, -23, 127, -141, 55, -91, -56, -109, 43, 113, -198, 166, 109, 226, 36, -114, 289, 181, -80, 97, 131, -294, -271, 299, 1, -31, 98, 72, 40, 99, -179, -31, -103, -24, -96, -75, -96, -209, 308, 79, -78, 139, -32, 37, 29, 12, 59, -42, -27, -214, 181, -50, 129, 285, -203, 7, -70, -223]
7145b23K54l3q5J23J00q1j14P0R9r8N1l47K80K5M9j10m2J79l23N7L03P3k16K34
7169B25l1J37n21J52N7N4n8p3J14j2j25J55M2k06q0M33l20m9K60k79J26J7J39
7192A57l46K02J17k58K50m71M01k38K30lk32K87j42j07N9J91k55J89j43K67j49
7213Fj56J36n4P2K18k88J29J8m4q6m7Q7ON8N7j40O8R7Q5j38j05k23M50l50K68
7238A24l05L62k06K85j78n1k10K55j51O4K2N0m0j1J02k93L54n5o3QJ76l09J62
7261I2k32K18q7j06K98m06L52j35N3j27j14P6n0J19O3j44K45k65L30j05j15K9
7283a1P1m0j9M4j63J73j03q1J34p6o9K56p4k10K49j46j56L50k12K08lj00L9O6
7307A27j68J15j50j43Q3K05q4k28L70j22m2J06j6n2o1K10N7j23Q9k55o6J67R5
$$ y = [-223, 31, -2, -87, 36, 136, 55, -59, 11, 110, 12, 63, -284, -4, 21, 70, -40, -82, 97, -226, -169, 134, 207, -9, 225, 194, 331, -190, -38, 19, 73, 15, -58, 56, 44, -81, 74, 116, -90, -170, 263, -57, -106, 154, -125, 1, 18, 157, -189, 13, 130, -128, 122, -349, 52, -186, 44, 41, -191, 96, -46, -153, -94, 97, -158, 31, -112, 155, 6, -150, -14, -68, 4, 222, -66, 63, 81, 37, -49, -96, -9, -3, 55, 112, -28, 40, 137, 222, 84, -21, -244, 206, -144, 124, -181, 181, -25, 260, 82, 31, -179, 76, -75, -11, 11, 61, 21, 10, 112, -181, 173, 118, 55, 63, 239, -70, 92, -140, 78, -9, -115, 183, -223, 129, -6, 47, -80, -194, -118, -168, -49, 14, -130, 115, -150, 180, 75, -40, -11, 60, 20, 1, 45, -118, 55, -48, -129, 5, -71, -140, 116, 42, -168, 81, -65, -221, 129, -83, 125, 122, 22, 61, 127, -41, 74, -76, -219, -136, 69, -15, -243, 127, 5, -37, 69, 53, 1, -60, 150, 207, 84, 173, -82, -148, 19, 114]
7330A14Q6k45Q9j79N0L41j46k78K68l37M90l21R0p4R4k16N7O1L21k77j85K98p
7353I4m7l1r7P3Nq8k9j17K32R7n5P4k20p0K61j00M1N5J11j23j60l9J38q9P6J66
7379A58k22J38j21J77l15J91J97jN4k78J32q3o3Q9J39j28m0J01j36J67j70l23
7401c37M15r1M2j21P5n5q3J12K7j26J89K1l4j79O7j77K32k6J97j48k0K60p1j24
7425D5o6K7n6K88m07n0k2K59k6j53L58k25J13J54j97r2MK79l40J01J53k04M4k13
7449b26K32j99J13k4K18j71N4J47j79R3j55J87k27K00k07J13L2j28J09l6J25r2
7471b1q5J45k25J91j02l1L28j4l17qm5l1L19l45P7J32J7q4l0K6J11O4K2L9k75
7496a42O1Q4J32j10Q2J6J8k50pJ61k19L87j52j62K37l07P5O0j8j0r8K44K1j54
$$ y = [114, 200, -45, 44, -135, -85, 256, 110, -168, 100, -237, 253, -68, 22, -52, 42, -174, -117, -56, 265, -12, -197, 101, 94, 47, 16, -81, -8, -3, -91, -120, -237, -5, 92, 37, 111, -109, -179, 82, -18, 23, 78, 189, 66, -94, -133, 5, -84, -8, 158, -64, 74, -47, 130, -185, 6, 203, 202, 256, -22, 110, 27, -36, 53, 192, 64, 24, 125, -11, 156, -14, -337, 78, -13, 29, -92, -17, -72, -155, -43, -16, -142, 47, 68, 34, -145, -78, -255, -23, -49, 148, 0, -20, 240, 169, 45, -21, 6, -50, 238, -169, -219, -241, 18, -8, -161, 197, -28, 85, 239, 42, -50, -46, 233, -107, -6, 147, -57, -13, -226, 6, -193, -80, -104, 114, -57, -3, 144, -35, 58, -97, 90, -137, 63, -144, -31, 1, -127, -18, -54, 71, -21, -106, 39, -186, 5, -97, -128, 200, 186, -131, -139, -184, -215, 104, -241, -164, -32, -15, -99, -129, -103, 8, 72, 94, 133, -142, -81, 3, 135, 25, 107, 123, 141, -109, -116, 45, -174, 213, 61, -101, 136, -171, -96, -36, -54, -64, -162, 82, 103, -51]
7520e1J65k06J88j15M6O4q1L9j84M58l82j13J63j51L0K07k1Mj91L07J33j87r5
7543B7j79J58q2J48k15J88k28K74j53M02n25R5Q1KOk16n4J48K9J86o9j34L5Oj81
7568b51J86j60K0J32J66r9O4L3k23J36nL29l49j05J43N4j86L91l06O4n4J19K1
7591A20j53N5L7J13k96k1O8J23m62K28L76m24L26o5m3J00j17K50j65lPP0k61J52
7615A5l1k1j66Q5m6K45j27j06O9p6L49j80j20k1L47l34K76n8m0K2k8j69j96K80
7639c1K03k25N3j24L31l15k7l0m5K48J1n1j45J50m1l7K46l1l8j39O1m1P2j74k7
7664a46J90r1J57O0j9j22j67K10q8K63j65l6J74j11l01J94J54J8k92N5o2j60L41
7687E6r2Q7J0j41Or8J85j01Q9o6l1OJ9J6n3J6J13NJ87l7k18n8J56j12j28J82M7
$$ y = [-51, 114, -92, 96, -19, 27, 91, 10, 49, -135, 323, -59, -172, -9, -160, -130, 77, 56, 60, -131, 176, 309, 122, 27, -152, 6, -76, 72, -143, 45, -183, 91, -62, 340, -185, -90, -9, -7, -1, -217, -271, -123, -94, 92, 23, -111, -76, -70, -251, -65, -225, -205, -73, 93, -6, 58, 91, -132, 4, -1, 328, -21, -126, 17, 71, -115, 276, -30, 34, -20, 99, 120, -33, 22, 59, 172, -124, -145, -77, 46, -416, -188, 188, -236, 90, 25, -18, 82, -35, 215, 50, 47, 54, 124, -137, 15, -16, -37, -203, -118, -164, 81, -46, -152, -83, -159, 190, 10, -110, -131, 216, -118, 158, 100, 60, 82, 54, -115, -311, -31, 172, -53, 0, -124, 207, -108, -135, -165, -210, 38, 49, -2, -147, 3, -38, -75, 171, 140, 102, -37, 24, -17, 55, -119, -146, 44, -47, 110, 170, 151, 29, -138, 72, -16, 247, 82, 46, 220, 109, -192, 2, 156, 174, -118, -63, -125, -285, 56, -36, 51, 61, -80, -74, -172, 13, -88, 1, -65, -96, -90, -71, -55, -108, -92, 21, 26, 213, 176, -42, -100, 56, -56, -184, -2, 45]
7714D5l5j35K53p2j76L64k72K7m1N9m3K58k64J1K9j51J09j8m8L63l52K49M8j68
7738D0n8M9l4J33j43k03M52l32J03J21Q6k62q8n1J37j81P9J14QJ06k64K90j60
7761e8N9J80l08J41J62k05J53j04k21m4M24j54J85k84j76J44K1J78N7k12J4k24
7783b72K64n8J46j42L1pj15M1K44l28k5L52j3L2k66R9k1m5m2k6K61j15J6Ql4K91
7809B76m07MK32m8l58M76m9j93n7RJ34L6m5k7J68j33j27L21m1j07j66L6L8M4k20
7834b04J47J23m4L9o3m1J47J6q6Q2j1j76P0J12k34o4K48l9j12K18J32j34l19L63
7858A70Q7l91J86J06k27J62lj38j94M01j25jJ18j56jl8j05J87j76K03rr1J35k3
7882G7n7K0J9j17o2R8qj02J58k15k7K61j25p1J60K5k1n2j35K67n4L7j38q3p4J39
$$ y = [45, 10, -125, 128, 56, -120, 244, -28, -1, -42, 17, -26, 232, -32, -21, 8, -143, -34, -52, -100, 263, -89, 160, 208, 40, -18, 31, -3, 130, -13, -216, 236, -96, 7, 128, 214, -48, -136, -187, -50, -231, -152, -38, -30, 76, -188, 102, -58, 1, 181, -127, 14, 176, -29, 124, 20, -201, -245, 179, 25, 210, -74, -250, -106, -85, 93, 150, -62, -48, -272, -8, -66, 80, -62, -31, -38, -153, -112, 132, -196, -221, 131, 118, 150, -116, -17, -38, -83, -125, -151, 110, -5, 11, 19, -15, 276, -131, -127, 105, 57, -301, 175, 126, -67, -124, -115, 19, 55, 10, -17, 151, 18, -109, 212, 171, 64, -102, -66, -28, 16, -204, -57, 66, 22, 61, -2, -43, 104, 120, 34, 116, 105, -71, -1, 111, -123, -187, 61, 22, -90, 128, 260, 126, -193, 170, 257, -134, 52, 158, -69, 93, 90, -48, -242, 159, 34, 33, 151, -5, -6, -44, -149, 38, -138, 65, 56, -35, 100, 77, 20, 40, 59, -58, -120, -22, -30, -132, 26, -189, -216, 45, -80, -151, 9, 34, 13, -39, -174, 93, 39, 76, -62, -145, -219, -80]
7908h0p7jK77r2K10m08J86k04K90L2n6J09l28j2K34k84M7J30O5J21l19J26K7L0
7932B3P0k61J24J54q2J33q0j70j0K88l08K38r1j27O4J62J54q7l70J84m6K9r6k5
7956a30J78jk05J28J4J01l3J20k54j26K0J77K07r0j5l25L77M5l64J76o4j2k25
7979c01K34J21rj51K14k50Q2K36k30J02M0o8J71j56j78K49k48L2K64q7q1k4K36
8002A98l09m2O5J4K03r5M7j34K79k77J76l1j67k8nk9J64k82J50K29l84J63R0k54
8026b59J93J16j00j15M2J41k07K79j26O5J9q4lm1J55j0p6m0M4P4J58p1k07J80
8050A27k66L3k0J30j3j42O4Q7J14j42K30j98K5J37j01k26J94j41O4K40k96L87
8072B87m38J37K38k24N5J11N6l37K61o5k68K14pr5l7N9n9K51PO1k01j19r5L86
$$ y = [-80, -157, -158, 119, 27, 237, -171, 15, -189, 101, 133, 77, 186, -142, -154, 80, -204, -157, -27, 38, 159, -160, -34, -7, 23, 93, -168, -44, 110, 28, 161, 81, -89, -99, 189, -119, 119, 28, -99, -35, 127, 281, 194, -176, 8, -38, -9, -105, -130, 48, 47, -158, -30, -16, 85, 52, 172, -82, -208, -188, -11, 196, 106, 91, -234, 143, 188, -176, 0, -64, -76, -301, -67, 54, 45, -106, 108, -142, -60, 176, -54, 48, 88, 20, 191, 35, -143, 106, -142, -110, 154, 67, -14, -38, 198, -111, -153, -88, -74, 129, 34, 81, -53, 226, -51, 125, 94, -73, -101, -106, -135, 29, -253, -103, 126, -258, -95, -5, -259, -66, 50, -50, -165, -123, 18, -189, 90, -36, 29, 48, -36, -39, -80, 75, 65, -11, -51, -7, 67, 225, 154, -53, 127, -139, -106, -126, 4, -9, -151, -87, 0, 114, -28, 202, 4, 29, 166, 65, -161, 33, -108, -44, 196, -100, 287, -151, -14, 224, 0, 55, 166, 222, -115, 146, 81, -187, 27, 20, -75, -112, -53, -112, 139, 146, 207, 6, -113, -208, 178]
8096A78M4j93k34O24k17k95P5rRJ00k08O1K7l1l8j3K8L8K08j81O3k01J79j59L36
8121A91j91m4M6p3l3j7R6R0j03m3J5j54N52n49K94j84J25L8R8j04k00J78j7P0
8145H1j99J28J16j6L5j98j49J96n6J23j05n9J30n0j3L7j22L49p8j55K45k48nN8
8169D5m2K48l08K11r1k38J25m4J35l4k38K07p6q4J11m4J04j28K21J35k32J53
$$ y = [178, 222, 29, -205, 419, 202, -93, -18, -27, -18, 82, -126, -65, -38, -69, -107, -120, -92, -54, 154, -27, 36, -165, 14, -145, 191, 0, -44, 2, -71, -104, -121, -25, 65, -38, -81, -66, -220, 332, -217, 77, -107, 18, 56, 154, 50, -150, 28, 11, 81, -118, 10, 126, 110, 145, -53, -202, -6, -62, 61, -44, -103, 27, -23, -36, 1, -121, 228, 150, -5, 240, -8, -13, 45, 3, 251, -57, 154, 63, -175, -50, -94, 41, 7, -231, -24, -100, -184, -73, -117, -13, -141, 80, 215, -17, 136]
8191A36
$$ Imaginary data points
##PAGE= N=2
##DATA TABLE= (X++(I..I)), XYDATA
0@%%%%%%%%%%%Qj6J6j6K4l2M0m8N6p2Q8j04J20j40J64j92K24k60L00l44L94m49
33b39N08n77O54p34Q24r23J032j152J280j420J575j746J933k135K356k599K863
50A500l153L473l825M217m654N143n693O319p039P874q860J0046j1500J3332j5729
65h549J9013k3813L1611m7094J33360k95490O8176L99113l41230j24445K05716
76A6368M6106j39514L251J07643M884j13786M9850N7488n2090m3678R3581K9106
88E9209j04104P1225J03328j60751J1189J15371j20828k1439O4095o4957M2790
99d872J2912n9942M3706R000k3539l965k5901N1621J3764n7082N5325M2572m2519
112A1080L004K4364j9342l8590L5800O75o9228O8742L0475r8374N4859L8079p5002
$$ y = [0, 0, 0, 0, 0, 0, 0, 0, 0, 0, 0, 0, 8, -8, 8, -8, 16, -16, 24, -24, 32, -40, 48, -56, 64, -76, 88, -104, 120, -140, 160, -184, 210, -239, 269, -308, 346, -388, 436, -487, 545, -607, 673, -747, 828, -918, 1015, -1120, 1236, -1363, 1500, -1653, 1820, -2005, 2212, -2442, 2701, -2992, 3327, -3712, 4162, -4698, 5348, -6152, 7180, -8549, 10464, -13349, 18262, -28832, 104528, -190962, -122786, 276327, -64903, -189348, 16368, 62474, -77040, -73789, 33854, 38738, -75048, -25198, 32290, -19800, -63478, 30103, 59209, -44895, 26330, 129658, -31093, -19904, 95467, -25361, -46800, 17295, -47662, -4872, 8040, -51902, -8196, 804, -22735, -26700, -52601, -980, 12784, -44298, 11027, 53599, 11080, 14084, 38448, 19106, -19484, 16316, 16991, -52237, 16505, 46980, -51394, 3465, 41544, -33458]
125c3458K3457j8882n739P1127o9812j1965J12941k7201n5025L4606J4406j3635
137B0820l1985j6183K8756K3457k8086l2080P6256J7496j09672L9258N9141r0410
149d3232N828M5095k9376L2932R290j6126L0695j7340q789k85l7760J7137J3688
162A757l4228J6804L1235q314j6616J3053J1654m7141P129L6183m9883J2942N9537
175C4112k4895q498K6319J0868j5347n2891K3964L6721p4074J277O5067k4022
187a399j6232K0517p37o735o542o789q765J3270K7699k3697M637N0450j0349k3939
201A1389J05J1563N534m9888n723N9949l1043l3962M6103o59k2386k168m458N288
215a0356o391k249J3039M250J3488R663p207N441n71j348r643j7634K3433k473
$$ y = [-33458, -10001, -28883, -34622, 36505, -33307, -45272, 67669, 40468, -14557, 20049, 34455, 20820, -11165, -27348, 1408, 24865, -3221, -35301, 40955, 58451, -51221, -11963, 47178, -43232, -37404, 7691, -21685, 11247, 20537, 4411, 35106, 17766, 8977, 8692, -29068, -11931, 1757, -32471, -15667, 15568, 7254, -9362, 3691, 15345, -31796, -24667, 11516, -38367, -25425, 34112, 9217, 719, 27038, 37906, 22559, -30332, -6368, 30353, -43721, -42444, 22623, -1399, -17631, 2886, 2149, -4586, -11128, -17917, -26682, -13412, 14287, -9410, -4773, 45677, 35328, 11389, 11494, 23057, 28591, -21297, -27020, 32929, 1886, -32076, 14027, 13368, -9018, -11186, -15644, -10356, -16747, -18996, -5957, -1707, 11781, 21444, 14237, 19678, 19107, 17759, 8116, -9518, 13915, 11442]
229A1442k6057K4766K124k3354R284p577j3124L520m310J0454l022j315L3802
242A6633l143k3723J8680J8448k2450k3085K3320K3395l1403q406L2705k589k0194
255a812j3649M775J2284k6518j1439K8638L923l698N827n72J7302j563k5562P253
269d811J6465n415j2209Q988K2835n673j7153N809K622j1483j4531m755J5755
282c556l596o566J8510K115j879O147r131l755L666p939L284N038J77J0706K157
297A5378m416l902j761l150j3393o092Q795N613k611m62J2579J4249j7380j4196
311a0749J7973l50k0277l050J6818J1881j1538q817J9755N447k5079r866J0934
324f918K634j2999l661J7388J2278m468o588P650R420j1029j4949P962J0054n688
$$ y = [11442, -14615, 10151, 12275, -11079, -1795, -9372, -22496, -18976, -23286, -12832, -15854, -17169, 16633, 13490, -10233, 8447, 26895, 4445, -18640, 4680, 28075, -3328, -11734, 20971, 18382, -1812, -15461, -10686, 1598, -24920, -36359, -7721, -3798, -7496, -1669, -2241, 15061, 13498, -12064, -4811, 11654, 6239, -5970, 3018, 25853, 20180, 3027, 8836, 11458, -25, -14556, -19311, -3556, -7152, -13718, 4792, 6907, 5028, 11175, 2044, -1711, 1955, -5984, -2700, 2338, 2515, 13221, 15378, 10962, 7060, 5299, 2149, -11244, -17336, -8541, -2928, -5539, -6001, 6578, 20827, 3447, -10749, 7224, 6874, -13403, -16453, 365, 12246, 708, -8109, 11646, 17093, -7986, -17852, -6918, -4284, -17283, -20944, -3556, 8722, 4254, -2334, 5316, 14736, 3707, -11242, -3280, 6774, 1086]
338A086n235P469J2243n758j4507K385L570j1374p943O713M772J423L633N590
352D067K299L65J69k380k862o91N758J459l515M466O895m611j0479k154J939o316
368e591j0832K072J0841K411o242J601J3937p47j2677m68R886K851p592j347J5521
383A3624P316j3898n930P516N83j5588j4176J1590R423j3402m381J5434P849j1156
397e196r167J0714P234j3267k200J3614Q662l091l740J0432L066j4095l373J265
411H58o949J17j236j83O864p92N14P1m387n9r67j464J434K071J1001L591n955
428D529Q467L071p556n506o878O077K315j5135M879J7349m955j1313J979J1136
442H459o366j9770R062J2599o633j338N186J1851K650j6437J866R421j2185o211
$$ y = [1086, -4149, 3320, 15563, 9805, -4702, -2317, 1253, -10121, -18064, -11351, -6579, -5156, -1523, 4067, 6366, 6731, 6900, 4520, 1658, 967, 6725, 8184, 4669, 9135, 16030, 11419, 940, -1214, 725, -5591, -16423, -14351, -3510, -1099, -7341, -5740, 8197, 7450, -5227, -5695, 4191, 7042, -550, -1897, 13624, 20940, 7042, 1112, 8628, 9211, -6377, -20553, -8963, 460, -12942, -17323, -1889, 5960, -5196, -14363, -3649, 3585, -9682, -11882, 1732, 10394, 7303, 3563, 13995, 17061, 2966, -407, 858, -6091, -5974, -7210, -7393, -529, -1321, -807, -736, -5123, -5182, -6149, -7613, -6179, -4108, 6893, 10484, 4529, 12996, 16067, 8511, 3005, -3873, 2204, 4519, -10616, -5737, 11612, 6657, -4656, -2677, 8459, 2093, -17677, -8615, 3984, -2649, -3987, 1199, 13050, 15700, -737, 1129, 10550, -1635, -7846]
456g846J734L112N179m022J464L533m98l98j1608q35J2718r026m336J3875J816
471D862J997l289l871R838q442j2782P085L616m688k346P574P633j2068J597J0660
486G376j5978p62J1591n977M06M258O175O486j2138l84J2368j0931j1785L378
500e917R471j705j4676J2888J3035j6356j837N179k090L406j0113O4K0865m883
514G331q140R282N977k626j3392O99Q045r683k800L811j68Q078r278n805J5254
529F585j1254r081J0189k799J520M193M95P568m79k37J333p826K779j360o486
544d860N867m630K881Q644j3404Q53Q072j2859j634K653j717N464j475O828M095
559D778l643Q794n478p387J1173o960p297R135L02L505m905n798J5114p227j7799
$$ y = [-7846, -6112, -3000, 2179, -1843, -379, 3154, 2656, 2258, -9350, -10185, 2533, -6493, -10829, 3046, 4862, 6859, 3570, -301, 9537, 1095, -11687, -4602, -986, -5674, -8020, -446, 7187, -4881, -3284, 7376, -8602, -9364, 2227, -3750, -3344, 914, 7089, 13575, 1437, 1053, 13421, 2490, -9295, -5917, 3554, 1849, -12827, 61, 13096, -3260, -5097, 82, -2008, 1398, -8715, -8651, 12214, 7331, -809, 8473, 14450, 11824, -1568, -869, 7176, -2507, -5307, -1496, -1664, 6414, -2864, -8669, 6585, -4669, -13750, -3561, -6360, -4840, -647, -152, 7416, 6937, 6700, 8033, 207, 2986, 1626, -4860, 1007, -3623, -742, 7902, -5502, -4649, 3423, -9436, -11070, -8417, -10134, -4670, -6145, 683, 4778, 1135, 9929, 4451, -2936, 8237, 1277, -6020, 3115, 3417, 6922, 2017, -3781, 11333, 4106, -13693]
574a3693O206O995l050r576N674J9136q727p412J4137l651l243j873o270J3024
588G677k738j1068J4336K754p536j226k774L025n373q127P894j382J074O265m611
603a810O250Qo298O676p375l857J0845o215P45O500m690N318l778o114L987o244
619f052o37K246l791R956o33p063J1966m84q016j442R72P541p876o853J6548R85
635G367q628K384p31L567n670j0007J1186q33n289Q276j689L949M120j0202L839
650A639L858o649q80j146Q108K577j0718P191M507p864j454m971L282L125j0284
665i679P721O685o626O601k6k912K720o540K934J965o478P068K713m709L421j963
681B895n29l738p954P698k203p410P236L290K158o55n965R348Q06j2222M319L689
$$ y = [-13693, -7487, -492, -3542, -13118, -7444, 11692, 2965, -4447, 9690, 6039, 2796, 923, -5347, 7677, 4939, -6129, 8207, 10961, 3425, 2199, -575, 2450, -2923, -11050, -3156, -4538, -3464, 2801, -1810, 4440, 4448, -1850, 4826, -2549, -6406, 4439, -1776, -1031, 5469, 779, 6097, 2319, -3795, 192, -6052, -6689, -4443, -8234, 1722, 1089, -5974, 5992, 5508, -2508, -3950, -2978, 4563, -3313, -10166, 6382, 7367, -1261, 1123, 392, 3959, -1711, -11718, -532, -1365, -6654, 1622, -67, 3882, 8002, -2200, 1639, 5497, -1152, -2032, -3178, 4930, 7507, -3211, 3980, 8487, 623, -831, -5802, -2520, 605, -9679, -1958, 4727, -1899, 4702, 4676, 1764, 4484, -2056, 878, 2843, -3635, 3433, 6146, 1437, 4858, 2895, 2366, -1372, -9326, -1628, -3831, -11241, -4005, -715, 1443, 788, -5177, 4171, 4977, -7245, -2926, 763]
697G63O80J416n539Q838M674j1736j87K877l545l617n182O893M845q395N172L889
713A846j218N63o451K912N236o446L028L748L97O207o101j533O579q621l325J529
729a650j604K226k300J583O058n358M87L216n652Q99K74L83K822k405O929L011
745H919p745L613K224o761j619k588K912K809p362M416N328l611j463l094K332
760a690K596q343J506Q013m90o32j069M751L178j1417M10N699m801k298O92L899
776DL912o181N58N200n366j387m90m98M039j711J121M758r54O79j678k559K284
793A731l375k526L961j469K011J615j444K718k717j584K054m019O8M849j474J312
809A711J246J958J756o257k26L222m638k839J756K905J758m054J068N543m348
$$ y = [763, 1443, 2859, -2680, 6158, 10832, -904, -1091, 1786, -1759, -5376, -10558, -3665, 1180, -7215, -2043, 1846, 628, 1191, -5260, -2348, 2888, -3558, -530, 3218, 3615, 9822, 3721, 2188, 8767, 146, -3179, -1650, -3254, -1028, -3328, -1745, 4313, -1045, -558, 2658, -2994, -2095, -1821, -1438, 1384, -1021, 5908, 8919, 1174, 4787, 7011, 250, -1369, -3957, -1045, 1764, -5598, -1182, 4146, 535, -928, -4022, -1690, 906, -7437, -5931, 2082, 1592, 960, -109, 4642, 7820, -3597, -3187, 2512, -2289, -4587, -3895, 4, 3916, -2265, -1707, 3493, -1873, -3260, -3750, -4248, -209, -1920, -799, 3959, 3005, 3684, 2006, -553, 1731, -1644, -4170, -209, -1678, 333, 1948, 504, 3222, 505, -1079, 975, -3044, -2976, 1873, 399, 1711, 2957, 4915, 6671, 414, 188, 3410, -1228, -4067, -2311, 594, 2352, -1702, -634, 4909, 561]
824E61l962N21J564J559m106J825P382n73l220M40K022l60o690k002N951j825
840i13l420K537L153M55m004j453L183k547l104K360K120J722L13J467L035j844
856C060j370K68k487j086L54N8J237k96N85J857k330k130j4L45j438j506L314
873a579L839j147J89L422M64k199k813K13K396k717k038L439K632j637k724J212
889I52N39l005k985K21K647J597k041J179N750j97m649L62K688j787l646N89L899
906B113P44k855J03L384j534n390P9K269l187o91K825J729K14Q62O24l2j145j060
924i48n64K16J12M71K730r2j821K082n20l243j785R87O30j406j98L892K173j532
942A184r76Q23K383l851l994M978J909l591Q52L903N69k388k816J485M12l461
$$ y = [561, -3401, -2880, -1316, 243, -3863, -2038, 5344, 4771, 1551, 1991, 4013, 3653, -3037, -5039, 912, -913, -4333, -1796, 1357, 1812, -2192, -3645, -462, -3009, -6113, -3753, -1633, 89, 402, 1869, 4904, 3060, 1690, 1958, -529, -1615, -1261, -1203, 34, -262, 323, 2180, -150, -2280, -2294, -1949, -3387, -4893, -1579, 2260, 1113, 1302, 4724, 5188, 2989, 176, 389, 2785, 68, -1970, 1469, 4101, 2464, -260, 952, 1491, -1514, -4499, -4278, -1631, -34, -2075, -896, 4854, 4657, 8, 370, 3058, 1271, -2375, -1786, 2113, 2857, 2, 105, 3489, 1955, -3435, -3356, -1087, -4274, -4965, -2140, -411, -197, 665, 1289, 1257, 112, -948, -1512, -1296, -1184, -713, 2017, 1925, 104, 2186, 1666, -1577, -3362, -2375, -1745, -3151, -3349, 543, 2716, 1184, 208, 1031, 3414, -437, -4431, 547, 2456, -1135, -283, 3620, 4189, 1801, -1015, 470, 882, -2579]
958b579j217J980M113j616j406M093N52l256k0j337N04J778l929J804M594j541
974B517j906M41O51j872l652O11J368m33J056K73K434J784l789J277P89l917J125
991a243J224j409J523J251Q33n01k658J836j314l924Q09Q86J041O3j188M657J647
1008C533n057P66K272j425j619j016M219J660l249J744J145o5k093m422K355J811
1024E59m998J482L552L22R64k658J538K350l814j651K678J154j71j488L287K533
1040E639m482M25M01k669N42k722J54L218j865J238K237k861R75j4k199J017j274
1057b240J978J430j978L100P28j661K36k407M62K33m111J985K743j804J414j205
1073a097J868J045n647J084K490j878O42k81K779L549m619N16K552k756j360j580
$$ y = [-2579, -3796, -1816, 2297, 681, -725, 3368, 3920, 664, 644, -693, -189, 1589, -2340, -536, 4058, 2517, 611, 1052, 1703, -169, -3821, -3210, -1842, -2275, -1219, -946, 1488, 3272, -517, 760, 1549, -2368, -1243, -19, -1428, 95, 1346, 2179, 1678, -980, 856, -458, -4382, -3573, -2687, -1646, -1583, -2771, 1886, 3533, -1524, -758, 1514, 89, -1530, -2546, 1673, 3333, 84, 1828, 2973, 2908, 815, -3607, -1252, 559, -4439, -2957, 595, 917, 1881, -777, 761, 3111, -703, -2354, 324, 1478, 1307, -181, 3106, 5639, 1157, 1582, 1983, -686, -144, -2866, -2712, 506, -1359, -121, 2116, -745, 230, 216, -1983, -966, -2240, -262, 1168, -810, 2290, 3018, 1357, 1593, -814, -352, -119, -4230, -2245, 498, -1306, 108, -1097, 771, 1816, -3831, -2747, -257, -2135, -1493, -1774, 1005, 4554, -65, 451, 3003, 247, -1113, -2693]
1089b693J451K722l819R68M079j431p51j290l02K794m670K51M209j233J315P28
1105B328q87K604l008j770J909k933N98J514j316K583p38j09J568l173K70M60
1121a00k335J840J59L88L148k765J042K359m134k77l47m80J647k898O73M821k261
1138D80j161M64k56J179m284l2M351j613o8J673P79K036l712j355L919l848j409
1155b857J623R1K621k027o75M076k787k207J266j393J660n26o26L848r54P5J955
1172C163k680P82p86j786J520j367K77L082k071R48Q43k807J450j612j286K924
1188E94k185M44L239q43J410j562j080L019k970j814J724j67J527j736o17M280
1204C263k539k721J599j132L69j550p01N440j605k245L800l57q43j160j715K861
$$ y = [-2693, -1242, 1480, -2339, -1371, 2708, 1277, 526, -764, -1066, 1728, -2942, -2691, 1518, 285, 1600, 2328, 1441, 4045, 1037, -733, 1176, -1757, -1159, 355, -961, 1622, 884, 775, 2343, -830, -560, -100, -2435, -595, -436, -48, 3100, 335, 1377, 3736, -398, -675, -1022, -1502, 145, -2753, -2080, 2741, 480, -681, -217, -473, 706, -3578, -3610, 741, -872, -940, 733, 1512, 3548, -164, -1519, 2400, -1448, -2857, -1234, -1143, 1478, -549, -1224, 2852, 65, -2142, -876, -2269, -609, -1135, -1761, 2087, 1133, 1208, 3163, 483, 1265, 479, -1307, 213, -1154, -877, 2205, 134, 1082, 1925, -882, 568, -1044, -2330, 594, -1591, -1147, 2092, 1249, 2659, 1097, 17, 3036, 66, -1748, -24, -191, 1336, -400, -1017, 3263, 724, -1997, -398, -1530, -1161, -2711, -3412, 2028, 423, -1822, 1978, 1621, 778, -382, -2097, 764]
1220G64j097k366L297K22L4j00j787J965j620k366K342j282L78J934j070K238
1236A486L04k019K117j984j190K013k134J253J338p61J820j144j147J554k217
1251g11j004L75m46K760q79l70K854r56n43m67j508K269j474k529L937M14j002
1268G20O09q95K171j776l858K494M39j545K58O41K544l75k839K605j46k084J15
1285i22q18J995J70k013K980M25j869N05j341j50K36k165J919P31p99K019m33
1302D70j30N57j604M95m05j048K067k99j81J544q24P80j052j699J438n61j572
1319b024J109N13J152N20j818K186k5k647M18L59O02K0j270K861Q31k236K64R8
1337I13k56q53k300J666J470j884R21J296L75m54j614O96O38j813K61R34M04Q95
$$ y = [764, -333, -2699, 598, 820, 854, 754, -1033, 932, -688, -3054, -712, -1994, -1616, 318, -752, 1486, 1790, -229, 1888, -96, -1286, 727, -1407, -154, 1184, 423, 2243, 1099, -48, 1506, -711, -1715, -1340, -1786, 974, 95, -275, 2579, 1623, 1080, 613, -895, 1374, -100, -2629, 1308, 1722, 720, 1329, 434, 2605, 829, -3029, -535, -96, -1641, -1383, -742, 1802, 1427, -1412, 1193, 1047, -1037, -922, -1740, 255, 425, -1588, 1392, 1817, -52, 453, -888, -1038, -802, -2967, -1048, -317, -1116, 903, 470, 340, 897, -707, -212, -617, -1665, 402, 103, -78, 1466, 642, 1422, 370, -1329, 109, -452, -2024, -915, -402, 750, 1270, -548, 1638, 1613, -1034, -616, -257, 345, 365, -905, 1956, 2787, 551, 815, 913, 657, -196, -2496, -830, 640, -1244, -323, 973, 1348, 894, -720, -24, 614, -1199, -938, -4, 400, 1295]
1355A295j240J166P27k248l91J8m98J03l72O03J396n72L15K04j098K2o66J47K07
1374h82n11J737J133j628P69N98q92j003p15Q25L41j564J376J452n5p68q14J266
1392F65j22k261Q47J331k05k9L46J089N94j778q19J160p14j074j54J560N41q16
1410A61J16P77k81o15p97J78N76o09k37J656M64m86j15j10O0q86o31j02N33j24
1430d72J20Q41J49m46j18r3r46m48P58L4j62P33R21J8p38l73M33l77j576K64J530
1451E2l7p20L67J669q08j443nR55r19k91L84J374L32p89N57Q66o70j171k69K95
1471b71L58r11M21J142O1j18l23l5R6j017p93J134J65J93N22K77N96o59l39k18
1491B81m94l71M7L64K03M18N7M72r80k29K84j328J05M23N95N64o22L08J633j309
$$ y = [1295, 55, 1221, 1948, -300, -691, -673, -1171, -1068, -1440, -837, 559, -13, 302, 506, -592, -570, -1236, -1089, -882, -1393, 344, 1477, -151, 618, 1216, 324, -679, -1394, -569, -228, -1792, -416, 1036, 981, 213, -601, 665, 543, -1718, -871, 460, 255, 226, 572, 1661, 2255, 477, -342, 818, 104, -970, -1124, 436, 977, 161, 277, 1054, 773, 158, -639, -461, 115, -494, -731, 925, 1389, 903, 788, 678, 738, -148, -779, -881, -348, -472, -352, 489, 638, 192, 74, -19, -965, -1413, -655, -621, -783, -50, 871, 889, 151, -222, 211, -166, -1742, -1478, 52, 15, -705, -338, 1331, 523, -920, -925, 30, -889, -1180, -796, 578, 910, 121, 678, 1544, 874, -297, -566, -271, 87, -824, -403, 739, 800, 682, 359, 324, 420, -597, -1390, -256, -91, 102, 624, 901, 1497, 838, 499, 281, -213, -584, -537, -173, 30, 448, 505, 977, -3, -232, 52, -1276, -1171, -748, -153, 411, -211, 97, 1730, 421]
1511D21j334P14m0j89r03N77J735q02m37R18k82j40j420k67J410q32l98J282J47
1530A60P80j062j13J213j134j033Q38J73J64K20j19J138m04j254P96n52l93J56
1548d26o30J341L1j00J108p53m1O2j028N36l99j43J364l93k82J086q46j94k75
1567A8q43Q66p55k23J583l94K72j04k78P73j196r60J168j88k05M84r8J492q19
1586E93j364J058k33r06p3k93J422k07r55J633J3q06K11r58R64l48j350J678L15
1605C94o36N85k04M33j02j352O70k7q99J075j69L54P09p67N79k31j153Q07k28
1624a62k88Q76m87J038r5o35Q07q75o73N59p99N29K48n92J429O3q19N82r58L09
1644E7p8j408J814J11q55O79L30j12K32j706R40K12j434Q15J34O07O8j243J243
$$ y = [421, -913, -199, -239, -428, -1331, -754, 981, 179, -258, 660, 378, 238, -1182, -1449, -39, -871, -1269, 13, 160, 940, -122, -235, 978, -156, -1189, -351, -178, -14, 206, 87, 1225, 821, -433, 363, -189, -582, -426, -1056, 285, 316, 216, 1324, 571, 530, 592, -436, 100, -299, -442, 922, 529, 247, 1333, 487, 293, 18, -825, 41, -714, -937, 646, 252, 524, 420, 142, 915, -281, -1241, -73, -261, -466, 18, -80, 1412, 593, -771, 287, 54, -852, -925, -1218, 204, -3, -958, 675, 688, -118, 93, -865, 99, -249, -1599, 79, 394, -242, 343, 139, 572, 470, -882, -212, -239, -1138, -63, -232, 122, 831, 64, 643, 412, -741, 66, -162, -450, 426, -61, 977, 882, 247, 1054, 179, -494, 65, -734, -205, 43, -549, 880, 943, 124, 706, -252, 57, -21, -1429, 385, 496, -359, 320, 650, 538, 770, -936, 4, 216, -1218, -403, -269, 338, 406, -837, 406]
1663D06M44j725L27m7j54Q62j007J324N82j069P83k89q99M10r45N75O58j258J456
1682D34J87q96Q07o09rJ21j241J094J55p23J454J6l46J75q85O96l51j148J033
1701c6J34j17P67n40M35L60j459N18J7m60M67o69Q84P11j184P36K77q55L59j026
1721f81L57P65j268P27P48m07K72p59j14R01j662K93Q23l29L00j39L74L84q03
1740b18J02L63j031L65q1M4R83o28J92N73j139M01M7p33P34p21M97O78o62R64
1760G30K71r15J03o77K04N46j013P56P44o42K18k94K43L95j326K99O91p66K52
1779a81L83R3Q25j010l15J011q61m48M12l25Q61l62k1Q76r73P9N0l94L56p61J66
1800e39Q76l18n9N32l89J86o21o66R87o23J03P86m01M10R6l49L13q84J58M87p55
$$ y = [406, 850, -875, -548, -595, -749, 113, -894, 430, 1012, -57, 726, 437, -462, -52, -997, -422, 236, -1022, 434, 621, -275, 532, -77, -86, 35, -1206, -112, 43, -680, 774, 790, 444, 619, -266, 430, 79, -1069, -36, 98, -19, 748, 208, 643, 1003, -456, 62, 79, -381, 86, -583, 301, 1012, -172, 564, 841, -14, 345, -681, -324, 441, -827, -100, 648, 241, 513, -246, -360, 541, -1121, -828, -5, -334, -34, -173, 201, 585, -218, -116, 247, -784, -419, -500, -456, 527, -101, 91, 664, -475, -74, -27, -760, -26, -747, -250, 428, -234, 730, 1001, 86, 189, -488, -284, 262, -751, 5, 749, 107, 325, 31, 274, 669, -657, -358, 333, -433, -181, 202, 295, 1120, 110, -205, 806, -55, -503, -91, -416, 445, 83, 62, 938, -35, 44, 94, -300, 56, -705, -539, 337, 19, -40, 492, 103, 289, -332, -998, -11, -634, -531, 255, -146, 264, 360, 11, 324, -560, -402, 85, -670]
1821f70L04K89J17L55n91r6R96j005k69N64l99N97m50L98Q47r57L8L38l18o9q04
1842g85K64J206q22k8O67j60J99m27m94O97n64j79P59n83P93k44PL77n23k65N1
1863e4k29J24Q6p1O35k38k43K00l31M2J95n20L57m5j52P27l35l29L84m66J31k70
1885d02o1J52L9O0O98n60L16j57o08M98l65m56P95J53k34J92K18J17o1r19M92
1906i3m7l00J42J07O36j80m35N60r3o89Q9J3K16l4k39Q48j9l51J48j53j82Lm67
1929e20L49K47l51N46j18J88O5p47L70j77j91L43j0K95K9M4J19k22n87L37k52
1950b43j13J29l67P85k7l01N39j70o43K18l21K45L0M4K35J77k45L23k13j72nl29
1972d24K39L8m56N32K98R8k41k26J74l4o54J25O20j53j43K90K83N9j73q1p3k67
$$ y = [-670, -366, -77, 40, 395, -196, -292, 704, -301, -570, -6, -405, 192, -258, 140, 987, 30, 68, 406, 88, 19, -785, -521, 685, -137, -165, 502, 342, 541, 114, -380, 317, -247, -426, 333, -250, 543, 299, 306, 683, 160, -105, -54, -283, -159, -73, -144, 491, 253, 10, 210, -121, -79, 116, -404, -47, -92, -244, 483, 148, -181, 203, -263, -132, -402, -463, -311, -272, -212, 486, -74, 242, 85, -523, -25, -390, -846, -51, 102, -132, 60, 278, 395, 334, -585, -93, -140, -440, -298, -191, 445, 265, -170, 390, 297, -392, -303, -290, -74, -108, -347, 501, 482, 131, 279, 126, -56, -53, -520, -171, 76, -275, 271, 153, 341, 406, -341, 29, -148, -339, 4, -6, 289, 318, 362, 481, 259, -328, 9, -243, -356, -227, -594, 191, 164, -137, 402, 232, -411, -193, -514, -269, -239, -195, 40, 217, -28, 295, 82, -90, -95, -424, -185, -147, -603, -71, 227, 325, 84, -142, 32, -2, -656, -531, 89, -64, -207, 83, 366, 425, 252, 171, 98, -169]
1994a69p9L32j2n8R5K41j64k54l9J20k82L12k98K68J11J52j25J09L6j57k45j62
2016b68J48j27L35J35o5j57J69j11K9m08j10K58J06k01J20J73L53n95K23N0J3
2037G0k52k32M57K03l08J16L06k45k48j62j44L78l92L64K62J01m37L27l3k03j1
2058h3k94N81k19j27L1M35j58K00r3j94J68m47q6J42J21K82J15p1j03j92K82m11
2080a21l12L57K89k43K01Q8J53j59j59k0J24l88k83K36J28L71o35L71L33l99N9
2101ij1k76J73r2J59L41j45J8r7k1L20o68J8J16j10J59p9L32J15k68k54L78l84
2124b85LJ92o2L53l76K95K18k50j39j5L8Q1l33K25K53j82r3N22n73%K69j85J41
2147I7l04n1O07l26J54M47k86o0j70j85L61o01K05R8j87M18j00J4J14l75m4j22
$$ y = [-169, -248, 84, 72, 14, 109, 350, 186, -68, -107, 13, -269, 43, -255, 13, 124, 276, 151, 260, 296, 139, -106, -268, -120, -247, 88, 223, 158, 1, 170, 59, 88, -320, -430, -172, -66, -267, -147, 26, 379, -216, 7, 57, 70, -182, -414, 43, 246, -62, 54, 360, 115, -133, -295, -439, -61, -453, -89, 173, 274, -163, 164, 131, -72, -83, -377, 204, -15, -142, -111, 324, 166, 366, 273, 79, 247, -200, -286, -144, -23, 259, 374, 303, 200, 8, 290, -121, -433, -76, 213, -30, 171, 259, 412, 253, 94, 74, 198, -190, -473, -237, -109, 262, -373, -2, 331, -68, -9, -20, -296, -123, -215, -56, 285, 140, 158, 61, 40, 360, -308, -290, -174, -284, -125, -204, 128, 243, -25, -279, 99, -285, -282, -90, -152, 201, -175, 120, 338, 88, -51, -66, -28, 53, -280, -55, 198, 16, -77, 445, -128, -128, 141, -44, 97, -207, -258, 349, 23, 177, 624, 338, 278, 108, -77, 284, -317, -112, -14, -201, 217, 117, 131, 245, -130, -174, -296]
2169b96J55p1K87j48O17k46m44M08m33K02j45k34K69k0J0K98k3j7j78o2k0j38
2191b29K34J91k41K58l7j29J46l32K7K50m40k7K80k6J17j58J13K11k66r1K36j62
2213g5K04k31MM31k48L3J93j38j65O2n43P16o46K82M90m78M81k89j52Q6k41j03
2235c27L17j19K54L3j40M8j8j10K12j2k59K23m2R8K6m28M55k07k11N7k42M07n3
2258c8k86M96m0l22L78k5q5n1n03M73j81J04M59n81J07K11l26K09j35l55O72l54
2280a73Q9J03j19L70j99k06L24k48k01J98n3L13j38j51K16q1P4K6l27l6L48k87
2302a58L85P8k83L59l72K11q0l69L99k5L7O1j4rK27m36Mo9l11J36j52M78L1o4
2326F4K2L8m0K98l74j89M09m56L51Q2k58O18m56lN7j95K6m81K28M29j17j46L07
$$ y = [-296, -141, -212, 75, -73, 544, 298, -146, 262, -171, 31, -114, -348, -79, -99, -89, 209, 186, 169, -9, -71, -91, -229, 5, 196, -45, 213, 176, 47, 193, -139, -112, 138, -302, -329, -49, -75, 42, -116, -3, 208, -58, -149, 87, -75, 129, -102, -98, 333, 85, 118, 311, 173, 8, 70, -473, 243, -403, -121, 369, -109, 372, 83, -69, 17, -224, -327, -10, -129, 125, 158, 18, 66, 48, -62, 150, 138, -121, 102, 60, 158, 184, -244, 211, 4, -207, -150, -392, 15, -38, -324, 172, 132, -190, 188, 163, 78, 27, -476, -3, -184, -80, 379, -202, -95, 116, -210, -1, -136, -491, 181, -173, -84, 19, -100, 270, 71, -135, 189, -59, -260, -62, -115, 198, 60, -91, 125, 44, 118, 144, -183, -219, 129, -158, 227, 305, 22, 381, 9, 220, 140, -229, 170, 145, 182, 243, 229, 220, 447, 11, 15, -54, -365, -229, -381, 97, 128, 64, 86, 124, 84, 382, 8, -181, 228, -228, 123, 205, -53, 565, 109, 106, 163, -32, -6, -487, -259, 170, 53, -93, 214]
2349B14j18j46J00j64J26j65k03P39j79j62J39k69L66n20j36L20q4j36J24O4K35
2370A45M0k53J66R5m15M17l51M2L30j42J17l6O1o6k34l9J56n19M20J80j70P6j72
2393a52J53K03k42K00l21j71K93L9J97l4k24J96o9l31J60o1J22q1L2N04m53j42
2415a82K76l2j7l13K23N2N8j03L36r4nO9k49k97J87l40L66J96j86R4J00K3j09
2438E3j91J6J59q8J02j3K2J05J24j21J9o05M06om36L80j3K81k15q3K83L7j93j99
2462a76m5N0J29r2K55Q9q8j9J98m52j20J14l3K19J4l11M13k9oj81K27k37L6q1
2486a26J7K16j67J69k02K82k34k7k58K0K28N8Q7J95l40K29j90kJ5l14J95J91j11
2509f9k4M46j64J67j54j83J46j45K24l27m3L86j74R4l3k59L09l39Q3k08K28K81
$$ y = [214, 96, -50, 50, -114, 12, -153, -356, 383, 204, 42, 181, -88, 278, -242, -378, -58, -142, -278, -154, -90, 145, 185, -68, 98, 193, -222, 195, -156, -114, 216, 74, 191, 155, 216, 150, -84, -123, 33, -486, -66, 114, -56, 20, -152, 1, 204, -38, 162, -159, -330, -37, 2, 199, 165, -59, 137, 68, -263, -103, -164, -42, -123, -91, 413, -40, -182, 94, 62, 45, -268, -45, 7, 65, -38, 298, 204, 199, 268, 19, -278, -91, -431, -65, 131, -55, 39, 139, 162, 53, -138, -122, 37, -51, 51, 38, 60, 165, 289, 168, 187, -418, -12, -18, -454, -74, -87, 194, -21, -104, 179, 216, 23, -176, -221, -171, -42, -134, 121, 210, 122, 103, 301, -151, -271, -157, -190, 29, 43, -268, 145, 116, 110, -71, 156, -81, -45, -126, -109, 107, -60, 109, -93, 189, -45, -72, -330, -310, -82, -24, 63, 258, -82, 147, -43, -45, -30, -344, -149, 42, -69, -93, 353, 189, 356, 202, 19, 165, 20, 244, -83, -126, 260, 86, 180, 147, -112, 197, -142, -59, -267, -39, 242]
2531B42j91J39k07K09j81j74J91r4J85k07j75J31R6J03k14K19k90J63j20J19j39
2552a95K71M1k05K47p3p8q8j18K93k75M7J65j33K80j00J43k14r5j53N3l7K35J57
2575A68o1P9k15J79N6j53k1j12K18q0J03j77p1K29J2k49K8j09K04l86M04J20j84
2598a8J75o5P9r4n9Rk52m8K81j05J57n9q1j17J25k17L16j68K5J23j10M29k04Q2
2622B04p4N3q9k43J66j56K79Q6j11k84L24o5k65K67q9k58m9L22k42L5K62l8J35
2645A70k11pkJJ22j30K40j12k09K30k29J82l09J2L22o5j10lK92j05k7j31J10r6
2669f5K33K84o11J35J03M0Q6j94q0j06K12j89l7J30K9J93p0J59k57J99L9l61M2
2692h6K33j49J79q7k80J84J97j15q5k27K16j39Q5J21q4j39L74k89J98k85j83L84
$$ y = [242, 51, 190, -17, 192, 11, -163, 28, -66, 119, -88, -263, -132, -36, 67, -147, 72, -218, -55, -175, -56, -195, 76, 117, -88, 159, 86, 8, -80, -198, 95, -180, -133, 32, -101, 179, 79, 222, 8, -87, -240, -187, -224, 11, 168, 107, 186, -29, 150, 206, 53, 32, -80, 138, 58, 161, -16, -87, 142, 154, -95, -67, -176, 28, -358, 46, 166, -18, 157, 92, 171, 77, 18, 27, -225, -273, 8, -97, 60, 1, -80, -197, -72, -289, 27, -141, -116, 7, -103, 326, 122, 204, 130, 183, 94, -149, 17, -139, 140, 226, 115, -169, 155, 90, -175, 92, 3, -255, -304, 18, -224, -189, 73, 35, 170, -41, -48, -50, -49, 73, -57, 183, 71, -138, 92, -137, 45, -264, -252, 70, 5, -105, -108, 184, 79, 52, -79, 31, -65, 168, 452, -159, -24, 79, 119, 205, 11, -69, -175, 37, -152, -189, -59, -30, 163, 93, 252, -5, 194, 233, -128, -86, 147, -2, 177, 90, -190, -6, 191, 76, -9, -236, -20, -159, -74, 47, -37, -176, 198, -91, 107, -178, -361, 23]
2714B3pK48m08J65J80l86J61K9K0k52RJ10J38O2j58K00j63j6J04p0Q1j44J11J41
2738A78m2R2L2k83j5Q3k0J67l79K58J75l16M35l17k33K52K07l47J60j16p2J85
2760H4o0K79j51Q3k39j64l5L52l84M3L20l42J18J59j49J84j77k9K31m04L16L04
2782C39l11J61j70m5J5n4K58p5k46K20k88K06L5N6j45Ln8O7J61j80M3J6J32r8
2806D2r3K09l17r9J44J95k86L62j71J59k10K5J62k59K91Mk32J14J04j62L32j33
2828A81j13J02k45l1j13j40K44O7K24j88p0m9K39j78k40K37K6R9J65l9p5m9J32
2851A86O8j30k31p5J65L4k87lJ26m6J64j11j03N07l31K41Nk78K01j88K90m2j69
2874gK33j89k07J56O6k51N03k29RJ33m26L3J70q9J35j41K42Qj37J45Q4k11Kk86
$$ y = [23, 16, 264, -144, 21, 201, -185, -24, 5, 25, -227, -218, -108, 30, 92, -66, 134, -29, -45, 59, -11, 70, -74, 37, 178, 136, 228, 260, -23, -38, 45, 25, 192, -187, 71, 246, -70, 365, 48, -185, 67, 274, -73, 87, -29, -101, 84, 24, 303, 152, 235, -4, -168, -203, 149, -235, -192, 128, -214, -96, 63, -86, 98, -79, -108, 123, -281, 35, 339, 28, 189, 19, -26, -11, -65, 193, 118, -128, 92, -196, 10, 45, 101, -44, -41, -99, -32, 129, -51, -8, 8, 140, 42, -51, 158, -159, -258, -114, 81, -205, 157, -14, 145, -65, -40, 122, -137, 154, 158, -74, 40, 144, -18, 314, 181, 68, 170, -75, -106, -219, -359, -115, -48, 176, -12, -82, -131, 108, -70, -310, -73, -47, 52, 217, 178, 103, 54, 186, 254, 124, -107, -182, -17, 17, -270, -273, -147, -193, -29, -140, -243, 264, -67, 174, 179, -99, 102, -86, 204, 162, -7, 226, 37, -170, -14, 52, -199, 304, 75, 84, 217, -209, -176, -6, -95, 40, -101, 141, 149, 12, 157, 241, 30, 32, -254]
2898b54J01K48k05n2M5J70R2m7n3r3k66K67M7k6M4j6M9J29k39L3q9l5J19P9k49
2923b01J14l2K15r3q3M2j37l4M1P7j2J91j71K03j75K90j06k65P7M05n08j53M73
2946A58j5k97J73j45K05j92j07K52L4K6J05j95L24q5l97K61J00k70r7j5K78l2
2968F9P5L9L5j70j93L69k98K05k12J41k3K7N0k5r3NJ7J24j03q7M5j59K82k63K32
2993H9L4l35N4K25k64L09j88r3J13J26o8J52j15m1j24O2j18K78j84K22q0O0o9
3016D5j35k5Mjn8J68J26j27J41r9N7J5j45J00j79J05J0O3O4j79K58k93q7N6k46
3041c62L60n2n1K49p0k06K57k57K71j34J34O6l87J38m3K3J17N7j40Q8k88K2J49
3064e9Rp2J86o4m6PM8l8j19J65p1q4K07L3k73J32K30m75K66n6j72K99l08K63k8
$$ y = [-254, -153, 95, -110, -162, -117, 53, 145, 98, 45, -48, -314, -47, 0, -26, 18, 2, 51, 180, -59, -26, -115, -150, -31, 48, -201, -87, -119, 96, 3, -80, -38, -175, -209, -168, -91, -103, 88, -83, 120, -55, 235, 129, -136, -59, 346, -162, -315, 158, 143, -154, 19, -126, 79, -113, -220, 32, 66, 92, 197, 2, 326, 241, -156, 105, 205, -65, -162, -177, 101, 69, 144, 183, 218, 48, -145, 224, -74, 131, -81, 60, 37, 64, 114, 89, -4, 1, 18, 142, 39, -48, -3, -162, 120, -143, 89, 123, -212, -158, 67, -197, 112, -76, -169, -56, 70, 2, 154, 39, -2, -126, -64, -182, 96, -88, 134, 54, 114, 45, -90, -115, -111, -112, -170, -2, 124, -3, 138, 39, 96, 111, -34, 66, -113, -8, 2, 65, 129, -50, 208, -85, -172, -116, -362, -2, -54, -105, 144, 74, -132, 125, -132, 139, 5, 139, 205, -182, -44, -87, -64, 53, 110, -30, 58, -230, -208, -59, -50, -122, 64, 0, -46, -39, 9, -29, -148, 17, -54, -138, 69, 102, -171, -39, 191, -284, -18, -74, -246, 53, -255, 8, -20]
3089b0j17K60j56j69K26j10J02O2n3K72l10J86l65K71j56Pm2M5J23j54J20J93
3111B15r0j7k00Q6j37M4m1J75q7o2K44j27M9J40l35K49r8m0o0J92Q2k81O9rm5
3136h4L8N0j6k9J69j18K1J0m9p1k3R0k73K46K4J7j17OL3P2M1l3p4Jj60K45J01
3163A17k13K12J23m49K32L1l8K06j02j97j41K47j30K51J62m09M1J2j1L00k69l6
3185f1J08J79K33l00q9J5J62l86J12J76k35p0J64k78K87p5J3k82K39L8p2K1J87
3208H6l8P9j66J15n3J57l2l50M73k05j07r1K01j99OJ34j40J24o1K5K4O9j45J88
3232I4j49k2K7o1J08kO8J12k86J37J18j66k37M56m06K42l9J40l07K18QNj04J74
3256A28k66J74o4K6J27j72j31J71N9j39J13P2j00r4J28k3k2J53K6l44J87J14k79
$$ y = [-20, -137, 123, -33, -202, 24, -86, 16, 78, 25, 297, -13, 173, -192, 79, -77, -70, -112, -67, 56, -98, 22, 215, 125, 108, -92, -6, -143, -99, -140, 35, -52, -114, 130, 3, 52, 192, -143, 106, 8, -32, -92, 100, 182, -99, -30, -39, -84, -46, 4, -12, -41, 128, 10, 31, 41, -8, -79, -102, -12, -285, -39, -15, 2, -115, -109, -76, -4, 37, 4, -70, -69, -229, 16, 117, -96, 116, 239, -210, 22, 53, 15, 221, 119, -78, -219, 28, -102, 149, 311, -98, -57, -45, -56, 244, -25, -61, 47, 226, 459, 159, 70, 85, 247, -139, -27, 149, -86, -156, 8, -270, 17, -58, -45, -327, -88, -50, -122, -101, 86, 48, 127, -39, 76, 23, 180, 148, -202, 271, 66, -41, -132, 69, -130, -124, 10, -130, -6, -67, -42, -18, 51, -94, 94, -55, -77, -50, -111, -3, -5, 63, 175, -111, 26, 144, -22, -259, 197, -209, 33, -6, 134, -173, 45, 53, 58, -46, 128, -138, 36, -28, -2, 125, -47, -178, -7, 52, -87, 26, 98, -2, -96, 32, 9, -13, 140, 166, -178, 9, 123, -156]
3279a56L53j1j56j73L43k67L91k74l90L73j22j18K36k03J00J77l74N01j50j42
3299f2L7k23L16pm8K47l23J18R5m5j16k3k65K62O5k28K04K66k67J15j26p2n9m0
3323a79J58n4K05r0k1L04j69k12K97l30q6K98j01O1j48J82L0j53n9M93m13j23
3345a10L64l71K44j25OJ74j36JJ67l49k20J59J20J07k02k0L89k08J9K38n14K29
3367c8L0K38j58j64P2k1j13N2o9Q0J77k38J53k5L47k77P6l3J9J62k32j59J54o7
3391c4K72k88K90l9j51P9p6J00j74l31M50j51q5L07j53M2J00j55j17R1N7k19K2
3414a63P4J10K06j67j28K28Rj55P3k69P7K59qj57P6q9m6O8q9K03Lr7j56K13k73
3439a98J41P7p0J05j76J38J12l23L66m1L3k05j39L37k37k40L67j31K61j66q2J91
$$ y = [-156, 197, 186, 30, -143, 200, -67, 324, 50, -340, 33, -89, -207, 29, -174, -74, 103, -271, 230, 80, -62, -25, -248, 68, 61, 13, 260, -63, 55, 150, 105, -11, -34, -299, -37, 28, -200, 4, 270, 3, 118, -8, -80, -139, -179, -21, -75, 130, 40, 19, 323, 154, -58, 239, -91, -177, 121, 20, 81, -67, 115, 145, -8, -67, 426, 13, -110, 254, -117, 127, 2, 8, 182, 46, 47, 214, -135, -355, -196, -76, 31, -171, -191, 198, -10, 9, 247, -267, -38, -8, 230, 72, -92, -20, -41, -154, -102, -171, -91, 86, -152, 1, -24, 323, 46, 122, 89, 108, 270, 38, -121, 33, -34, 238, -50, 240, 201, 50, 129, 53, 153, -21, -352, 98, -53, -138, 169, 16, 58, 158, 3, -114, -23, 34, -185, -163, -89, 21, 227, 60, -68, 160, 169, 14, 87, -182, -105, 154, 146, -11, 65, -24, -70, -2, -91, 112, 115, 18, -138, 75, -198, -57, 20, -50, 55, -121, 17, 129, -194, 172, 131, 164, -41, -180, 157, -80, -320, 47, -84, 177, 11, -71, 120]
3461A20o6R6j29l2J0j59J49l00L37K8P4l4r8r4j6Q4j8j23M69q4n00K82J36k81
3485a49J06k38K45J56k02J4N1O7J37k68K32r2k61K03Q4K33l96M52l89K49k60J15
$$ y = [120, 54, 150, 21, -11, -1, -160, -11, -311, 26, 54, 128, 94, -4, -98, -114, -30, -48, -171, 298, 214, -286, -4, 132, -149, -43, -281, -36, 120, -82, -68, -17, 50, 187, -81, 151, 59, -202, 1, 85, 318, -78, 374, -15, 234, -26, 89]
$$ [...]
8191b3
##END NTUPLES=NMR FID
##END=
