##TITLE=1H_Pr Pip-o-Et
 200.13MHz, CDCl3,
 8 sc
 
 9.9.2025
##JCAMPDX= 6.0         $$ Bruker NMR JCAMP-DX V2.0
##DATA TYPE= NMR FID
##DATA CLASS= NTUPLES
##ORIGIN= UXNMR, Bruker Analytische Messtechnik GmbH
##OWNER= pz
$$ XWIN-NMR		Version 3.5
$$ Tue Sep  9 15:27:27 2025 Russian Standard Time (UT+4h)  she@DPX200
##.OBSERVE FREQUENCY= 200.1313
##.OBSERVE NUCLEUS= ^1H
##.DELAY= (6, 6)
##.ACQUISITION MODE= SIMULTANEOUS
##.ACQUISITION SCHEME= undefined
##.AVERAGES= 8
##.DIGITISER RES= 18
##SPECTROMETER/DATA SYSTEM= spect
##.PULSE SEQUENCE= zg30
##.SOLVENT NAME= CDCl3
##.SHIFT REFERENCE= (INTERNAL, CDCl3, 0, 14.3821)
##AUDIT TRAIL= $$ (NUMBER, WHEN, WHO, WHERE, WHAT)
$$ ##TITLE= Audit trail, XWIN-NMR		Version 3.5
$$ ##JCAMPDX= 5.01
$$ ##ORIGIN= Bruker BioSpin GmbH
$$ ##OWNER= she
$$ F:/spectra/data/she/nmr/H-C/1/audita.txt
$$ ##AUDIT TRAIL=  $$ (NUMBER, WHEN, WHO, WHERE, WHAT)
(   1,<2025-09-09 15:25:42.15 +0400>,<she>,<DPX200>,
      <created by zg, POWCHK disabled, PULCHK disabled
       configuration hash MD5:
       00 E9 B6 7A A2 85 ED C7 34 08 36 98 17 FE 4E 26
       data hash MD5: 16K
       E9 4D 0D 9A FD D2 C8 9F 14 93 E0 7C 93 B3 D0 E5>)
$$ ##END=
$$ 
$$ hash MD5
$$ 4C 8D 89 DF 8F 8B 03 26 8A 4F A2 3D F4 31 82 FD
##$RELAX= 
##$RELAX= 
##$RELAX= 
##$RELAX= 
##$RELAX= 
##$RELAX= 
$$ Bruker specific parameters
$$ --------------------------
##$DU= <F:/spectra>
##$EXPNO= 1
##$NAME= <H-C>
##$PROCNO= 1
##$TYPE= <nmr>
##$USER= <she>
##$AMP= (0..31)
100 100 100 100 100 100 100 100 100 100 100 100 100 100 100 100 100 100 
100 100 100 100 100 100 100 100 100 100 100 100 100 100 
##$AQSEQ= 0
##$AQ_mod= 1
##$AUNM= <au_zg>
##$AUTOPOS= <>
##$BF1= 200.13
##$BF2= 200.13
##$BF3= 200.13
##$BF4= 200.13
##$BF5= 200.13
##$BF6= 200.13
##$BF7= 200.13
##$BF8= 200.13
##$BYTORDA= 1
##$CFDGTYP= 0
##$CFRGTYP= 5
##$CHEMSTR= <none>
##$CNST= (0..31)
1 1 145 1 1 1 1 1 1 1 1 1 1 1 1 1 1 1 1 1 1 1 1 1 1 1 1 1 1 1 1 1 
##$CPDPRG= <>
##$CPDPRG1= <>
##$CPDPRG2= <>
##$CPDPRG3= <>
##$CPDPRG4= <mlev>
##$CPDPRG5= <mlev>
##$CPDPRG6= <mlev>
##$CPDPRG7= <mlev>
##$CPDPRG8= <mlev>
##$CPDPRGB= <>
##$CPDPRGT= <>
##$D= (0..31)
0 0.7 0 0 0 0 0 0 0 0 0 0.03 0 0 0 0 0 0 0 0 0 0 0 0 0 0 0 0 0 0 0 0 
##$DATE= 1757417141
##$DBL= (0..7)
120 120 120 120 120 120 120 120 
##$DBP= (0..7)
150 150 150 150 150 150 150 150 
##$DBP07= 0
##$DBPNAM0= <>
##$DBPNAM1= <>
##$DBPNAM2= <>
##$DBPNAM3= <>
##$DBPNAM4= <>
##$DBPNAM5= <>
##$DBPNAM6= <>
##$DBPNAM7= <>
##$DBPOAL= (0..7)
0.5 0.5 0.5 0.5 0.5 0.5 0.5 0.5 
##$DBPOFFS= (0..7)
0 0 0 0 0 0 0 0 
##$DE= 6
##$DECBNUC= <off>
##$DECIM= 32
##$DECNUC= <off>
##$DECSTAT= 4
##$DIGMOD= 1
##$DIGTYP= 9
##$DL= (0..7)
0 120 120 120 120 120 120 120 
##$DP= (0..7)
150 150 150 150 150 150 150 150 
##$DP07= 0
##$DPNAME0= <>
##$DPNAME1= <>
##$DPNAME2= <>
##$DPNAME3= <>
##$DPNAME4= <>
##$DPNAME5= <>
##$DPNAME6= <>
##$DPNAME7= <>
##$DPOAL= (0..7)
0.5 0.5 0.5 0.5 0.5 0.5 0.5 0.5 
##$DPOFFS= (0..7)
0 0 0 0 0 0 0 0 
##$DQDMODE= 0
##$DR= 18
##$DS= 0
##$DSLIST= <SSSSSSSSSSSSSSS>
$$ [...]
##$SUBNAM0= <"">
##$SUBNAM1= <"">
##$SUBNAM2= <"">
##$SUBNAM3= <"">
##$SUBNAM4= <"">
##$SUBNAM5= <"">
##$SUBNAM6= <"">
##$SUBNAM7= <"">
##$SUBNAM8= <"">
##$SUBNAM9= <"">
##$SW= 18.0517328524113
##$SWIBOX= (0..15)
0 0 2 0 0 0 0 0 0 0 0 0 0 0 0 0 
##$SW_h= 3612.71676300578
##$TD= 16384
##$TD0= 1
##$TE= 0
##$TE2= 300
##$TE3= 300
##$TEG= 300
##$TL= (0..7)
0 120 120 120 120 120 120 120 
##$TP= (0..7)
150 150 150 150 150 150 150 150 
##$TP07= 0
##$TPNAME0= <>
##$TPNAME1= <>
##$TPNAME2= <>
##$TPNAME3= <>
##$TPNAME4= <>
##$TPNAME5= <>
##$TPNAME6= <>
##$TPNAME7= <>
##$TPOAL= (0..7)
0.5 0.5 0.5 0.5 0.5 0.5 0.5 0.5 
##$TPOFFS= (0..7)
0 0 0 0 0 0 0 0 
##$TUNHIN= 0
##$TUNHOUT= 0
##$TUNXOUT= 0
##$USERA1= <user>
##$USERA2= <user>
##$USERA3= <user>
##$USERA4= <user>
##$USERA5= <user>
##$V9= 5
##$VALIST= <valist>
##$VCLIST= <CCCCCCCCCCCCCCC>
##$VD= 0
##$VDLIST= <DDDDDDDDDDDDDDD>
##$VPLIST= <PPPPPPPPPPPPPPP>
##$VTLIST= <TTTTTTTTTTTTTTT>
##$WBST= 1024
##$WBSW= 4
##$XGAIN= (0..3)
0 0 0 0 
##$XL= 0
##$YL= 0
##$YMAX_a= 732697
##$YMIN_a= -813234
##$ZGOPTNS= <>
##$ZL1= 120
##$ZL2= 120
##$ZL3= 120
##$ZL4= 120
##$ABSF1= 10
##$ABSF2= 0
##$ABSG= 5
##$ABSL= 3
##$ALPHA= 0
##$AQORDER= 0
##$ASSFAC= 0
##$ASSFACI= 0
##$ASSFACX= 0
##$ASSWID= 0
##$AUNMP= <proc_1d>
##$AZFE= 0.1
##$AZFW= 0.1
##$BCFW= 1
##$BC_mod= 2
##$BYTORDP= 1
##$COROFFS= 0
##$CY= -3
##$DATMOD= 1
##$DC= 2
##$DFILT= <>
##$DTYPP= 0
##$F1P= 0
##$F2P= 0
##$FCOR= 0.5
##$FTSIZE= 0
##$FT_mod= 4
##$GAMMA= 1
##$GB= 0.15
##$INTBC= 1
##$INTSCL= 1
##$ISEN= 128
##$LB= 0.25
##$LEV0= 0
##$LPBIN= 0
##$MAXI= 10000
##$MC2= 0
##$MEAN= 0
##$ME_mod= 0
##$MI= 1.114404
##$NCOEF= 0
##$NC_proc= 0
##$NLEV= 6
##$NOISF1= 3.799351
##$NOISF2= 2.8
##$NSP= 1
##$NTH_PI= 0
##$NZP= 0
##$OFFSET= 14.38212
##$PC= 1
##$PHC0= -1565.307
##$PHC1= 17.19228
##$PH_mod= 1
##$PKNL= yes
##$PPARMOD= 0
##$PSCAL= 0
##$PSIGN= 0
##$REVERSE= no
##$SF= 200.129724274929
##$SI= 16384
##$SIGF1= 3
##$SIGF2= 2
##$SINO= 400
##$SIOLD= 16384
##$SREGLST= <1H.CDCl3>
##$SSB= 0
##$STSI= 0
##$STSR= 0
##$SW_p= 3205.1282051282
##$SYMM= 0
##$S_DEV= 0
##$TDeff= 0
##$TDoff= 0
##$TI= <>
##$TILT= no
##$TM1= 0
##$TM2= 0
##$TOPLEV= 0
##$USERP1= <user>
##$USERP2= <user>
##$USERP3= <user>
##$USERP4= <user>
##$USERP5= <user>
##$WDW= 1
##$XDIM= 8192
##$YMAX_p= 0
##$YMIN_p= 0
$$ End of Bruker specific parameters
$$ ---------------------------------
##NTUPLES= NMR FID
##VAR_NAME=  TIME,          FID/REAL,        FID/IMAG
##SYMBOL=    X,             R,               I
##VAR_TYPE=  INDEPENDENT,   DEPENDENT,       DEPENDENT
##VAR_FORM=  AFFN,          ASDF,            ASDF
##VAR_DIM=   8192,          8192,            8192
##UNITS=     SECONDS,       ARBITRARY UNITS, ARBITRARY UNITS
##FACTOR=    0.0002768,     1,               1
##FIRST=     0,             0,               0
##LAST=      2.2672688,     0,               0
##MIN=       0,             -813234,         0
##MAX=       2.2672688,     732697,          0
$$ Real data points
##PAGE= N=1
##DATA TABLE= (X++(R..R)), XYDATA
0 0 0 0 0 0 0 0 0 0 0 0 8 -8 8 -8 8 -16 16 -24 24 -32 40 -45 53 -64 72 -84 97 -112 130 -148 168 -192 217
33 217 -244 275 -308 348 -388 431 -479 535 -593 654 -725 801 -883 976 -1073 1182 -1303
50 -1303 1435 -1582 1745 -1928 2134 -2370 2637 -2947 3316 -3756 4293 -4966 5836 -7011 8676
65 8676 -11227 15566 -24326 48734 -257207 -813234 60196 494743 5933 -103085 167613
76 167613 -149410 -340337 202878 395157 -189781 -271399 224149 147515 -275766 -91562
86 -91562 232930 38079 -167928 46526 138684 -110580 -172784 68622 153834 45121 -18791
97 -18791 -66665 -137764 -60163 169494 231096 -37892 -249163 -95733 115152 91251 19491
108 19491 29813 -28768 -137246 -58876 111350 74718 -31085 15872 108 -121608 -40049
119 -40049 148633 79864 -103518 -43878 90097 -9223 -104698 28493 90448 -23125 -17178
130 -17178 61245 -48779 -158393 15386 211099 67103 -156311 -97237 23277 1163 54552
141 54552 149818 -3824 -222263 -88725 190578 123291 -105513 -53572 62447 -37701 -64340
152 -64340 81969 58224 -100357 -35865 119982 7953 -150554 -8727 133540 5960
162 5960 -68610 36378 17899 -98986 -22469 133848 67925 -88590 -62335 15835 -9419
173 -9419 16756 87933 11395 -109793 -59256 63075 53683 -23620 -11224 16371 -27614 -28786
185 -28786 30619 27076 -12308 -1033 18018 -10124 -30448 10289 33322 -8454 -13526 23963
197 23963 -1051 -44948 -18360 33856 33259 -3894 -19561 -23993 -31267 14222 69364 23470 -55018
210 -55018 -42779 17713 31915 10584 7592 1708 -32970 -21843 33540 21905 -27646 -11894
222 -11894 22331 132 -29758 -3833 24083 -4082 -12333 24850 7271 -39382 -10645 37869
234 37869 19983 -14899 -3908 7208 -22321 -16416 38174 27679 -30582 -25154 7289 -2074 -7552
247 -7552 20882 23066 -26462 -38177 16765 31673 -4227 -6442 5828 -7773 -8860 15232 17590
260 17590 -15894 -21248 20673 22861 -21496 -24866 5153 12771 5455 2449 -5335 -21198 -14263 23825
274 23825 30398 -8328 -22776 -6222 4457 12428 15988 3035 -18196 -17658 12246 21529 -6343
287 -6343 -17140 -2270 6554 7645 -3345 -15476 -6676 11692 16978 -1047 -20534 -6257 15736
300 15736 10630 -34 -3363 -4128 284 1970 2077 1067 -4377 1398 3555 -11450 -7868 10255 6286
315 6286 -8382 -5111 7583 1083 -12584 4541 20084 -3236 -14810 3029 6401 2252 6664
328 6664 -1715 -15673 -3563 22103 7635 -27878 -14241 19290 12646 -3510 -10915 -17958 2796
341 2796 30058 9192 -26898 -13247 22008 11254 -11607 4531 5201 -16962 3121 22202 -11734
354 -11734 -21218 14748 11947 -21419 -4827 25850 -6660 -32772 14256 32976 -13304 -21022 9790
367 9790 6592 -1730 11888 3234 -22027 -5832 28128 7636 -28311 -6890 17993 2877 -8135
380 -8135 -5062 -5023 3385 10983 -799 -13540 -3024 15510 5270 -11261 -477 8613 30 -1341
394 -1341 372 -1585 886 2308 -262 -5292 -3787 5576 1619 -9950 -1072 9896 997 -10564
408 -10564 -3734 11620 7828 -8377 -4493 5092 2263 4113 2884 -8769 -6536 10021 10049 -9945
422 -9945 -15216 5279 11358 -3939 -5494 -387 -3783 1727 7566 -1362 -5356 1945 5249 -1180 -2595
437 -2595 5378 2692 -5614 236 2733 -3310 -276 830 -3625 -232 2956 -2054 -6791 -243 8705
452 8705 1823 -6513 -48 1974 -184 4956 3076 -3495 -1237 2847 650 -3484 -192 5829 -1192
467 -1192 -8054 -1625 1835 574 2123 -660 -4375 -1508 1706 3279 696 -366 2990 31 -3612
482 -3612 1106 2675 1879 1563 -2677 -4481 -1179 479 2513 -193 -2913 -835 -2411 -2369 3370 3211
498 3211 1564 396 -3354 -2320 2790 5322 3951 -2114 -4274 -125 -500 21 3524 -157 -3604 -1720
514 -1720 -2062 -2235 389 4784 3553 -5319 -5724 3353 3221 1362 4669 1137 -4705 -3098 3191 3626
530 3626 -1444 84 4213 -5513 -9631 2626 7751 623 -3505 -1711 -1700 -3922 2210 9989 893
545 893 -7072 775 3533 -3213 -484 7355 4599 -7239 -7192 3423 1791 -3564 4044 4573 -7131
560 -7131 -8446 2068 6377 -113 -1148 4762 -2311 -9995 2687 11945 1436 -5050 416 1651
574 1651 -5899 -2942 10588 4853 -9711 -4572 3010 -3726 -3193 8404 6925 -8217 -9134 5015
588 5015 4900 -4143 4592 9677 -6634 -10909 4055 8562 -1365 -1781 5674 -2513 -13844 483 12193
603 12193 9 -5908 2541 -801 -9422 -1331 13032 6728 -9173 -3942 4549 -3506 -2920 10529
617 10529 7725 -8091 -8982 2469 2805 -4051 4530 9290 -8362 -14447 2863 9010 -749 -1338 6444
632 6444 -1337 -13432 -1616 14364 4739 -4467 2036 -1427 -10730 -1605 14386 7540 -10399 -6818
646 -6818 3492 -4770 -6458 10250 11040 -6742 -11546 -676 3420 711 6997 9808 -6785 -15258
660 -15258 1767 10972 1465 -1860 5549 452 -14550 -7643 12745 9817 -4242 -2060 -1448 -11446
674 -11446 -4358 15252 12437 -8498 -9029 4458 -2206 -8183 11327 16384 -6543 -14697 -867 2616
688 2616 -1945 7043 12900 -7712 -19234 205 10211 -726 1647 9516 -2939 -16202 -4916
701 -4916 12942 8597 -820 1972 -2617 -12991 -3450 13339 10192 -3824 -6451 -1711 -5689 -5982
715 -5982 9338 14409 -3149 -13191 -4200 1537 -53 6296 12518 -955 -16135 -5407 8975
728 8975 3465 848 8378 12 -15769 -9148 10127 9811 -2450 168 1383 -12234 -9555 11027
742 11027 13518 -1575 -5652 -452 -4676 -6850 8294 15968 -1457 -11215 -1954 162 -3551 4164
756 4164 11803 689 -13493 -6886 4537 1094 1368 8932 1440 -12802 -7675 6745 7449 470
770 470 2707 2667 -9310 -8967 7593 9607 -954 -2099 -133 -5436 -7578 3929 11405 511 -6929
785 -6929 -1334 -1959 -4895 4306 10557 1996 -7849 -4109 2536 -113 407 7985 2926 -8497 -6060
800 -6060 2453 2544 470 2593 2474 -6021 -7761 3135 5786 -593 621 2279 -2769 -6155 1194 7962
816 7962 3290 -2934 -869 -1287 -4069 813 5752 2006 -4025 -3189 225 -958 -1855 4154 4936 -3121
832 -3121 -4700 -337 1697 1270 2322 2943 -1054 -5111 -323 3812 410 187 2058 -1321 -4754 -2098
848 -2098 3171 2181 -1838 233 854 -3690 -1824 4040 2817 -669 -302 483 -2348 -1723 3836 4000 -2188
865 -2188 -2325 524 -1726 -1397 2629 2330 -1811 -2886 -58 351 -959 1896 3054 -1570 -2280 625
881 625 137 327 2064 2177 -704 -3023 -1616 1816 1457 729 94 -1890 -1165 -498 -329 1235 846 -374
899 -374 -608 -1444 -486 1152 1700 1629 -797 -1959 296 768 -750 1096 1889 -909 -2866 -1922 1225 1353
917 1353 -223 343 -1134 -2592 887 2024 -213 -521 1990 1123 -2271 -2286 2405 2739 -887 -301 -904
934 -904 -2526 413 2364 -181 -1825 27 376 -2366 -1823 2969 2087 -1690 -538 541 -885 977
950 977 1986 97 -866 -127 276 -1983 -1446 2636 1747 -2241 -2146 -1288 154 1977 807 -985 -598 84
968 84 -6 -112 598 1997 879 -552 -1342 -1510 1281 3055 -701 -1887 14 -335 -1138 -240 1711 1024
986 1024 -1249 -812 -506 -1291 1942 3760 -1360 -2607 1314 1119 -915 410 2023 482 -2001 -879
1002 -879 -465 -1475 2128 2532 -2541 -3381 784 1214 -527 107 1594 -19 -2165 -76 1348 -119
1018 -119 1687 2063 -1679 -2436 509 1643 265 -991 457 -45 -2100 -670 1387 441 195 644 -1002
1035 -1002 -1292 452 1896 1497 -796 -113 616 -812 -312 1076 684 -299 -679 -1110 -620 -110 983 962
1053 962 -1230 -820 310 -618 651 1344 275 -127 -869 -603 175 293 889 743 -872 -1078 -432 -412 259
1072 259 648 -517 -304 -821 -981 256 925 1560 209 -1324 -429 237 274 1552 769 -851 -739 -398
1090 -398 -383 22 441 931 -55 -1786 -1279 154 382 1397 414 -933 -301 -193 701 813 394 1008 27
1109 27 -1556 -557 537 1425 1065 -644 -1598 -1022 -301 509 597 -286 137 49 -1166 -444 812 1742 1002
1128 1002 -1227 -1246 -2 666 1497 762 -1253 -753 -412 -622 -266 427 828 -10 -1760 -1277 417 864
1146 864 1657 666 -1251 -1081 363 1005 859 171 55 -509 -1325 -197 631 358 688 -503 -1710 -933
1164 -933 141 1088 1147 -228 -660 -879 -225 1302 736 138 434 -467 -1089 -72 404 624 787 -706 -1649
1183 -1649 -1359 397 1629 -158 -1157 20 -325 -802 650 1154 740 165 -292 -1074 -761 1110 2520
1200 2520 -404 -2466 -274 682 -48 64 539 -111 -661 -808 -116 -499 558 2300 -153 -2692 -603
1217 -603 1647 1373 -406 -58 825 -971 -1511 1063 870 -660 583 100 -2127 -1754 1908 2061 -1284
1234 -1284 -1500 1484 543 -1938 1074 2499 -369 -1529 -47 59 -763 1254 2405 -1263 -3136 764
1250 764 2013 -1350 -1117 1691 1086 -2039 -1229 1746 921 -469 1033 87 -2209 -496 2498 1424
1266 1424 -1321 -735 1223 -591 -2239 1066 2576 -746 -1665 -522 -56 -209 1031 1441 -384 -2185
1282 -2185 386 1315 -559 290 1805 460 -1844 -1322 918 1445 -11 88 -459 -1908 -317 1489 1117
1299 1117 -594 -616 122 -358 -1038 1260 2209 -101 -1424 -300 -71 72 732 1629 -91 -2332 -1128
1316 -1128 1073 411 -207 703 -304 -1858 -942 1754 1941 -350 -252 757 -877 -1493 1499 2404 -12
1333 -12 -1613 -705 92 -680 373 2274 -27 -2470 -500 915 -299 -191 1796 1080 -2499 -2125 1910
1350 1910 2117 -215 778 796 -1907 -1607 1564 2194 -669 -886 875 -912 -2281 884 2828 -195 -1631
1367 -1631 -602 -95 -593 970 2555 32 -2375 -428 1073 -56 -67 1775 734 -2177 -1903 650
1383 650 873 -109 693 -17 -2333 -1675 1293 1760 -120 -622 271 -328 -1559 853 2336 -6 -669 -203
1401 -203 -681 -1139 904 2562 215 -2416 -663 884 -527 -72 1060 506 -1289 -1086 587 687 261
1418 261 1357 866 -2040 -1631 1495 1611 -194 -620 209 -457 -1615 54 1529 186 -480 55 -285
1435 -285 -972 336 1624 938 -965 -442 719 -229 26 1005 953 -693 -951 -230 538 -375 407 612 -927
1454 -927 -1133 103 710 -391 -183 611 -101 -1142 -469 1042 472 87 423 -64 -1160 -252 601 377
1472 377 -342 -458 19 -890 -596 653 258 -201 41 -158 -465 -102 387 603 172 -17 174 -243 67 743
1492 743 209 -366 -299 -257 -370 -104 300 363 -116 -542 -131 2 345 737 72 -122 -119 -565 180 148 325 490
1514 490 -627 -1076 -302 -246 468 346 -220 -336 -16 -120 208 210 450 421 -329 -986 137 548 437 46 -643
1535 -643 -349 -326 230 462 -70 -185 51 -712 -945 237 593 392 -176 -793 -166 315 442 300 385 118
1555 118 129 -504 251 441 203 41 -558 -1067 -191 525 541 7 -463 -237 136 -532 111 738 604 -163 -341
1576 -341 -98 121 331 843 -59 -992 -218 431 -289 -437 396 135 -379 -555 126 505 -177 447 355 -526
1596 -526 -252 416 569 233 110 118 -264 -890 223 1298 128 -634 -509 -55 -228 173 495 333 -636 -456
1616 -456 330 -207 -93 728 619 -425 -764 90 383 43 -36 389 -804 -880 253 261 -147 -58 67 -773 -548
1637 -548 115 809 268 -374 -171 -407 -463 535 773 165 -124 -210 -10 -118 -144 498 238 -628 -398 -287 118
1658 118 101 421 347 -497 -328 577 539 44 456 -182 -154 -357 -389 225 230 -251 -276 -401 -571 56 89 229 19
1681 19 -205 -103 -292 -240 726 823 -206 -205 -250 41 4 524 200 105 -269 -222 -30 -221 -170 526 -5 -278 -439
1704 -439 77 337 263 216 -104 -319 -171 191 225 218 -162 -170 -107 -371 -32 179 109 -284 212 -207 -300 -101 382
1727 382 330 -138 52 -102 -373 299 981 21 -329 -18 176 -155 -201 211 210 -100 -91 -192 -657 159 705 203
1749 203 -291 -253 -275 82 334 499 -180 -466 -215 149 -161 359 659 -187 -464 -115 -81 58 190 303 29
1770 29 -582 -236 172 361 390 628 -144 -548 -165 474 439 60 156 -110 -524 159 551 -220 2 9 -443 -248
1792 -248 -228 94 421 -12 -195 -418 -513 184 758 563 -111 -603 -575 238 95 177 -6 99 -168 -300 -125
1813 -125 413 311 -79 87 -418 -564 422 572 236 -99 -247 -116 -237 179 774 -38 -532 -326 -173 -95
1833 -95 101 236 13 -30 -232 132 70 127 548 217 17 74 -69 355 716 -80 91 -387 -692 369 396 -29
1855 -29 -224 -433 -156 285 0 357 177 -163 96 -238 -244 173 442 13 177 -217 24 186 116 245 -47
1876 -47 -587 -352 -239 82 133 -11 -268 56 -129 -219 139 108 155 60 222 58 -248 307 488 -201 -479 -205
1898 -205 -226 -343 165 414 -367 -508 11 438 -277 -21 473 118 -195 250 255 58 -146 319 148 -691 -320
1919 -320 207 207 -78 -79 -115 -442 205 -148 278 -37 -139 224 -67 -117 334 252 112 -314 -342 333 18 -38 153
1942 153 10 -360 -527 -278 316 -10 102 62 100 -452 -151 317 293 -89 152 222 86 265 77 -107 -245
1963 -245 -77 181 -31 -63 66 -122 -65 -357 184 165 -384 195 347 46 -228 192 385 256 102 188 -50
1984 -50 -451 98 543 -372 -418 66 6 80 199 516 18 -263 148 -135 -214 154 419 -48 -164 -121 -82 175
2006 175 144 204 -79 -311 32 48 -98 234 -332 -148 69 171 14 556 -38 -190 16 142 -151 53 45 21
2028 21 -452 -429 254 236 -39 -58 -66 -301 -324 281 530 -179 -285 241 -102 1 349 383 -417 -365 174 123 26 5
2052 5 278 214 -676 -158 26 -90 161 -46 -69 -284 -536 431 259 -334 344 -150 -31 -311 189 244 -209 -270
2074 -270 78 -185 -157 -71 334 -198 -122 -232 -41 -136 180 84 37 -303 -107 -21 122 321 4 198 -114 -35 174
2097 174 214 -525 -99 456 -210 -371 3 237 -230 -270 243 183 -444 32 559 -17 -33 190 293 -318 -94
2118 -94 385 -16 -444 -116 178 -105 -251 7 268 -234 -70 114 -25 44 -352 354 -51 11 317 -40 -90
2139 -90 -11 216 -96 29 -262 -431 -147 -52 362 83 -254 -234 98 135 -207 328 404 -223 208 243 -150 -216 109
2162 109 -13 -256 -70 -38 104 201 18 292 -544 -104 392 -117 -101 -118 -21 -60 -15 -56 232 -134 -11 -121 -162
2185 -162 -151 4 189 -187 67 -387 -105 -62 291 160 -297 -548 86 -205 185 183 17 -2 -5 3 38 18 164 100
2209 100 -336 -343 -169 -66 6 -179 123 185 -115 260 170 103 -20 56 0 119 26 78 244 -6 -191 -143 -129 -158
2233 -158 22 121 -32 -176 -374 -96 333 49 -86 140 -317 80 261 237 -1 108 45 91 -152 270 201 30
2255 30 -179 -152 58 57 -211 189 -225 -492 233 65 -86 181 151 137 -86 -294 76 220 -88 158 165 -176 -106
2278 -106 96 186 100 80 -43 25 -184 280 198 -314 -319 251 -165 -168 225 534 -97 -269 205 118 -173 -55 365
2301 365 67 -144 -11 42 107 -258 322 309 -271 132 -47 110 197 246 114 -204 -104 177 120 27 -77 155
2323 155 21 -97 -195 203 -189 -124 370 -142 34 8 7 -111 -69 204 74 150 35 242 72 -198 -283 69 253
2346 253 8 15 -62 -38 129 -191 241 -80 165 169 -123 -180 -87 188 -241 -81 -80 245 184 86 -190 415 -63 -128
2370 -128 211 -120 40 -118 104 168 147 164 197 -61 131 22 86 -239 112 390 -60 -293 129 27 -30 15
2392 15 110 -166 -244 -117 97 20 35 244 -93 -271 76 146 -118 -2 -52 166 127 -55 272 61 -267 153 -249
2415 -249 -226 -67 146 -92 -367 -83 125 313 -34 39 -23 -198 73 495 251 -69 -45 -192 -123 9 361 31
2437 31 -208 32 -147 -285 433 20 -28 23 -59 -190 24 116 124 81 -49 -12 39 -155 88 452 -221 -293 135 -190
2461 -190 81 -193 412 26 -90 -44 24 -171 294 360 -113 -280 119 127 64 -17 212 -12 -608 160 398 26
2483 26 33 -16 176 -160 -119 316 -33 32 96 45 -187 157 462 -148 -155 -135 -109 -156 -227 193 82 -93 -48 165 299
2508 299 59 -56 316 273 -186 244 53 -188 -132 -32 -11 -367 133 140 -20 -293 -83 -297 59 37 104 53 28
2531 28 -46 -199 -323 -136 287 -34 14 23 -90 136 -173 73 164 217 141 -220 2 74 59 -82 41 -110 249
2554 249 38 274 -129 -130 115 109 -154 354 344 -55 35 -368 -108 67 13 196 -196 -327 20 138 -105 -79 239
2577 239 -158 -97 -113 173 2 279 -16 279 -5 104 1 -74 298 -40 -74 24 16 210 187 87 -57 -134 87
2600 87 149 73 99 -88 38 8 -287 -290 -46 115 135 -61 5 -55 77 -150 162 -284 14 137 54 154 205 307
2624 307 -110 -131 43 337 37 67 -59 72 -306 50 7 -112 -183 -423 396 -123 -78 332 285 -133 -19 91
2646 91 -117 97 107 56 -214 -50 67 315 -90 38 -85 -6 63 -111 110 -179 -46 134 345 19 -13 387
2668 387 -263 -222 36 329 137 9 254 -42 -85 187 313 -160 187 -16 -135 -296 -236 -13 -183 13 -88
2689 -88 257 -54 -165 -122 -100 27 -576 -36 -143 -49 -24 159 -52 -455 -156 -132 94 58 -153 96 -109 -64 364
2712 364 173 75 -102 -138 -131 -65 295 244 -70 -96 14 -41 52 191 223 142 -605 -187 167 -142 -6 157 -270 -554
2736 -554 64 298 154 -86 -38 119 -333 38 -9 159 -325 269 -179 -254 52 119 208 -9 89 89 -9 4 270
2759 270 252 -98 -160 13 309 -187 -218 60 -44 -180 -29 289 -250 107 37 77 153 -189 51 135 -115 -33 127
2782 127 -130 130 -39 17 -54 -188 -70 114 -117 80 -192 33 -155 -105 -315 -77 -183 -28 -80 -128 -79 217
2804 217 261 138 214 273 -45 -62 198 99 -55 -301 -19 -268 176 -73 -40 -146 28 -136 -8 -167 11 98
2826 98 37 98 8 -29 13 87 313 189 27 261 -23 4 179 -58 72 228 -97 124 224 -12 312 91 -59
2849 -59 40 7 -103 382 82 147 -36 -223 54 -153 119 86 -173 31 -102 70 -70 -66 167 -61 -45 -25 -181
2872 -181 79 71 97 -227 35 85 -107 6 -177 221 177 98 -279 -188 183 29 106 -196 6 -38 -70 -137 12 103
2896 103 -56 152 -225 -21 57 -91 129 -190 -143 -97 -10 -85 22 5 -66 -134 32 -58 146 110 166 65 -227 238
2920 238 70 38 5 94 124 2 19 205 -211 -22 34 -61 -304 -82 -25 76 -48 67 276 59 -259 184 266
2943 266 104 -32 -61 135 110 -20 -75 -55 74 112 -10 -45 -135 56 80 75 -38 -49 32 -435 21 -14 -60 173 -122
2968 -122 -223 -333 -200 169 43 18 96 -198 -106 -372 -20 -153 69 41 22 76 86 -65 237 -51 44 -39 -43 -76
2992 -76 -52 325 15 -6 10 5 -133 26 265 -191 -116 -67 -126 121 12 -177 51 -44 -27 96 15 -41 -249 26
3016 26 -22 117 88 115 149 -231 34 -46 -57 231 308 -212 71 50 337 -213 -88 -31 149 38 50 173 17 -314
3040 -314 -96 -68 -240 39 -91 60 19 68 49 -323 120 -220 258 299 -76 -74 480 81 52 59 -349 -159 -124 -29
3064 -29 -91 73 66 103 -64 -27 -306 13 156 89 131 48 15 61 -66 61 92 238 -275 148 293 59 -107 151
3088 151 -85 -3 -213 -36 -209 -107 82 -75 -104 -170 45 442 -119 -21 98 -181 -121 -142 -84 -143 -29 -385 -230
3111 -230 151 11 -202 230 -141 307 87 13 -26 -26 61 -7 198 26 106 -56 56 -171 -164 31 50 -225 121
3134 121 54 71 21 -10 -26 -64 75 -80 116 95 8 -107 220 -21 -9 -27 43 -165 408 -14 44 -216 152 36
3158 36 -76 215 -34 -368 -56 121 -109 -92 58 64 -189 137 93 120 -94 -221 -187 113 -4 -46 -85 63 11
3181 11 200 -293 130 213 -72 -272 -239 -92 -64 251 243 151 -123 1 -151 -413 250 -41 -39 60 -3 -75 -14 -153
3205 -153 -69 -278 277 135 4 -15 0 -82 -4 -152 162 22 54 25 88 144 54 -26 -4 89 -116 210 -72 308
3229 308 207 275 48 42 -70 232 150 -36 18 -82 -46 0 42 212 -180 172 36 275 -279 72 26 147 -89
3252 -89 -46 31 -220 201 66 201 8 -52 301 -21 -182 81 100 -233 -26 -81 180 -125 -60 72 264 246 -26
3275 -26 75 -71 136 -84 4 178 21 -220 321 28 134 191 105 -112 -136 8 126 -91 -83 -70 -135 2 28
3298 28 280 -121 74 -119 129 -152 -91 92 184 -185 153 211 -17 180 195 11 36 -112 -36 -296 68 87 168
3321 168 40 -102 -175 -49 61 -58 -182 80 146 84 -301 -132 50 150 -194 -271 58 -44 139 74 -22 147
3343 147 -9 -153 282 10 291 80 -7 36 -4 -36 -164 146 12 -48 109 -238 -11 -22 -185 53 -13 -58 -31
3366 -31 15 36 -92 9 -102 -20 -167 249 -120 84 105 49 142 259 -78 151 204 125 -40 87 251 117 32
3389 32 -328 -152 -34 -44 165 -223 -169 -143 9 -214 129 134 -55 -91 -38 102 65 62 -275 -158 180 65 87 -144
3413 -144 -43 -94 181 97 19 38 66 5 -43 158 -120 -133 215 -334 79 69 183 -126 -57 -323 -27 80 -156
3436 -156 100 107 -105 -130 53 -53 76 -191 -59 -98 -100 -90 -72 230 216 -16 31 96 -124 89 86 -70 -52 6 48
3461 48 -74 55 118 205 -14 166 -47 49 0 -128 -36 -114 -252 -79 118 -124 167 -17 303 -18 152 196 20
3484 20 -179 -191 301 32 -127 -15 -149 -81 -223 21 -133 56 83 -175 233 119 -87 -144 112 -194 74 -391
3506 -391 126 185 97 -39 -93 20 33 -47 15 128 -165 131 23 -147 160 -144 -34 78 -34 -86 -219 -154 135
3529 135 123 -16 5 -56 -60 112 -378 82 385 -150 -308 -30 -94 -130 -96 -133 19 -226 55 122 10 -125 16
3552 16 143 58 -17 6 70 -161 -25 109 -256 -35 160 125 257 -306 233 144 -72 120 -82 254 -178 -118 168
3575 168 -55 -228 17 32 -141 109 127 115 -123 -172 -57 -152 135 117 -46 1 68 73 -155 -61 145 156 -76 44
3599 44 -75 192 92 -98 141 -27 -146 55 202 -5 -201 204 -86 69 -22 -14 -82 11 104 -61 -180 -83 -191
3622 -191 -124 199 99 -103 -219 -2 105 134 -85 403 98 -24 410 75 33 -51 -32 94 125 456 8 -40
3644 -40 35 165 84 115 -17 -173 -21 -277 -156 -178 186 267 -73 -196 -16 -148 -220 -85 208 -119 77 -92
3666 -92 -156 -59 -207 48 -80 -190 81 -13 124 44 43 -91 -287 155 210 271 41 -33 -105 207 -158 -20 101 139
3690 139 11 110 147 -52 -158 148 75 178 -71 12 -55 111 -50 69 141 -79 4 -147 -170 230 114 88 83 -154
3714 -154 68 -50 223 34 54 -70 -41 58 64 70 147 -3 92 30 -126 93 -77 239 -282 235 -213 -266 75 -150
3738 -150 122 -23 -106 -149 156 148 183 -109 218 380 113 179 29 25 19 -17 -218 177 -57 -284 -43 -3 -108 462
3762 462 -36 376 119 -122 -17 173 -19 81 11 -147 -80 -452 89 172 -196 -87 -49 -66 -195 -62 306 61
3784 61 -225 34 -154 22 -111 -39 -1 -157 -1 -11 113 122 65 73 11 152 -165 -101 -37 43 32 -82 -85 -147 -196 86
3810 86 -9 87 -98 31 17 -49 -252 13 -61 -320 -62 -127 -58 100 163 13 -195 270 68 -52 179 238 106
3833 106 -48 27 232 -32 68 179 46 -66 147 61 -42 64 -215 -296 292 114 -61 -297 -388 341 84
3854 84 91 -178 -14 -53 129 25 -266 -1 124 74 219 -208 175 -109 -112 32 83 -106 -55 123 -170 -10 78
3877 78 172 -60 131 -318 -152 78 107 -5 -261 -77 177 -46 -254 208 -160 -149 -51 143 -115 116 102 70
3899 70 158 -235 147 -4 -146 -55 128 72 231 120 47 -155 -63 -64 171 125 -169 135 -11 -68 58 -143 189
3922 189 98 -50 89 -103 -27 -35 -168 -74 -260 -173 169 -36 -28 -143 -166 -319 -95 153 54 295 233 -46 -2 103
3946 103 -225 -75 33 166 327 -24 -132 41 108 -2 -133 272 -224 73 -197 97 81 95 207 -218 148
3967 148 -62 -178 2 35 83 -259 -165 -4 85 125 -30 62 -11 10 -63 76 79 64 -90 -132 -105 -17 -75 -65 80 -82
3993 -82 51 333 133 93 124 16 382 -89 191 -171 61 -50 -98 63 -1 -98 126 -38 172 -130 -1 6 105
4016 105 -321 -102 -171 -317 138 -178 15 -195 -50 16 111 124 -43 204 49 -112 -105 138 -141 -4 -5 93 111
4039 111 104 -283 308 -39 79 352 82 -58 79 -48 -207 379 34 232 244 229 61 103 243 -121 -95 -213
4061 -213 -60 203 -82 -12 112 155 84 -130 -35 12 31 -60 35 25 -75 151 47 -15 17 260 108 -82 -61 183
4085 183 109 61 -11 -51 -158 -86 -109 109 -56 127 81 37 307 110 51 -14 59 -28 -77 39 1 105 27 191 -121
4110 -121 -118 -155 231 136 168 38 38 -84 -155 60 -114 3 217 246 380 -110 29 118 73 14 46 -14 -20 -173 25
4135 25 85 55 429 -104 55 93 42 18 30 -134 -210 -67 6 7 -45 -121 34 -203 -46 -78 -164 42 -175 104 -90
4160 -90 -42 -43 -225 75 247 -44 114 55 108 163 128 114 162 -111 129 75 127 -16 137 156 -201 185 -17 40 -146
4185 -146 -208 -107 14 -422 208 -140 -90 -151 67 252 -90 -254 72 21 -127 -103 -43 19 7 -98 -347 -56 86
4208 86 11 103 283 -65 -53 -16 153 -57 235 176 -158 -48 -90 137 -3 159 -101 42 -124 205 60 -69
4230 -69 -57 -126 39 -111 107 -24 77 69 -89 102 -57 -82 -96 -51 61 -215 -43 118 100 -116 122 -44 99
4253 99 289 -62 26 34 -27 -337 -144 -48 94 -50 -124 100 -150 -8 113 -42 -132 15 -78 48 -187 200 78
4276 78 313 -142 127 -2 -215 222 31 257 142 -361 24 18 224 167 -202 20 -76 -78 116 -237 372 105
4298 105 29 163 199 -3 -112 -102 46 32 -150 337 -150 227 -97 -13 -49 -61 -135 -108 -68 -91 58 -85 133 -64
4322 -64 334 -20 27 218 170 144 -20 -142 -111 206 21 61 40 60 -155 130 227 56 190 77 -49 193 35
4345 35 -227 -29 -148 -120 -3 92 -62 -42 -85 -110 35 64 -114 -203 -176 66 -63 -129 312 -65 8 -202 -14 -25
4369 -25 166 -282 -301 -107 -301 44 -230 -322 112 226 62 -79 167 -121 262 204 -142 51 -260 208 -143
4390 -143 -84 149 -284 -44 106 208 -145 58 8 231 27 188 32 -137 105 -65 24 124 42 192 -106
4411 -106 -10 435 -15 63 54 182 -170 -2 267 106 -26 -74 233 119 -127 -67 -479 -145 421 57 41 -51 -6
4434 -6 -273 72 91 -267 -81 88 -141 -64 -74 85 26 -84 -96 -170 -91 -146 -101 49 259 -143 86 -75 -4 -147
4458 -147 -172 97 -42 -176 65 10 161 111 -116 173 -116 75 -185 -115 7 -23 -185 150 350 91 -35 147
4480 147 189 47 -90 -82 95 234 -5 -165 95 -156 184 325 -30 -55 -34 -67 138 153 -130 -62 105 -221 -224
4503 -224 304 347 40 -85 -158 -153 98 255 83 -117 235 45 16 -66 -33 16 -4 -124 7 172 268 -96 164
4526 164 80 -23 297 112 9 -204 -230 83 34 231 -108 -193 40 -169 48 -299 -56 -36 -214 4 -56 133
4548 133 -55 -26 93 89 299 219 34 98 68 160 44 -53 -136 298 225 309 21 32 -48 -8 -129 -5 -59 125 301
4573 301 -173 37 -15 209 94 53 1 47 -7 52 -178 -85 128 243 -24 305 -119 90 485 -118 267 -20
4595 -20 -179 11 147 45 -76 117 -13 -35 123 -288 263 -85 90 7 -230 11 209 -29 -105 170 67
4616 67 18 58 -88 -108 -225 -158 103 -79 107 171 -6 34 34 182 22 -68 22 82 285 -179 -76 19 158 189 149
4641 149 37 98 -33 -86 117 281 291 25 -1 189 -33 51 -321 50 21 143 188 68 -174 -31 -38 56 143 308
4665 308 92 104 -50 -197 -1 -147 232 161 -502 -116 -76 169 -41 117 167 245 356 -170 3 -52 76 105
4687 105 -184 -245 158 60 6 80 172 24 -3 50 38 -180 -50 123 -28 128 60 81 38 -11 -314 -89 2 171
4711 171 7 119 76 29 -21 -207 110 -205 -29 292 52 -54 7 40 90 11 -94 -58 -16 -291 -113 -186 4
4734 4 -132 11 -52 237 -101 -100 -206 -59 -505 168 -130 -1 92 -110 -76 29 154 -148 143 -420 52 126 77
4757 77 -186 -14 -136 -186 -42 -18 23 69 -107 173 -121 17 63 -283 -115 -255 -139 -29 -79 195 94 70 -6
4780 -6 131 -61 -75 104 346 80 -189 42 -10 128 -207 -71 21 -198 -1 -4 19 22 -177 -61 -381 -92 -8 14
4804 14 -343 -37 266 221 60 160 60 -232 174 -19 -86 144 -232 19 33 220 213 129 44 -302 -79 9 -156
4827 -156 -65 -22 -125 -195 -151 81 -84 53 223 31 -49 -392 -79 81 152 39 72 106 -170 -137 -161 100 143 -188
4851 -188 -92 -95 -97 -96 25 151 163 79 11 317 24 58 139 -3 88 -235 100 -171 290 -134 -209 19 -280 -164 119
4876 119 -94 -196 -181 225 -170 -250 -247 61 -129 265 272 -138 124 -45 -192 156 -271 107 -14 -150 301 -2
4898 -2 99 25 -41 146 -18 202 63 60 118 136 -203 4 104 -115 -76 -132 -27 -365 64 33 51 -62 2 -105
4922 -105 43 -14 -45 31 -309 -109 167 192 -17 66 -215 -134 30 -259 -90 -15 201 1 -23 -16 -98 15 207 243
4946 243 -102 40 -123 58 -47 -67 -317 -3 37 160 43 191 59 -137 15 -13 151 56 19 -20 -6 10 78
4969 78 -15 106 -31 155 69 32 171 125 -179 117 326 -89 265 -130 -163 -71 -75 181 -346 -94 46 169 -155
4992 -155 -90 -153 36 170 24 61 200 105 -278 -334 -168 85 170 -42 14 -82 -24 -90 -30 -27 158 115 13 61 -205
5017 -205 -89 -299 -160 54 -71 3 -143 42 330 86 -32 -113 131 -2 83 49 378 -125 -154 -210 18 205
5039 205 -22 -272 -92 85 100 64 15 86 65 14 55 296 -347 5 -253 -122 -122 160 -33 341 82 -21 313
5062 313 60 -97 92 -367 69 87 140 54 -141 -422 178 182 -132 -34 108 232 -97 -374 165 -79 -111 102
5084 102 -94 -44 -9 -118 -140 124 33 82 151 -90 -87 92 -100 10 33 255 -170 57 79 -229 64 82 126 156
5108 156 363 36 -24 69 -233 51 125 -84 33 -129 -104 263 37 10 -89 32 143 -71 169 -135 -304 -208
5130 -208 198 277 216 21 -47 -146 -30 16 -31 106 25 67 -66 178 242 200 119 213 122 142 -65 -24 18 125 -22
5155 -22 174 51 -120 -11 -19 99 -59 -31 32 52 -255 202 -257 -241 -122 34 -77 -14 -11 -144 -81 -35 199 39
5179 39 -110 159 13 10 92 -43 279 -73 -39 -189 239 46 96 329 -164 -250 86 98 -327 50 99 -232 224
5202 224 5 -296 -21 -96 -124 -150 -10 109 2 143 -145 57 -176 -154 85 15 -55 -153 207 19 107 127 216
5225 216 260 -145 -309 -5 55 33 1 76 112 177 251 20 -58 89 -65 85 -40 44 176 -63 -323 54 177
5248 177 -49 25 -43 347 2 155 -9 95 292 11 -144 89 148 173 -7 125 63 -124 -74 -130 171 52
5270 52 -75 36 91 324 89 8 -188 84 39 -183 -54 -12 -53 271 47 -206 289 -138 -272 -30 231 307
5292 307 9 -90 76 -90 -41 40 22 -84 56 287 -43 -153 -115 -75 103 -132 58 152 -49 63 -193 -49
5314 -49 -187 10 248 -136 -114 15 65 -20 -115 119 -94 -39 216 -45 -134 -216 214 -20 -13 48 54 -183 33 -363
5338 -363 245 -56 -125 44 -113 -149 63 -7 -178 99 -123 71 -109 42 45 -90 -44 -49 -55 116 -57 -138 -278 68
5362 68 19 234 -22 286 -94 -158 125 -172 -43 -218 221 -22 -107 -121 -40 -149 115 20 -125 -22 94 79 261
5385 261 48 91 -120 118 155 -156 83 -175 -48 104 176 1 -97 -164 153 110 -99 -78 13 16 -17 -347 40 -24
5409 -24 -78 -55 -104 143 -152 130 -17 -18 -59 -80 -23 40 79 -45 -205 128 -203 -78 -12 -200 2 -142 -53 12 -46
5434 -46 27 -158 185 -26 201 -107 42 74 -173 161 215 -13 -191 44 -103 54 96 101 -308 124 13 149
5456 149 -35 -83 -159 -180 -114 -77 -126 -53 -249 -21 48 42 -60 85 28 170 16 132 -367 -156 64 173 36 138
5480 138 -13 -38 136 -150 -146 82 -4 153 301 105 45 -314 159 -24 -275 -23 -1 -321 -140 -37 -248 -123
5502 -123 41 181 -40 -2 81 -158 215 81 84 -94 5 -48 15 -46 -174 70 89 -57 -31 254 -20 -76 -152 -11
5526 -11 121 56 319 99 -201 13 11 -110 -26 342 -108 4 -88 135 -100 70 -51 113 -67 -37 90 56 -40
5549 -40 62 -17 26 185 198 -110 215 -207 -330 159 72 0 54 49 -270 -195 168 -172 27 68 25 36 -241 48
5573 48 -81 54 -109 -78 -89 185 -110 -50 85 -136 175 118 51 -11 114 -278 54 -101 -108 -90 -124 -153 -190 -13
5597 -13 -102 -81 82 161 115 -197 -141 -126 44 -71 170 -14 -53 -211 -53 -92 76 -108 106 -54 84 71 37 -96
5621 -96 28 112 94 188 -390 213 -64 44 46 22 -15 -42 -167 142 175 -36 -27 -87 -122 34 -129 -21 -22 -100 -62 -117
5647 -117 -49 -115 34 -90 -73 376 171 -342 -19 -402 22 -77 -225 -77 26 137 -218 333 76 68 -6 11 -123
5670 -123 114 -74 122 68 -42 -37 31 11 -40 -337 -101 80 102 95 -87 206 52 228 -67 -64 65 122 -25 -183
5694 -183 -54 -109 21 -9 133 78 6 130 -109 206 -181 -12 59 20 53 -26 -162 -59 34 70 -129 13 -54 41
5718 41 -3 -43 270 -10 -186 28 119 -54 236 78 -93 -71 144 7 -105 53 -350 -142 215 150 121 64 -40
5741 -40 -11 279 67 13 21 134 -34 -9 -215 121 107 275 153 87 80 78 -147 198 13 125 7 -174 -37 -244
5765 -244 233 8 -26 157 21 -118 -4 -241 -9 94 -21 193 79 104 -33 -116 -69 -139 155 -270 -65 -93
5787 -93 230 65 -282 -104 149 -7 167 23 124 -54 -37 -246 -9 -91 51 132 -19 -9 114 -18 -88 56
5809 56 227 104 201 -107 128 4 103 58 256 -37 225 -20 -206 -60 125 124 152 -58 -365 -21 119 381
5831 381 32 16 -89 51 -321 109 64 -127 50 119 -131 -88 -329 75 65 169 -42 205 -114 260 52 -146
5853 -146 -53 172 -127 -35 -16 26 -115 -52 234 -105 -213 -101 -54 -125 -139 -171 145 -188 257 -88 -126 -25 62 71
5877 71 -81 -134 65 -197 14 161 -105 222 -278 -93 34 138 -94 75 -4 -473 79 -284 -137 -112 93
5898 93 66 -182 -75 -131 -1 20 107 -41 -195 -195 12 -98 214 214 -119 81 -74 69 39 -171 168 75 61 -87
5922 -87 152 7 -63 21 -158 32 -45 70 -96 119 125 -79 -207 12 -206 219 -192 -181 -159 168 -152 85 52
5945 52 162 -44 173 89 4 -161 45 120 134 105 -25 -225 -205 106 145 -228 -145 -54 -138 36 -270 -140 159 144
5969 144 -214 -12 60 -63 102 -156 -173 -143 -2 368 18 111 -58 -5 64 164 -174 104 -150 243 -35 -96
5991 -96 -120 -182 197 227 208 -120 21 0 -376 -74 -12 156 -80 -19 -214 7 -159 -232 -82 83 489 -146 27
6014 27 118 -411 24 -87 225 -1 -332 -127 -147 -124 161 -178 68 101 -382 -7 -84 72 217 98 -57 -164
6036 -164 29 199 215 186 204 -118 -116 -82 91 18 143 65 -3 4 152 41 145 39 -74 73 -228 -70 58 -117
6060 -117 106 -133 -205 75 -35 204 -167 149 -370 -186 14 -160 240 -45 -99 132 -51 -13 35 -232 60
6081 60 -18 -159 65 -315 124 2 -71 -97 -88 332 -159 -131 56 213 -23 -68 -11 4 28 -81 -216 -145 -90 -140 -180
6106 -180 351 135 -153 56 62 42 21 -47 -27 -59 -30 9 48 -171 40 -147 57 87 -49 -115 -50 102 20 77 112
6131 112 226 -37 139 59 -102 89 -30 -83 168 -285 188 26 78 49 50 111 -95 -176 -266 122 43 -94 30
6154 30 44 -168 -149 95 35 21 -51 -184 191 86 -118 -83 -122 82 0 134 101 113 -3 -76 38 57 -63 111
6178 111 64 -3 -302 -217 71 -98 -321 69 -96 106 90 -59 -114 -61 -87 -57 9 -15 -90 -83 203 161 -85 51 78
6203 78 71 68 -99 -32 -60 2 41 -181 219 218 -140 126 54 -85 -189 -30 39 -39 -20 -94 31 18 -26 3 226 -142
6229 -142 15 184 -23 -22 263 96 -96 -125 81 -137 106 61 -90 -137 -13 147 58 246 226 -209 -101 158
6251 158 216 -8 101 -34 -95 -108 25 46 77 169 253 49 124 -148 -155 129 98 -183 16 -163 76 6 11 100 222
6276 222 154 122 146 -89 -64 69 -1 -205 139 -59 -146 -30 149 227 150 -47 -42 143 191 -69 58 58 290 251 367
6301 367 -82 119 116 22 -21 -195 -1 54 66 -123 -105 -95 -161 -403 58 -175 -11 93 64 186 186 -188 -69 -39
6325 -39 -76 -90 -154 28 -102 -74 -69 -119 -197 95 -133 -174 164 -106 -157 -71 120 160 -22 89 -58 -17 40 -41 -124 122
6351 122 -206 18 -98 70 -119 -172 112 36 21 -35 -138 -66 -31 31 -177 53 -244 153 -118 -27 -112 -132 -15
6374 -15 -128 -45 -138 -9 -16 -30 212 -204 31 32 -81 35 95 89 -63 21 -12 88 210 68 70 -100 161 136 -170
6399 -170 -111 -379 -232 210 142 -334 -154 150 183 -160 -111 -8 216 63 191 228 259 14 64 81 187 -156 -23
6422 -23 123 -223 -137 216 -31 -31 -52 146 -274 -167 -124 -82 67 114 154 -425 -110 239 71 172 173 -29 -103 -38
6446 -38 131 139 -94 83 -129 1 90 -16 38 116 -163 -70 200 225 -101 90 141 105 -30 40 24 -7 74 18 81
6471 81 -12 -205 -49 -421 -182 185 126 163 165 67 -35 -46 -181 99 -3 -46 154 375 -9 -342 -23 71 50 305
6495 305 49 -40 -163 -156 161 118 43 -203 -235 76 -345 196 21 72 -208 43 -149 -137 6 51 -141 -23 -89
6518 -89 19 59 -42 -145 -214 -21 -90 -12 -176 64 -68 -266 241 22 194 210 52 -151 109 111 229 -132 -21
6541 -21 77 61 -75 -74 27 -200 -56 -103 -189 80 20 -40 -143 180 2 18 291 115 -216 133 -256 201 -176
6564 -176 -159 -7 -16 -173 309 -39 -85 -18 241 51 99 -56 -3 -64 -67 7 111 31 -36 123 -30 -20 112 48 130
6589 130 69 17 148 -178 120 202 152 1 113 -135 -113 36 -170 -194 214 15 -98 -163 45 -208 -117 132 -97
6612 -97 179 198 -328 211 -86 -63 -205 -91 -280 -247 49 -376 -309 329 -198 3 263 -70 171 -223 -116 -80
6634 -80 -95 8 -152 299 270 201 206 -41 -49 -2 -301 -165 37 1 55 92 35 -147 212 -169 256 -348 2 -92 -273
6659 -273 102 158 -9 -143 -10 -22 -71 -131 165 40 -81 -37 -61 -95 231 99 255 -44 225 71 -50 7 -126
6682 -126 -44 118 94 -127 155 -53 -354 -180 -141 -107 -61 -231 166 -166 -104 224 148 85 127 -73 -81 124 242 39
6706 39 -105 175 192 -18 -169 -36 154 -158 -47 14 3 11 82 -89 -181 -329 -187 113 -151 -176 -260 94 -139
6729 -139 70 -137 -180 366 198 -78 -21 35 15 -100 140 208 46 194 -147 -47 104 -71 222 2 -70 -232
6751 -232 -92 45 -107 17 131 -24 -45 120 211 -237 14 124 -250 -51 -22 167 71 6 -172 233 2 314
6773 314 185 116 -118 -13 0 185 5 58 -35 89 39 -2 -175 5 -150 4 -341 -81 120 -115 214 -288
6795 -288 -56 157 22 16 -34 -108 160 -144 -185 63 -195 40 -65 -138 72 -20 69 56 -3 -11 -16 -32 -101 -46 253 219
6821 219 52 37 24 24 133 -25 148 101 151 25 -222 -300 6 -104 -22 -17 94 -17 216 -93 153 114 78 -1
6845 -1 -149 -116 -249 -46 -103 29 -59 374 86 -139 195 -288 202 226 -82 -102 63 -133 51 -211 -224 151 37
6868 37 73 -13 -225 95 -296 236 101 -91 385 -147 -50 118 -115 -176 53 165 182 -93 84 66 -78 188
6890 188 -5 284 204 -265 -25 -28 -275 -153 134 47 -110 -150 -169 65 -236 -27 -246 -162 -313 75 101 102 100 117
6914 117 -15 42 -47 218 103 205 95 19 -13 13 -42 134 -98 172 -99 -32 127 253 113 -285 162 143 57
6937 57 -105 -175 -93 367 -109 -179 165 -288 -43 161 58 -326 9 -72 145 -83 -87 -98 191 79 204 189 -230
6960 -230 -274 122 75 -53 116 -271 -1 98 -94 214 312 -78 -178 -188 29 160 272 -194 -78 222 -101 334
6982 334 -300 93 244 -58 369 -20 -142 -100 67 102 -20 110 -235 -35 -59 323 -12 73 -158 220 -15
7003 -15 72 50 -38 116 -114 278 87 168 -120 138 85 61 126 269 -30 8 174 92 -50 102 102 169 -7 205
7027 205 74 -52 21 -192 493 122 126 40 3 35 -52 -138 159 -65 62 -134 -128 -29 -108 112 73 -218 -154 -20 -38
7052 -38 7 140 -308 75 265 -81 -146 65 29 32 73 -161 23 72 47 3 -72 169 46 152 46 239 46 -234
7076 -234 -118 -170 119 131 -83 -235 119 -89 69 283 -126 159 152 -86 -88 44 67 152 -3 -9 -6 -16 -112 -31 18
7101 18 -30 105 -49 160 -33 64 -206 -24 91 21 -274 -127 -171 -117 35 185 -116 -188 157 -50 21 297 -17
7124 -17 -222 -47 -59 -130 -7 -43 11 -110 22 -9 -177 -98 -170 73 312 -104 -207 166 239 -241 -153 264 -28
7147 -28 -163 -67 -64 147 106 236 -76 -275 41 20 -64 -122 -232 -19 189 -67 40 -19 -73 -204 -66 -119 8 58
7171 58 -117 -38 -234 -57 265 89 20 23 95 126 6 133 91 -349 76 -159 27 200 -166 99 -7 -81 165
7194 165 52 39 58 -37 -53 85 195 -34 -32 246 8 -269 -55 -64 -37 11 -320 50 -96 -71 38 126 -133 -114
7218 -114 -123 -181 -113 -114 -29 -184 -250 123 -50 -86 14 143 -34 -307 53 36 161 158 57 36 73 91 258 -31 36
7243 36 -129 -282 39 176 -6 262 36 106 167 27 171 149 101 -82 -179 -62 114 89 79 -19 220 6 -51
7266 -51 12 -203 -73 8 190 233 40 -54 20 -330 58 8 -5 173 4 -59 -57 -222 -294 71 98 -125 -236 -167 -193
7291 -193 20 -29 56 348 235 -29 152 175 -165 -82 -82 -85 -4 -23 324 186 -55 -108 -153 -119 111 18 60 34 -65 50
7317 50 270 70 -274 -93 223 165 40 -114 -83 262 202 7 287 -14 115 3 53 8 -18 295 -203 -93
7339 -93 -19 77 75 210 180 -56 -133 207 -33 14 -34 148 -30 79 59 -117 17 -216 -20 -83 6 138 58 65 80
7364 80 126 -67 213 -23 54 15 -69 -178 148 -267 216 77 -233 -42 43 33 -2 178 39 121 44 -57 7 70
7388 70 -87 72 -306 120 -251 -32 -68 -13 25 9 61 -150 -47 -107 119 52 201 -130 305 -74 -105 -56 -16 -100
7412 -100 80 -12 340 355 -19 -57 -29 94 -265 -244 132 -103 -15 362 -33 154 127 298 351 -99 97 38 116
7435 116 -74 35 91 -147 75 -6 -222 57 45 -4 -106 -12 -283 150 -86 -271 -113 -38 126 -297 -54 1
7457 1 198 15 61 177 5 -91 216 265 -119 34 20 -94 55 35 -328 83 -85 92 102 35 -90 79 179
7480 179 113 -60 42 169 136 -61 -123 25 29 51 125 124 146 222 167 -27 80 -92 99 166 -94 219 -124 -247
7504 -247 -94 -124 4 -137 66 -43 -54 41 195 -3 51 130 -277 -152 162 -115 -177 12 -158 -31 -20 -14 61
7527 61 -187 49 -22 16 -87 -170 62 -34 -71 7 -93 59 46 61 119 102 -40 97 -13 62 -68 -219 -44 202
7551 202 11 150 98 55 129 252 265 -59 -190 142 -55 43 -68 199 106 74 310 86 -345 128 19 -147
7573 -147 -129 54 -127 -258 380 -161 -44 -165 -170 177 134 -75 -124 136 -169 -91 -67 60 -140 118 -2 32 -101
7596 -101 -11 -1 82 79 -193 166 105 -104 -38 95 105 89 -48 -200 -134 -102 -40 208 -172 37 -8 140 -96 71
7620 71 79 -249 387 -20 -6 -101 -16 -129 339 -229 -132 110 77 -44 -71 -31 49 78 110 123 88 -92 -127 -21 56 184
7646 184 30 -30 -282 68 322 94 -13 158 -136 43 -26 42 24 83 48 54 -191 95 249 -163 82 -26 71
7669 71 -21 94 65 89 -110 246 -122 169 183 -115 4 41 189 -23 -7 -14 138 106 -378 93 -34 235 -74
7692 -74 41 219 25 172 167 -87 -35 132 -153 176 -117 93 245 -9 -48 12 -268 153 168 -19 -349 -177
7714 -177 143 86 -16 -157 -270 -188 -200 -157 3 70 -137 -348 -4 -32 51 -289 27 72 96 46 -63 -222 33
7737 33 56 8 64 111 -230 -117 180 43 216 -196 170 179 263 -252 22 283 183 -29 -95 135 -168 89 75
7760 75 50 -94 32 -60 -90 -80 -167 -104 -66 72 94 57 206 -181 23 81 43 131 289 125 -357 102 0 29 80
7785 80 -64 -99 183 190 -160 231 60 -233 113 -152 -32 100 244 -197 91 -72 -66 71 16 -146 73 70 19
7808 19 103 -135 10 97 179 43 -60 -151 -34 11 62 -124 -82 139 38 -149 75 -160 -222 28 2 -16 227 45
7832 45 -66 130 121 20 -39 -149 55 177 60 89 171 95 70 208 161 -77 125 32 286 166 218 104 53 -44
7856 -44 -29 -78 123 -137 88 5 75 108 8 349 199 -59 -183 83 325 47 45 -22 -28 54 141 291 -54 23 55
7881 55 -87 491 -46 134 -129 46 -67 324 79 72 -94 45 38 48 43 32 -67 -138 7 -237 144 36 -49 107
7905 107 -299 -3 55 -185 -191 25 21 -86 82 -84 -206 90 -29 -146 -146 61 -12 107 156 -159 -73 -221 -144 -197
7929 -197 -5 -162 112 -16 -250 190 -11 40 -58 -70 142 -77 229 186 -240 -53 44 -216 -28 -2 80 -50
7951 -50 -46 -95 1 86 -27 -139 30 135 -52 9 -62 15 -254 -191 163 -126 -100 151 60 201 0 -67 15 -68 -30
7976 -30 -57 -163 -130 -106 28 124 38 -168 -65 -166 105 -233 34 -150 -232 -270 -31 72 -64 -77 -165 -222 186 -271
8000 -271 -95 0 -121 254 -74 24 75 -88 -222 -10 41 45 159 -105 22 57 -142 -102 -212 121 -208 -70 -18
8023 -18 0 126 127 191 158 125 -25 -18 -28 270 223 -138 -39 12 34 21 123 4 230 -135 241 -119 -227 -16 45
8048 45 -83 -21 123 -45 -136 -267 21 135 11 133 -350 147 110 -368 -26 -135 221 -171 -262 -3 41 65
8070 65 110 90 -82 62 -151 59 -16 1 -22 -41 159 241 15 217 -17 30 17 -119 17 227 -174 112 31 -59
8094 -59 -152 -6 -131 -154 217 27 19 217 8 -151 152 70 -45 99 -12 135 -121 -92 206 50 -74 -124 -46
8117 -46 29 90 22 178 -106 57 -67 -252 -148 234 75 0 -62 -273 71 -18 -32 163 132 72 42 229 -106 137
8141 137 -140 83 124 -205 -20 47 -93 -22 -195 171 -99 -39 -187 40 -22 195 97 56 2 -215 -112 67 121
8164 121 -53 60 -45 -163 122 272 26 -146 300 492 65 274 7 183 82 -94 -120 -15 57 -127 115
8185 115 -137 -192 98 32 -125 -84
8191h4
$$ Imaginary data points
##PAGE= N=2
##DATA TABLE= (X++(I..I)), XYDATA
0 0 0 0 0 0 0 0 0 -8 8 -8 8 -14 16 -24 24 -32 40 -48 62 -72 88 -105 128 -150 176 -206 238 -273 318 -366
30 -366 417 -473 541 -613 690 -778 872 -981 1096 -1223 1360 -1514 1678 -1860 2057 -2272
46 -2272 2508 -2766 3049 -3358 3699 -4076 4492 -4956 5474 -6061 6726 -7486 8373 -9412
60 -9412 10659 -12182 14094 -16579 19947 -24797 32419 -46187 78879 -323653 59646 732697
72 732697 -34146 -269272 41406 -34399 -277313 208522 383535 -182219 -350276 210876
82 210876 198817 -246684 -115063 272450 66288 -193881 -2520 145397 -93972 -154897
92 -154897 98053 174282 -17817 -100583 -79452 -67029 17338 178289 155142 -112762 -261752
103 -261752 -35284 196902 118250 -33803 -35602 -41299 -95075 -14149 138280 79680 -73736
114 -73736 -42772 1146 -78422 -17762 144654 64931 -129537 -69599 91437 17479 -94151
125 -94151 28364 109206 -20967 -55110 35983 -22032 -106118 44271 195334 23727 -201176
136 -201176 -99420 88028 59941 26870 73674 -44367 -202232 -44598 219033 120798 -145050
147 -145050 -94564 79885 7809 -57639 69237 66329 -90643 -48925 107275 18463 -139447
158 -139447 -8045 146730 7491 -107503 7138 35078 -68997 -12612 124860 46898
168 46898 -118110 -72256 54384 35804 11617 55406 -6746 -106875 -37651 90614 62841
179 62841 -41299 -37031 13321 -14969 -25690 30923 28970 -22472 -15610 12057 -6197 -23057
191 -23057 13382 37400 -5050 -21982 16433 5206 -34674 -4595 43943 27142 -21629 -33683
203 -33683 -15541 -6254 21400 52825 1706 -70236 -38036 36962 42445 1895 -11044 -5805 -20711
216 -20711 -10249 38258 26725 -28973 -16386 24097 4477 -27097 -2945 26428 -646 -20898
228 -20898 11279 6081 -35718 -8636 41269 16736 -26264 -13375 10564 -6649 -7655 35441
240 35441 25497 -35496 -28066 18977 12833 -4639 11788 12319 -28212 -34888 20149 35870 -11211
253 -11211 -20832 3159 -2492 -6471 13446 14766 -13369 -17569 20413 24016 -20634 -23484 15459
266 15459 20252 980 -6644 -9588 -14440 -5700 22859 22468 -19533 -30874 -885 14179 12228 8198
280 8198 -5056 -17441 -9097 17309 23410 -7687 -18719 3088 12120 5026 -5763 -13399 -2622
293 -2622 13004 10131 -8722 -21726 -4482 18497 8823 -7652 -6628 -2557 2910 5328 3248 1952
307 1952 -1508 822 4595 -6107 -5717 11225 6419 -10668 -7533 5452 1915 -11250 417 16012
321 16012 -4870 -18878 3602 11515 935 2030 -1016 -9752 1044 20451 6857 -25115 -10897
334 -10897 24838 13036 -13359 -13961 -9069 5716 23966 1816 -31329 -13239 24825 13881 -16226
347 -16226 -2800 9861 -9776 447 22414 -6122 -21402 14370 17147 -17869 -9039 22321
359 22321 -1813 -31475 9372 32651 -15968 -29186 11567 13798 -5144 3292 2453 -16292 -2825
372 -2825 27461 8483 -27595 -6178 24781 5233 -13246 -4036 471 3342 7137 -3739 -14409
385 -14409 -2710 13967 3926 -14190 -3030 10672 322 -3847 1807 761 2003 3482 267
398 267 -2764 -1370 5568 3177 -8521 -2205 8849 -873 -11820 -3831 10128 5453 -11092 -6992
412 -6992 7436 3715 362 1751 -5547 -3326 11143 9090 -9444 -12240 8231 13656 -5456 -9466
426 -9466 758 -958 66 4831 -3112 -7315 800 4561 -1150 -3658 3853 3784 -4828 -172 5664
441 5664 -1087 -346 3274 -1636 -776 2801 -1639 -5377 48 6757 -10 -9295 -2043 3648 -588 1436
457 1436 2170 -4349 -1735 4118 2313 -1600 989 5180 230 -6860 -43 5280 662 -383 -1745
472 -1745 -5007 -1582 2214 1721 -1158 -2490 685 199 -3206 1495 4789 1595 478 -1970 -2481 1724
488 1724 3529 2489 -183 -3566 -1401 -585 -1826 2252 2216 -2035 -2572 -3607 -1816 3619 4434 1373
504 1373 -3177 -3869 1811 3248 1563 3486 382 -3811 -683 607 -377 1341 2445 561 -6452 -6224
520 -6224 3924 4275 -1000 1024 -311 -5093 -1320 5117 4917 -682 -1089 3377 -2670 -6738 5143
535 5143 9312 -1392 -6501 -2637 -581 -1745 1796 6822 -1595 -9903 -498 5260 -1172 -93 6222
550 6222 3120 -7053 -5822 6498 6147 -2553 1570 3586 -6681 -7077 4776 7252 -1347 -4913 870
565 870 -1506 -8340 2879 12081 -123 -8452 -735 3548 -1868 -458 9466 4914 -10093 -5542 6395
580 6395 325 -2917 6469 4109 -10140 -9633 5739 7267 -4717 -338 6556 -6558 -10635 6240
594 6240 10934 -931 -4166 3502 -490 -9441 2609 14255 97 -9899 14 1090 -6690 -691
608 -691 11488 3850 -12419 -6562 6345 645 -2862 8424 5762 -9232 -8218 6007 7536 -1288
622 -1288 1636 6552 -7786 -13133 5647 12196 -1769 -5547 2055 -1894 -11256 -192 14740 4024
636 4024 -10116 -2183 1296 -5963 1533 14540 5600 -12254 -7800 6696 1423 -4329 8278 8301
650 8301 -10156 -12998 1899 7654 1864 1579 3959 -7937 -13933 4674 14959 1377 -5300 1518
664 1518 360 -10172 -3165 15196 10556 -9173 -7421 121 -5703 -841 14300 8804 -13417 -13100
678 -13100 5248 4005 -4982 8364 13281 -9838 -16486 2922 10032 1934 3942 7373 -8859 -17337
692 -17337 3844 15700 472 -4182 3917 -4509 -14757 -1160 15687 8139 -6741 -4426 -2009
705 -2009 -7884 1114 15910 8301 -8747 -9520 199 842 -793 8898 10874 -7706 -16068 -2015 7034
720 7034 3169 3498 5666 -4952 -16348 -2814 14427 6634 -2702 2627 -1538 -12720 -3943 14638
734 14638 11567 -5661 -5695 252 -7851 -5711 12921 12113 -7380 -11419 -1314 -44 -2552 8042
748 8042 13059 -5483 -14717 -904 6342 852 4019 8567 -2104 -13744 -4737 9541 4947 -1225
762 -1225 3700 -1482 -12927 -5223 10023 8639 -2492 -2926 63 -6837 -5524 10248 11036 -3611
776 -3611 -6194 -552 -2166 -3315 5957 10287 -1932 -10269 -2242 1597 -1769 3729 7950 -1736 -10348
791 -10348 -4125 5340 3179 196 4786 1075 -8750 -4718 6336 5682 427 260 271 -5407 -5787 4793
807 4793 7423 -1913 -3276 -131 -3121 -4576 2308 7689 1715 -5461 -2549 930 -1327 1964 6268
822 6268 1037 -5164 -3146 1684 1530 -810 2749 2910 -4621 -5723 829 2923 914 780 768 -2024
838 -2024 -4570 556 5830 1378 -1201 1168 -859 -3371 35 4529 2492 -2946 -2104 454 -2493
853 -2493 -1653 3944 2069 -2733 -1936 -161 -857 -546 3486 3677 -2864 -3564 1556 513 -638 2830 2283
870 2283 -2802 -2869 240 1448 -573 591 1712 -2171 -3102 932 1112 87 1032 946 -1096 -2649 -403
887 -403 3081 2306 -50 -436 -1442 -882 669 662 964 466 -1284 -1464 -952 -577 1438 1074 253 -1367 -1937
906 -1937 845 1883 -70 870 1894 -1401 -2165 -124 2372 1876 -875 -1163 -872 -2224 244 2204
922 2204 -698 -1478 896 240 -2212 -1370 2759 2879 -1259 -1342 453 -805 910 2938 -77 -2173 -208
939 -208 559 -1243 -1401 2278 1742 -2981 -1750 238 -480 701 1705 -37 -1501 93 1080 -498 -339
956 -339 2619 1436 -2463 -2099 329 1227 1500 -35 -2026 -1118 134 -12 -569 470 1251 136 -1312
973 -1312 -1170 -243 1724 3092 -701 -2506 192 1027 -556 381 1309 207 -1842 -1561 232 -415 1154
990 1154 2093 -1925 -3176 1406 1504 -816 147 1788 311 -1959 -428 1022 101 1339 2272 -2937 -3467
1007 -3467 1382 2021 -627 -867 401 -281 -2038 -401 1844 -99 375 1581 -1773 -2212 1615 2427
1023 2427 640 -873 -145 300 -1542 -407 1863 246 -960 -525 -1512 -1386 603 1596 428 -1322
1039 -1322 -1061 831 37 -65 1590 797 -436 -354 -648 -72 551 964 666 -1512 -1644 183 -31 -91 1194
1058 1194 94 -993 -677 -556 1002 1009 767 668 -1208 -687 363 362 507 752 -788 -707 -542 -441 544 675
1078 675 509 -475 -1617 -757 738 699 1064 584 -1173 -421 494 598 971 603 599 -509 -1714 -529 834
1097 834 454 508 -389 -1919 -724 287 510 725 -58 -5 6 -1141 -143 1476 1179 508 -885 -1198 105
1116 105 706 623 55 -1047 -960 -372 -968 -144 1395 931 4 -1878 -998 919 1325 1183 239 -1424 -595
1135 -595 434 218 553 695 382 -607 -1591 -976 1265 787 445 -330 -1998 -1034 976 1111 742 -54 -399
1154 -399 -278 -735 227 1571 345 62 -308 -1371 -681 688 923 584 -1325 -1573 -473 6 1111 970
1172 970 -599 -94 -92 -773 587 1260 561 53 -787 -1131 -241 1016 1675 -493 -1966 -398 101 -710 301
1191 301 853 -114 -220 -495 -475 205 1493 2084 -637 -2481 213 2120 607 -28 402 50 -832 -795 158
1210 158 -14 -87 1151 -793 -2764 -504 2390 1117 -987 -850 505 -303 -826 1367 1436 -802 -163
1227 -163 177 -1354 -765 1826 1476 -1776 -2178 1098 572 -2090 494 2100 -897 -2158 374 1025 253
1244 253 782 1935 -909 -3174 1123 2974 -1048 -1385 1574 460 -2378 -1239 1662 1375 -1367 -332
1260 -332 14 -1809 -157 2707 1361 -1860 -801 1227 474 -1442 1339 2379 -878 -2383 -310 627
1276 627 196 486 412 -1027 -1994 304 1558 -466 -503 1089 -204 -1646 -860 1692 1950 -437 -908 -354
1294 -354 -1210 157 1949 606 -1324 -959 -57 46 -524 723 1695 -812 -2132 172 804 507 840
1311 840 966 -187 -1999 -537 2152 998 -477 -74 -480 -1606 -438 1506 1200 -852 -1180 193
1327 193 -514 -1372 1761 2173 -923 -1997 -356 1008 441 589 1625 -127 -2810 -340 1649 50
1343 50 -287 766 345 -2479 -1897 2326 2357 -1139 -807 59 -1350 -777 2094 2478 -1062 -1687 635 57
1361 57 -1564 1217 2905 -546 -2618 -792 661 178 626 1579 -370 -2914 -514 1967 567 -41
1377 -41 1250 323 -1845 -981 1612 1772 -350 81 -224 -1831 -836 2131 1692 -1112 -1680 -68 -193 -1085
1395 -1085 873 2182 -47 -1708 -439 -119 56 1066 2027 -153 -2554 -699 1808 263 -560 920
1411 920 294 -1556 -1147 663 1144 -297 390 273 -1664 -1479 1823 1854 -456 -775 195 302 -509 425
1429 425 1652 338 -1013 -448 -546 -367 453 949 136 -1607 -936 588 562 -245 887 779 -869 -987
1447 -987 362 1060 394 -133 367 -726 -1325 566 928 -65 -503 274 -143 -853 -543 1104 717 -460
1465 -460 5 -114 -560 266 1145 419 -322 -288 177 -470 -322 593 153 -701 -286 -431 -524 197 519 397 -182
1486 -182 -469 -294 26 204 631 42 -645 -220 -186 187 264 365 312 -434 -943 102 -141 44 495 -41 -312
1507 -312 36 -277 222 287 257 325 -324 -526 97 825 466 -116 -473 -552 -8 -89 104 321 -227 -56 -591 -816
1529 -816 502 945 588 -41 -423 -193 235 305 355 91 -240 -128 -240 -382 357 622 110 -459 -899 -197
1549 -197 -26 109 72 -83 -198 -188 -362 164 724 152 -174 -348 -188 387 678 636 -110 -863 -70 149 -508
1570 -508 -175 697 61 -746 -454 22 433 317 445 286 -846 -166 832 149 -358 144 132 -455 -405 167
1590 167 765 -182 -529 -158 -532 -276 956 725 -114 -305 19 221 -321 428 1024 -58 -869 -489 128
1609 128 15 57 51 -14 -714 -453 545 -120 -316 545 241 -740 -302 344 671 159 21 102 -474 -539 719 567
1631 567 -126 54 128 -608 -526 40 552 -160 -663 109 37 -561 480 704 -97 -254 -93 75 190 -295 455
1652 455 274 -490 -478 111 126 149 354 -301 -619 -693 346 636 -72 104 45 -222 -213 148 248 440 -160 -29
1674 -29 214 -425 129 439 145 -296 -298 -287 -48 -274 117 514 -37 -663 -209 181 288 323 -48 -73 -141 94
1696 94 389 -142 -5 128 73 -538 -434 19 630 14 -327 -17 -519 111 491 260 -55 70 261 137 -192
1717 -192 174 730 122 -6 203 -386 -455 27 19 333 12 -353 -132 44 308 883 -160 -527 125 286 427
1738 427 90 -10 95 -175 -313 12 -216 335 870 -220 -515 -465 -80 270 260 289 -241 -276 -152 436 200
1759 200 168 614 24 -181 239 346 374 34 33 -212 -504 -421 369 167 -235 39 -323 -869 30 684 440 -189
1781 -189 -106 -233 -374 292 633 -116 -210 -205 -261 -238 86 106 286 -15 -434 -762 -118 634 788 46 -467 -217
1803 -217 -191 558 415 -82 -417 -305 -98 -150 -67 279 249 -321 -22 -436 -350 307 638 149 -568 -195 -130 195
1825 195 491 592 -64 -452 -174 -60 -8 156 145 -407 -376 -204 97 187 -137 313 -138 -438 -318 19 589
1846 589 435 -45 80 -93 -310 663 618 -27 -434 -172 109 157 -8 155 256 -249 -122 -103 -284 624 351
1867 351 32 -113 67 -366 404 390 168 141 -372 -147 308 269 368 -101 -190 0 -10 -264 214 312 -214 -258 -62
1890 -62 -11 -115 337 220 -389 -449 -118 341 34 190 75 -146 -424 -181 463 -15 -173 120 -222 -400 23
1911 23 274 370 -29 146 410 -253 -43 644 217 -123 -56 -129 -94 -260 189 224 -123 -126 -30 -289 -66 357 97
1934 97 -116 -74 -38 196 80 -205 180 23 7 -42 236 184 47 -171 -136 -105 -423 162 322 -131 -373 31 -221
1957 -221 -149 63 549 264 -275 152 242 250 368 -35 119 -224 -157 214 4 -333 306 223 -285 -368 36 142
1979 142 -137 -322 167 51 -162 79 348 -104 -435 208 74 -162 148 357 -31 -266 -325 225 -195 -34
1999 -34 -153 -250 -172 110 -69 372 93 -262 -58 13 180 247 88 7 -390 263 386 107 -187 31 164 -571
2021 -571 -105 276 104 28 17 41 -54 -276 491 35 -291 241 -222 -5 -178 347 492 -510 -491 170 -62
2042 -62 -113 64 835 -158 -272 -68 480 -113 18 76 192 -416 86 476 -56 -334 -123 -203 -371 -290 294 147
2064 147 -656 -80 7 -59 -117 423 224 197 -383 372 -64 94 -84 269 21 -94 26 17 150 220 -90 -1 -215
2087 -215 -241 249 55 45 -236 -87 52 128 56 189 43 67 533 -143 -267 28 -2 -143 -271 79 -108 -436
2109 -436 -223 442 65 -420 97 10 12 94 171 164 -21 140 214 -118 -184 -4 205 -193 -153 -105 -49 -241 -18 251
2133 251 -78 -235 -1 165 205 260 -4 248 72 -186 390 214 -65 -5 215 -340 37 162 112 -54 53
2154 53 215 -155 -237 451 143 74 315 -177 -118 -64 426 211 101 -103 198 -394 -144 384 -57 -327 -393 -76
2176 -76 -133 -9 273 164 122 -292 -34 83 215 453 -64 -63 221 -24 -167 -34 209 8 -131 -280 190 57
2198 57 90 126 108 -343 -59 -13 30 27 -261 -274 -145 -184 76 38 295 -172 -99 59 28 -176 -182 -69 -22 -122 -87 128
2224 128 -103 -134 551 203 -141 114 12 65 129 179 -189 -276 -304 35 -157 -97 -96 102 -343 -314 164 140 28 -206
2248 -206 -87 -190 59 253 110 235 -1 -98 -58 -18 -157 -15 -7 -61 -53 194 -183 -119 79 -185 52 -303 57
2271 57 278 9 -132 242 -136 259 240 353 -86 -245 -87 -153 -121 26 183 -300 -403 69 -139 -113 -3 216
2293 216 68 -302 -180 120 29 34 172 70 -200 -70 232 -50 -181 176 269 -598 -413 47 100 -313 -15 136
2315 136 17 -267 115 117 -145 -133 96 -177 -275 164 208 7 -50 -236 -12 -87 -361 124 -250 -87 -106 -34 116
2338 116 249 168 177 -299 -71 398 149 67 86 106 -164 40 -141 -173 -182 -233 60 164 -196 -8 279 3 -6 -143
2362 -143 199 162 -303 47 303 -293 -281 17 77 -29 -98 16 285 -137 -103 143 -179 38 106 -42 -172 15
2384 15 257 35 -195 2 343 108 -159 71 -39 -127 -74 -83 -156 -210 180 240 -259 282 220 -171 -331 -9 269
2407 269 -131 -238 117 -94 -266 -35 201 83 -56 3 -116 -131 51 -30 -36 -197 -152 195 -373 87 67 -90
2429 -90 -126 -16 10 169 -122 156 341 -177 -132 -88 -62 -23 190 -225 -81 -126 -442 55 -23 187 -13 -328 65
2452 65 -140 239 407 422 -261 -230 -117 28 -249 -44 -23 -204 -380 6 171 -103 257 366 -19 -331 256
2473 256 343 167 72 -35 10 -239 315 294 351 58 -203 -238 -113 125 32 -81 -308 153 -147 -111 23 279 -271
2496 -271 88 -141 -22 399 318 52 -156 -121 -135 285 -80 277 63 328 80 -61 -230 102 -98 13 167
2517 167 -160 -303 32 96 182 -201 -29 26 180 131 163 -192 106 -242 -166 -301 278 -39 -147 -25 -164 -174
2539 -174 172 322 -76 -215 -3 138 -61 131 65 75 -199 -112 209 -55 336 32 -228 -124 303 -400 -211
2560 -211 118 331 27 -245 83 109 256 194 195 77 -73 138 68 29 306 249 79 -1 147 -71 -303 -22 -93
2583 -93 -294 -156 45 -62 90 114 290 -100 -22 248 139 68 -325 -35 -26 85 -87 -37 -169 -104 18 -125 116
2606 116 -175 272 205 165 60 44 223 80 -266 234 266 -466 149 222 -41 87 66 -17 -97 -143 51 242 -319
2629 -319 350 437 -41 -25 50 -151 -129 193 325 -80 101 238 -116 -470 72 167 77 27 -258 11 123 98 121
2652 121 363 -272 -134 85 187 -36 17 346 -319 -352 -8 267 -51 -60 10 -173 -80 -33 69 61 -51 213 15
2675 15 -105 -151 149 -174 87 62 7 106 -203 112 -102 -269 -358 -61 30 86 169 281 9 -101 0 403 305
2698 305 -136 36 -9 -37 -177 -2 145 -313 26 -76 -99 -274 171 260 -42 -14 -87 -190 -249 -195 107 221 -197
2721 -197 114 73 45 194 103 39 -215 -27 172 -189 -22 92 -16 -351 -52 16 210 91 -104 252 -17 -94
2743 -94 326 233 -253 -211 122 -413 -17 -20 2 181 -80 -99 -184 -366 -17 53 -150 -148 130 -80 262 -151 -57 83
2767 83 -55 89 150 -2 -135 -265 142 101 20 -6 302 -312 148 -76 -343 -25 71 64 242 -141 -379 159 105
2790 105 -197 -242 140 -429 -143 159 252 -83 22 -13 -216 -52 72 -73 -136 -195 -82 92 -117 222 -107 -67
2812 -67 217 35 -96 20 135 -10 -58 -202 36 -50 -86 78 205 -64 31 -137 -144 164 88 -189 89 -47 225
2835 225 -22 -161 -154 162 154 -178 169 -83 186 -94 -23 -184 -135 -29 -31 -107 86 77 -69 341 -54 15 -153 67
2859 67 145 -127 0 32 -214 -283 14 -38 48 10 260 -218 -18 88 -17 184 -225 97 171 27 -27 119 -121
2882 -121 -88 177 227 -17 56 -96 -48 44 -110 6 11 123 168 -54 -22 362 -46 -34 153 53 -25 22 -89 173
2906 173 72 29 19 -202 -50 194 -169 240 175 -126 -27 -116 181 -75 -141 67 133 85 -59 -60 -180 -233 -56 -109
2930 -109 -110 91 9 -268 -248 -135 176 -116 100 171 -37 162 -257 194 -7 19 21 -51 -391 -9 -115 69 -152
2953 -152 -126 -6 172 21 -119 -15 -426 190 -78 -220 -305 -26 100 286 -169 5 -147 -144 -13 -45 83 151
2975 151 -224 -48 4 -155 -265 -86 -169 -335 -81 -123 87 61 -72 14 75 -177 90 116 49 -160 -27 141 379
2998 379 -32 -37 -230 -183 -16 103 211 174 -62 95 -53 129 132 -89 85 -170 81 138 -25 37 61 -15 -149
3021 -149 -144 13 -149 122 83 30 -115 19 124 -53 -125 111 -134 -69 -7 155 -11 119 285 106 -301 -20
3043 -20 -75 94 -49 182 299 187 -13 68 17 73 128 18 89 355 -27 24 -56 -6 -47 -8 79 -54 130 4
3067 4 -150 110 -79 -60 -43 134 125 -92 237 194 192 43 3 -44 -351 186 27 -216 -15 -162 139 0 110 -89
3091 -89 131 57 -194 -191 60 -108 -205 137 -52 -53 158 -145 -51 -8 -81 153 -143 57 36 -69 -317 -28 -110 -235
3115 -235 150 64 -62 -117 -85 -78 174 94 30 -116 83 181 160 -294 -36 128 207 -99 -123 -215 -33 311 -136 -131 -118
3140 -118 -49 -87 159 -95 -197 -6 263 274 46 189 -58 -151 251 33 -66 -225 -133 -4 -207 -93 -288 -309
3162 -309 235 -23 196 8 -24 -115 284 84 175 317 -123 66 -11 18 -17 113 95 -7 150 -125 -193 83 25
3185 25 77 -3 185 4 121 27 29 -210 101 -82 -143 -17 310 -60 87 53 200 -146 67 -20 -58 -33 -62 176
3209 176 134 25 -203 124 52 -127 116 -27 -181 203 222 -69 -16 -46 -191 -142 -53 -40 -89 240 -195 -211 33
3232 33 52 -94 -56 -239 69 122 118 57 -18 319 70 -2 19 -85 -98 128 301 167 -87 19 -162 -19 -126 137
3256 137 -322 8 16 -153 8 122 72 -54 -71 -5 -76 21 -292 -224 21 12 -116 -307 -33 -61 -10 177 -117 188
3280 188 97 -198 -223 56 66 -189 -95 48 36 -144 -363 3 -37 -46 -114 269 -40 -134 157 9 -167 119 -82
3303 -82 13 56 -120 72 -27 -60 117 197 224 -119 99 101 42 -85 -27 191 -103 103 36 -29 -90 174 -152 -99 39
3328 39 250 -73 -23 -28 210 -85 -225 -193 -19 201 -121 168 219 279 -89 -305 -175 115 124 154 51 128 -248 -32
3352 -32 96 -121 2 -159 -75 65 -144 95 26 -271 -222 -29 -42 107 -76 -89 218 -112 130 -65 187 109
3374 109 -187 -110 -36 -155 -66 -108 45 -50 -155 145 -57 24 -36 66 -300 -124 57 -90 -295 -116 -74 15 132
3397 132 90 -24 -249 -124 229 10 -196 -85 -107 -6 134 -171 -64 309 121 69 172 -66 -172 -194 -104 -101
3419 -101 -264 122 138 -143 191 -236 -20 -185 -134 -141 -33 145 106 194 14 -174 -128 270 136 69 85 284 -237
3442 -237 34 -470 -87 164 214 75 -169 370 49 30 97 -80 6 187 -58 -41 29 -187 308 308 12 -5 229
3465 229 268 93 69 -63 -163 -18 -23 -169 -222 -1 -312 119 -37 160 46 -4 -48 -126 -119 -267 89 -90 -168 52
3489 52 19 -142 107 -104 -222 70 -281 -31 -52 224 315 -140 -337 -72 -187 -37 -56 -14 11 331 36 149
3511 149 -155 -53 99 -223 152 -119 -84 64 -57 -58 6 -45 136 -31 99 35 74 71 -4 329 5 89 38 -54
3535 -54 98 -70 -49 95 54 143 37 -232 -352 -84 265 -187 264 131 -91 0 96 -27 174 119 -104 107
3557 107 -5 12 -129 46 -40 -375 -5 191 -145 -166 -179 -25 -48 7 -86 -40 86 97 -119 12 -90 110 114 -268
3581 -268 119 -261 -342 21 -74 40 19 -134 29 -308 -58 -22 -7 158 56 -106 -91 4 -33 -76 63 -77 249
3604 249 95 76 110 21 163 206 -149 137 -138 15 -127 -196 -242 29 25 -351 -12 242 59 -25 7 -56 -216 -43
3628 -43 93 -63 -57 92 -84 -18 -185 -131 -32 -57 -177 32 77 102 -184 24 -204 53 144 -85 28 39 52 -63
3652 -63 169 130 90 97 -119 -35 192 19 -50 53 -75 67 -31 -243 180 344 -118 59 -168 6 -42 108 17
3675 17 31 155 -118 135 91 -173 -19 227 -195 -220 73 101 67 265 -69 -45 189 -151 -125 -11 -324 -398 -75
3698 -75 14 258 -31 -109 -20 -29 -98 395 162 135 58 45 -15 -107 64 -47 -89 95 281 -194 82 13 111 -16 -33
3723 -33 -445 -52 -60 -7 24 -21 30 254 69 -21 -130 -226 175 133 113 244 -196 -89 -103 -14 -147 190 -26 56 70
3748 70 2 135 -303 -119 -32 -39 -1 129 107 53 206 111 -101 -29 129 -14 19 74 116 -113 69 -95 58 -7 -17
3773 -17 -253 4 -43 -97 37 101 20 86 182 30 -29 -15 -110 69 -155 -61 181 71 -67 123 -137 -91 -78 -143 67
3798 67 -131 -265 72 -6 137 54 242 -173 -74 100 -38 83 -159 -44 101 64 264 16 81 79 -205 99 -95
3821 -95 -26 6 45 -195 -119 -10 -18 -296 369 -183 -231 23 71 -140 131 -33 127 170 -202 53 90 261 -53 135
3845 135 -8 -265 -99 76 -297 37 141 215 -180 -10 14 -126 299 112 270 -68 -188 14 133 148 136
3866 136 -237 50 -56 -65 -77 188 26 -82 105 77 -18 168 -69 147 -28 135 152 -70 -153 -260 -191 146 58
3889 58 -275 69 108 -162 1 138 -171 56 66 240 221 68 -288 -108 -237 63 -169 37 -101 -97 299 84
3911 84 -45 22 102 -51 40 -9 -9 13 -119 -227 -74 224 -126 -92 125 4 -20 -42 171 6 70 173 -54 -159
3935 -159 -122 147 -174 221 119 8 -127 -35 -52 -97 -232 166 180 -28 -157 -23 -72 -18 -95 14 -24 -176 243
3958 243 -8 -237 148 198 118 -26 14 49 171 70 165 271 -102 -365 266 34 -34 10 -161 -6 89 -200 168
3981 168 -12 127 -19 -4 -19 -57 112 -104 48 9 157 -246 -32 226 -53 -344 183 210 -16 -44 -46 -156 -119
4004 -119 -97 -77 61 34 -2 -144 294 -50 33 244 148 3 -108 151 61 40 -155 60 72 71 304 312 5 229
4028 229 -29 34 172 -98 -142 134 -342 -282 90 -54 -223 251 104 -129 106 -116 -40 179 127 59 -109 -20
4050 -20 -143 -109 77 176 162 -105 -29 22 -314 154 161 -108 -299 19 25 -22 6 113 43 -283 -155 12 -292 -66
4074 -66 -85 -30 -93 46 56 -9 1 174 116 -144 100 203 -108 -39 181 -116 -79 68 11 -24 57 84 -99 -76 281
4099 281 98 29 1 -68 -102 86 98 -66 -42 -26 -22 196 178 -37 172 51 64 -133 -168 25 -6 -22 21 -19 -225
4124 -225 -285 128 55 -176 137 257 -155 -51 -138 -173 209 -43 190 -101 72 -75 -53 36 -92 -94 -76 -95 2 -220
4148 -220 -80 147 -47 -57 25 233 71 22 -103 59 234 31 23 232 -30 171 71 -25 -173 106 -31 -42
4170 -42 -146 57 220 328 126 -221 101 -87 -105 134 121 -201 -90 -13 13 81 -127 -183 78 -80 58 101 226
4193 226 189 -37 3 114 -156 -176 -33 68 -195 5 173 -5 -1 -108 173 -40 -74 5 -121 108 67 -38 35
4216 35 -97 -23 -82 -80 156 -78 -53 126 -138 86 -1 181 -151 -162 104 20 17 -73 257 50 -136 -57 -55 -48 6 -3 -53
4243 -53 -83 -58 -206 102 67 -39 136 -146 143 48 -120 -50 153 -102 -151 400 -26 1 79 -28 135 104 -7
4266 -7 -153 -51 258 -127 40 -137 140 207 22 -130 -1 -165 -39 -193 101 -176 -183 -29 -25 -42 -109 -48 -95 -54
4290 -54 -176 -38 -100 0 -83 140 -43 -249 97 65 184 -86 98 -216 -169 246 9 -68 -94 130 -50 96
4312 96 32 275 1 45 16 88 -192 58 161 -118 268 1 38 -109 -113 -295 47 74 -152 10 -169 23 -180
4335 -180 -84 -141 59 -197 162 157 96 -218 304 96 17 50 -167 -86 -59 64 134 321 123 -186 14 297 -96
4358 -96 168 62 290 293 3 59 -155 -60 196 332 110 -186 -197 29 -77 -28 101 -29 180 19 53 236 12
4381 12 124 -158 -209 -85 126 -170 262 -36 74 -27 -53 -119 -28 -7 112 -56 -93 24 -28 -86 208 143 -310
4404 -310 11 245 -272 62 -298 108 -17 140 -36 -45 73 159 -175 -161 -59 -68 72 -18 114 -175 49 149
4426 149 -35 -8 56 -168 54 -46 19 -111 205 -48 -173 -106 31 43 211 178 -286 -74 69 247 246 -64 6
4449 6 246 134 -115 -75 -281 223 -6 54 159 -163 -41 -1 -15 -57 -75 -265 132 -174 -228 130 456 -15 -85
4472 -85 207 61 167 50 220 131 21 276 144 -272 -55 -28 -45 121 -163 10 8 -257 -149 -158 -163 64 224
4495 224 -13 -75 8 43 14 98 207 87 -41 -16 69 -193 -46 -91 -25 -287 -193 178 129 19 -110 27 58 136
4519 136 -65 -116 -80 269 19 41 -110 -153 5 -109 234 253 3 -74 129 -132 -208 49 135 52 -111 -86 76
4542 76 110 24 98 196 -164 -251 155 -139 -103 -18 239 -67 -108 -6 -143 98 37 -96 97 28 -266 -188 -215 159
4566 159 35 50 160 79 -66 38 55 125 16 -5 29 242 -27 28 -68 247 -73 -156 -127 -320 36 68 -189 -82
4590 -82 159 -70 -147 41 -196 382 279 165 -103 28 20 173 145 35 -177 76 -108 79 -135 -7 229 -34
4612 -34 38 -18 95 168 -28 121 -160 144 -31 -94 8 163 183 -43 29 -25 344 124 226 16 84 123 101 -296
4636 -296 -154 -23 74 -11 -195 -54 19 -46 13 -30 -136 69 32 -55 121 -2 -61 27 224 33 -171 214 -26
4659 -26 158 37 172 28 -77 -137 159 -203 -141 129 73 87 79 24 111 188 -222 103 103 192 -220 41 85 221 -84
4684 -84 -255 0 177 -215 7 31 -104 -2 -207 21 -303 38 321 378 -131 -250 80 3 5 -58 142 -61
4706 -61 -116 -82 196 100 122 102 25 13 31 60 103 -59 61 78 -105 -56 147 -137 -139 190 85 -26 184 -206 63
4731 63 34 -82 -200 -124 47 -102 -42 -100 1 107 90 88 45 27 -26 -26 65 119 -142 128 213 224 139 188 7 147
4757 147 27 3 -124 111 -22 -41 -64 120 62 62 -92 -345 -135 -28 -207 -27 -9 21 -4 75 43 226 -97 -34
4781 -34 -3 124 68 166 148 -100 116 -93 63 -61 111 77 165 -19 44 -81 105 164 3 89 130 206 63 123
4805 123 -81 40 107 135 -51 -226 -114 0 -175 -132 46 361 -4 126 -101 -287 97 263 -75 -16 -13 -107
4827 -107 102 59 34 301 61 115 -105 -54 383 -35 256 160 77 136 49 -182 -144 50 273 179 -54 -91 36 138
4851 138 53 98 -213 29 122 96 186 -176 -68 195 92 63 89 -128 118 42 201 -93 -37 -193 61 -73 -9
4874 -9 -13 149 30 -144 66 -69 -3 22 -193 123 126 79 -169 94 -45 104 -123 180 -125 5 123 -170 -20
4897 -20 -77 288 309 -88 46 118 43 -17 133 -28 49 390 274 75 -53 -259 -234 -307 -52 185 -115 212 10
4920 10 -38 -61 -234 -39 56 171 176 -32 -61 23 96 -222 178 -126 80 5 -19 121 124 29 250 -29 -117 -18 247
4945 247 -26 246 -61 96 235 26 282 -6 -1 57 18 -29 219 -344 13 -227 3 -13 -57 107 160 42 146
4968 146 -46 -208 -47 38 52 -57 74 136 218 224 100 16 -166 38 -182 98 78 2 155 -6 -35 -107 0 -33
4992 -33 7 122 -1 -218 -15 144 96 -77 71 65 -35 126 -135 -195 20 138 138 -64 -205 143 72 -8 100
5015 100 -30 -77 -19 48 28 67 -65 -69 -42 52 -106 -207 185 -31 76 47 206 7 182 57 -139 218 376
5038 376 16 103 129 53 75 -156 233 -25 -119 -2 -18 25 -44 -113 -258 -224 208 -171 329 332 -90 -99 87 -101 -14
5063 -14 -32 110 219 -361 -83 31 -64 125 -128 -366 -119 86 -132 -206 116 -181 141 124 267 -228 10 -40
5085 -40 -106 -3 117 184 -63 -413 144 -132 85 -1 157 17 -38 240 -10 -56 188 -169 93 -32 -130 51
5107 51 -77 -227 22 170 -37 96 -303 -81 -144 140 -61 106 -188 119 -113 -123 25 130 -211 -109 59
5128 59 -149 91 119 10 99 -159 174 -158 -213 49 118 15 -136 -333 25 71 98 331 -44 146 -24 -71 121
5151 121 129 27 -2 -136 95 150 -274 -22 -167 176 73 187 33 -328 -139 -32 35 -22 -89 33 41 -79 24
5174 24 -246 46 106 31 -72 -76 141 -157 199 149 314 -277 50 46 108 -101 38 -19 -211 255 -160 158 263
5197 263 176 147 -177 201 24 -238 209 131 -10 -134 124 -21 -113 -18 155 323 -59 -28 -88 -44 67 66 198
5220 198 -91 205 -59 -64 11 -157 170 -102 361 130 -73 -314 -49 -20 5 -236 -151 38 -179 -97 -141 -76 185
5243 185 -203 -114 -289 124 -186 -44 -26 116 94 -318 -49 258 -125 -234 38 134 341 -213 -35 -80 -260 142
5265 142 236 111 -63 -37 -98 30 -6 183 -37 -265 115 141 123 165 94 153 -302 -146 -60 -109 147 37 -5 124
5289 124 -49 65 115 -72 63 57 96 7 -171 151 -33 209 -61 257 -237 -133 123 134 85 115 -44 -75 417
5312 417 129 35 99 52 -177 78 -90 -39 -2 185 -10 86 352 154 -143 -141 316 146 -159 69 -44 120 -44
5335 -44 -135 97 147 153 -109 155 20 -127 75 45 -268 173 -12 200 -6 156 39 93 172 111 239 -136 -56
5358 -56 -63 148 119 73 -33 -154 147 -227 -163 155 -63 -45 -232 -79 1 -99 -11 38 -66 78 68 11 -310 178
5382 178 -162 -205 -131 -29 -79 -90 -127 -76 99 54 -157 -85 -124 -12 -59 8 202 -223 -269 -65 -116 -51 290 -8 311
5407 311 81 -5 -171 130 -109 -20 65 261 -81 -29 97 42 -37 103 -71 -3 182 -51 -202 -21 42 -101 -51
5430 -51 76 434 322 86 -148 -121 -106 -17 77 -146 199 43 21 -81 165 -119 53 96 28 360 171 171 -8
5453 -8 -271 160 -338 -35 -19 -35 -5 60 49 31 223 31 187 75 -124 53 115 -113 80 179 -20 13 28 -209
5477 -209 265 82 -122 -140 30 -31 5 -106 39 -26 -5 -67 -81 4 208 330 192 272 -95 231 22 -71 17 165
5501 165 -24 -167 127 11 -114 76 178 -145 -157 167 -84 -50 58 56 -30 22 -215 82 374 43 -40 40 -63
5524 -63 -149 -65 -122 16 128 -93 -149 49 -291 -126 94 170 -109 -271 51 -86 -14 -121 -14 -38 -90 46 37 -37
5548 -37 -260 -294 -10 103 108 -79 28 -29 20 -119 165 301 -350 -224 369 174 -29 -225 26 52 -49 68
5570 68 -161 110 346 10 -285 -3 268 -85 26 123 -352 83 -86 -233 -122 68 70 -68 -79 13 132 115
5592 115 3 4 -66 65 82 18 -230 -200 -114 -59 -8 93 54 17 -187 -63 -384 -104 23 58 184 191 156 102 46 41
5618 41 -29 -142 165 -80 -43 84 61 -254 59 36 16 -72 110 -83 -88 -57 -26 -5 -13 83 145 -12 258 22 -16 -108
5644 -108 -307 14 28 34 -251 51 10 22 -60 -198 117 -214 6 130 189 -161 148 -71 142 -56 -35 -83 -145
5667 -145 -92 -72 22 391 28 -96 39 152 -82 -203 -127 77 -111 -163 286 164 -39 24 118 61 111 70 154 -88
5691 -88 -19 -43 83 144 -21 9 149 -117 -18 145 124 -94 -22 -41 -30 -22 -38 51 -102 -132 -94 -161 -92 -38 -60 70 43
5718 43 -162 85 -33 -88 215 23 21 89 4 -38 156 -17 264 -58 -140 -70 -236 78 5 55 193 106 -122 -13
5742 -13 225 -28 26 -42 23 272 -190 -107 164 -66 304 160 202 67 -159 -247 80 -89 149 -328 151 -35
5764 -35 -230 90 109 -145 133 204 -54 94 175 -134 47 54 228 -132 132 184 166 -164 -144 -211 -197 50 15 88
5788 88 -321 -181 150 7 -110 14 -82 -104 -128 -10 -375 39 32 -21 202 -170 156 72 -62 -144 -70 19 -58 259
5812 259 -76 88 -47 -185 -23 -101 144 -2 235 72 53 56 -45 70 -24 -109 -136 140 -111 150 72 -93 174
5835 174 -129 160 83 137 -20 -28 -22 98 -72 275 18 62 89 -105 -83 -120 15 116 -273 210 -113 -32 -29 86
5859 86 -128 137 92 152 -78 -100 -6 33 -142 81 153 -217 -134 91 113 -177 239 273 -51 175 -180 -143 -10 -259
5883 -259 7 -69 -59 17 92 -144 102 -1 21 -71 94 -55 -208 95 374 -251 -252 -166 111 -172 -57 46 44 -4
5907 -4 -275 143 -74 -42 347 -62 99 -70 -75 222 -137 -27 229 -199 131 -142 -168 -91 176 -41 108 54 -117
5930 -117 -117 -59 -105 -84 425 -54 -90 -30 -29 173 118 -12 7 48 47 47 -164 272 -145 54 -102 -37 22 169 -146 -42
5956 -42 73 -101 134 -69 -266 -78 -126 206 -46 151 161 -11 -72 244 -49 106 230 -40 -55 -7 153 141
5978 141 -101 193 -125 52 24 192 26 136 24 97 50 28 163 -37 136 -150 -257 139 121 -200 147 41
6000 41 -147 82 -26 -185 111 -41 175 -68 -22 13 -16 -104 75 164 63 202 21 -20 10 219 184 -50 83
6023 83 -125 51 142 2 -149 219 293 0 -231 -92 65 -129 24 3 -233 174 87 -20 99 -15 -66 43
6045 43 1 -140 1 -69 179 69 -198 -138 -94 85 -194 209 -100 -165 104 -87 57 17 -98 -86 37 -130 -219
6068 -219 -221 -37 -205 83 -85 -47 175 -69 -66 186 120 40 14 -34 242 -13 178 70 68 -39 169 -2 156 21
6092 21 22 -18 166 -40 -35 54 53 -38 192 -29 -27 25 201 82 -197 97 74 -213 -59 -74 74 34 -238 384 137
6117 137 6 172 -112 -25 -91 153 -165 141 -131 -10 73 64 387 0 62 -28 -89 -15 -136 -46 -17 46 -92 310
6141 310 -25 -19 42 214 247 4 -87 -144 -69 40 132 -184 -302 -146 -107 22 326 -139 195 222 107 -274 -35
6164 -35 -75 70 34 294 -72 -86 181 75 -152 -78 50 58 167 61 -190 103 36 -226 -24 127 85 -44 -89
6187 -89 159 48 183 -193 270 66 23 -247 -173 193 -68 7 88 106 3 38 91 -276 222 0 101 -7 -30
6210 -30 98 10 53 13 -12 -117 -124 10 54 231 -34 -175 168 -247 -184 -22 -127 130 -150 201 249 46 -120
6233 -120 29 135 75 -199 179 -54 76 -47 -55 96 94 -10 193 169 92 72 41 -160 158 31 69 9 18 -12 163
6258 163 -11 -64 180 152 68 -189 -187 -103 -105 -131 200 -54 -29 -157 125 110 51 -75 210 104 -25 142 49 -51
6282 -51 -119 -89 -221 -187 -83 277 9 149 13 14 -30 -252 -35 187 16 -109 52 -59 -55 -69 -201 -174 -78 32
6306 32 -161 -13 -87 11 337 -24 152 111 -131 -195 199 -257 -209 -114 38 180 -78 17 -57 -41 89 93 75 -196
6330 -196 -42 313 98 159 36 -179 -158 -123 57 -111 121 117 -53 -116 118 -9 82 -10 63 -20 281 80 237
6353 237 176 282 64 254 -103 48 57 -293 -107 186 -1 -213 59 -27 39 -107 -1 -162 -48 73 18 31
6375 31 131 -30 -75 19 -203 -90 170 88 120 -157 -181 -1 83 -77 64 -31 185 60 161 5 -56 -224 77
6398 77 -214 199 163 -89 112 -202 -10 -35 67 120 85 -61 -87 -126 -114 -67 82 -137 -16 238 -109 18 -45
6421 -45 163 29 58 1 5 -43 310 28 -149 -74 -33 190 106 -122 35 -95 -289 -102 135 171 -110 211 -61
6444 -61 -169 62 27 122 43 -45 23 -168 -91 -115 15 -230 86 120 156 -295 7 93 4 -2 -32 -53 58 55 9 -114
6470 -114 139 144 -151 211 -59 53 -33 179 -30 -114 -381 18 116 -146 -64 90 83 75 -269 -10 145 -20 -26 -77
6494 -77 113 145 -16 171 -53 10 -138 87 59 -210 146 -87 111 39 -41 -44 -84 42 187 -288 26 -83 222
6517 222 -127 123 -51 -100 -12 -48 -445 18 69 204 121 -59 13 -2 -162 200 -278 54 119 -116 -291 -137 -89
6540 -89 -113 281 80 37 -53 -86 -48 12 -9 -20 -13 32 -44 -173 -186 217 1 8 -4 -266 108 149 -41 31 -63 -71 -247
6567 -247 -228 82 -74 200 90 26 8 246 242 -114 37 72 -24 135 -174 36 27 19 75 -204 225 -73 -45 64
6591 64 138 -167 -63 -8 92 70 -168 -120 -80 -9 170 154 74 -95 41 -331 135 -70 -230 -78 -7 153 -246
6614 -246 -180 -123 -186 43 190 -59 62 100 -23 -202 90 -106 -101 272 116 60 19 -160 -196 77 40 -72 -45 101
6638 101 2 -58 124 166 -137 -78 -19 73 -28 -183 -291 173 26 24 -86 -40 314 16 -132 -56 367 100 -12
6661 -12 -81 -117 59 86 9 95 96 41 -132 -83 146 -240 302 -38 53 -150 89 190 66 -172 -156 -56 79 -64
6685 -64 198 48 271 -119 -122 1 120 -76 115 30 3 -90 67 102 -44 23 66 151 35 320 -82 48 52 51 30
6710 30 -111 0 -45 180 110 -35 68 -155 107 130 -77 -120 54 -58 -83 -87 -39 -67 302 -107 -105 -3 57 73 -164
6735 -164 71 -263 -45 137 -68 89 -59 121 -22 -117 -78 -124 -194 33 64 -106 -73 79 1 -30 -67 -98 98
6758 98 14 -212 -249 -187 57 84 -23 8 86 203 -227 -10 -189 98 -87 133 -59 235 -164 -205 -153 120 146
6781 146 -196 -35 104 -100 -172 27 3 -164 15 292 80 -66 89 156 -63 18 72 -148 -177 2 151 -186
6803 -186 21 21 43 107 68 -182 -72 5 -137 -55 117 -144 65 -196 8 -14 -181 130 255 -268 -146 -40 5
6826 5 235 151 -118 -256 189 -27 145 -26 -248 44 -212 -167 -11 15 167 -17 -119 -56 -70 122 129 367 8
6849 8 -147 7 -159 -92 -106 77 -189 61 -344 -105 -17 -173 232 -206 -20 127 -95 165 -135 -28 106 -74
6871 -74 -62 -224 12 208 -18 240 -161 -25 -9 -209 403 1 21 50 -2 89 188 99 -233 111 -110 -44 236
6894 236 -77 108 127 49 -17 360 4 -109 45 -89 -28 -11 30 -25 230 46 -42 -25 -247 -39 -214 -164 -113 324
6918 324 121 -234 85 -34 12 359 133 -32 130 -60 16 0 -1 -74 206 120 122 -21 -153 23 -197 -12 -144
6941 -144 -211 -67 59 -216 -145 -124 85 -90 -11 -70 104 103 155 125 -72 241 57 -25 151 -179 -57 52 332
6964 332 15 -82 -104 56 81 89 -62 264 59 177 -6 -120 -63 -40 390 42 170 -135 164 74 -78 -22 -44
6987 -44 -63 15 0 -261 27 -55 124 -327 9 -52 -148 -104 -137 144 -241 -111 -64 -115 69 -87 156 343 -71 111
7011 111 34 -419 183 -37 140 153 23 165 157 237 183 -67 -16 -173 68 -146 -66 91 -170 45 -57 144 51
7034 51 -57 -36 137 8 -179 203 -11 49 -115 -18 -40 -16 -44 -81 58 104 -27 -160 -196 62 -67 -148 51 47
7058 47 -83 -156 -14 207 -80 -44 192 -126 195 -58 -100 -172 150 35 117 -178 27 143 121 61 -96 101 -52
7081 -52 -221 -32 123 2 201 -73 232 114 191 76 10 -100 -39 -11 70 30 283 -168 83 -86 148 27
7103 27 -21 -67 73 -184 -78 217 -11 -4 -257 -38 -56 -276 36 -130 -56 209 44 -141 81 -25 -13 -205 -243
7126 -243 227 -192 -2 57 212 -59 -232 -28 -228 -184 -120 -120 209 10 84 129 -157 -254 -32 -320 -63 -122 -28
7149 -28 -103 51 -221 188 309 232 -2 5 -79 1 206 33 92 180 -103 -311 83 249 -3 124 114 0 -303
7172 -303 131 98 -120 -234 36 237 17 72 49 -85 30 -259 47 -74 66 91 -65 -220 -184 291 106 197
7194 197 47 -4 -221 16 28 -291 38 -68 226 2 -86 109 -185 -15 -30 7 -69 -104 -81 -28 -147 -52 -30 -123
7218 -123 -209 141 229 -34 -88 98 -23 -40 67 30 -105 -112 134 -150 97 34 109 141 -30 83 -7 15 5 -32 55
7243 55 -240 -109 -28 -148 -270 -37 22 164 -169 -55 -58 -161 130 -100 192 -164 -95 -57 -359 253 64 -352
7265 -352 21 -66 -299 146 -468 102 -11 -234 127 68 -105 86 66 -54 42 48 -111 -126 273 2 -82 6 147
7288 147 44 -22 -290 76 30 -63 -69 42 98 78 -16 -109 61 78 27 -15 255 -135 -21 -16 30 80 -151 174 -22
7313 -22 362 -12 -197 147 -81 109 -16 181 56 -49 -236 -103 185 -113 97 209 -163 210 203 47 184
7334 184 -47 -80 -7 -202 84 137 170 51 98 118 -291 354 -269 200 -111 -50 131 -11 28 -127 232 44 -88
7357 -88 -2 -22 7 -18 43 18 316 -101 5 187 -149 19 225 -110 -24 -162 92 -100 188 223 114 31 -76
7380 -76 249 29 -139 -316 98 -50 -25 36 27 31 82 169 -8 -38 142 34 -49 244 -75 175 35 109 298 -18
7404 -18 143 -3 -150 32 -16 -212 182 160 170 67 90 -9 -91 152 -203 -54 -30 -288 140 -158 109 -163 67
7427 67 -4 125 -145 -88 32 -179 -30 -167 7 177 234 314 31 65 -115 250 15 -160 236 92 14 0 83
7450 83 207 252 31 -102 -297 -273 214 -13 -149 -63 110 192 -3 -296 64 -120 -119 -200 77 -93 43 -114 67
7473 67 109 83 -187 -8 -27 406 97 207 -20 -4 -176 -305 -113 -244 -3 -73 -161 16 142 40 217 198 160
7496 160 10 -23 -111 70 155 250 -205 -478 136 -114 -68 -41 -143 206 281 -253 74 172 -26 -222 -75 -140 304
7519 304 -54 -239 -79 14 -54 -203 68 3 29 -112 8 -90 -49 -18 -74 361 113 -209 82 -281 27 69 175
7542 175 279 138 -231 -301 45 364 113 -118 -147 78 124 -183 133 70 -39 53 91 -161 -95 -17 31 188 151
7565 151 105 -87 238 -83 66 -61 121 -163 -366 -17 -267 -206 247 83 141 -89 164 -312 -134 200 55
7586 55 146 -163 94 183 6 181 -225 -338 -122 -45 28 270 192 101 107 103 212 -35 -215 102 13 -164 -179 1
7610 1 -36 -112 -154 -54 -12 21 -171 185 -133 -5 110 -341 -17 34 33 111 154 -99 -132 -20 15 23 -207 -238 218 88
7636 88 141 -121 9 90 -140 112 -74 -214 125 87 57 285 153 99 -137 308 199 -35 -192 -31 -64 153
7658 153 121 30 -70 -254 -85 -181 92 -165 -140 -147 -20 -99 176 21 301 216 -99 -37 17 169 59 -4 -97 143
7682 143 7 25 42 -79 -132 125 364 186 234 -54 105 -166 -120 -115 48 100 -6 -74 -152 260 4 -221 -35
7705 -35 -110 4 -96 217 66 -174 13 -6 3 -7 11 -181 -255 -33 -262 -9 33 -23 208 93 -118 89 199
7728 199 -200 174 -121 293 -44 -21 40 78 47 -46 36 1 230 37 119 120 -83 66 56 -180 -89 -23 102 30 28
7753 28 -284 104 152 -127 -113 110 53 -188 73 -40 -108 -55 -269 17 224 69 116 -154 136 -82 143 -82
7775 -82 -69 53 205 -24 -168 83 -110 249 247 -20 260 -30 23 -64 101 103 157 96 -47 -90 -139 -150 103 134 38
7800 38 -87 150 -57 -1 101 -118 -236 97 172 -176 125 187 14 97 -31 -20 2 33 141 -344 176 129 44
7823 44 -46 -173 87 -164 -83 346 -14 122 -71 -13 267 110 318 53 89 -127 -2 134 301 146 -34 12
7845 12 -87 -18 42 -12 61 114 -112 6 -17 276 164 -16 -144 -147 94 199 54 116 -5 -242 -93 81 77 -198
7869 -198 -172 73 -132 65 -10 86 271 127 197 169 106 207 -196 -208 -47 -17 439 117 -69 205 104 -170 316
7892 316 303 -96 172 177 274 -84 8 69 -142 -162 -197 11 -233 -208 76 -288 -106 70 -47 -199 74 127 -250
7915 -250 88 69 62 -162 -149 44 93 144 -111 -76 13 -183 -204 -52 35 72 -145 94 -28 47 117 104 -151 -300 -321
7940 -321 6 -142 8 233 74 15 -94 -1 70 -164 34 -21 31 -174 65 333 -84 110 101 91 51 28 81 -76
7964 -76 -114 -170 70 23 200 86 364 108 209 -307 -240 -68 -113 171 104 246 114 25 133 97 -86 191 221
7987 221 233 -163 -68 181 91 -80 92 20 110 23 70 68 -39 31 -89 -178 -140 145 -134 -174 -232 6 -51 -52 132 89
8013 89 -46 -99 -285 57 114 84 -96 -89 -209 -125 -95 50 54 81 -63 48 -202 122 -35 -129 178 -86 -108 -69 32
8038 32 -70 66 -149 91 45 -2 113 -141 205 -104 14 -12 -29 70 -26 114 -80 124 135 -218 97 -82 -95
8061 -95 141 -169 196 366 148 -66 -70 49 202 326 -8 -3 196 36 -260 -168 63 -99 -278 95 -70 -11
8083 -11 73 240 100 -136 287 243 4 68 184 32 9 148 259 24 -80 13 48 -73 -73 54 -66 116 98
8106 98 -25 18 118 156 -98 171 -47 -198 262 148 100 128 220 -259 156 181 -265 168 221 29 8 288 -255
8129 -255 12 -14 79 105 -438 -33 228 -85 38 -80 14 -68 5 260 -243 97 -25 46 -106 116 193 76 -59
8152 -59 -231 177 77 -41 118 99 76 84 -117 -241 -122 118 57 46 -135 -189 95 -37 -6 83 -179 79 -194
8175 -194 57 -60 -121 -76 -28 258 -80 -51 83 -52 139 33 8 170 -146 17
8191A7
##END NTUPLES=NMR FID
##END=
