##TITLE=1H_Pr Pim_Cl
 CDCl3, 8 sc, 
 28.06.2021
##JCAMPDX= 6.0         $$ Bruker NMR JCAMP-DX V2.0
##DATA TYPE= NMR FID
##DATA CLASS= NTUPLES
##ORIGIN= UXNMR, Bruker Analytische Messtechnik GmbH
##OWNER= root
$$ XWIN-NMR		Version 3.5
$$ Mon Jun 28 10:39:24 2021 Russian Standard Time (UT+4h)  she@DPX200
##.OBSERVE FREQUENCY= 200.131506
##.OBSERVE NUCLEUS= ^1H
##.DELAY= (6, 6)
##.ACQUISITION MODE= SIMULTANEOUS
##.ACQUISITION SCHEME= undefined
##.AVERAGES= 8
##.DIGITISER RES= 18
##SPECTROMETER/DATA SYSTEM= spect
##.PULSE SEQUENCE= zg30
##.SOLVENT NAME= CDCl3
##.SHIFT REFERENCE= (INTERNAL, CDCl3, 0, 15.7039)
##AUDIT TRAIL= $$ (NUMBER, WHEN, WHO, WHERE, WHAT)
$$ ##TITLE= Audit trail, XWIN-NMR		Version 3.5
$$ ##JCAMPDX= 5.01
$$ ##ORIGIN= Bruker BioSpin GmbH
$$ ##OWNER= she
$$ F:/spectra/data/she/nmr/H-F/1/audita.txt
$$ ##AUDIT TRAIL=  $$ (NUMBER, WHEN, WHO, WHERE, WHAT)
(   1,<2021-06-28 10:37:45.89 +0400>,<she>,<DPX200>,
      <created by zg, POWCHK disabled, PULCHK disabled
       configuration hash MD5:
       00 E9 B6 7A A2 85 ED C7 34 08 36 98 17 FE 4E 26
       data hash MD5: 16K
       D9 51 1E 85 9E 60 02 64 64 AD AD 85 39 54 4F 50>)
$$ ##END=
$$ 
$$ hash MD5
$$ B6 0A 0E 26 26 CD A3 97 C3 46 05 45 4A DA 75 52
##$RELAX= 
##$RELAX= 
##$RELAX= 
##$RELAX= 
##$RELAX= 
##$RELAX= 
$$ Bruker specific parameters
$$ --------------------------
##$DU= <F:/spectra>
##$EXPNO= 1
##$NAME= <H-F>
##$PROCNO= 1
##$TYPE= <nmr>
##$USER= <she>
##$AMP= (0..31)
100 100 100 100 100 100 100 100 100 100 100 100 100 100 100 100 100 100 
100 100 100 100 100 100 100 100 100 100 100 100 100 100 
##$AQSEQ= 0
##$AQ_mod= 1
##$AUNM= <au_zg>
##$AUTOPOS= <>
##$BF1= 200.13
##$BF2= 200.13
##$BF3= 200.13
##$BF4= 200.13
##$BF5= 200.13
##$BF6= 200.13
##$BF7= 200.13
##$BF8= 200.13
##$BYTORDA= 1
##$CFDGTYP= 0
##$CFRGTYP= 5
##$CHEMSTR= <none>
##$CNST= (0..31)
1 1 145 1 1 1 1 1 1 1 1 1 1 1 1 1 1 1 1 1 1 1 1 1 1 1 1 1 1 1 1 1 
##$CPDPRG= <>
##$CPDPRG1= <>
##$CPDPRG2= <>
##$CPDPRG3= <>
##$CPDPRG4= <mlev>
##$CPDPRG5= <mlev>
##$CPDPRG6= <mlev>
##$CPDPRG7= <mlev>
##$CPDPRG8= <mlev>
##$CPDPRGB= <>
##$CPDPRGT= <>
##$D= (0..31)
0 1.2 0 0 0 0 0 0 0 0.06 0 0.03 0 0 0 0 0.0002 0 0 0 0 0 0 0 0 0 0 0 0 
0 0 0 
##$DATE= 1624862265
##$DBL= (0..7)
120 120 120 120 120 120 120 120 
##$DBP= (0..7)
150 150 150 150 150 150 150 150 
##$DBP07= 0
##$DBPNAM0= <>
##$DBPNAM1= <>
##$DBPNAM2= <>
##$DBPNAM3= <>
##$DBPNAM4= <>
##$DBPNAM5= <>
##$DBPNAM6= <>
##$DBPNAM7= <>
##$DBPOAL= (0..7)
0.5 0.5 0.5 0.5 0.5 0.5 0.5 0.5 
##$DBPOFFS= (0..7)
0 0 0 0 0 0 0 0 
##$DE= 6
##$DECBNUC= <off>
##$DECIM= 32
##$DECNUC= <off>
##$DECSTAT= 4
##$DIGMOD= 1
##$DIGTYP= 9
##$DL= (0..7)
0 120 120 120 120 120 120 120 
##$DP= (0..7)
150 150 150 150 150 150 150 150 
##$DP07= 0
##$DPNAME0= <>
##$DPNAME1= <>
##$DPNAME2= <>
##$DPNAME3= <>
##$DPNAME4= <>
##$DPNAME5= <>
##$DPNAME6= <>
##$DPNAME7= <>
##$DPOAL= (0..7)
0.5 0.5 0.5 0.5 0.5 0.5 0.5 0.5 
##$DPOFFS= (0..7)
0 0 0 0 0 0 0 0 
##$DQDMODE= 0
##$DR= 18
##$DS= 0
##$DSLIST= <SSSSSSSSSSSSSSS>
$$ [...]
##$SUBNAM2= <"">
##$SUBNAM3= <"">
##$SUBNAM4= <"">
##$SUBNAM5= <"">
##$SUBNAM6= <"">
##$SUBNAM7= <"">
##$SUBNAM8= <"">
##$SUBNAM9= <"">
##$SW= 20.0188882624521
##$SWIBOX= (0..15)
0 0 2 0 0 0 0 0 0 0 0 0 0 0 0 0 
##$SW_h= 4006.41025641026
##$TD= 16384
##$TD0= 1
##$TE= 0
##$TE2= 300
##$TE3= 300
##$TEG= 300
##$TL= (0..7)
0 120 120 120 120 120 120 120 
##$TP= (0..7)
150 150 150 150 150 150 150 150 
##$TP07= 0
##$TPNAME0= <>
##$TPNAME1= <>
##$TPNAME2= <>
##$TPNAME3= <>
##$TPNAME4= <>
##$TPNAME5= <>
##$TPNAME6= <>
##$TPNAME7= <>
##$TPOAL= (0..7)
0.5 0.5 0.5 0.5 0.5 0.5 0.5 0.5 
##$TPOFFS= (0..7)
0 0 0 0 0 0 0 0 
##$TUNHIN= 0
##$TUNHOUT= 0
##$TUNXOUT= 0
##$USERA1= <user>
##$USERA2= <user>
##$USERA3= <user>
##$USERA4= <user>
##$USERA5= <user>
##$V9= 5
##$VALIST= <valist>
##$VCLIST= <CCCCCCCCCCCCCCC>
##$VD= 0
##$VDLIST= <DDDDDDDDDDDDDDD>
##$VPLIST= <PPPPPPPPPPPPPPP>
##$VTLIST= <TTTTTTTTTTTTTTT>
##$WBST= 1024
##$WBSW= 4
##$XGAIN= (0..3)
0 0 0 0 
##$XL= 0
##$YL= 0
##$YMAX_a= 448043
##$YMIN_a= -460446
##$ZGOPTNS= <>
##$ZL1= 120
##$ZL2= 120
##$ZL3= 120
##$ZL4= 120
##$ABSF1= 10
##$ABSF2= 0
##$ABSG= 5
##$ABSL= 3
##$ALPHA= 0
##$AQORDER= 0
##$ASSFAC= 0
##$ASSFACI= 0
##$ASSFACX= 0
##$ASSWID= 0
##$AUNMP= <proc_1d>
##$AZFE= 0.1
##$AZFW= 0.1
##$BCFW= 1
##$BC_mod= 2
##$BYTORDP= 1
##$COROFFS= 0
##$CY= 11.3945322036743
##$DATMOD= 1
##$DC= 2
##$DFILT= <>
##$DTYPP= 0
##$F1P= 15.9154993809931
##$F2P= -4.1035820241983
##$FCOR= 0.5
##$FTSIZE= 0
##$FT_mod= 4
##$GAMMA= 1
##$GB= 0.15
##$INTBC= 1
##$INTSCL= 1
##$ISEN= 128
##$LB= 0.24
##$LEV0= 0
##$LPBIN= 0
##$MAXI= 10000
##$MC2= 0
##$MEAN= 0
##$ME_mod= 0
##$MI= 1.114404
##$NCOEF= 0
##$NC_proc= 0
##$NLEV= 6
##$NOISF1= 3.799351
##$NOISF2= 2.8
##$NSP= 1
##$NTH_PI= 0
##$NZP= 0
##$OFFSET= 15.70392
##$PC= 1
##$PHC0= -11570.92
##$PHC1= 10.00101
##$PH_mod= 1
##$PKNL= yes
##$PPARMOD= 0
##$PSCAL= 0
##$PSIGN= 0
##$REVERSE= no
##$SF= 200.130013532006
##$SI= 16384
##$SIGF1= 3
##$SIGF2= 2
##$SINO= 400
##$SIOLD= 16384
##$SREGLST= <1H.CDCl3>
##$SSB= 0
##$STSI= 0
##$STSR= 0
##$SW_p= 3612.71676300578
##$SYMM= 0
##$S_DEV= 0
##$TDeff= 0
##$TDoff= 0
##$TI= <>
##$TILT= no
##$TM1= 0
##$TM2= 0
##$TOPLEV= 0
##$USERP1= <user>
##$USERP2= <user>
##$USERP3= <user>
##$USERP4= <user>
##$USERP5= <user>
##$WDW= 1
##$XDIM= 8192
##$YMAX_p= 0
##$YMIN_p= 0
$$ End of Bruker specific parameters
$$ ---------------------------------
##NTUPLES= NMR FID
##VAR_NAME=  TIME,          FID/REAL,        FID/IMAG
##SYMBOL=    X,             R,               I
##VAR_TYPE=  INDEPENDENT,   DEPENDENT,       DEPENDENT
##VAR_FORM=  AFFN,          ASDF,            ASDF
##VAR_DIM=   8192,          8192,            8192
##UNITS=     SECONDS,       ARBITRARY UNITS, ARBITRARY UNITS
##FACTOR=    0.0002496,     1,               1
##FIRST=     0,             0,               0
##LAST=      2.0444736,     0,               0
##MIN=       0,             -460446,         0
##MAX=       2.0444736,     448043,          0
$$ Real data points
##PAGE= N=1
##DATA TABLE= (X++(R..R)), XYDATA
0@%%%%%%%%%%qJ6j6J9k7L2m0N6p0P9r0J13j37J61j90K23k62L02l50M04m62N29
$$ 0 0 0 0 0 0 0 0 0 0 0 -8 8 -8 11 -16 16 -24 32 -38 41 -49 64 -73 88 -102 121 -141 161 -189 215 -247 282
32B82o03O86p77Q74r86J111j241J386j548J723j913K121k350K599k869L165l491
$$ 282 -321 365 -412 462 -524 587 -654 732 -816 907 -1006 1115 -1235 1364 -1505 1660 -1831
49a831L849m240M670n145N670o257O916p659Q502r474J0608j1943J3547j5520
$$ -1831 2018 -2222 2448 -2697 2973 -3284 3632 -4027 4475 -4999 5609 -6334 7213 -8307
63h307J8015k1281K5767l2359M3092o4321J75692m87180j2444Q05468k96171m44414
$$ -8307 9708 -11573 14194 -18165 24927 -39394 136298 -350882 -363326 442142 145971 -298443
75b98443K80378J63243k45881J88451L0803l96818J92651N12157m38186m48801
$$ -298443 -18065 145178 -100703 87748 118551 -278267 -85616 426541 -11645 -460446
85d60446N42951L36319n44817j93681M25402R5074k62053j9466M9472J3598J32496
$$ -460446 82505 418824 -125993 -319674 105728 200802 -61251 -80717 -31245 -17647 114849
96A14849m0757k63537P3928L26956o6888l70534M6194L92522k3759l88022O834
$$ 114849 74092 -189445 -115517 211439 144551 -225983 -179789 212733 188974 -199048 -192214
107a92214L48445J2647k87307j5603J88186J2963m1408l5357j29894J11432K69240
$$ -192214 156231 168878 -118429 -134032 54154 67117 25709 -9648 -139542 -28110 241130
118B41130k16974l43178L18448L47641l90655k80591M09675J51308l37091m403
$$ 241130 24156 -319022 -574 347067 -43588 -324179 85496 236804 -100287 -104690
128a04690J68389r3118N0586J13258k55831o6906M09632k4210m84779J38532M56838
$$ -104690 63699 -29419 21167 134425 -121406 -188312 221320 197110 -287669 -149137 307701
139C07701k26953l32163K39370J65570j66218j6064M3263r2499R7569J52195k31967
$$ 307701 80748 -251415 -12045 153525 -12693 -28757 14506 -77993 19576 171771 -60196
150f0196j54412L26330J07937l47950n2566K99971K3754k18869k1700J28198L1821
$$ -60196 -214608 111722 219659 -128291 -180857 119114 142868 -76001 -97701 30497 62318
161F2318l2756n7591n2572R3276J07703j18519j36168J15046J58254r7622j79277
$$ 62318 29562 -28029 -80601 12675 120378 1859 -134309 -19263 138991 41369 -137908
172a37908Q2788J81122o6539j61391L7383J32408o082r5902k1084M2260N5372
$$ -137908 -55120 126002 59463 -101928 -64545 67863 61781 -34121 -55205 -12945 42427
183D2427J7696j07077n8160J56412P0019j81588o7946J81328N9443j62833l9640
$$ 42427 60123 -46954 -105114 51298 121317 -60271 -128217 53111 112554 -50279 -89919
194h9919J17617J9107m4157j9913l2781M4337Q7711p1949j17652R0484J31789
$$ -89919 27698 46805 2648 -17265 -50046 -5709 82002 10053 -107599 -17115 114674
205A14674j03101j24017J04853R2538p9217n5937L0264L5592J9910k6574n7327
$$ 114674 11573 -112444 -7591 84947 5730 -50207 -19943 15649 35559 8985 -48342
216d8342J7665Q9325j2694j11998J8454J12816k1220r1903Q962O8384J1654m9503
$$ -48342 -30677 58648 45954 -66044 -47590 65226 44006 -47897 -38935 29449 41103 -8400
228h400k5970K7558L8155o93n5318j6558O8738K1563o5717k8941N4678M0776m6399
$$ -8400 -34370 -6812 31343 30650 -24668 -41226 27512 49075 -16642 -45583 9095 49871 3472
241C472m5639L6570M1256j7342l8940n413M2474J7265l9576k4523K7517L6424
$$ 3472 -42167 -5597 35659 18317 -20623 -26036 16438 33703 -5873 -30396 -2879 33545
253C3545j8535m7491J6114M5250r386l7474n837L4350J6229l2754j7851K1436
$$ 33545 15010 -32481 -16367 28883 19497 -17977 -23814 10536 26765 -5989 -23840 -2404
265b404K0816p578k9929J655L2763l0k5811q605J9705J8396j9608j9695J5669
$$ -2404 18412 10834 -19095 -17440 15323 15293 -10518 -19123 582 18978 -630 -20325 -4656
278d656J5712l337j9274m729K3859L966j9217n475J0921J3260q971j6934R802
$$ -4656 11056 7719 -11555 -16284 7575 11541 -7676 -13151 -2230 11030 2059 -14875 -5073
291e073J2188k924r288o552J4065P434j4477l874P427O670j758j1848L559J0318
$$ -5073 7115 4191 -5097 -11649 2416 9850 -4627 -8501 -1074 5596 3838 -8010 -4451 5867
305E867k904m332l989N698P736r359l326O893K92M61l947j214O114j611p45j876
$$ 5867 2963 -1369 -5358 340 8076 -1283 -4609 2284 2576 3037 -910 -2124 3990 2379 1634 -242
321b42j272P613l570n742O584n72j953J013j285K787k352j38L925o039K173L681
$$ -242 -1514 6099 2529 -3213 3371 2799 846 1859 574 3361 1009 871 4796 -1243 930 4611
337D611n579K367Q23k151K421k541R77L81l033M819k066l946N164j824r06P58
$$ 4611 -968 1399 2222 71 2492 -49 928 1309 -1724 3095 1029 -2917 2247 423 -483 275
353B75k393L728j255l390L853j916O63P96m018L777M1l295K515j415R20J485m285
$$ 275 -2118 1610 355 -3035 818 -1098 -435 361 -3657 120 161 -3134 -619 -2034 -1114 371 -3914
370c914K902J068k442J565k638K337K426o084K823K911k100Ol070L769L266o470
$$ -3914 -1012 56 -2386 -821 -3459 -1122 1304 -4780 -1957 954 -1146 -1140 -4210 -441 2825 -3645
386c645J137K497q2J946n615O33P033k899l321j310M170O091q980l124Q081J217
$$ -3645 -2508 -11 -93 1853 -3762 -3129 3904 1005 -2316 -3626 544 6635 -2345 -5469 2612 3829
402C829j646n642O2J0148j812q190l86N631P643q927r737J1820O600p034p267
$$ 3829 2183 -3459 -3397 6751 4939 -3251 -3637 1994 9637 710 -9027 2793 9393 2359 -4908
417d908J016J2463q9j2776j651Q261R879q613j7231J2161J7506j1299j5676M351
$$ -4908 -3892 8571 8482 -4294 -5945 2316 12195 3582 -13649 -1488 16018 4719 -10957 -6606
431f606J7667k87j8697j260J2547P461n991j9004N292K5683n945k5931L14K6975
$$ -6606 11061 10774 -7923 -9183 3364 10825 4834 -14170 -8878 16805 10860 -15071 -14757 12218
445A2218N051k9100n670K3899O326j2275j4013K730K2769J845k5615q645K5502
$$ 12218 17269 -11831 -17501 6398 12724 449 -13564 -10834 11935 13780 -11835 -20480 5022
458E022J8954k8719k4272K9596K3227k1785k4382J0477K8809k881k8937l857K2200
$$ 5022 23976 -4743 -29015 581 23808 2023 -22359 -11882 16927 14046 -14891 -18748 3452
471C452J6910j6628l0828J5049L8013r088m2621k84M9545N714n2543m880M4450
$$ 3452 20362 3734 -27094 -12045 25968 16880 -25741 -26025 23520 29234 -23309 -28189 16261
484A6261O968k8420j4387J2735K2138M316k7854k5306L9173M2563n4625m5441
$$ 16261 23229 -5191 -19578 -6843 15295 19611 -8243 -33549 5624 48187 -6438 -51879
496e1879O2262L9364n6783l0967M2620K2136k2980j0019p148L101M3859q880p2826
$$ -51879 10383 49747 -7036 -38003 4617 26753 3773 -6246 -13394 -10293 33566 24686 -48140
509d8140K2637Q5111l3095q4761L7555P4793l7320n2868K6622K2970r54J454l2647
$$ -48140 -25503 59608 26513 -58248 -20693 54100 16780 -36088 -9466 13504 12550 14004 -18643
522a8643j3446O0356J8295p8850k1365R0117J8720r0460j2570P4032J1559m8438
$$ -18643 -32089 28267 46562 -32288 -53653 36464 55184 -35276 -47846 26186 37745 -10693
534a0693j9253K3613K7190m16l1624k5333L5405N0385m2109o6903M4609P5750
$$ -10693 -29946 -6333 20857 20441 -11183 -36516 -1111 49274 7165 -59738 -15129 60621
546F0621m0856q2038L7024Q0335l3684o4591K3282L7753k72j1754k8702j0590
$$ 60621 19765 -62273 -25249 55086 21402 -43189 -19907 17846 17574 5820 -22882 -33472
558c3472N8496K9594q9538l8035J16358L0738j26054j2476J10982k159p6662P289
$$ -33472 25024 54618 -34920 -72955 43403 74141 -51913 -64389 46593 44434 -32228 -24939
570b4939L3296m391J7299j1169o4519M0384R4990p3386j00278R4957Q7359r7103
$$ -24939 8357 3966 21265 10096 -54423 -14039 80951 7565 -92713 2244 89603 -7500
582g500o5561Q3133L9106n2968j2288P026k568M2776K036q1649O071J04076j1866
$$ -7500 -73061 10072 49178 -3790 -16078 -9052 -11620 31156 33192 -48457 -42386 61690 49824
595D9824j14096J6755J10806j9325r2030J3626O3102L108l5076k3149J0233L8774
$$ 49824 -64272 -47517 63289 43964 -48066 -34440 28662 31770 -3306 -26455 -16222 22552
607B2552J6525n4237m2074P1045N7861q2358o4215Q2706O5719p5789o1949O3196
$$ 22552 39077 -15160 -57234 13811 71672 -10686 -74901 7805 73524 -2265 -64214 -1018
619a018M8329m0634k9246M400J5531L5555j0420p0270R879R6451j2655j13537
$$ -1018 47311 6677 -22569 -18169 -2638 32917 22497 -47773 -37894 58557 45902 -67635
631f7635K1323J12351l0391r0133K7544N6534j1211k2474j2540q132L8741L4477
$$ -67635 -46312 66039 35648 -54485 -26941 29593 18382 -4092 -16632 -24764 13977 48454
643D8454o8554m7951R2921M6170j01145l6850R0595L0419o9539k5711M1440K2550
$$ 48454 -20100 -68051 24870 71040 -30105 -66955 23640 54059 -15480 -41191 249 22799
655B2799o590k4716k8084L4138N3120m2722o6841M4727P3909m0848p5241L5423
$$ 22799 16209 -8507 -36591 -2453 50667 7945 -58896 -14169 59740 18892 -56349 -20926
667b0926O7265k3628n2800M713L8068J7332k5910l4817J2264M9941L093o4708
$$ -20926 46339 22711 -30089 -25376 12692 30024 4114 -30703 -18439 31502 34595 -30113
679c0113j2592P3043J6857p0157k1456N9917K7144m5908l0392K7778L0951l572
$$ -30113 -42705 30338 47195 -22962 -44418 15499 42643 -3265 -33657 -5879 25072 21500
691B1500l4482k0551M1555L5767m3922m5959M1337N2377l6141n3935K8817M6933
$$ 21500 -12982 -33533 8022 43789 -133 -46092 -4755 47622 11481 -42454 -13637 33296
703C3296j4417l7978n586L1704K2806k6194l5618J8603M5173r883n3263M937N2719
$$ 33296 18879 -19099 -24685 7019 29825 3631 -31987 -13384 31789 21906 -31357 -26420 26299
716B6299N81m3992j1678L4664K2553k6069l0113J5324L4829k136m0509p822M2664
$$ 26299 26880 -17112 -28790 5874 28427 2358 -27755 -12431 22398 20262 -20247 -28069 14595
729A4595J3752l7735k0110K7992K8867k0103l3667J1365L4557N91l5338j2110
$$ 14595 28347 -9388 -29498 -1506 27361 7258 -26409 -15044 19513 20104 -15234 -27344
741b7344L6543J8094l2524k1443K3365K6768j3664l1147O056L0192L784k7099
$$ -27344 9199 27293 -5231 -26674 -3309 23459 9795 -21352 -15296 14896 18680 -8419
753h419j5054K6212K2665k4735k3760J7405K5523p754k8175J463K7261M445k2148
$$ -8419 -23473 2739 25404 669 -23091 -5686 19837 12083 -16092 -14629 12632 17077 -5071
766e071j2023J6933J9360j3819k1601Q078K1670R62k3590q267K5426J1484k2734
$$ -5071 -17094 -161 19199 5380 -16221 -8143 13527 14489 -9101 -17368 8058 19542 -3192
779c192j4211J7793J7315j3496j7470Q722J3707M69j1072j1988J2955J8103j4086
$$ -3192 -17403 390 17705 4209 -13261 -4539 9168 9637 -1435 -13423 -468 17635 3549
792C549k0877J2551K2866j1721k2283J1545J5296p098o684k827J794J2460j306
$$ 3549 -17328 -4777 18089 6368 -15915 -4370 10926 3828 -2856 -5683 -3889 8571 7265
805G265j7954J67K1480j31k4066L678K0657o244j1681L430K158L917J934r177
$$ 7265 -10689 -10522 10958 10827 -13239 -9561 11096 4852 -6829 -3399 -1241 2676 4610 -4567
819d567m616J2564O712j6288n192J7304O44j2219J284M107J888J476o053l661
$$ -4567 -9183 3381 10093 -6195 -11387 5917 6561 -5658 -4374 -267 1621 3097 -2956 -6617
833f617Q292N451r896n927J1762K836j0058J749L057q09L644l357n701O226O025
$$ -6617 1675 7126 -2770 -8697 3065 5901 -4157 -2408 649 -160 3484 127 -5574 652 6677
848F677p364n965R374L247r515K386M618n075K772K426o776J554P302l728o978
$$ 6677 -687 -6652 2722 5969 -3546 -1160 3458 -1617 1155 3581 -3195 -1641 5661 1933 -5045
863e045N974N642q689m46P611n387j570O404m359l085O174k35n952J994N703n111
$$ -5045 929 6571 -2118 -2564 5047 -340 -1910 4494 135 -2950 3224 2989 -2963 -969 4734 -377
879c77k793P419l560m686P379j420n592M416K355n131K10M561k672l653O212j096
$$ -377 -3170 4249 689 -3997 3382 1962 -3630 786 3141 -1990 -1780 2781 109 -3544 2668 1572
895A572o786O166K699p607K241M511l866j401L557o03l968L745K585p406K606
$$ 1572 -5214 952 3651 -3956 -1715 2796 -1070 -2471 1086 483 -3485 260 2845 -4561 -1955
910a955O198o714j651O415j668l683K404J690l044O06L749m468j006O502l602
$$ -1955 4243 -2471 -4122 2293 625 -3058 -654 1036 -2008 -1402 2347 -2121 -3127 3375 -227
925b27m121N609M51l595O10K499p63k040K399k71k597L862l62m302L671J619k929
$$ -227 -4348 1261 1712 -1883 -1273 1226 463 -1577 822 551 -2046 1816 1454 -2848 823 2442 -487
942d87m63J921Q33k524K23K712k156L38J530k919J410K121k779l73J933O91j433
$$ -487 -950 971 1804 -720 -497 2215 59 397 1927 -992 418 2539 -240 -613 1320 2011 578
959E78k087L346J066l413M26L29J294L31l190Q46K204n1j284k446K151L445l772
$$ 578 -1509 1837 2903 -510 -84 245 1539 1870 -1320 -474 1730 1679 395 -2051 100 3545 -227
976b27k467K737K356r91m249J332L846j342j765k150J704N131l705n301L908M819
$$ -227 -2694 43 2399 1408 -2841 -1509 2337 995 -770 -2920 -1216 3915 210 -5091 -1183 3636
992C636k425n329P84O433j449l876j007J283N654j693q373K774Q979k443q520
$$ 3636 1211 -4118 -3334 3099 1650 -2226 -3233 -1950 3704 2011 -6362 -3588 5391 2948 -5572
1007e572M08R429m98p455P3K679M321k30q472m13J0969O66j0820l092J2376L575
$$ -5572 -5164 4265 3767 -3688 -3615 -936 3385 3155 -5317 -5730 5239 5905 -4915 -8007 4369 7944
1023G944j1526l072P957M067k615p773o4J0262J865r854m903R180Q668r464j0067
$$ 7944 -3582 -6654 1303 5370 2755 -5018 -5082 5180 7045 -2809 -7712 1468 10136 672 -9395
1038i395Q160J0098l694j2475O65J4767O6j3233j783R025O127n915r345K195J2074
$$ -9395 -1235 8863 5169 -7306 -6641 8126 8192 -5041 -6824 2201 8328 2413 -6932 -4737 7337
1053G337K702j5576p579K0104Q224k1675o492J8195N837j2568o138N880N601L238
$$ 7337 10039 -5537 -13116 6988 15212 -6463 -12955 5240 11077 -1491 -7629 -1749 3852 7090
1067G090o825j3498J1523J9938j7041k1302J9551J9075j7971j6329J4529J1109
$$ 7090 265 -13233 -1710 18228 1187 -20115 -564 18511 540 -15789 -1260 9849
1079I849q171m368k941P91J4953j562k3658L494K7617l876k9491M047K8063m756
$$ 9849 1678 -2690 -5631 -4840 10113 8551 -15107 -11613 16004 12128 -17363 -13316 14747 9991
1093I991k1073J922J1733N093m291j2358r29J7224O900k1515j2147K5287J4862
$$ 9991 -11082 -9160 2573 7666 3375 -8983 -9912 7312 14212 -7303 -19450 5837 20699
1106B0699k6300j4371K1978J5281j5922j6675J0863J5620l657j2235o185J0145
$$ 20699 -5601 -19972 2006 17287 1365 -15310 -4447 11173 7516 -4719 -10904 -759
1118g59J5976r458k2592P537K7351m886l1401M809L0867m575k4612J905J5539
$$ -759 15217 5759 -16833 -9296 18055 13169 -18232 -13423 17444 12869 -11743 -9838 5701
1131E701M262p518r863j736J6300J0878k4491j6180L1653J6303l3496j4319K9666
$$ 5701 9963 2445 -7418 -9154 7146 18024 -6467 -22647 9006 25309 -8187 -22506 7160
1144G160J2501k2440j0356J2247P942J270q321j5609J2705K5127j7190k9741J8899
$$ 7160 19661 -2779 -13135 -888 7054 8324 3 -15606 -2901 22226 5036 -24705 -5806
1157e806L0731j8459k9073J6142K2803r884j4790q73Q682J2858n839k1203K501
$$ -5806 24925 6466 -22607 -6465 16338 6454 -8336 -9209 -527 12331 6492 -14711 -12210
1170a2210K7071R78l2191k215L2417K927k7228n816J9498J1102j2918j4675N608
$$ -12210 14861 15839 -16352 -18567 13850 16777 -10451 -16267 3231 14333 1415 -13260 -7652
1183g652J6629L500j9624j0927K1551J6017k0913j9100J7197K2646j3302k4238
$$ -7652 8977 12477 -7147 -18074 3477 19494 -1419 -20519 -3322 19324 6022 -18216
1195a8216R663K2235l758j8144m268J5085J1147j0855j6863N121K2996l52k8066
$$ -18216 -8553 13682 9924 -8220 -12488 2597 13744 2889 -13974 -8853 14143 13791 -14275
1208a4275j655K9338K295k5243n295K0009Q849j3488j0948M222J4625M983j9781
$$ -14275 -15930 13408 15703 -9540 -14835 5174 14023 535 -10413 -6191 8434 13417 -6364
1221f364j0839K3622J3437k3522j4916K0238J5926j5410j5234Q494J3331J795
$$ -6364 -17203 6419 19856 -3666 -18582 1656 17582 2172 -13062 -4568 8763 10558
1233A0558j4152j1116J6325J6183j6707j8304J3800K0081j0742j9260O004J6200
$$ 10558 -3594 -14710 1615 17798 1091 -17213 -3413 16668 5926 -13334 -7330 8870
1245H870Q46j2952r452J1716J5930j1719j8266R005J9363n519j9192J930J6645
$$ 8870 9716 -3236 -12688 -972 14958 3239 -15027 -6022 13341 7822 -11370 -9440 7205
1258G205J902j1395q915Q028J5271o679j8253M431J8596p46j8356k150J6209M654
$$ 7205 9107 -2288 -11203 -3175 12096 5417 -12836 -8405 10191 9445 -8911 -11061 5148 9802
1272I802j1488q605O300J4020l690j6723J454J6594K042j5478n536J3776Q262
$$ 9802 -1686 -10291 -3991 10029 6339 -10384 -8930 7664 9706 -5772 -11308 2468 10730
1285A0730j0382j0573N868J3756k199j6269O08J5742J372j2456m858R221P963
$$ 10730 348 -10225 -4357 9399 7200 -9069 -8461 7281 8653 -3803 -8661 560 8523
1298H523n779r968J185J2870K624j5783l641J6331L176j3218l823Q691N323m197
$$ 8523 2744 -7224 -6039 6831 9455 -6328 -9969 6362 9538 -3680 -7503 1188 6511 2314
1312B314o218q06P527O585j0601r563J3183Q820j2679p634R648P003o284n605
$$ 2314 -3904 -4710 2817 9402 -1199 -10762 2421 11241 -1438 -9072 576 7579 1295 -4310
1326d310J942L838L844l984q977O027J0992p552j0298O551R364m626q370K801
$$ -4310 -2368 1470 5314 1330 -7647 -1620 9372 1820 -8478 -1927 7437 2811 -5559 -2758
1340b758N609L22k902n084K699Q008l640p815J998P687m30p329j035O496J597
$$ -2758 2851 3173 271 -4813 -2114 5894 2254 -5561 -3563 4124 3694 -3635 -4670 1826 3423
1355C423l686m082K125O564k539o761K488M718K8m074k089L807K850j857m166
$$ 3423 -263 -4345 -2220 4344 1805 -4956 -2468 2250 2278 -1796 -3885 -78 2772 915 -3251
1370c251L51O217m86p385J981N420j208l213l73K014J789j249k063r36L931J977
$$ -3251 -2900 3317 2831 -4554 -2573 2847 1639 -1574 -1947 67 1856 607 -1456 -2392 1539 3516
1386C516n801n72N355k55l605P3J770J023j247m55q21J415K208k953k105M194
$$ 3516 -2285 -2857 2498 2243 -1362 -1289 481 1504 257 -198 -1019 396 2604 -349 -2454 1740
1402A740L26k870P9J427N67p44m39M4O1J428q10k852K842J518l011K05J282R9
$$ 1740 2066 -804 -725 702 1269 525 86 130 191 1619 809 -2043 799 2317 -694 -489 793 892
1420H92o83l30N20o02P32N48k560J381J817k520Q3J312n40o32l3J304q18o66J418
$$ 892 209 -121 399 -203 529 1077 -1483 -102 1715 -805 -722 590 50 -582 -615 689 -129 -795 623
1439F23r30m88J383j048o82J665o40p14L42O13r3j518J147J006j724Q21q0n38
$$ 623 -307 -795 588 -460 -1142 523 -117 -831 -489 124 31 -1487 -340 666 -1058 -237 -317 -855
1457h55J140n52o64N04L94K42r13j3J209k74q52N35j25O26m42q52J511l23m01
$$ -855 285 -267 -931 -427 -33 209 -704 -717 492 218 -634 -99 -224 402 -40 -892 619 296 -105
1476a05L34m57O25J25m92j06n4J221n65j440J764O20j964O46K12j41M11m74K54
$$ -105 229 -228 397 522 30 -76 -130 1091 526 -914 850 1470 -494 152 364 223 634 160 414
1495D14m23N84M73j671M39J708j467m09J377o40l22k50P76k85r60J311n21o85
$$ 414 -9 575 1048 -623 -184 1524 57 -352 1025 385 63 -187 589 304 -656 655 134 -551
1513e51J203m18o41Q54l19j78o67P35N39j095r6J043m62N3o30J16J185p63r48
$$ -551 652 234 -407 447 128 -50 -717 18 557 -538 -634 409 -53 0 -630 -514 671 -92 -1040
1532a040Q83j13K07k83m63P88K3k27o31m98K258l11k518J163J765j038j298K44
$$ -1040 -157 -270 -63 -346 -809 -21 2 -225 -856 -1354 904 593 -1925 -762 1003 -35 -1333 -1089
1550a089J465K31j069J3o27J591Q46l057K02K878kk445n79K438R55k395n28J117
$$ -1089 376 607 -462 -449 -1076 515 1361 -1696 -1494 1384 1382 -1063 -1642 796 1751 -644 -1172 -55
1568e5R19O58k557p85L372J72k141j182J661K658k073k607J108K940L22m321o89
$$ -55 864 1522 -1035 -1820 1552 1724 -417 -1599 62 2720 647 -1960 -852 2088 2410 -1911 -2600
1585b600N158K71m213k16K366J095o83k700J15K558K375l836m169N781L671o596
$$ -2600 2558 2829 -1384 -1600 766 1861 1178 -1522 -1407 1151 3526 -310 -4479 1302 4973 -1623
1601a623k125M942K099l387k196J646J611P70j113m425K381O532l837p026M557
$$ -1623 -3748 1194 3293 -94 -2290 -644 967 1737 624 -3801 -1420 5112 1275 -5751 -1194
1616a194O332l822n843K577M682j457k448j327P60M622n16o179N4P009R67q009
$$ -1194 5138 1316 -4527 -1950 2732 1275 -1173 -2500 -1740 2882 2366 -3813 -3759 3250 4217 -3792
1632c792j482P980J869o942j982M449L718l134m296J321M391J286m083m458M918
$$ -3792 -5274 2706 4575 -2367 -4349 100 3818 684 -3612 -2291 2100 3386 -697 -5155 -237
1647b37O281n180p416M661Q540l926r008L956P041k495m298o85K218M357o39p360
$$ -237 6044 864 -6552 -1891 6649 2723 -6285 -2329 4712 2217 -2081 -2766 -548 3809 3170 -4190
1663d190l81R613J839j2200j179J2319K48r774n04O163J765k704l263r97M992
$$ -4190 -4571 5042 6881 -5319 -6498 5821 6069 -3705 -4209 1954 3719 1015 -2248 -3245 1747
1678A747M921p494p239R966P066j0123o727Q358O487n878o186L503M330R15l859
$$ 1747 6668 -826 -8065 1901 8967 -1156 -7883 475 6962 1084 -5102 -1599 2731 3646 -213
1693b13n265M700P874n245q703L578R911k148j0601R70R853L24p840k838N883
$$ -213 -5478 -778 7096 1851 -6852 -3274 6637 4489 -6112 -5142 4711 5035 -2805 -5643 240
1708B40M848m057n727J165O806K024q311m721R747N803r302o585Q000P269o793
$$ 240 5088 1031 -4696 -3531 3275 5299 -3012 -7733 2014 7817 -1485 -8070 -70 7199 406
1723D06o870M130N474N36m869n014N147Q272n350r906M697J1301m431j0971L937
$$ 406 -6464 -2334 3140 3676 -1193 -6207 -1060 7212 1862 -8044 -3347 7954 3523 -7448 -3511
1738c511Q486j115n795k733M179N799k808q251J291J0006K80j0881r44J0183J653
$$ -3511 4975 3860 -1935 -4668 -489 5310 2502 -5749 -4458 5548 5828 -5053 -5997 4186 5839
1753E839p351m136N177O195l438o809Q49P950J547q839l216Q428M247o361o243
$$ 5839 -1512 -5648 -471 5724 2286 -4523 -3674 4276 5823 -3016 -6232 2196 6443 82 -6161
1768f161M563Q106l099q543J510P774J358p781l565P151M713n273o078K547Q146
$$ -6161 -1598 6508 3409 -5134 -3624 4150 5508 -2273 -5838 1313 6026 753 -5325 -2778 5368
1783E368o91r571k13Q735J753p110m114O052M946l817o055J235P311J148q549
$$ 5368 4677 -4894 -5107 3628 5381 -1729 -5843 209 5155 1338 -4717 -3482 3829 4977 -3572
1798c572k467Q432L164o759m249M772N252k776n692K39N812K850o939m576P512
$$ -3572 -6039 2393 5557 -1202 -5451 -679 4573 1797 -3895 -3656 2156 5006 -1933 -6509 1003
1813A003M929o535n200M733N509k362n886O46M959K391m759n079N305N573m326
$$ 1003 5932 -603 -5803 -1070 4439 2077 -3809 -3163 1796 4187 -572 -5651 -346 5227 901
1828I01o200L069O551j334o275J17N338J560l911m008L559N305k883n377R94N906
$$ 901 -5299 -2230 4321 2987 -3288 -3171 2167 3727 -184 -4192 -633 4672 1789 -3588 -2594 3312
1844C312M77n771k047N410K861m130m140L455M461k272m342N21M020J755l674
$$ 3312 3789 -1982 -4029 1381 4242 112 -4028 -573 3888 1616 -2726 -2205 1815 3570 -104
1859a04l585M077M004l448m585K320N096j663n167J458L341O62k496k424J590
$$ -104 -3689 388 4392 944 -3641 -1321 3775 2112 -3055 -1597 1744 2406 -90 -2514 -924
1874i24L966j499m629P43N205k30n472L45M197K61k607j630J527K877p32l291
$$ -924 3042 1543 -3086 -2343 2862 2632 -2840 -2495 1702 1963 -644 -2274 -747 2130 1398 -1893
1890a893j40L411J090m088j283M004R65k370j797J098K697n05k929j73K680J377
$$ -1893 -2033 1378 2468 -1620 -2903 1101 2066 -304 -2101 -1003 1694 1189 -1740 -1913 767 2144
1906B144k945j647K783J567k066j368K40K724j19k701o7K202Q37j667j957K017
$$ 2144 -801 -2448 335 1902 -164 -1532 -1292 1432 1313 -1388 -1455 747 1584 -83 -2040 -23
1922b3J656j427r74J31J453O73j960j090K139J027j807j191J536J435j555p78
$$ -23 1633 206 -768 -637 816 1489 -471 -1561 578 1605 -202 -1393 143 1578 23 -755
1938g55P07K23J017r40j290J389J163j173j433Q95J801j273j231J073K25J83k30
$$ -755 -48 175 1192 252 -1038 351 1514 341 -1092 -197 1604 331 -900 173 398 581 351
1955C51j044P03J278r14r86J82J516p09j191R07j46j23L07j71m54Q26Qr92K43
$$ 351 -693 10 1288 374 -612 -430 1086 377 -814 93 -53 -176 131 -40 -494 332 340 -652 -409
1974d09O65J81j496O88R75j361M84M49p30M24K48n1p52P22J92j008K25J212j177
$$ -409 256 437 -1059 -371 604 -757 -273 176 -554 -130 118 67 -685 37 229 -779 -554 658 -519
1993e19j48J267p60l70N48Km46K43O25r10j45J288o54o65Q21J89p71K45J94k23
$$ -519 -667 600 -160 -530 18 20 -426 -183 442 -468 -613 675 21 -644 177 366 -405 -160 34 -189
2013a89l55O08j0m90P64N0j150R79P27r76k66J116n03j13m50M15PM6L27j100O39
$$ -189 -544 64 54 -436 328 378 -772 207 934 -42 -308 808 305 192 -258 157 164 210 537 -563 76
2034G6P28r21l13O88l3O0m37L37J91j26L74r39J33J074j066k18R70j55p30N8K05
$$ 76 804 -117 -430 258 225 285 -152 185 376 250 624 -315 -182 892 -174 -392 578 423 -307 -249 -44
2055d4R2j61K42m23k21J107l04j330J291J83p96K79J81k50n03R03K2p02K97P38
$$ -44 48 -113 129 -294 -515 592 288 -1042 249 432 -364 -85 96 -154 -657 246 268 -434 -137 601
2075F01j365N55P85j143j40N79J44n14K00O57q81k36J106m06k20K51Jj72K10K03
$$ 601 -764 -209 576 -567 -707 -128 16 -498 -298 359 -522 -758 348 -58 -278 -27 -26 -198 12 215
2095B15m77M6M76J45j112O17L07r6r0m7j72P22k65k56j14N49P6r92L31O54m74
$$ 215 -262 -216 260 405 -707 -90 217 121 31 -16 -188 534 269 13 -101 448 524 -468 -137 517 43
2116D3J5Q2m28R16L54j528K66J094K12j512M4J327n31o31Q4N12J14j15q54J05
$$ 43 58 140 -288 628 982 -546 -280 814 1026 -486 -442 885 354 -277 -193 319 433 318 -536 -431
2136d31P61R90j321j297J609J122j682p57J137Q13n41r75l4J091J15p84r82R79
$$ -431 330 1320 -1 -1298 311 1433 -249 -1006 131 944 403 -572 -606 485 600 -184 -1166 -187
2154a87J499q95j545N44J442r5j922K74J731l1j282o80Q85J284p77j259M18R24
$$ -187 1312 417 -1128 -584 858 763 -1159 -885 846 815 -467 -1147 -262 1022 245 -1014 -596 328
2172C28O16j763j297K582J021k033j325J836J527j561j524J228R02M47j054j567
$$ 328 944 -819 -2116 466 1487 -546 -1871 -35 1492 -69 -1593 -365 537 984 -70 -1637
2188a637J624J971j927k155J418K539j002k694R78K199j80j569r87J429J620r56
$$ -1637 -13 1958 31 -2124 -706 1833 831 -1863 -885 1314 1134 -435 -1422 7 1627 671
2204F71k125M11K468J98k908m32L168M21k388j444K104J862j484k152J014J772
$$ 671 -1454 -1043 1425 1623 -1285 -1717 1451 1872 -516 -1960 144 2006 522 -1630 -616 1156
2220A156M76k110j546K679J842k319k698K029L105j624l271J409K530o09j908
$$ 1156 1632 -478 -2024 655 2497 178 -2520 -491 2614 990 -2281 -872 1658 1049 -859
2235h59p82J556J969j067k957Q01L553m48m323O44L774j20k442j194J735J552
$$ -859 -1641 -85 1884 817 -2140 -1339 2214 1766 -2557 -1913 1861 1741 -701 -1895 -160 1392
2251A392n82k642o9L294P68l897j086M264Q46l382j382K084K470j430k566L27
$$ 1392 810 -1832 -1901 1393 2161 -1736 -2822 1442 2288 -1094 -2476 -392 2078 648 -1918 -1591
2267a591K428J260l019j812L373J971k683k453J866K820q35l229L84K779P28k455
$$ -1591 837 2097 -922 -2734 639 2610 -73 -2526 -660 2160 1325 -1904 -1520 1259 1987 -468
2283d68j963K537K351j998k407J030K795j8l331p66L327J284k673k139K256K709
$$ -468 -2431 106 2457 459 -1948 -918 1877 1859 -1472 -2238 1089 2373 -300 -2439 -183 2526
2299B526j823k343M78K282J071k929j713L102K577l110k856K338L317k216k748
$$ 2526 703 -1640 -1162 1120 2191 -738 -2451 651 3228 118 -2738 -400 2917 701 -2047
2314b047J025K070R64k056j956J600L256j856l415J137M138j192m038J206K638
$$ -2047 -1022 1048 2012 -44 -2000 -400 2856 1000 -2415 -1278 2860 1668 -2370 -1164 1474
2329A474l6j960j068J060K597j187k603k00L718K28l816m96L467P85k580j406
$$ 1474 1438 -522 -1590 -530 2067 880 -1723 -1923 1795 2023 -1793 -2289 1178 1963 -617 -2023
2345b023J625K227j138k059j9K027J236k450j776K684J894j996k465J241L045
$$ -2023 -398 1829 691 -1368 -1387 640 1876 -574 -2350 334 2228 232 -2233 -992 2053
2360B053p94k983M31K305N12j869j819K179J854j243k340O05K672J8k897j03K515
$$ 2053 1259 -1724 -1293 1012 1524 -345 -2164 15 1869 626 -1714 -1109 1563 1581 -1316 -1419 1096
2377A096L13j866j411J921J440j004j428q7J751J070k029j641K280J782k182j745
$$ 1096 1409 -457 -1868 53 1493 489 -939 -1026 725 1795 -234 -1875 405 2187 5 -1740
2393a740J614K182j451j609K82J314Q65j544j254J269J820r97k293O84K589p16
$$ -1740 -126 2056 605 -1004 -722 592 1457 -87 -1341 -72 1748 751 -1542 -858 1731 1015
2409A015k321J89K008R1j137j179J238J137p79q95m42J878L89j802q05J732R02
$$ 1015 -1306 -1117 891 982 -155 -1334 -96 1041 262 -633 -1075 803 1192 -610 -1415 317 1219
2426A219j331j153Q65J551p90j307K46J096O71j508p62J282Q40p29j481P19J279
$$ 1219 -112 -1265 -400 1151 361 -946 -700 396 1067 -441 -1203 79 919 190 -1291 -572 707
2443G07j84j455M8J486J98r22q43J115N04m29q70K7J445l28j118k12R87M46o75
$$ 707 523 -932 -884 602 800 -122 -965 150 654 225 -645 -618 827 499 -619 -831 156 602 -73
2462g3p81Q79R20r48n71K38O66K14r94pO78L45l19q52N57O30p2p47n9N13N05q68
$$ -73 -854 25 945 -3 -574 -336 330 544 -450 -457 221 566 247 -605 -48 582 510 -237 -296 217 722 -146
2484a46m72R91L23m74m24J71K07J09k96j87J00O18o13m74Q86%l54j3k44M47N6
$$ -146 -618 373 696 222 -202 -31 176 285 -11 -198 -98 520 -93 -567 319 319 -35 -48 -292 155 211
2505B11k59j56J76J52K15o76L14K50l77k57K58J51K42m63J49J78m15M93k29k02
$$ 211 -48 -204 -28 124 339 -337 -23 227 -150 -407 -149 2 244 -219 -70 108 -307 186 -43 -245
2525b45M92k69j70J00j02M27n05J08J61P1J0o5k85J87J6r3L81n17K02R2K9k25
$$ -245 247 -22 -192 -92 -194 233 -272 -164 -3 68 78 13 -272 -85 -69 -162 219 -298 -96 -4 25 -200
2547b00K0K02J95l82K64o0m65Q86n00m21N52J42j53M2m0N9j7L4J17k55J03K73
$$ -200 -180 22 217 -165 99 39 -426 460 -40 -461 91 233 80 122 82 141 124 158 275 20 123 396
2569C96m20k51O01j04k73m1J68J6q6p0Q8O3K00k08k23L96k4j02m59N08P9k70J0
$$ 396 -24 -275 326 222 -51 -92 76 92 6 -64 24 87 287 79 -144 252 228 126 -333 175 254 -16 -6
2592fL20l30j31L7J57j0J9k1p6j69L13j9l50K86M5j37k75K61J95j60j33L54l64
$$ -6 314 -16 -147 -110 47 37 56 35 -41 -210 103 84 -266 20 65 -72 -347 -86 109 -51 -184 170 -194
2615a94K04J67m28M5L36l37K7j61N48j59n18M25K19j90R4j48j80K15l1J07K8l7
$$ -194 10 177 -251 -206 130 -207 -180 -341 207 48 -470 -45 174 -16 78 -70 -250 -35 -66 41 69 32
2637C2r2J8j8K36k84O7K59k74L44o8l63L90p3k50K14l15M87k18M5P0j82J40q2
$$ 32 -60 -42 -60 176 -108 -41 218 -56 288 220 -143 247 174 -76 138 -177 310 92 137 207 25 165 83
2660H3j03K20r3j9j52L32j62Q0q2O2k18j51O05k91j07J91m1k70O1J66j30k99M83
$$ 83 -20 200 107 88 -64 268 106 186 104 166 -52 -203 402 111 4 195 154 -116 -55 111 -19 -318 165
2683A65L8j47j73J65NO0k41m26P35M19n19m64N89J89n66J1oJ77K27l15l53K00
$$ 165 203 56 -117 48 53 113 -128 -554 181 600 81 -383 206 395 -171 -160 -166 11 238 -77 -430 -230
2705b30O76j35j174N76P89p17m53M05N82j33m14j15L07O89m93p62M63Q09n33q10
$$ -230 446 311 -863 -287 502 -215 -668 -263 319 186 -228 -343 -36 653 160 -602 -139 670 137 -673
2725f73M48M46m5n07q2L44M65m20m12P1J234k14j255M6Q71J54n12k01K95L32K8
$$ -673 -225 221 176 -331 -413 -69 396 -24 -436 -365 869 655 -600 -554 317 471 -41 -242 53 385 413
2746D13q04J19J076l32n28m89J214Np81j49rP15l69n02p2Q52L21r09m60R52P62
$$ 413 -391 -272 804 472 -56 -545 669 674 -107 -256 -265 450 81 -421 -493 359 680 -229 -689 263 1025
2767A025j179k89K68O48N7q73k07Q27N15j002o96Q92R57r49n65L29P79k88o91
$$ 1025 -154 -443 -175 473 530 -343 -550 277 792 -210 -906 -14 943 -6 -571 -242 537 249 -442
2786d42l3L38J002q77j027P85J024m98j287P24R46n2j064m91J136O40r18p80L50
$$ -442 -475 -137 865 -12 -1039 -254 770 272 -1015 -291 655 603 -461 -952 184 824 -94 -874 -524
2805e24J497m83j365M62J115m9r17q96J152N42l62j110M05J738o50j192O4R35
$$ -524 973 490 -875 -413 702 653 -264 -1160 -8 534 172 -938 -533 1205 555 -637 -573 362
2823C62J88q65m53O73N99j37j161M7J467K95j688k43J379O74j141m49K76R22k99
$$ 362 550 -315 -768 -95 504 367 -794 -747 720 1015 -673 -916 463 1137 -4 -453 -177 745 446
2842D46p82n78J305Q25j457q03J251J067j418o14L57J461o87r09j81J142N01j068
$$ 446 -336 -914 391 1216 -241 -1044 207 1274 -144 -758 -401 1060 373 -536 -717 425 926 -142
2860a42r55J175R75r47q74l3J699j56j335r2R75L77o96p82M75J338p19j081p4
$$ -142 -1097 78 1053 106 -768 -801 898 742 -593 -685 290 667 -29 -811 -336 1002 283 -798 -872
2879h72J386L53j473n38J273Q05r88j048P37J299n29j216j10R87O87r76q57R70
$$ -872 514 867 -606 -1144 129 934 -54 -1102 -365 934 405 -811 -921 66 753 -223 -1080 -110
2897a10P99m07j069K95J178M7j780M76Q80M58j092l65O66P06m73p69Q1R52J09
$$ -110 689 282 -787 -492 686 733 -1047 -571 309 767 -325 -690 -24 682 209 -560 -479 473 582
2916E82j009k52J110N22j041o93P22R45o85q84K63R83L80r68q86R84P76o97j012
$$ 582 -427 -679 431 953 -88 -781 -59 886 201 -683 -420 563 943 -25 -911 73 849 152 -860
2935h60L70J364l91q55j57O68Q14j003p03O12Q62l38q31K23O66J08p52k23N52
$$ -860 -490 874 483 -372 -529 139 953 -50 -753 -141 721 383 -448 -225 441 549 -203 -426 126
2954A26O03o78o26N10P56k39r52Q1Q09J50r57l01O91L99j65q01K21Q90o1r62K1
$$ 126 729 51 -575 -65 691 452 -500 -419 390 540 -417 -718 -27 372 207 -594 -373 517 456 -506 -485
2975d85O33K93n34l85M80J50k21m92K04P50k48l96k67L68M91o48k54P27L63j38
$$ -485 148 441 -93 -478 2 152 -69 -561 -357 393 145 -251 -518 -150 341 -307 -561 166 529 391
2995C91n26k47P60j62j32m78K89M90k49n36M2Q91j92p62K44K65J32n42L1K47J85
$$ 391 -135 -382 378 216 84 -394 -105 385 136 -400 -358 533 341 -421 -177 88 220 -322 -291 -44 141
3016A41J71n83O0L51K96m70k11O30O7m14j90K52K19R1m36n9J06L98n01n7J21K82
$$ 141 312 -271 -211 140 436 -34 -245 385 452 38 -152 100 319 410 -26 -85 21 419 -82 -139 -18 264
3038B64j12m60J94K34Q2k36j53M61k28p1J00k02J60M6j56l7J23K23k66k17J51
$$ 264 152 -308 -114 120 202 -34 -187 274 46 -25 75 -127 33 79 -77 -114 9 232 -34 -251 -100
3059a00K71k74m4L72l24j00M45m64K12N6j58j50M66J9n25o8L47k5o0P9R5k16J53
$$ -100 171 -103 -147 225 -99 -199 246 -218 -6 50 -108 -258 208 227 -298 -366 -19 -44 -104 -25 70 -146 7
3082Gj94J69q8K77o6l31p9L71j47p1J35J13k02PM86n37J37l2Kk6M06m05N8k3l3
$$ 7 -187 -18 -106 171 105 -226 -305 66 -81 -152 -17 96 -106 -99 387 -150 -13 -45 -43 -69 337 -68 -10 -33 -66
3107f6K86l80M00o1l51K76l4K14l50J56LK67m35K17L9j98K98k21o9P7o8L3K4K9
$$ -66 220 -160 240 179 -172 104 70 284 -66 90 93 360 -75 142 181 -17 281 60 -9 68 0 33 57 86
3131H6p6j40j16M65r7k26P0L7J8l8k3J8l3O8j04j10K06j62M4N6r1K87j17k3J3
$$ 86 10 -130 -246 219 122 -104 -34 3 21 -17 -40 -22 -55 13 -91 -201 5 -157 -113 -57 -148 139 22 -1 12
3156A2k09J26J40j84n1K57k1r2k64M79k54k08L26l38L80j41k03J85J79j71j7m5
$$ 12 -197 -71 69 -115 -166 91 70 -22 -286 193 -61 -269 57 -281 99 -42 -245 -60 119 -52 -69 -114
3178a14J04J04j81r1N2Q8J53l95K18OL8L0q4j32J14J29j45K47J09l06P5o8J91
$$ -114 -10 94 -87 -178 -126 -38 115 -280 -62 -56 -18 12 -72 -204 -90 39 -106 141 250 -56 19 -49 142
3201A42j75j11L20l08J31R9n0p8L84k67J35k9l64J30M5K7K04k19l8K04M4j08J59
$$ 142 -33 -144 176 -132 -1 98 48 -30 354 87 222 193 -171 -41 4 31 235 16 -22 182 226 118 277
3224B77k7l02J14Jk00J44P2k69J28J30p9K04j18j25Q1k74J80j66J36L47k73j43
$$ 277 250 -52 62 63 -137 7 79 -190 -62 68 -11 193 75 -50 31 -243 -63 -229 -93 254 -19 -162
3246a62J68j7j25K61n50M06k2r7K77j49K4k0j20L1M7j5j30P6L05k81J48jK93L
$$ -162 6 -11 -136 125 -425 -19 -41 -138 139 -10 14 -6 -126 -95 -48 -63 -193 -117 188 -93 55 54 347 350
3270C50k97m09K40J22O9r0j85M86l27K2j14L36k72n6j9K53L06l80k54Q7K67M3
$$ 350 53 -356 -116 6 75 -15 -200 286 -41 -19 -133 203 -69 -125 -144 109 415 35 -219 -132 135 178
3292A78j99j86L10K57j30m95Q6O04k44j24pL22J7p01J42N0K62K16n88N2N84n1
$$ 178 -21 -207 103 360 230 -265 -179 425 181 57 50 372 389 -312 -170 -120 142 358 -230 -178 406 355
3314C55p10RN90j1k48j43k9L64R0l70k49M71J50n40k77N60L43j62n47J61L92j94
$$ 355 -355 -346 244 233 -15 -158 -187 177 267 -103 -352 119 269 -271 -548 12 355 193 -354 -193 199 5
3336Er5j8L7J57q3n68R8P30P7p86K82O27l54o17J86L69K33l59k57K05L52Ln37
$$ 5 -90 -108 -71 86 3 -565 -467 263 340 -446 -164 463 109 -508 -322 47 280 -79 -336 -131 221 224 -313
3359c13J33N44j72m02k39N10J70j90l88K29L28p2j62k28N57J7m72k64M37M68l34
$$ -313 -180 364 192 -210 -449 61 231 41 -347 -118 210 138 -24 -252 305 322 -150 -414 23 491 157
3380A57p01L17N92l33m35K25M58J55j98o01J95M31Q6p87n3Q29J55r63K85J92M55
$$ 157 -544 -227 365 32 -403 -178 280 435 237 -364 -169 262 348 -439 -492 337 492 -471 -186 6 461
3401D61o78NN95j52P9o10j16N08L55m74n54M41N38l58o67N02Q58p02n27K58N10
$$ 461 -217 -212 383 231 310 -300 -416 92 447 -27 -581 -140 398 40 -627 -125 733 31 -496 -238 272
3422B72P2n94k21L62K90n3o11K66N36J20n70n05P15L62n90k49N58Qj01k73j73
$$ 272 344 -250 -471 -109 181 128 -483 -217 319 439 -131 -636 79 441 -149 -398 160 168 67 -206 -379
3443c79M84N9j77p94J021J37j85o98O30K50k06k71k69N87J45m22l56L64M15M4
$$ -379 105 164 -13 -807 214 351 166 -532 98 348 142 -129 -398 189 334 -88 -444 -80 335 379
3463C79p26O8P79K7o29o7J99L52m23m28P38K1k27l41p7P48j40l04l33L70N56m26
$$ 379 -347 -279 500 527 -102 -169 30 382 -41 -469 269 290 63 -278 -355 393 253 -51 -384 -14 542 116
3485A16l67J10N47k99m92K27M46Pk31k55RM22j5n40J28L81r7o16K71N29r2l08
$$ 116 -251 -141 406 107 -385 -158 288 295 64 -191 -182 240 225 -315 -187 194 97 -519 -248 281 189 -119
3507a19l5J34J48J99m14r4L47P4m72k42M99K54l86j08J94L01p4m73KL83P3l68
$$ -119 -154 -20 128 327 -87 -181 166 240 -232 -474 25 279 -107 -215 -21 280 206 -267 -265 118 191 -177
3529a77o7J13O04n46l52M04K93R4n60j74L42K15m6n05M33J20j08j24j5L49j96
$$ -177 -244 -131 473 -73 -425 -21 272 366 -194 -368 -26 189 143 -362 71 191 83 -41 -56 293 97
3550I7q2j04J70J84l44j53P4K86N7l61K86K1K19m91n1J04L76j98l84K63L97j21
$$ 97 15 -89 81 265 -79 -232 -158 128 185 -176 110 131 350 -141 -192 -88 288 90 -294 -31 366 245
3572B45k80j15K68Q0k1l10j18L52Q2m80M7M89n3j33l19L75q5Mj32K05J44j74j08
$$ 245 -35 -150 118 198 177 -133 -251 101 183 -297 -250 239 186 53 -266 109 24 28 -104 101 245 71 -37
3595c7k20L67m6j85r5J16L37k68J01J20k38J30j47j50J13j54R3r1K28M06l94J20
$$ -37 -257 110 64 -121 -216 -100 237 -31 70 190 -48 82 -65 -215 -102 -256 -163 -254 -26 380 -14 106
3617A06L8p2p2J96k51J21n6k19k1J84O3p3J41O4l16K50O5k24J15J86j6k42k12
$$ 106 144 72 0 196 -55 66 10 -209 -230 -46 17 -56 85 149 -167 83 148 -76 39 225 209 -33 -245
3640b45K80K5o6J71k52m2l5K09k0K75j11m33M33k38J01qJ19r1j04P8N2n2P3K10
$$ -245 35 60 -6 165 -87 -129 -164 45 25 300 189 -244 189 -49 52 44 163 72 -32 46 98 46 119 329
3664C29l62L93k18P9k83J96L1l34o4L40k71L05j56r0l2n1L4J57j7P4n3j80p2K46
$$ 329 -33 360 142 221 -62 134 165 -169 -233 107 -164 141 -15 -105 -137 -188 -154 3 -14 60 7 -173 -245 1
3688Ak70L35l9j2q7j56J93k41M5K57j40l9K52k16J08J74k93J60j05J38ol51J72
$$ 1 -269 66 27 15 -72 -228 -35 -276 -231 26 -114 -153 99 -117 -9 165 -128 32 -73 65 59 -292 -120
3711a20Q4J55j6j21j60K41j58j64J51k9M52j41k73J37J08M8k80n7K79m7k64K9
$$ -120 -36 119 103 -18 -178 63 -95 -259 -108 -137 315 174 -99 38 146 194 -86 -143 136 89 -175 -146
3733a46J31K19k79QJ56n8O8k68J05K19m3k40K20k06m5Q6K65l42J40Q9j9q1j58
$$ -146 -15 204 -75 -67 89 31 99 -169 -64 155 112 -128 92 -114 -159 -73 192 -150 -10 79 60 -21 -179
3756a79M21j46m18J18K04P9l64L04R9j24J61k92L3J63j95J52J19nn6k46J70J62
$$ -179 242 96 -322 -204 0 79 -285 19 118 -6 155 -137 -104 59 -136 16 135 130 74 -172 -2 160
3778A60k21l6J82j5m9k57L43J26k73K2M3j94k3J74k04J54J95k70K63j02k8q3o7
$$ 160 -61 -97 85 70 21 -236 107 233 -40 -18 25 -169 -192 -18 -222 -68 127 -143 120 18 -10 -93 -160
3801a60Q7k34L63l2j7k56L63k17Kr5M72l27k4Q9P4poj07J2L85n50J79J13m2J12
$$ -160 -73 -307 56 24 7 -249 114 -103 -101 -196 276 -51 -75 14 88 81 75 -32 -20 365 -185 -6 107 65 177
3826A77n49M16o3J67k11j3R4K76m64J61K8K05j24m48K96J87J84m27K58m0K26l1
$$ 177 -372 44 -19 148 -63 -76 18 294 -170 -9 19 224 100 -348 -52 135 319 -108 150 110 336 305
3848C05l85K90j57k91L69L1j04j06%M5j37j0J30l10N8K97k5O9j74J45n5L1Qj45
$$ 305 -80 210 53 -238 131 162 58 -48 -48 -3 -140 -150 -20 -330 -272 25 0 69 -105 40 -15 16 24 -121
3872a21K49J54o21J35N63j87j59l87M37o6k1l29M29j6p2q3j57L60p4k21P5K87
$$ -121 128 282 -339 -204 359 172 13 -374 63 -3 -24 -353 76 60 -12 -95 -252 108 34 -187 -112 175
3894A75j23k80J75N6q3L03j99k86K03K90k69k15K71M23l41k22K7M18m24K21j80
$$ 175 52 -228 -53 3 -80 223 24 -262 -59 231 -38 -253 18 441 100 -122 -95 323 -101 120 -60
3915f0M2K29k9k91Q4L91l32K8q4K76j3m10J63K62L7l24k62M06K04J9l53j89O03
$$ -60 -18 211 182 -109 -25 366 34 62 -22 254 241 -169 -6 256 293 -31 -293 113 317 336 -17 -206 397
3938C97j64j25m45M29j4J27m20K10K57j10k52%n7J80j17l28M74KK12p36K02M73
$$ 397 233 108 -337 92 78 205 -215 -5 252 142 -110 -110 -167 13 -104 -432 42 44 256 -480 -278 195
3960A95km71j60N23L09l87p1p3K89j64l09J58M02J28m22m75L40O28n29r7L96q8
$$ 195 193 -278 -438 85 394 7 -64 -137 152 -12 -321 -163 239 367 -55 -530 -190 438 -91 -188 208 120
3982A20j64M8k45K89O3k75J54P4K02J2n62k4M89J85l15k88K73K3Kk86J10N55K3
$$ 120 -44 4 -241 48 111 -164 -10 64 266 278 -284 -308 181 366 51 -237 36 59 61 -225 -115 440 463
4005D63o22j31O14q3l51k70N79J11l14k50K89J75j05N2m70L43K15j48j46l12Q33
$$ 463 -159 -290 324 241 -110 -380 199 310 -4 -254 35 210 105 157 -313 30 245 97 -49 -361 472
4026D72j77q17M87K76N0l76p4J44J58q6o1k7Q9J52m61l3N48j48l50J12J45J13
$$ 472 295 -522 -35 241 291 -85 -159 -15 143 57 -4 -31 58 210 -251 -284 264 116 -234 -122 23 136
4048A36j69r2R4J03J8q2k24L18J78j89l81K2N52j28n23J04L97r8o2%J46O9k0k92
$$ 136 -33 -125 -31 72 90 8 -216 102 280 91 -290 -268 284 156 -367 -263 134 36 -26 -26 120 189 169 -123
4072a23j46O39k64k53M7K44o9j12n7K36j73J24j68K8K01j25m0m7L48r7k72m4J64
$$ -123 -269 370 106 -147 -100 144 75 -37 -94 142 -31 93 -75 -47 154 29 -11 -58 290 193 -79 -123 41
4095D1K94r3p2j44j11M32k72L8k60L28j11J16k20J28J24l21O6J16L38m44oJ69
$$ 41 335 242 170 26 -85 347 75 113 -147 181 70 186 -34 94 218 -103 -37 79 417 -27 -33 136
4117A36J54j74r2m6K35J83l25k55K57M5j67k6PK08l2l37P4R2K79m54R7P6J7J5
$$ 136 290 116 24 -22 213 396 71 -184 73 118 -49 -75 -68 140 108 -229 -155 -63 216 -238 -141 -65 -48 -33
4141c3J3j15K85l49P4J19l34L13j10M1l3K68o4J44k21J38k38J74l59L35J93l51
$$ -33 -20 -135 150 -199 -125 -6 -340 -27 -137 -96 -129 139 75 219 -2 136 -102 72 -287 48 241 -110
4163a10q5K69k7j79q4K49k82L06pj60K91k25m6j94J72M37k84%r5J58j4j11l7j72
$$ -110 -195 74 47 -132 -216 33 -249 57 50 -110 181 -44 -90 -284 -112 325 41 41 -54 104 90 -21 -58 -230
4187b30L74o9K0j3J20p9J06k80J13J21o1k34K02j20J09O9k85K62J40j63lk81K79
$$ -230 144 75 95 82 202 123 229 -51 62 183 122 -112 90 -30 79 148 -137 125 265 102 99 -182 97
4210I7J55m52J63j01J57Pnl64K57L53l10M3kJ63j43j6O7r4l5K38k10M2j64J00
$$ 97 252 -200 -37 -138 19 26 21 -343 -86 267 -43 0 -2 161 18 2 69 -25 -60 178 -32 10 -154 -54
4234e4p5k3L31k68K3Or9K76q0L0j98J56k35K32j37J22Q3k15J66o9k7O6j34O1K22
$$ -54 -129 -152 179 -89 -66 -60 -159 117 37 67 -131 25 -210 22 -115 7 90 -125 41 -28 -55 11 -123 -62 160
4259A60k77N2P7j96M6R7J26j6k05L98n6j71J47j70j78N5J15R1qk45K43m3k0j92
$$ 160 -117 -65 12 -184 -138 -41 85 69 -136 262 206 35 182 12 -166 -111 4 95 87 -158 85 42 22 -170
4283a70K90j05J17j76j72J34j37J20m8K9N49m01k10P8j01O99n20N2K57k02P5q7
$$ -170 120 15 132 -44 -216 -82 -219 -99 -147 -118 431 30 -180 -102 -203 496 -24 28 285 83 158 71
4305G1j57R6k68K55J17k84R9m3j61K14J01r2K3j5j41L18k07N1M5J8j72K51n3k
$$ 71 -86 10 -258 -3 114 -170 -71 -114 -275 -61 40 -52 -29 -44 -185 133 -74 -23 22 40 -132 119 66 64
4329F4Q9k18l4K6Nk3J16j74oN1R0J65P8l40K68k23K06n5j08J02J86k83P0j82K89
$$ 64 153 -65 -99 -73 -68 -91 25 -149 -155 -104 -14 151 229 -111 157 -66 140 85 -23 79 265 -18 52 -130 159
4354A59p4k15L89o8r0Q2l19J51K1j11L14j55j73Q9j13J05J80j09p3K6l3L45k78
$$ 159 85 -130 259 191 101 183 -136 15 36 -75 239 84 -89 0 -113 -8 172 63 -10 16 -17 328 50
4377E0j17J94k46J17Q3j46o1J37j3j26n5Q8j1m4Q5K00l2p0q1j4jJ88m36K28K44
$$ 50 -67 127 -119 -2 81 -65 -126 11 -2 -128 -183 -95 -106 -150 -65 135 103 33 -48 -62 -63 125 -311 -83 161
4402A61l7j65J15K9k09J1j43KL17R6m40J40J62P1l05o7L16p2kJ06j76L90l99Q5
$$ 161 124 -41 74 103 -106 -95 -238 -236 81 177 -263 -123 39 110 -195 -262 54 -18 -20 86 -90 300 -99 -14
4426a4qJ95n5k13QJ73L8k96m9j20N05l26J58j30J3K74r8M2j58K34q0L2l70M99
$$ -14 -22 173 118 -95 -87 86 124 -172 -221 -341 164 -162 -4 -134 -121 153 55 97 -61 173 93 125 -245 254
4450B54j18j29p7K99k46n4j0O9L93m10j23K05J7k30K31k71K96M9m38J11K70K31
$$ 254 136 7 -70 229 -17 -71 -81 -12 381 -29 -152 53 70 -160 71 -200 96 145 -293 -182 88 319
4472C19o2n28J76J36j56M30l63J94k8n5j42O6K63M3n21M07m3j15J4j60J36P7k23
$$ 319 257 -271 -95 41 -115 315 -48 146 118 63 -79 -13 250 293 -228 179 136 21 35 -125 11 88 -135
4495a35K28j82Q9K12m10J1K66J79l23k63K22L82m08j21K34k29J83J14l47M26J5
$$ -135 93 -89 0 212 -198 -187 79 258 -65 -328 -106 276 -132 -253 -19 -248 -65 49 -298 128 143
4516A43j73j92J58L32k25k97K58MJ90r7r9N8J67j2l20j79O08j12k74K4J35Q0k08
$$ 143 -30 -222 -64 268 43 -254 4 8 198 101 2 60 227 215 -105 -284 324 212 -62 -38 97 177 -31
4539c1j70L46Rj17l7j68J74M89n02j43L02R4j02p9j57L99l39k05R2K88J51l31
$$ -31 -201 145 154 37 0 -168 6 495 -7 -150 152 246 144 65 -92 307 -32 -237 -145 143 294 -37
4561c7j86K54J76k55j99LM02K3k28lj42K66ok83J88J20k02q8L9K89J70l47o0R
$$ -37 -223 31 207 -48 -247 -244 158 181 -47 -50 -192 74 68 -215 -27 93 -109 -197 -158 131 301 -46 -106 -97
4585i7K45M2m26K68L03k70k88J40L5j31J56k27N04k36L4j93k13P23m32k12M44
$$ -97 148 190 -236 32 335 65 -223 -83 -48 -179 -23 -250 254 18 52 -141 -354 369 -63 -275 169
4606A69j22K31m16n5L26l2q5o7k41K52J75k42j28K99l5N3l47M83k2N4k27l06L24
$$ 169 47 278 -138 -193 133 101 16 -51 -292 -40 135 -107 -235 64 29 82 -265 218 196 250 23 -283 41
4629D1J17r7j60J29K43j15k26kJ43j85K11k7p7L45j53m74L38K65l00l2J2K66n28
$$ 41 158 61 -99 30 273 158 -68 -70 73 -112 99 72 -5 340 187 -287 51 316 16 -16 -4 262 -266
4652b66J86M4L26k48j42J42J85l64P9K0p3K97Rl42ML11j15o1j10n9M55l51k92
$$ -266 -80 -36 290 42 -100 42 227 -137 -58 -38 -111 186 195 -147 -143 168 53 -8 -118 -177 278 -73 -365
4675c65L63n5J15J07m25j8M29j14j83n3M27k27N2J5q0O0J06n5P5k21J49p5l05
$$ -365 -2 -57 58 165 -260 -278 151 37 -146 -199 228 1 53 68 -12 48 154 99 174 -47 102 27 -278
4698b78J43K47l23N1j41L55j0k22P8J58L65m18P0j95M6K52l04J29o4J96k96k54
$$ -278 -135 112 -211 -160 -301 54 44 -178 -100 58 423 5 75 -120 -74 178 -126 3 -61 135 -161 -415
4720d15M84j06n8J7J54J63j02j20J57l87L14L09n27J63l4J29k16m7J11Q6k1J07
$$ -415 69 -37 -95 -78 76 239 137 17 174 -213 101 410 -117 46 12 141 -75 -122 -11 75 54 161
4742A61p2j5k39K59l00L52M22o28J65r1K3k25R1L91k44L34l74l47L83Q4k47M5
$$ 161 89 74 -165 94 -206 146 568 -60 105 14 37 -188 -97 294 50 384 10 -337 46 130 -117 -72
4764g2m5K68j54j17J56p8J57k99R0L71k84k4j17J14J4J19Q3k94J4R6j42K25j12
$$ -72 -117 151 -3 -120 36 -42 115 -184 -94 277 -7 -31 -148 -34 -20 99 182 -112 -98 -2 -144 81 -31
4787c1m6p4m7M25k27j06O1J10k6J84j09j95m8K71k13n2J30p1L4m0K29km0L8p8
$$ -31 -77 -151 -198 227 0 -106 -45 65 39 223 114 -81 -129 142 -71 -123 7 -64 -30 -70 159 157 117 155 77
4812G7j91L19k52j6l2J39j01j1j0j5K33k34K60o1j41P3Pp9L0J82k30K8M0J58k68
$$ 77 -114 205 -47 -63 -95 44 -57 -68 -78 -93 140 -94 166 105 -36 37 44 -35 -5 177 -53 -25 15 173 -95
4837i5k3J38j02L9m0J3K9L2J53N8k60M5%l3m9K14k06k01J32Q0J13K66l67k37N03
$$ -95 -118 20 -82 -43 -83 -70 -41 -9 144 202 -58 -13 -13 -46 -95 119 -87 -288 -156 -76 37 303 -64 -301 202
4862B02j18p0r5m0K67k62j24M31j0k69kL7J5J02r0J3j53K12n7j92J57Q6M4o0o6
$$ 202 84 14 -81 -121 146 -116 -240 191 181 -88 -90 -53 -38 64 -26 -13 -166 46 -11 -203 -46 40 84 24 -42
4887d2L25l26o3J62l9q1OQ7l4J18k72J99Q5l7k71J21j64K67j26K69k70J08J61
$$ -42 283 -43 -106 56 17 -64 -58 29 -5 113 -159 40 125 88 -183 -62 -226 41 -85 184 -86 22 183
4910A83l28Q7J22J34k48J00J96j07Mj88J39p6J33k13j19J45P7N1k48J40n9J04
$$ 183 -145 -58 64 198 -50 50 246 139 143 -45 94 18 151 -62 -181 -36 41 92 -156 -16 -75 29
4932B9q3j59K20j32J32k77K24m1K07j29k12L42J9j55j2n9J57J22k82l1K51K6m28
$$ 29 -54 -213 7 -125 7 -270 -46 -87 120 -9 -221 121 140 -15 -27 -86 71 193 -89 -120 131 157 -271
4955b71J50M2M46k19l63M93k66j38RJ55O0l8m9J65m10J90J99j68M9j38J23k32
$$ -271 -121 -79 367 148 -215 278 12 -126 -117 38 98 60 11 176 -234 -44 155 -13 36 -102 21 -211
4977b11K73J69l32L4R5R6J8J6l41K32L7p2j86J61J15J36q4l50J75J81n2l56P3
$$ -211 62 231 -101 -67 28 124 142 158 -183 49 86 14 -172 -11 104 240 156 -194 -19 162 110 -246 -173
5000a73L03k84J21J09m2K05k45j07K9J65p7j99L15J17j11j75J6J02J29p5m87K17
$$ -173 130 -154 -33 76 34 239 -6 -113 -84 81 4 -195 120 237 126 -49 -33 69 198 123 -364 -147
5022a47L47Qj30m37M72K98m83M6O2j01j56PM58n4j45j25l0l6K67k61L5J48J56
$$ -147 200 208 78 -359 113 411 -72 -26 36 -65 -221 -214 244 190 45 -80 -110 -146 121 -140 -105 43 199
5045A99J25n81O1N59m69k28O44o9j11m90L44l8k4L05l55N0K02J66m33J64J69m6
$$ 199 324 -257 -196 363 -106 -334 310 241 130 -360 -16 -54 -78 227 -128 -78 124 290 -143 21 190 144
5067A44o20N93l3j63K55q9k87J12K36n2j71PN81l01m57K85J5j81m5L91k89P1L23
$$ 144 -476 117 84 -79 176 87 -200 -88 148 96 -75 -68 513 212 -245 40 55 -126 -171 220 -69 2 325
5090C25l97K41l6j98r3L1K53m5j73n5K10j89J69Qj18O5Q9k5m03M13N25n70k21
$$ 325 -72 169 133 -65 -158 -127 126 81 -92 -147 63 -126 43 51 -67 -2 87 62 -341 72 597 27 -194
5113a94K00K25j51o37L40M30k68k91O3O8M10k63r3K6L9J62l19K80J87j5m80R7
$$ -194 6 231 80 -557 -217 213 -55 -346 -283 -215 195 -68 -161 -135 -96 66 -253 27 214 199 -281 -184
5135a84p5L08N8m61J91J99j25N5j3j8J89k4m95K32L06r5j01j10JJ51J81k93K86
$$ -184 -259 49 107 -354 -163 36 -89 -34 -47 -65 124 100 -395 -163 143 48 -53 -163 -162 -11 170 -123 163
5158A63p7j45j82M31l52O5J08k1K56j35l16K26l4J70k36r2L50k0k09j18l7O47
$$ 163 86 -59 -241 190 -162 -97 11 -10 246 111 -205 21 -13 157 -79 -171 179 159 -50 -168 -205 442
5180D42l14n2r5j4J29k14q8L7J50J02j87j20L39j87J43k56J6K73k9o57O66J23
$$ 442 128 76 -19 -33 96 -118 -206 -169 -19 83 -104 -224 115 -72 71 -185 -169 104 75 -582 84 207
5202B07l42O1j13L24jj45j5J7K4j3k39J09K09l71J27K57j25J44l13J89p3j11L34
$$ 207 -135 -74 -187 137 136 -9 -24 -7 17 4 -235 -126 83 -288 -161 96 -29 115 -198 -9 -82 -193 141
5225A41l42QQ2N85m96j93J13J60j55j79L13l32L30j34K2m2M7J86j21O0m2O7l24
$$ 141 -201 -193 -111 474 -22 -215 -102 58 -97 -276 37 -295 35 -99 -77 -119 -72 114 -7 53 11 78 -246
5248b46K47J14n4K08n93L94K17l58K36k15J93Ok51J1K17PO4k88k0q0J53J89k97
$$ -246 1 115 61 269 -324 70 287 -71 165 -50 143 149 -102 -91 126 133 197 -91 -111 -191 -38 151 -146
5271a46K71J41k64Q0j10k4K22j00q1M6m9J53rOj46r2K58k65K48j7k4k29NK69L8
$$ -146 125 266 2 82 -28 -52 170 70 -11 35 -14 139 130 136 -10 -102 156 -109 139 122 98 -131 -126 143 181
5296A81j40k64L66K53o50K9K89oJ07j97L0nk02r3q0mM21j0j2P6k78J56J1L5J32
$$ 181 41 -223 143 396 -254 -225 64 58 165 -32 -2 -7 -209 -302 -382 -386 35 25 13 89 -189 -33 -22 13 145
5321A45l5j66R5j04K6J31n7o0K7p0J16m23L81N3J01k46J69m3P5j30N6m7K16l11
$$ 145 110 -56 39 -65 -39 92 35 -25 2 -68 48 -375 6 59 160 -86 83 40 115 -15 41 -6 210 -101
5345a01J12Q8J04k86p7P0L4K11j23r8J99J75k74k7J0P3j62L41j05L8k66J89j92
$$ -101 11 99 203 -83 -160 -90 -56 155 32 -66 133 308 34 7 17 90 -72 269 164 202 -64 125 -67
5368f7N4J77k47o0R2K01j52OK37k71N3P3o4j1K81k82L8j14R4J21l94J24J0J51
$$ -67 -13 164 -83 -143 -51 150 -2 4 241 -30 23 96 32 21 302 20 58 -56 38 159 -235 -111 -101 50
5392E0J68j99k82L59k87J78k21K65j7K9k63M64J6l97J30j86J13J33k38K2k3p5
$$ 50 218 19 -263 96 -191 -13 -234 31 14 43 -220 244 260 -137 -7 -193 -80 53 -185 -163 -186 -261
5414b61J54k7K22r1K19l23K01j34Q2j4j68K93r8L7k02K83k01l0L5j1q1K34j81
$$ -261 -107 -134 88 -3 216 -107 94 -40 42 28 -140 153 55 92 -110 173 -28 -58 -23 -34 -115 119 -62
5437f2K71p7j40J67pj34K93k65L9R9j59n5p1JJ77j02L1J14j42qJ26l66M20j71
$$ -62 209 132 -8 159 152 18 311 46 85 184 25 -30 -101 -100 77 -25 6 120 -22 -30 96 -270 150 -21
5461b1R7q0k43L20l7m3l4p0R2j37r6L71k06J63j21J24J9J2k94J42q1J10P4k03
$$ -21 76 -4 -247 73 36 -7 -41 -111 -19 -156 -252 119 -87 76 -45 79 98 110 -184 -42 -123 -13 61 -142
5485a42K27K72m91p2K57K9j07L2l10K58j27J90k69K96j03j01j92K91K59k32j03
$$ -142 85 357 -134 -206 51 80 -27 5 -305 -47 -174 16 -253 43 -60 -161 -353 -62 197 -35 -138
5506a38J22j89K82k08M0j0K99M0j55j32R9m1K01k67J54j13j21N1O4Qj41J48Q3
$$ -138 -16 -205 77 -131 -91 -101 198 238 83 -49 50 9 210 -57 97 -16 -137 -86 -22 -14 -155 -7 76
5529G6L66o14L59j84j6J39J1k57K70o0Nq7M2k0K19l88K51J15k13P1k2j61J16j55
$$ 76 442 -172 187 3 -13 126 137 -120 150 90 95 8 50 30 249 -139 112 227 14 85 63 -98 18 -137
5553a37J44j42J62K30l14M7O3P0j13J19k77K77L8l19k14L02J66k28%J32j4J00
$$ -137 7 -135 27 257 -57 -10 53 123 10 129 -148 129 167 -152 -366 -64 102 -126 -126 6 -8 92
5575I2j91k5O3k4kM3P8Q2J78l44K8k6K81j11l45L86k14m3O1p8J67k14R1J80k1
$$ 92 -99 -124 -61 -85 -87 -44 34 116 294 -50 -22 -48 233 122 -223 163 -51 -94 -33 -111 56 -158 -67 113 92
5600I2k55Lj78K65L16j5k19o9K50j82l32L36R0j46P1Kj32K47k75J94p1J50j62
$$ 92 -163 -160 -338 -73 243 228 9 -60 190 8 -324 12 102 -44 27 29 -103 144 -131 63 -8 142 -20
5623b0k00l6M03k76m8J51L9N5Q6j77j76K66p6L25n79M63j88K9j51J15K4P2k81
$$ -20 -220 -256 147 -129 -177 -26 13 68 154 -23 -199 67 -9 316 -263 200 12 41 -110 5 29 101 -180
5646a80J31K41j47K6l11K95K40l40j89P9M61l10n3J7K30q9J10r1j83K22j54L5
$$ -180 -49 192 45 71 -240 55 295 -45 -234 -155 306 -4 -57 -40 190 101 211 120 -63 159 5 40
5668D0k78N5R0j68K55J80j47J37l01J90J01k15o9J59L00l37K15n08L36J26L1l52
$$ 40 -238 -183 -93 -261 -6 174 27 164 -137 53 154 -61 -130 29 329 -8 207 -301 35 161 192 -160
5690a60O3R8J67l19J50m1K24k84K59k41j42L28l33J11L41J06m39M4J73j5k25J13
$$ -160 -97 1 168 -151 -1 -42 182 -102 157 -84 -226 102 -231 -120 221 327 -112 -68 105 90 -135 -22
5712b2j85L47r5n4j03J15J77k01K0P9K2J82l04K3j49Q8M1o1K70k18K02m24J17
$$ -22 -207 140 45 -9 -112 3 180 -21 -1 78 100 282 -22 1 -148 -60 -19 -80 190 -28 174 -250 -133
5735a33M22l32M9k64N00k38j01m2K67j79J21l08L51m2M6q5j29L23j22J67l95K29
$$ -133 289 -43 6 -258 242 4 -97 -139 128 -51 70 -238 113 71 117 32 -97 226 104 271 -124 105
5757A05p6j14r3J19pN5J39k59j92M21j30j82K33Q8k51K59M5P8j74j46k44K86k0
$$ 105 29 -85 -178 -59 -66 -11 128 -131 -323 98 -32 -214 19 107 -144 115 160 238 64 -82 -326 -40 -60
5780f0J47k63L32l2p1m5O6J15m3j75J69k7N0J42m36M01j84k18pJ21j10J23M1m6
$$ -60 87 -176 156 124 53 8 74 189 146 -29 140 113 163 305 -131 270 86 -132 -139 -18 -128 -5 36 -10
5804a0K2J79l18J52j85K81K20l37K28l78K77k28J27j11K45j23k39L04j40L3j74
$$ -10 12 191 -127 25 -160 121 341 4 232 -146 131 -97 30 -81 164 41 -198 106 -34 -1 -175
5825a75J65J50k15K39l17q0L56j47J08k96J56K54m62K85k99L57K7k43K8J31j01
$$ -175 -10 140 -75 164 -153 -233 123 -24 84 -212 -56 198 -264 21 -278 79 106 -137 -109 22 -79
5846g9K25m8m29M73j38r4K22k64L30j65l2J15K8m04O8K92p1j93L0KL7J80l7R9
$$ -79 146 98 -331 142 4 -90 132 -132 198 33 1 116 144 -260 -192 100 29 -164 -134 -132 -95 85 48 147
5870A47k62K97j2j93j69O4L69r1k5K85n69J74J0O2j34Q8J22n2Q8K25k82l60K15
$$ 147 -115 182 170 -23 -192 -128 241 150 125 410 -159 15 25 87 -47 41 163 111 199 424 142 -218 -3
5893ck01K00j40J17Q9J44J6k65M2Kj18n1J4K27r3j46K25m1r7j3n3K8K16p8m7j38
$$ -3 -204 -4 -144 -27 62 206 222 -43 -1 1 -117 -168 -154 73 -20 -166 59 18 -79 -92 -145 -117 99 21 -26 -164
5919a64L65m6j15n99N28J1l05K18j33J75J59p0r7k00L38j18k6P7K71j41k37J4
$$ -164 201 155 40 -559 -31 -20 -325 -107 -240 -65 94 24 -73 -273 65 -53 -79 -2 269 128 -109 -95
5941i5nJ97j75k36J89j53J22K32j88J02J21p3k67L51J57l7j43j27p0J05r0k7R0
$$ -95 -100 97 -78 -314 -125 -278 -156 76 -112 -10 111 38 -229 122 279 242 99 -28 -98 7 -83 -110 -20
5964b0J64j4Q1k44k0J67q7j66Q5k6m2K07o3O6J1j34K07j9J0j79L8NM6K7r2j1J31
$$ -20 144 130 211 -33 -53 114 27 -139 -54 -80 -122 85 22 88 99 -35 172 153 163 -16 22 27 73 100 8 -3 128
5991A28k2l75K33L0M4J0k89J70J33k97N1K29K1J24j68J02O6Jk75J17k00L36k83
$$ 128 106 -269 -36 -6 38 48 -241 -71 62 -235 -184 45 66 190 22 124 190 191 -84 33 -167 169 -114
6014a14%j17J89j17K10n9R1o3ol6M2M4p5J07j10j07K82m6l0Pn7k30R2L27j88l6
$$ -114 -114 -231 -42 -159 51 -8 83 20 14 -22 20 64 -11 96 -14 -121 161 115 85 92 35 -195 -103 224 36 0
6040@J9K14l03R4k3p3k67N54q8k28O0l7K14k23j41K05Lq5L27m65N56j81Qj56j7
$$ 0 19 233 -70 24 1 -72 -339 215 127 -101 -41 -78 136 -87 -228 -23 -20 -105 222 -243 313 132 140 -16 -33
6065c3J23M9r8J08q6j69Or0K28J17k50K2LJ04q0P4K07m0j37l44J35J81K6j41J4
$$ -33 90 139 41 149 63 -106 -100 -190 38 155 -95 -73 -70 34 -46 28 235 195 58 -286 -151 30 56 -85 -71
6090g1J75q4k6j51K49j62q6J14J8R3k27J89j08K94k48j15LK68o8k59K9R3j7M6
$$ -71 104 20 -6 -157 92 -70 -156 -42 -24 69 -158 31 -77 217 -31 -146 -143 125 57 -202 -173 -80 -97 -51
6114e1l4K01J40l92K28j69k7K36k10j14K71K1j07J33R4r2q0j52N6J60k67J31J0
$$ -51 -85 116 256 -136 92 -77 -104 132 -78 -192 79 100 -7 126 220 128 48 -104 -48 112 -155 -24 -14
6137a4K41m28J39R3J56l8p2l99L17J82k00J25k48R0K10k87J8M60n84L61p6M1M1
$$ -14 227 -201 -62 31 187 149 77 -322 -5 177 -23 102 -146 -56 154 -133 -115 345 -239 122 46 87 128
6160A28j67L6QJ41k68j13J57K19J08J4j63j47J58N2j39J99k82K43j74k17L34J04
$$ 128 -39 -3 5 146 -122 -235 -78 141 249 263 100 -47 111 163 24 223 -59 184 10 -207 127 231
6182B31j50m5m0j89L84k91K01j98p1J86k76K45K0j26k9j13M34k56J5K5p5J62r6
$$ 231 81 36 -4 -193 191 -100 101 -97 -168 18 -258 -13 7 -119 -148 -261 173 -83 -68 -43 -118 44 -52
6205e2J0Q2M2j95j48M62j36J94j77p3J18j51RJ13j08L78k98j06J48k5k8n5o9J86
$$ -52 -42 40 82 -113 -261 201 65 259 82 9 127 -24 -15 98 -10 368 70 -36 112 87 59 4 -65 121
6229A21M0m32O6L41j62K38l53J25J30j39J05r1j43J98l9n7J10M6o7j6o6K5K14
$$ 121 161 -271 -205 136 -26 212 -141 -16 114 -25 80 -11 -154 44 5 -52 58 104 37 21 -45 -20 194
6252A94j44Q3p4J00l16K52j19o9L29j47l16R3R9P7R0k2K12l28r0r5NQ9K53l25
$$ 194 50 133 59 159 -157 95 -24 -93 236 89 -227 -134 -35 42 132 110 322 -6 -96 -191 -186 -97 156 -169
6276a69K27m9j77K1J52o6J4j20M6O3q7K2Q1r1K34j69K9j94K48nk9K0J0j6j05q4
$$ -169 58 9 -168 -147 5 -61 -47 -167 -121 -58 -145 -123 -42 -133 101 -68 -39 -233 15 10 -19 1 11 -5 -110 -194
6302a94j47M78J65m82J40r5K24j84j36K28L57m93o7J55j20L78m63J9L30n3k6J72
$$ -194 -341 137 302 -180 -40 -135 89 -95 -231 -3 354 -139 -206 -51 -171 207 -256 -237 93 40 14 186
6324A86m0k2k05J94o5j51L02k23r4K41k36J85j55J50k80K86k2j2o1MJ4j48J59
$$ 186 146 124 -81 113 48 -103 199 -24 -118 123 -113 72 -83 67 -213 73 51 39 -22 -18 -4 -152 7
6347GR6J0j4K2j12r9l3J76N5P2l11J1j7O6n7K25Qo4k55L6J1K8oJ29R4j12K4l3
$$ 7 103 113 99 121 9 -90 -123 53 108 180 -131 -120 -137 -71 -128 97 105 41 -214 -178 -167 -139 -145 -16 78 -34 -10 -43
6375d3M8j26J13o8J50l48K09j49K94j95l66N10o5J98Oj90M5O0k86O4L3r0K59j82
$$ -43 5 -121 -8 -76 74 -274 -65 -214 80 -115 -481 29 -36 162 168 -22 23 83 -203 -139 -106 -196 63 -119
6399a19J70J08O9o5k21J27M2n4K0j55K0O8j85L06k62R6P7kj76L54pm15K16r6J83
$$ -119 51 159 228 163 -58 69 111 57 77 -78 -58 10 -175 131 -131 -35 42 40 -136 218 211 -204 12 -84 99
6424I9j12N3J10k60K53j9k24K10KoJJ0k6Qm49M39m8j67K13j41J18pm5r8Ml2P5
$$ 99 -13 40 150 -110 143 124 -100 110 112 106 107 117 91 99 -350 89 41 -126 87 -54 64 57 12 -86 -82 -114 -39
6451c9nl1N9J73j98L22k79J02j60r4K19j09J7l7N1k5J66p9k11jN1N5r6J89j26
$$ -39 -44 -75 -16 157 -41 281 2 104 -56 -150 69 -40 -23 -60 -9 -34 132 53 -158 -159 -108 -53 -149 40 -86
6476h6J7j58K03J15k40J91o7J04j96J46k47L20Q3l54N5j88L05J99j53J19m6m03
$$ -86 -69 -227 -24 91 -149 42 -25 79 -117 29 -218 102 185 -169 -114 -302 3 202 49 168 122 -281
6498b81K04j38J00J99r1L31m20L23m21Q4O5r0K63Q2j06jl8k7l4J31Q0l01K94k98
$$ -281 -77 -215 -115 84 -7 324 -96 227 -194 -110 -45 -135 128 210 104 103 65 38 4 135 215 -86 208 -90
6522i0M0M3R0j52p7L4K32j33q9L9j8j2j73L92n4k0j13j19J9j0K65k04J16j81K83
$$ -90 -50 -7 83 -69 -146 -112 120 -13 -102 -63 -81 -93 -266 126 72 52 -61 -180 -161 -171 94 -110 6 -175 108
6547A08j78J31J27m44K29N4k11k4j2K20M9o2j2l1J24j18o1L9J18j31L15l08r6
$$ 108 -70 61 188 -256 -27 27 -184 -208 -220 0 49 -13 -25 -56 68 -50 -111 -72 46 -85 230 -78 -174
6570a74K19k0j42O8r0K40k63J02O2n2N4J09M2j26k4k3j14K33K9R2j57J6m39K18
$$ -174 45 25 -117 -49 -139 101 -162 -60 2 -50 4 113 155 29 5 -18 -132 101 130 222 65 81 -358 -140
6594a40K45k99J92p4J70j36M13k64q6J58k37k2J06j37J9Q3OJ06j55k0R1J34l01
$$ -140 105 -194 -2 -76 94 -42 371 107 21 179 -58 -80 26 -111 -92 -9 -3 103 -52 -72 19 153 -148
6617a48Q0J53o5J16l5j57m0p8O0o7R8k0J12J49n20M14j20j98M93l3l82j32N69
$$ -148 -68 85 20 136 101 -56 -96 -174 -114 -181 -83 -103 9 158 -362 52 -68 -266 227 194 -188 -320 249
6640B49l42Q8j58K3K35l3j31jQ0R3%j72O6qq1j29N8L44k23k12K69l6J7P9m39L76
$$ 249 -93 -5 -163 -140 95 62 -69 -70 10 103 103 -69 -3 -11 -92 -221 -163 181 -42 -254 15 -21 -4 75 -364 12
6666A2j01j07K50O9p6J28j36n2K61m10K42P4k8L4k53J75M5j00K1J19r8j94K36
$$ 12 -89 -196 54 123 47 175 39 -13 248 -162 80 154 126 160 -93 82 127 27 48 167 69 -125 111
6689A11k35J29r7K70J84k76L09l74k43K32m4J37Q0k88J50J12n6ol53J11K72j51
$$ 111 -124 5 -92 178 362 86 395 21 -222 10 -34 103 183 -105 45 157 101 95 -258 -147 125 -26
6711b6K6P6o3P0J52k74K05l00J64j23K2j28K03J09j92OJ73J80m88J51o3k0L27
$$ -26 0 76 13 83 235 -39 166 -134 30 -93 -71 -199 4 113 -79 -73 100 280 -208 -57 -120 -140 187
6734A87l04R1J5j22L45l76K86J44j32q4J71l89J99n6k77K91j3J52k47o0L07l16
$$ 187 -117 -26 -11 -133 212 -164 122 266 134 50 221 -168 31 -25 -302 -11 -24 128 -119 -179 128 -188
6756a88n5N17k78qk4O1j05L58l19L5p8K59j32k79K11J58r2J65k75P0q2j47J01
$$ -188 -243 274 -4 -12 -36 25 -80 278 -41 -6 -84 175 43 -236 -25 133 41 206 -69 1 -81 -228 -127
6779a27J03K6r3J46j13L97m47J11j11QK15j40J88j56O9k65J17K75k34Q4Q0K4j61
$$ -127 -24 2 -91 55 -58 339 -108 3 -108 -100 115 -25 163 7 76 -189 -72 203 -31 53 133 157 -4
6802dK50k26j68J01N9q2q6J2J70J90k18Lj45j29J14J42j8k58J77J65Qj26K24k25
$$ -4 246 20 -148 -47 12 -70 -156 -144 26 216 -2 1 -144 -273 -159 -17 -35 -293 -116 49 57 -69 155 -70
6826g0J39j35kk8j10M0Q1K62j6k82P8J66j52O9qKK2oJ34R3k74jj19J78j45Q2J16
$$ -70 69 -66 -68 -96 -206 -166 -85 177 161 -121 -43 123 -29 40 32 34 56 50 184 277 3 2 -117 61 -84 -2 114
6853A14j21N6L9j40K0Q7J88l15P7l0M9J66k00PPJ75l46M07k82J52o3Rj4N9K73
$$ 114 -7 49 88 -52 -32 55 243 -72 5 -25 24 190 -10 -3 4 179 -167 240 -42 110 47 56 42 101 374
6878C74l74j21k3L49m2m2j78K87j78j17L1R6L8O7j37J31l7k03J85k97K77L1l6
$$ 374 0 -121 -144 205 163 121 -57 230 52 -65 -34 62 100 167 30 161 124 -79 106 -191 86 117 81
6901H1j13j03O0J6J5j8o9LL30m59Q9K59k08m06M06L44m83L05j86K64j37j5K48
$$ 81 -32 -135 -75 -59 -44 -62 -131 -128 202 -257 -168 91 -117 -523 -117 227 -256 49 -137 127 -10 -25 223
6924B23k01n0j70o6J79j06J52j65J99Q5rk90J85q4J70L7K4k83K76j18j15J36m9
$$ 223 22 -28 -198 -264 -85 -191 -39 -204 -5 80 71 -219 -34 -118 52 89 113 -170 106 -12 -127 9 -40
6947d0j54K29n2L8K12r0o4Nk32J40K44l16L00Q3k80r3k3o5N08k30k50K68J3o0
$$ -40 -194 35 -17 21 233 143 79 84 -148 -8 236 -80 220 303 23 -70 -93 -158 350 120 -130 138 151 91
6971I1j51k8L02j96k2l0K14J06mk56r2J67J9q0J04j1o9k38K34N0j06J55j5l44
$$ 91 -60 -88 214 18 -4 -34 180 286 282 26 -66 101 120 40 144 133 64 -174 60 110 4 159 144 -200
6995b00J81l3J19J9J9j29n0k2K72j98MK1J53l05P8J16o8Q0j19J22p7KK03k09j72
$$ -200 -19 -52 67 86 105 -24 -74 -96 176 -22 -18 3 156 -149 -71 45 -23 57 -62 60 -17 -15 188 -21 -193
7020a93K23Q0p9k69J05J64j4P8j29j43K18J39j11l49L90j9j76P9j62J45J27r0
$$ -193 30 110 31 -238 -133 31 17 95 -34 -177 41 180 69 -280 110 91 -85 -6 -168 -23 104 14
7042A4K17k02l0j08j11J32R2J31p7m1o7j76L09k04K53rj41j6JN5j2J23l08K12
$$ 14 231 29 -1 -109 -220 -88 4 135 58 17 -50 -226 83 -121 132 123 -18 -34 -33 22 10 133 -175 37
7066C7l2R3j87K83l47K1J82k82L33k35O0K8o2L50k57N2K11j50j69R5K7J4j33L8
$$ 37 5 98 -89 194 -153 -132 50 -232 101 -134 -74 -46 -108 242 -15 37 248 98 -71 24 51 65 -68 -30
7090c0J2r0L27k16j04K63L1j47P3l05K26j38j24J32J56m7m1K1L56o04K52j6J65
$$ -30 -18 -108 219 3 -101 162 193 46 119 -186 40 -98 -222 -90 66 19 -22 -1 355 -249 3 -13 152
7113A52j50L61l31k79L68l25K44k94J92R4M9j10N1J88k13J02j2K9k96J00p5J23
$$ 152 2 363 32 -247 121 -204 40 -254 -62 32 81 -29 22 210 -3 99 87 116 -180 -80 -155 -32
7135c2R3p5M5j39M54j62j63Q4j61K08k58J26L37l88nJ89q2J48j2j75l7Jk8JN5
$$ -32 61 -14 31 -108 346 184 21 105 -56 152 -106 20 357 -31 -36 153 71 219 207 32 -5 -4 -32 -31 24
7160B4J23q6p0J00L2l30J47l17L90J01k44L36j45j67K51n95K90J45k66K07K43
$$ 24 147 61 -9 91 123 -207 -60 -377 13 114 -130 206 61 -106 145 -450 -160 -15 -281 -74 169
7181A69M4k10o1m0R5J43J05l64l7O8j26r1O5K57kk17K92O4k12j38M66n57L75j36
$$ 169 213 3 -58 -98 -3 140 245 -119 -156 -88 -214 -305 -240 17 15 -202 90 154 -58 -196 270 -287 88 -48
7205d8J13Q4l70J12J60j57K34qj3j92M3j4j%oj53m2K72K00j87Ln7N7r2R8k6j37
$$ -48 65 149 -221 -109 51 -106 128 120 107 -85 -42 -56 -57 -57 -63 -216 -258 14 214 27 30 -27 30 -62 36 10 -127
7232a27J68j61J96J63r8L3l5J23l83P2n6K45n0j85J37j71M7k9O0K35Kj14R5K4
$$ -127 41 -120 76 239 141 174 139 262 -121 -49 -105 140 90 -95 42 -129 -82 -111 -51 184 186 72 167 191
7256A91k17N8j88R5R5m8L1r3M8j91K39L2j85l8M33l83J17jK03k71J8j3O0Q6K5
$$ 191 -26 32 -156 -61 34 -14 17 -76 -28 -219 20 52 -133 -171 262 -121 -4 -5 198 -73 -55 -68 -8 78 103
7281A03l2l68N98j12l65L40l18J87l30J33L23k13M0J52j41O5M2j52K15k66J3N3
$$ 103 71 -297 301 189 -176 164 -154 33 -297 -164 159 -54 -14 138 -3 62 104 -48 167 -99 -86 -33
7303c3L7J12qk51L57j39p5J0j95K77m59L28k1N5J76k15J00j68R6o3O8J10k46K56
$$ -33 4 116 108 -143 214 75 0 10 -185 92 -367 -39 -60 -5 171 -44 56 -112 -16 -79 -11 99 -147 109
7327A09k38P8Q4q6L01l08J1J87j72K54j79r2J73j76L17l77K1N5O9ok7o3j1j89
$$ 109 -129 -51 33 -53 248 -60 -49 138 -34 220 41 -51 122 -54 263 -114 -93 -38 31 25 -2 -65 -76 -265
7351b65L89n9j5k10P9P9mM7j72j78L45J6j19j18K45q0r6J39n9k9J77O2k87J42
$$ -265 124 65 50 -160 -81 -2 -6 41 -131 -309 36 52 -67 -185 60 -20 -116 23 -36 -65 112 174 -113 29
7375B9JJ62l95M1N56l01j29O7M1k95p9K23K95j95j36J79p6L9p6Q4J04k43L50k39
$$ 29 30 192 -203 -162 394 93 -36 31 72 -223 -302 -79 216 21 -115 64 -12 27 -49 35 139 -104 246 7
7399Gj09J77l7K74m36J13J48j40m6L42m33L56q0j15l12N81k61J19k83R8P2J14
$$ 7 -102 75 38 312 -124 -11 137 -3 -49 293 -140 216 136 21 -291 290 29 148 -135 -37 35 149
7421A49J22n06L29J83m19K81J5lk68Q6k3J15j66n9M00m07J50Mj33n5P6J53r2o3
$$ 149 271 -235 94 277 -142 139 154 151 -117 -31 -54 61 -105 -164 236 -171 -21 -17 -150 -205 -129 24 -68 -131
7445a31LQ9n6P6o3J85j75O3q0p4J9O8L60j57K3o4j87Q9Q3J76l12l9K04N4j38L6
$$ -131 -128 -39 -95 -19 -82 103 -72 -9 -89 -163 -144 -76 284 127 150 86 -101 -12 71 247 -65 -104 100 154 16 52
7471E2P4O9j33k52L05N4j14q7L0j59K09j14K22N7p16N23j44P4j3j06J70J79j01
$$ 52 126 195 62 -190 115 169 55 -32 -2 -161 48 -66 156 213 -503 20 -124 -50 -63 -169 1 180 79
7494G9L9l9N7J95m89N45m92j12L87m07L0L94q6J21k82Q2j2O4k3j48j1M6M7j48
$$ 79 118 79 136 331 -158 387 -105 -217 170 -237 -207 187 101 222 -60 22 10 74 51 -97 -108 -62 -15 -163
7518a63k2J20K1K59m53L69K5k44J43q9J3o6K66k16P7J72k1k72J44j55O3r7P5P4
$$ -163 -185 -65 -44 215 -238 131 156 -88 55 -34 -21 -87 179 -37 40 212 191 -81 63 -92 -29 -126 -51 23
7542B3k12J84n5J29j35J29l31J93N8l7k7J30l53L67L7l4j34j84K01K10j03k01
$$ 23 -189 -5 -60 69 -66 63 -268 -75 -17 -54 -81 49 -304 63 100 66 -68 -252 -51 159 56 -145
7564a45K11q5k9R0R7J21m60K29j12j38K15o2K26O2j59l1k06J31K04j72Q4j08j9
$$ -145 66 -19 -48 42 139 260 -200 29 -83 -221 -6 -68 158 220 61 30 -176 -45 159 -13 71 -37 -56
7587e6J15j75P1J19Jp0J64j20j40k3K9K67l32J3J61k06L19l29J70Jk4j8K71j45
$$ -56 59 -116 -45 74 75 5 169 49 -91 -114 -85 182 -150 -137 24 -182 137 -192 -22 -21 -45 -63 208 63
7611F3j41L33j64p4j60J44K47m06O4j37J28ml5J83k9j8l57M03p2N3r7M0N9p7R5
$$ 63 -78 255 91 17 -143 1 248 -158 -94 -231 -103 -107 -142 41 12 -6 -363 40 -32 21 -76 -36 23 -54 41
7636D1j57j06K86j71j10J15R1J20N3m22J59J03M7k48L13j2O3k10J04j56J25l8
$$ 41 -116 -222 64 -107 -217 -102 -11 109 162 -260 -101 2 49 -199 114 102 165 -45 59 -97 28 -10
7658a0R9k26J27N5J7j4j49Q9QJ47l62L02N3k74N0L34k24K39n42L84N9k50J90p0
$$ -10 89 -137 -10 45 62 48 -101 -12 -4 143 -219 83 136 -138 -88 246 22 261 -281 103 162 -88 102 32
7682C2j67K16N5J78k90N4q4j00J67oj7L0k4K10k89j96J03l2K68j76O0pJ83k00
$$ 32 -135 81 136 314 24 78 -6 -106 61 55 38 68 44 254 -35 -231 -128 -160 108 -68 -8 -15 168 -32
7706c2k10L35l31L76LJ48k37j77j5O9J54l21K08j3J66J28j76m5j58p5Q2J67j82
$$ -32 -242 93 -238 138 141 289 52 -125 -140 -71 83 -238 -30 -43 123 251 75 30 -128 -203 -121 46 -136
7729a36J72j99p7J65k2K51r5l12K43k6P6j41m2J43k79M55l21N0L22l64P4L14j48
$$ -136 36 -163 -240 -75 -97 154 59 -253 -10 -36 40 -101 -143 0 -279 176 -145 -95 227 -137 -63 251 103
7752A03l58M35k74P0J36k37J90k78J44L05l69K26Q5k70j55K22K15o4j19q8j55
$$ 103 -255 180 -94 -24 112 -125 65 -213 -69 236 -133 93 178 -92 -247 -25 190 126 7 -81 -236
7773b36M59o7K3l10K52l5O5k62O3N1J53Q6m09K09j83Q9l0K89j03q7m3k04J88n2
$$ -236 223 156 179 -131 121 86 151 -111 -48 3 156 242 -167 42 -141 -52 -82 207 104 17 -26 -230 -42 -94
7797i4qL0n5M67l68J48j12K5j4P4j97J75R3P1p4k25O5j38rL51j51k36J74J70l91
$$ -94 -102 -72 -127 340 -28 120 8 33 19 93 -104 71 164 235 161 -64 1 -137 -146 205 54 -182 -8 162 -229
7822b29L57k03K2j80L08k18j34M40k43J56N5J37l15q2k9K53k8j94K29N3n56L66
$$ -229 128 -75 -53 -233 75 -143 -277 163 -80 76 131 268 -47 -129 -158 95 67 -127 102 155 -401 -35
7844c5K13q5k37J66m28K90L02q0Q7l17KK39n8%j20k5J72M3K3r3k40J22K3P8O6
$$ -35 178 93 -144 22 -406 -116 186 106 193 -124 -122 117 59 59 -61 -86 86 129 152 59 -181 -59 -36 42 108
7869A08k34J18J68j02j44j57O09o72L03r8j4J32jk57L05q5J04k91K88J75m79L48
$$ 108 -126 -8 160 58 -86 -243 366 -306 -3 -101 -115 17 16 -241 64 -21 83 -208 80 255 -224 124
7891A24r2o0j0o3J29K08j20k47P2J24l43L12R9o3l32lM79j83J3o9k12K10j23J90
$$ 124 32 -28 -38 -101 28 236 116 -131 -59 65 -278 34 133 70 -262 -265 214 31 44 -25 -237 -27 -150 40
7915D0N0k17j87N98j22k87J5R8o6P3l01L98j2J11r1j14R8p1j56Q4J44j64K94j78
$$ 40 90 -127 -314 284 162 -125 -110 -12 -78 -5 -306 92 80 191 100 -14 84 13 -143 -59 85 -79 215 37
7939C7M2m2k81K90k0J14m7o3M2M5j01r9K05l74K37L6L1k40Q5K7j22L49n6j22n7
$$ 37 79 37 -244 46 26 140 93 30 72 117 16 -83 122 -252 -15 21 52 -188 -103 -76 -198 151 95 -27 -84
7964h4J07l2K3o3K15k44Q3j37L07k63O8k16M32l32J48j8K43l84L3L03m43K45O3
$$ -84 23 -9 14 -49 166 -78 5 -132 175 -88 -20 -236 196 -136 12 -6 237 -147 -114 189 -254 -9 54
7987E4L7K2l01J89r0m3J41k65M30k40J41p0j92K53k65P8N1K8K2J7j01L1K00k70
$$ 54 91 113 -188 1 -89 -132 9 -256 174 -66 75 5 -187 66 -199 -121 -70 -42 -20 -3 -104 -73 127 -143
8011a43L18j82k61K56k12m3K20J30n8n4M5J14j85J04P1j6K07j86j20j08k08L64
$$ -143 175 -7 -268 -12 -224 -267 -47 83 25 -29 16 130 -55 49 120 104 311 125 5 -103 -311 53
8033E3j02j09K83j53J00J23j06k6k24J31m6J73k8j19P6k6K21l47R4oL59l19j92
$$ 53 -49 -158 125 -28 72 195 89 63 -161 -30 -76 97 69 -50 26 0 221 -126 -32 -38 321 2 -190
8056a90M83k11k58P9p2OpJ55j34J54m0Ro4K79m32K66J29N5r3m8N8k85K81l15K84
$$ -190 293 82 -176 -97 -169 -163 -170 -15 -149 5 -35 -26 -90 189 -243 23 152 207 114 66 124 -161 120 -195 89
8081H9j50rL04l30J2q9J40j31K16j11l2R3j33K03n9R9r3J99k85R3J40j46R2l77
$$ 89 -61 -70 234 -96 -84 -173 -33 -164 52 -59 -91 2 -131 72 13 112 19 218 -67 26 166 20 112 -265
8105b65Q9K24j65Q2m1K70n37J69J11R0j12Q1j86M9J6J06K6k71L86j11J32R8p9
$$ -265 -176 48 -117 -35 -76 194 -343 -174 -63 27 -85 -4 -190 -141 -125 -19 7 -264 122 11 143 241 162
8128A62k20J1j74K20J59k25J13K72l84J6J84k58p9K33J03m53K10J76j44N1j02
$$ 162 -58 -47 -221 -1 158 -67 46 318 -66 -50 134 -124 -203 30 133 -320 -110 66 -78 -27 -129
8149a29J09j83L40k43J88n3p0p7o6m4J59K06k54O9R2J32k57K87l1k87O0Q9j04
$$ -129 -20 -203 137 -106 82 29 -41 -118 -184 -228 -69 137 -117 -48 44 176 -81 206 175 -112 -52 37 -67
8172f7j13L06k60K05j70l4L38l12J34k09K10q9K5J33K82n09M3o1M2
$$ -67 -180 126 -134 71 -99 -133 205 -107 27 -182 28 -61 -36 97 379 -130 -87 -148 -106
8191a06
$$ Imaginary data points
##PAGE= N=2
##DATA TABLE= (X++(I..I)), XYDATA
0@%%%%%%%%%%Qj6J6k2L0l2M0n6O5p3R1j15J36j56J83k16K54k92L34l84M40n03
$$ 0 0 0 0 0 0 0 0 0 0 0 8 -8 8 -14 16 -16 24 -32 33 -40 51 -64 72 -84 99 -117 137 -155 179 -205 235 -268
32b68N69o42P26q18R21j032J151j285J430j586J759j951K158k381K628k899L194
$$ -268 301 -341 385 -433 488 -544 607 -678 752 -834 925 -1026 1132 -1249 1379 -1520 1674
49A674l518L876m269M705n193N739o354P053p860Q798r902J1228j2854J4903j7575
$$ 1674 -1844 2032 -2237 2468 -2725 3014 -3340 3713 -4147 4651 -5251 5977 -6877 8026 -9549
64i549K1220k6503L4860n0048Q5975l14067j79511Q84159k16279n99280K76745
$$ -9549 11671 -14832 20028 -30020 55955 -258112 -437623 446536 230257 -369023 -92278
75i2278L27740k95887L3629J36585k95700O7664M82966l32111m88555N01068M02922
$$ -92278 235462 -60425 -26796 109789 -185911 -118247 364719 32608 -455947 45121 448043
86D48043n63945k58274M91067J44031l52947m8140J54340J2265M5306k2145k08989
$$ 448043 -115902 -374176 116891 260922 -92025 -140165 14175 26440 71746 49601 -159388
97a59388O3066K98976p3025l51254N8536L83455l3289l95479J6439L71304M334
$$ -159388 -96322 202654 129629 -221625 -163089 220366 187077 -208402 -191963 179341 183675
108A83675l21444j6115K43924J4402j20984j7646m5024O7620K06486j62262l15158
$$ 183675 -137769 -153884 90040 104442 -16542 -34188 -79212 -11592 194894 32632 -282526
119b82526K70164L54090l58722l23726M09308K22023l86541p5522K62903n3553
$$ -282526 -12362 341728 -16994 -340720 68588 290611 -95930 -171452 91451 37898
129C7898o0645J12511j58262r6705L40758K5869m58987Q1027M84455j90185m04007
$$ 37898 -22747 89764 -68498 -165203 175555 201424 -257563 -176536 307919 117734 -286273
140b86273K44576K49781k12100q6331J08221m3753K5967J28815j67149j61243
$$ -286273 -41697 208084 -4016 -90347 17874 -25879 88 128903 -38246 -199489
150a99489K86603J35083l47479p8415L30508L3988k61852k0331J74043K5290q0735
$$ -199489 87114 222197 -125282 -203697 126811 160799 -101053 -121384 52659 77949 -2786
161b786m2379j3089P4874Q4663j08964j24075J19630J47073j06632j69920Q9871
$$ -2786 -45165 -58254 16620 101283 -7681 -131756 -12126 134947 28315 -141605 -51734
172e1734J83394p6213j73082N3257J47412k0913j15577p703P1347L6306j1377
$$ -51734 131660 55447 -117635 -64378 83034 62121 -53456 -61159 10188 46494 35117
183C5117p9681m1306J33582O7122j72420o9845J84357O4756j74491n0579J44163
$$ 35117 -44564 -85870 47712 114834 -57586 -127431 56926 121682 -52809 -103388 40775
194D0775K8088q3307j5566M364L0762O3142n8720j05006Q2179J27085r7091j31140
$$ 40775 68863 -14444 -30010 -25646 5116 68258 9538 -95468 -13289 113796 16705 -114435
206a14435J06483J10561r5613p3282N6535M3519l830l0384m0032K2200P3883j4044
$$ -114435 -7952 102609 6996 -66286 -9751 33768 29938 -446 -40478 -18278 55605 41561
218D1561j02803J4990J15711k1383j04280J6936P9619J557n9383j9574L9797L0804
$$ 41561 -61242 -46252 69459 48076 -56204 -39268 40351 41908 -17475 -37049 2748 33552
230C3552j3648m6195j0010O3406J9900o9586k4677O0314L4752n0072m5231M2786
$$ 33552 19904 -26291 -36301 27105 47005 -22581 -47258 13056 47808 -2264 -47495 -4709
242d709M3930k8338l9245N110M0401J2688m2653k0843L4076K9855k2000m3137
$$ -4709 39221 10883 -28362 -23252 17149 29837 -12816 -33659 417 30272 8272 -34865
254c4865J6860M7856j3791m1295K466L4783J2275l4614j7128K8220J7959j3291
$$ -34865 -18005 29851 16060 -25235 -22769 12014 24289 -10325 -27453 767 18726 5435
266E435k5457L182L3043j104k9772l128K1411J4539j9417k0295J9064J7541r906
$$ 5435 -20022 -16840 16203 15099 -14673 -17801 3610 18149 -1268 -21563 -2499 15042 5136
279E136j6156j961K2254N254k2970l718J4880R517q862j6398R906J5482p164j0060
$$ 5136 -11020 -12981 9273 14527 -8443 -12161 2719 12236 3374 -13024 -3118 12364 5200 -4860
293d860k225J1526Q551j5671n326J1415M601l474r715K255J2061m188p046k3L947
$$ -4860 -7085 4441 12992 -2679 -8005 3410 8011 4537 -5178 -2923 9138 4950 -2096 -2119 1828
308A828O921p848o146R094Q42k904j670k071N950o76m132J007j170M767l66q202
$$ 1828 8749 901 -5245 3849 4691 1787 117 -1954 3996 3320 -812 195 -975 3792 3426 -4776
324d776N918K345m964J689p52P59K24k278L385l146j056N288m513q11L982l465
$$ -4776 1142 3487 -1477 212 -540 219 443 -1835 1550 -1596 -2652 2636 -1877 -2688 1294 -2171
340b171J414j51j750K551k848K352Q18n199M339J098l796K249j482J814Q87m239
$$ -2171 -757 -908 -2658 -107 -2955 -603 215 -4984 -645 453 -3343 -1094 -2576 -762 125 -4114
356d114L117O98k180K625l381K045K853m982K373Q25j064K121l478J300L350l391
$$ -4114 -997 -299 -2479 146 -3235 -1190 1663 -3319 -946 -121 -1185 936 -2542 -1242 2108 -1283
372a283J148k35n1L698m939j07N391k953n98o45J395M003n749p99M954j479P02
$$ -1283 -135 -370 -421 3277 -1662 -1769 3622 669 71 -574 821 4824 -925 -1724 3230 1751 2453
389B453k768j211P086k234n132J080L049M516o954n086R548J541n211k642M9Q176
$$ 2453 -315 -1526 5560 3326 -1806 -726 2323 6839 -115 -5201 4347 5888 677 -1965 -1916 6260
405F260r74r846J654O260L966p172r518J1572P778j0533n806L382R554K5j3596
$$ 6260 5286 -4560 -2906 3354 7320 148 -9370 2202 9980 -553 -6359 -2977 6577 6602 -6994
420f994m13J0680N158p847j4111J0105J8242j3003j5934P899J6108j793j9022
$$ -6994 -7407 3273 8431 584 -13527 -3422 14820 1817 -14117 -6218 9890 8097 -10925
433a0925j89J6160L257q679j3216M608K3532n860k5954L667K5906K491k7991n579
$$ -10925 -11114 5046 8303 -376 -13592 -8984 14548 8688 -17266 -13599 12307 14798 -13193 -18772
447a8772K7364N350j8427r300O625J9254k34k4910m908K5650J4281k7034k2336
$$ -18772 8592 13942 -4485 -13785 -7160 12094 11860 -13050 -17958 7692 21973 -5061 -27397
460b7397K9844K4303k6266k3492J5798K7000o024k9670o6K5790J0046j8592k4259
$$ -27397 2447 26750 484 -23008 -7210 19790 13766 -15904 -15970 9820 19866 1274 -22985
473b2985J5317L5479j2549m0049M484M5622M412n2451n456M9985M935l6805j0217
$$ -22985 -7668 27811 15262 -24787 -20303 25319 29731 -22720 -28176 21809 26744 -10061 -20278
486b0278K0758J8614m938k5070j4108L2720L4606m6530m6145O0001M3215o1294
$$ -20278 480 19094 14156 -10914 -25022 7698 42304 -4226 -50371 9630 52845 -8449
498h449l5213N0542K6929l4133j6121R284M970K5546m390o0244J5449Q0881k8805
$$ -8449 -43662 6880 33809 -324 -16445 -7161 -2191 23355 18965 -41279 -25830 55051 26246
511B6246q6286L5691Q1140l8494o5300L3944L7871j5618r355j5986q535M7656
$$ 26246 -60040 -24349 56791 18297 -47003 -13059 24812 9194 -161 -16147 -24682 22974
523B2974J5751p0395k0314Q5509K0881r2048j5680Q4024J0965o1774j4637L5703
$$ 22974 38725 -31670 -51984 33525 54406 -37642 -53322 30702 41667 -20107 -34744 959
535I59K3663j2031l0064j1884L3305L8517l8813n9980M4519P1639m2942p9051
$$ 959 24622 12591 -17473 -29357 3948 42465 3652 -56328 -11809 59830 16888 -62163
547f2163L8470Q2867l5494p4103K9600N2191j3261k4102j3729nM3513K1103p3828
$$ -62163 -23693 59174 23680 -50423 -20823 31368 18107 -5995 -19724 -19729 23784 44887 -28941
560b8941l5605J04244L6434j24136k2424J22354L953r5597O061N5590o681q693
$$ -28941 -64546 39698 76132 -48004 -70428 51926 55879 -39718 -33657 21933 15252 6559
572F559j393m2184K4654Q2689n7657j00672Q6817R4793r8174p7037R1778N2889
$$ 6559 5166 -37018 -12364 70325 12668 -88004 -1187 93606 -4568 -81605 10173 63062
584F3062o9999k5011L1056K942J8358L948o4321J669R4766r166j10790J4238J13918
$$ 63062 -6937 -31948 -892 2050 20408 24356 -39965 -38296 56470 47304 -63486 -49248 64670
597F4670j8404j03186J8041P7755o450m8563j3367K2575L1203K935m6493l0066
$$ 64670 46266 -56920 -38879 38876 32426 -16137 -29504 -6929 24274 27209 -19284 -49350
609d9350O2730N1396p7737o1849Q3100O5520p9440o5213P0623N6307n3907l8584
$$ -49350 13380 64776 -12961 -74810 8290 73810 -5630 -70843 -220 56087 2180 -36404
621c6404K3657K1272J5976j2327n3924J0036Q4265j0195j07188J6744J15894k6837
$$ -36404 -12747 8525 24501 12174 -41750 -31714 52551 42356 -64832 -48088 67806 40969
633D0969j03659L0876P4302k0851l9257J59O904K5033K2651n3585m3208Q2437
$$ 40969 -62690 -31814 42488 21637 -17620 -17461 -10557 14476 37127 -16458 -59666 22771
645B2771M8516r9165m1856R7581L3564q0547k8399N6129K4171k4622k2435j1591
$$ 22771 71287 -27878 -69734 27847 61411 -19136 -47535 8594 32765 8143 -14292 -25883
657b5883K8730M2649l9034o1370M4895P0879m3410p5560L8888P2728l0943o0407
$$ -25883 2847 45496 6462 -54908 -10013 60866 17456 -58104 -19216 53512 22569 -37838
669c7838J5386M4681O423l2122k6633J9432M2394m311n7592q825P0002J5248p3344
$$ -37838 -22452 22229 28652 -3470 -30103 -10671 31723 27412 -30180 -39005 30997 46245 -27099
682b7099j8660O5208K4578n3181k9501L7622L0522j6071l2151r391L8130K9239
$$ -27099 -45759 19449 44027 -9154 -38655 -1033 29489 13418 -18733 -28124 10006 39245
694C9245m3990m1224M3180M9575l8720n4056L2524N0848k2100m2257M905L4001
$$ 39245 -4745 -45969 -2789 46786 8066 -45990 -13466 37382 15282 -26975 -22070 11931
706A1931J4990k9296k9644K2389M0723j3727n0123P458N3893k543m8886n388L9025
$$ 11931 26921 -2375 -32019 -9630 31093 17366 -32757 -25299 28594 26051 -22835 -28223 10802
719A0802J7246l0340k6604K0994L2714q725l7587l735M2284J1352m0865j6671
$$ 10802 28048 -2292 -28896 -7902 24812 16087 -21500 -25235 17049 28401 -12464 -29135
731b9135L3014K4603k4120l1627J6144L4732o148l4275o783L5958J5789l5116
$$ -29135 3879 28482 4362 -27265 -11121 23611 17463 -16812 -23595 12363 28152 -6964
743f964j9745K8257K4070j8072k9076R407L1267j321k8596r535K6594J9252k5848
$$ -6964 -26709 1548 25618 7546 -21530 -12123 19144 17823 -10773 -20308 6286 25538 -310
756c10k3567K1323K4892j2661k7100M331K8456J219k4975p952J8985J6227j5486
$$ -310 -23877 -2554 22338 9677 -17423 -13092 15364 16583 -8392 -16344 2641 18868 3382
769C382k1130J1417K1693l801k2431n282K4618J0381k4492j3007K0042J6099j5502
$$ 3382 -17748 -6331 15362 11561 -10870 -16152 8466 18847 -5645 -18652 1390 17489 1987
782A987j8269J1665J5524m401j1901o796J1876J5694j3792k0072J3397K2270j2088
$$ 1987 -16282 -4617 10907 6506 -5395 -12191 -315 15379 1587 -18485 -5088 17182 5094
795E094k2886J1697J9283j0385j0692K978L333P936j428j5526J023J9851J37k3449
$$ 5094 -17792 -6095 13188 2803 -7889 -4911 -1578 6358 4930 -10596 -9573 10278 10415 -13034
809a3034J596K3479n375j6430N234P090M7J71p015k718J0999N472j4351o403J7409
$$ -13034 -11438 12041 6666 -9764 -4530 2560 2607 2778 -4237 -6955 4044 9516 -4835 -11238 6171
824F171L184j5324P94Q383k84o35m141k647P582L847q512o077J1220M887j1512
$$ 6171 9355 -5969 -5175 3208 2924 2289 -1852 -4499 3083 6930 -1582 -7659 3561 8448 -3064
839c064m24O741k028P28r21n157N242N448o704n868Q134N183j0128m26P834m548
$$ -3064 -3488 3253 1225 1953 1032 -4125 1117 6565 -139 -6007 2127 7310 -2818 -3244 4590 42
855D2j071M433n442k29P027k434p396M692O367p176l615Q838l042m812O751k229
$$ 42 -1029 3404 -2038 -2267 4760 2326 -5070 -378 5989 -1187 -4802 4036 994 -3818 2933 704
871G04m939N712J430o141P06O066l306m818O718n15o652O038J407o990L652L757
$$ 704 -4235 1477 2907 -3234 -2528 3538 232 -4586 2132 1617 -5035 1003 2410 -4580 -928 2829
887B829n094o53M541j255m065M382J654p054L744M931p742L82O742l538l002L833
$$ 2829 -2265 -2918 1623 368 -3697 685 2339 -4715 -971 3960 -3782 -3400 3342 -196 -3198 635
903F35N77l666J814L896o029K47P447n047m139O868j03m892J979K494k238q99
$$ 635 1212 -2454 -640 3256 -2773 -2526 4921 -126 -4265 2603 2500 -2392 -413 2081 -157 -1056
919a056L438k228k808N650r85n613M786K698n048J80K925m87k346J642J410l216
$$ -1056 2382 154 -2654 2996 2011 -3602 1184 3882 -1166 -986 1939 1452 -894 748 2158 -1058
935a058K209J575m737K280L034l829m68K202O66j990m99K368r59j421K226k043
$$ -1058 1151 2726 -2011 269 3303 -526 -994 1208 1874 -116 -615 1753 794 -627 1599 -444
951d44J73K425k649q44K228N5j083j828K195J930l772J25J639J63M59k557m2K781
$$ -444 -271 2154 -495 -1339 889 944 -139 -1967 228 2158 -1614 -1489 150 313 772 -1785 -1827 954
969I54p72j343j297J698L300l540k947L807K070j818k891L46M512j405k789l28
$$ 954 182 -1161 -2458 -760 2540 -1000 -3947 -140 1930 112 -2779 -2433 2079 674 -2115 -2443
985b443J391M050k645n900M577M970l441m700J430O085j246m998N22K161L390
$$ -2443 -1052 2998 353 -5547 -970 4000 559 -4141 -2711 3374 2128 -2870 -2348 -187 3203
1000C203q49p809K644Q900k634q589J168Q926k22q479M14N326J307o79o429k81
$$ 3203 2354 -5455 -2811 6089 3455 -5134 -3966 4960 4738 -3741 -3327 1999 3306 2627 -3802 -4083
1016d083J0113N7j0803j639J1145L913j2522k988J0036L185n165n794J165R163
$$ -4083 6030 6087 -4716 -6355 4790 8703 -3819 -6807 3229 6414 1249 -4545 -3380 5783
1030E783N04r949k926R275O797r552r362R100R893n973j1143J332J4100j35j4481
$$ 5783 6287 -3662 -6588 2687 9484 -68 -9430 -330 9563 3590 -7553 -6221 7879 7744 -6737
1045f737o18J1184L475p232p941M119J0856j2j3504n406J7666Q283k1622p093
$$ -6737 -7355 3829 7304 72 -7869 -3750 7106 7094 -6410 -11816 5850 14133 -7489 -14582
1059a4582K0513N393j5282n794R467N411j538n717q574Q793J7494j4671k1046
$$ -14582 5931 11324 -3958 -9752 -285 5126 3588 -2129 -10703 -1910 15584 913 -20133
1072b0133J8822K0070j8573j7869J6154J4078j1593p957L234K288R145j007k0024
$$ -20133 -1311 18759 186 -17683 -1529 12549 956 -7001 -3767 -1479 7666 6659 -13365
1085a3365K829K6369l976k8930L936K9408m562k4825L747J6642J241p726r140
$$ -13365 -10536 15833 11857 -17073 -13137 16271 11709 -13116 -9369 7273 8514 788 -8352
1098h352J693J5340L799j9607r864K3906J3775k6730j3744K4374J4484j8914j6296
$$ -8352 -6659 8681 12480 -7127 -16991 6915 20690 -6040 -19784 4590 19074 160 -16136
1111a6136J3594J6190p518j3463j449J0915J1695j0155j9623Q983K5065o334k9730
$$ -16136 -2542 13648 6130 -7333 -8782 2133 13828 3673 -15950 -6967 18098 11764 -17966
1124a7966M613L1863m953k8454L984K0300N05j1317p181L008J2765O864k0333
$$ -17966 -13353 18510 13557 -14897 -10913 9387 9892 -1425 -8606 -5598 7167 14031 -6302
1137f302j4802K8670J7232l3856j5475L2567J2980k6706j1208J7770Q873n841
$$ -6302 -21104 7566 24798 -9058 -24533 8034 21014 -5692 -16900 870 9743 3902
1149C902p170r004J0063K1176j5513k7653J8238L0618j9009l0345J7894K6148
$$ 3902 -3268 -12272 -2209 18967 3454 -24199 -5961 24657 5648 -24697 -6803 19345
1161A9345j3765j8641N151J1309O822o791j7248M039K4698j164k9904j556L2916
$$ 19345 5580 -13061 -7910 3399 10221 3430 -13818 -9779 14919 13755 -16149 -17705 15211
1174A5211K520l0527l929K3449Q450j6207j2860R229J6052j198j8054p572K0859
$$ 15211 17731 -12796 -16725 6724 15174 -1033 -13893 -4664 11388 10190 -7864 -15436 5423
1187E423J3901k1945j7265J9246K0813j4899k3993J1802K3598p440j9809k84J6688
$$ 5423 19324 -2621 -19886 -640 20173 5274 -18719 -6917 16681 9241 -10568 -10852 5836
1200E836P802j3194j3976Q099J9720k255k5912j072K9540J881k7886l665K2363
$$ 5836 13638 444 -13532 -5433 14287 12032 -13880 -14952 14588 16469 -11417 -15082 7281
1213G281P475j6763j0385R370J2829K13j6902q931K2335J2639k4260j4137K1816
$$ 7281 14756 -2007 -12392 -3022 9807 10020 -6882 -15813 6522 19161 -5099 -19236 2580
1226B580J5850j8100j5844J2197J4092l367j3641o678J5269J4189j7269j7363
$$ 2580 18430 330 -15514 -3317 10775 7408 -6233 -12911 2358 16547 -722 -18085
1238a8085J5577J9250j2185k0283Q921J7887k999j4273n340J1918J3352j1815
$$ -18085 -2508 16742 4557 -15726 -6805 11082 8083 -6190 -11530 388 13740 1925
1250A925j7501J0613J8851o914k0008L893J8187l71j3655n518R555J2503p231
$$ 1925 -15576 -4963 13888 6974 -13034 -9141 9046 8675 -4980 -10498 -943 11560 4329
1263D329j7387N993J8640k694j8735p66J7603L651j4482o057Q834J1301m782j5724
$$ 4329 -13058 -7065 11575 8881 -9854 -10620 6983 10634 -3848 -9905 -1071 10230 5448 -10276
1277a0276K734J7087j49j5585m027J4528P516j2862r109Q033J1910l286j5399
$$ -10276 -7542 9545 9396 -6189 -10216 4312 11828 -1034 -10143 -2110 9800 6514 -8885
1290h885J205J6401J11j3964l237J0994O363p684q800L797J0855J069j4486l901
$$ -8885 -7680 8721 8832 -5132 -8369 2625 8988 1304 -7496 -3699 7156 8225 -6261 -10162
1304a0162J7089L414j5336l413J0907M899o585n842J602O735L729q576q932J2246
$$ -10162 6927 10341 -4995 -8408 2499 7398 813 -5029 -3427 3308 7037 -1539 -10471 1775
1318A775R699j3712p944J1118P245q216o236M297M774M50l469o921N288J0562
$$ 1775 11474 -2238 -10182 936 8181 -35 -6271 -1974 2800 3250 -219 -7140 -1852 8710
1332H710p455j0428O988R756n534q980L664P212j407m414k838L043O773l045q197
$$ 8710 1255 -9173 -2185 7571 2037 -6943 -3279 3933 2526 -1888 -4726 -1683 5090 2045 -6152
1347f152L110P743j267p636m96P086J463n178k670K845N237k133o985K799N925
$$ -6152 -3042 4701 3434 -4202 -4698 2388 3851 -1327 -3997 -1152 4085 1952 -5033 -2234 3691
1362C691j244m280j263M322K490l357l126J053N212k39p117J589O199j365m133
$$ 3691 2447 -1833 -3096 1226 3716 359 -2767 -1714 3498 3259 -3858 -2269 3930 2565 -1568
1377a568k13K806J255j587j860j62L062J971n268j436O016j44m606L64K400O83
$$ -1568 -1781 1025 2280 693 -1167 -1329 1733 3704 -1564 -3000 3016 2872 -1734 -1370 1030 1713
1393A713j756m03jP69K025k323k789M001J437l984n8K176K81j437p10R10K07M47
$$ 1713 -43 -446 -447 322 2347 24 -2765 1236 2673 -1311 -1369 807 1088 -349 -1059 -149 58 505
1411E05k92k390K112K154l460j36K006r7p91m11N82l8j80J010j652j86K739j982
$$ 505 213 -2177 -65 2089 -1371 -1507 499 402 -389 -800 -218 -256 -436 574 -1078 -1264 1475 -507
1429e07j012J779k39q31J68P26P5j119J181J82j714J695k68j090J267P8j151O40
$$ -507 -1519 260 21 -810 -642 84 159 -960 221 403 -1311 384 116 -974 293 371 -780 -140
1447a40N30j11q88M18J199j147j68Q40j054R51M8p64P61o1k63m4m15J143j09j115
$$ -140 390 279 -609 -191 1008 -139 -307 533 -521 430 478 -286 475 414 151 107 -308 835 726 -389
1467c89P72j08N44q5j359J330L13j071M56j42P2P34j113J61K53L84k1j774J075
$$ -389 383 275 819 734 -625 705 1018 -53 403 261 333 1067 -46 115 368 752 731 -1043 32
1486C2J355j543k55R86n81J42m0q5K58k80N07q53m89K034q71j556J421K48o23
$$ 32 1387 -156 -411 575 -6 136 96 11 269 -11 496 -357 -846 1188 317 -1239 182 430 -193
1505a93l07N42J38r57N36J66r97J347k34j124R37R5o07K96N7M09l95m83R71k71
$$ -193 -500 42 180 -777 -241 -75 -1072 275 41 -1083 -146 -51 -658 -362 -305 104 -291 -774 197 -74
1525g4m01K44m60J033j31j402J236L84m96n12p7O27N82p75j60n54J695N91k846
$$ -74 -475 -231 -691 342 211 -1191 45 429 -67 -579 -656 -29 553 -222 -382 -936 759 1350 -1496
1544a496R67K205j070j422M10J344K21j664K59L73O53Q32k630k46K944N0k717
$$ -1496 -529 1676 606 -816 -406 938 1159 -505 -246 127 780 1612 -1018 -1264 1680 1730 -987
1561i87k69K186J212k443j048J918P03k18j828o17L046J69k888m03J938J844j914
$$ -987 -1256 930 2142 -301 -1349 569 1272 1054 -774 -1391 1655 1824 -1064 -1467 471 2315 401
1578D01k543J365K657m4l524j088N101N96m958j75L100J026j867k007O49K370
$$ 401 -2142 -777 1880 1836 -1688 -2776 2325 2921 -2037 -2212 888 1914 47 -1960 -1311 1059
1594A059J385l605l068M951M103o756l058N831K759m442k412K707J952m48j265
$$ 1059 2444 -1161 -4229 722 4825 -1931 -4989 842 3601 -841 -3253 -546 1406 958 -307
1609c07k966J774O090l746o889M667O528l797o429L234N476k255l418m0J634K965
$$ -307 -3273 -1499 4591 845 -6044 -1377 5151 1354 -5075 -1841 3635 1380 -2038 -2078 -444 2521
1625B521p17n424L62O879N24p603j084P822J840p627k001N965K924l669m217K018
$$ 2521 1804 -3620 -3258 3621 4145 -3458 -4542 3280 5120 -2507 -4508 1457 4381 712 -3505 -1487
1641a487M706j55m476k935M722N637n351o978N310P886m266r132L933Q554l440
$$ -1487 3219 3064 -1412 -4347 375 6012 661 -6317 -1007 6879 2613 -6519 -2586 5968 2528
1656B528n827J106L271K545j643n715Q2Q448J512j1183k002J2684P20j1622Q6
$$ 2528 -3299 -2193 1078 3623 1980 -3735 -3653 4795 6307 -4876 -6878 5806 6526 -5096 -5010
1671e010P899J123m270k785R49L846L031o073o443Q900P533j0562o842R508O295
$$ -5010 2889 4012 -258 -3043 -2094 1752 4783 -1290 -7733 1167 8700 -1862 -8704 804 7099
1686G099p200n837M456N275j168m620l152M675O662n090q381M368R392k705j0690
$$ 7099 -101 -5938 -1482 3793 2625 -1995 -5147 -472 6190 1100 -7281 -2913 6479 3774 -6916
1701f916J693J0441j43r152j193O765L922n084n794L185O205M13p611l520R240
$$ -6916 -5223 5218 5075 -4077 -5270 1495 5417 333 -5461 -2276 3929 4342 -3269 -6789 2451
1716B451N083r162o608Q682P743p907p124N268O441j989m776l022N319O493n494
$$ 2451 7534 -1628 -8236 446 8189 282 -6842 -1574 4867 2878 -1898 -4920 399 6892 1398
1731A398q997N191J0630m429j1400M314R792k662o943j025N199M053k951p666
$$ 1398 -7599 -2408 8222 3793 -7607 -3293 6499 3837 -3106 -4131 1068 5121 2170 -5496
1745e496K082R298n82j0694m52J1043R53r067k412O013N012m246o603J999P470
$$ -5496 -3414 5884 5302 -5392 -5844 5199 6152 -2915 -5327 686 5698 1452 -5151 -3152 4318
1760D318N92q305k662Q807L667p601m918N252O866l399q270K043Q434l20p898
$$ 4318 4910 -3395 -6057 2750 6417 -1184 -6102 -850 6016 2617 -5653 -3610 4824 4504 -3394
1775c394k532P471M356o228n698L768P248j433q904L82Q854R46p951k663O808
$$ -3394 -5926 1545 5901 -327 -6025 -2257 4991 3558 -5346 -4964 3890 4836 -3115 -5778 1030
1790A030M168m964n120K219O546J54p831k095Q832K723p981l405O085M860m083
$$ 1030 5198 234 -4886 -2667 3879 4033 -3798 -5893 2939 5662 -2319 -5724 361 5221 1138
1805A138n542J682N683J389o280m074P428M711o533n332N286N694l523n868J646
$$ 1138 -4404 -2722 2961 4350 -1930 -6004 1424 6135 -398 -5730 -444 5250 1727 -4141 -2495
1820b495N479R00m852m085N245N654n074n965L881O450k173o826J048N849L54
$$ -2495 2984 3884 -968 -5053 192 5846 772 -5193 -1312 5138 2965 -3861 -2813 3036 3390
1835C390m529k491L596M535l188n392K250N355p2n599j614N714K282n093l357
$$ 3390 -1139 -3630 -34 4501 1313 -4079 -1829 3526 3454 -2145 -3759 1955 4237 -856 -4213
1850d213L658M738k535n256J976L907K90l883k296L655L947l895m333K796N311
$$ -4213 -555 4183 1648 -3608 -1632 2275 2565 -1318 -3614 41 3988 93 -4240 -1444 3867
1865C867k056n259J297M366m68k725j715K301L446j959m335J346M688l61n418
$$ 3867 1811 -3448 -2151 2215 1747 -978 -2693 -392 3054 1095 -3240 -1894 2794 2433 -2985
1880b985J16N124l26l327q44J914K518j277l144K67L537R82m201j055M172Q30
$$ -2985 -2869 2255 1929 -1398 -2242 -328 2190 913 -2231 -1964 1573 2555 -1646 -2701 1471 2301
1896B301k933j557J882K371j028k687L54K479P90k511j750L027J742k426j728
$$ 2301 -632 -2189 -307 2064 1036 -1651 -1297 1182 1972 -539 -2289 738 2480 54 -1674
1911a674J450K014j03k941R5K533M95k294j129K039J636k066r69J087P04L29j555
$$ -1674 -224 1790 1687 -1254 -1159 1374 1869 -425 -1554 485 2121 55 -914 173 877 1206 -349
1928c49p72J987J005j935j301J313J553j522r13Q95N58lm35j113J205J155j516
$$ -349 -1121 866 1871 -64 -1365 -52 1501 -21 -934 -39 519 516 81 -1032 173 1328 -188
1945a88p28N25J421j063j067J205L20k77j89o64N30R13n54j097L46J314m44j400
$$ -188 -916 -391 1030 -33 -1100 105 425 148 -41 -705 -175 738 184 -913 -567 747 303 -1097
1963a097O93J089j054M3K14l63O53J42o70m39P96K16j046L45J291j082J24L96
$$ -1097 -404 685 -369 -326 -112 -475 178 320 -350 -789 7 223 -823 -478 813 -269 -145 251
1981B51l44p2K04k94J46J64L43o24k11J268q73n86J231j90n97M32J96o09L23K59
$$ 251 -93 -165 39 -255 -109 55 398 -226 -437 831 -42 -628 603 413 -184 248 444 -165 158 417
2001D17k51j74Q03m46r78J173N15j205pP03j09n72L25J67n99M70M19j260O74Q93
$$ 417 166 -8 795 349 -629 544 1059 -146 -153 550 441 -131 194 361 -238 232 651 -609 65 958
2021I58j060n38J305j12n59K1K56k38j29L65o69J07R04p32o06R66k24m03O1L75
$$ 958 -102 -640 665 553 -6 15 271 33 -96 269 -400 -293 611 -121 -727 239 15 -388 -327 48
2041D8j06L25l23l52L15O25n05j046J249j25p07M6N05l78J50L07k50o24J460k38
$$ 48 -58 267 -56 -408 -93 532 27 -1019 230 105 -602 -556 -51 -429 -279 28 -222 -846 614 376
2061C76j359P44Q94j037m40J190l22n01M05N18r78J39P97q33j25J158p31n13O02
$$ 376 -983 -239 655 -382 -822 368 46 -455 -50 468 -510 -371 426 -407 -532 626 -105 -618 -16
2080a6L31o82J41Q67k91q52Q02J8p62N38J50l94N79J7o38p0O87M05j052K74O31
$$ -16 315 -367 -226 641 350 -502 300 318 -444 94 244 -150 429 446 -192 -262 425 830 -222 52 683
2101F83p73J89j03q5P00m29k52J41K90P6o89K45M76l76k40O3q2M49L26j392N10
$$ 683 -90 99 -4 -89 611 182 -70 71 361 437 -252 -7 469 93 -147 -84 -166 283 609 -783 -273
2122b73O88K01j105k78J627m02j232N61M21P4l9p75j6O75P50j156q32J303Q86
$$ -273 415 616 -489 -767 860 458 -774 -213 208 282 243 -532 -548 127 877 -279 -1111 192 1078
2141A078j528q61J490N34o48r20M31Q43J15j148k18Q25R30q67j262P73J262k55
$$ 1078 -450 -1311 179 713 65 -855 -424 419 534 -614 -832 -7 923 56 -1206 -433 829 574
2159E74j656n8K217k40j493n60J174J202j113j266Q43J164L23j838o27J943J485
$$ 574 -1082 -1140 1077 837 -656 -1216 -42 1160 47 -1219 -376 788 1111 -727 -1354 589 2074
2176B074k629j227K002J307j229j843J290J280j37j243r61J348J676j376k124
$$ 2074 -555 -1782 220 1527 298 -1545 -255 1025 888 -355 -1316 32 1708 332 -1792
2191a792J365K560j187k656R26K608q03k051r7J358J331j375j812J029K017J11
$$ -1792 -427 2133 946 -1710 -784 1824 1021 -1030 -1127 231 1562 187 -1625 -596 1421 1532
2207A532k796n83L181O58k870j102K409J552j955j770R43K036l26j956q84K410
$$ 1532 -1264 -1847 1334 1992 -878 -1980 429 1981 26 -1744 -801 1235 909 -1047 -1931 479
2223D79J689k382k393K108K647j620l198J719K550p05k139l71J556K117j589k622
$$ 479 2168 -214 -2607 -499 2148 528 -2670 -951 1599 894 -1245 -1616 -60 2057 468 -2154
2239b154J182K847k75m027L82L983k3l690J05J981J407j452k178P43K650O18l563
$$ -2154 -972 1875 1600 -2427 -2045 1938 1915 -1775 -1670 311 1718 266 -1912 -1169 1481 2099 -1464
2256a464j153M227R67l680j322K578J864j840k180R68K418O58l098j396L211K134
$$ -1464 -2617 1610 2577 -1103 -2425 153 2017 177 -2003 -1035 1383 2041 -1057 -2453 758 2892
2272B892l014k189K106K545j138l280P89L007M81k957j616K777K266k561k415
$$ 2892 -122 -2311 -205 2340 1202 -2078 -1289 1718 2199 -758 -2374 403 2669 108 -2307
2287b307J553L090o30l266m21L429J042l375j586K848J900j707k666J341K096
$$ -2307 -754 2336 1706 -1560 -1981 1448 2490 -885 -2471 377 2277 570 -2096 -755 1341
2302A341K64k399j524K853K393k948k813K470L227k248l060J646K338m57j993
$$ 1341 1605 -794 -2318 535 2928 -20 -2833 -363 2864 616 -2444 -798 1540 1083 -910
2317i10j172K125K363j961l277J503L921j384l866J146L348n92k121q11J525K002
$$ -910 -2082 43 2406 445 -2832 -1329 2592 1208 -2658 -1512 1836 1244 -877 -1688 -163 1839
$$ [...]
8191c5
##END NTUPLES=NMR FID
##END=
