##TITLE=1H_Pr PimAm
 D2O, 8 sc, 
 30.06.2021
##JCAMPDX= 6.0         $$ Bruker NMR JCAMP-DX V2.0
##DATA TYPE= NMR FID
##DATA CLASS= NTUPLES
##ORIGIN= UXNMR, Bruker Analytische Messtechnik GmbH
##OWNER= root
$$ XWIN-NMR		Version 3.5
$$ Wed Jun 30 13:17:45 2021 Russian Standard Time (UT+4h)  she@DPX200
##.OBSERVE FREQUENCY= 200.131506
##.OBSERVE NUCLEUS= ^1H
##.DELAY= (6, 6)
##.ACQUISITION MODE= SIMULTANEOUS
##.ACQUISITION SCHEME= undefined
##.AVERAGES= 8
##.DIGITISER RES= 18
##SPECTROMETER/DATA SYSTEM= spect
##.PULSE SEQUENCE= zg30
##.SOLVENT NAME= D2O
##.SHIFT REFERENCE= (INTERNAL, D2O, 0, 15.7039)
##AUDIT TRAIL= $$ (NUMBER, WHEN, WHO, WHERE, WHAT)
$$ ##TITLE= Audit trail, XWIN-NMR		Version 3.5
$$ ##JCAMPDX= 5.01
$$ ##ORIGIN= Bruker BioSpin GmbH
$$ ##OWNER= she
$$ F:/spectra/data/she/nmr/H-F/1/audita.txt
$$ ##AUDIT TRAIL=  $$ (NUMBER, WHEN, WHO, WHERE, WHAT)
(   1,<2021-06-30 13:15:48.75 +0400>,<she>,<DPX200>,
      <created by zg, POWCHK disabled, PULCHK disabled
       configuration hash MD5:
       00 E9 B6 7A A2 85 ED C7 34 08 36 98 17 FE 4E 26
       data hash MD5: 16K
       58 3A A5 36 F9 1C C8 64 5D 8B 8D B1 CE 67 80 40>)
$$ ##END=
$$ 
$$ hash MD5
$$ 5E 9E 2C AD DB 2F CC F3 95 15 3A F2 BD 9F D0 32
##$RELAX= 
##$RELAX= 
##$RELAX= 
##$RELAX= 
##$RELAX= 
##$RELAX= 
$$ Bruker specific parameters
$$ --------------------------
##$DU= <F:/spectra>
##$EXPNO= 1
##$NAME= <H-F>
##$PROCNO= 1
##$TYPE= <nmr>
##$USER= <she>
##$AMP= (0..31)
100 100 100 100 100 100 100 100 100 100 100 100 100 100 100 100 100 100 
100 100 100 100 100 100 100 100 100 100 100 100 100 100 
##$AQSEQ= 0
##$AQ_mod= 1
##$AUNM= <au_zg>
##$AUTOPOS= <>
##$BF1= 200.13
##$BF2= 200.13
##$BF3= 200.13
##$BF4= 200.13
##$BF5= 200.13
##$BF6= 200.13
##$BF7= 200.13
##$BF8= 200.13
##$BYTORDA= 1
##$CFDGTYP= 0
##$CFRGTYP= 5
##$CHEMSTR= <none>
##$CNST= (0..31)
1 1 145 1 1 1 1 1 1 1 1 1 1 1 1 1 1 1 1 1 1 1 1 1 1 1 1 1 1 1 1 1 
##$CPDPRG= <>
##$CPDPRG1= <>
##$CPDPRG2= <>
##$CPDPRG3= <>
##$CPDPRG4= <mlev>
##$CPDPRG5= <mlev>
##$CPDPRG6= <mlev>
##$CPDPRG7= <mlev>
##$CPDPRG8= <mlev>
##$CPDPRGB= <>
##$CPDPRGT= <>
##$D= (0..31)
0 1.2 0 0 0 0 0 0 0 0.06 0 0.03 0 0 0 0 0.0002 0 0 0 0 0 0 0 0 0 0 0 0 
0 0 0 
##$DATE= 1625044548
##$DBL= (0..7)
120 120 120 120 120 120 120 120 
##$DBP= (0..7)
150 150 150 150 150 150 150 150 
##$DBP07= 0
##$DBPNAM0= <>
##$DBPNAM1= <>
##$DBPNAM2= <>
##$DBPNAM3= <>
##$DBPNAM4= <>
##$DBPNAM5= <>
##$DBPNAM6= <>
##$DBPNAM7= <>
##$DBPOAL= (0..7)
0.5 0.5 0.5 0.5 0.5 0.5 0.5 0.5 
##$DBPOFFS= (0..7)
0 0 0 0 0 0 0 0 
##$DE= 6
##$DECBNUC= <off>
##$DECIM= 32
##$DECNUC= <off>
##$DECSTAT= 4
##$DIGMOD= 1
##$DIGTYP= 9
##$DL= (0..7)
0 120 120 120 120 120 120 120 
##$DP= (0..7)
150 150 150 150 150 150 150 150 
##$DP07= 0
##$DPNAME0= <>
##$DPNAME1= <>
##$DPNAME2= <>
##$DPNAME3= <>
##$DPNAME4= <>
##$DPNAME5= <>
##$DPNAME6= <>
##$DPNAME7= <>
##$DPOAL= (0..7)
0.5 0.5 0.5 0.5 0.5 0.5 0.5 0.5 
##$DPOFFS= (0..7)
0 0 0 0 0 0 0 0 
##$DQDMODE= 0
##$DR= 18
##$DS= 0
##$DSLIST= <SSSSSSSSSSSSSSS>
$$ [...]
##$SUBNAM2= <"">
##$SUBNAM3= <"">
##$SUBNAM4= <"">
##$SUBNAM5= <"">
##$SUBNAM6= <"">
##$SUBNAM7= <"">
##$SUBNAM8= <"">
##$SUBNAM9= <"">
##$SW= 20.0188882624521
##$SWIBOX= (0..15)
0 0 2 0 0 0 0 0 0 0 0 0 0 0 0 0 
##$SW_h= 4006.41025641026
##$TD= 16384
##$TD0= 1
##$TE= 0
##$TE2= 300
##$TE3= 300
##$TEG= 300
##$TL= (0..7)
0 120 120 120 120 120 120 120 
##$TP= (0..7)
150 150 150 150 150 150 150 150 
##$TP07= 0
##$TPNAME0= <>
##$TPNAME1= <>
##$TPNAME2= <>
##$TPNAME3= <>
##$TPNAME4= <>
##$TPNAME5= <>
##$TPNAME6= <>
##$TPNAME7= <>
##$TPOAL= (0..7)
0.5 0.5 0.5 0.5 0.5 0.5 0.5 0.5 
##$TPOFFS= (0..7)
0 0 0 0 0 0 0 0 
##$TUNHIN= 0
##$TUNHOUT= 0
##$TUNXOUT= 0
##$USERA1= <user>
##$USERA2= <user>
##$USERA3= <user>
##$USERA4= <user>
##$USERA5= <user>
##$V9= 5
##$VALIST= <valist>
##$VCLIST= <CCCCCCCCCCCCCCC>
##$VD= 0
##$VDLIST= <DDDDDDDDDDDDDDD>
##$VPLIST= <PPPPPPPPPPPPPPP>
##$VTLIST= <TTTTTTTTTTTTTTT>
##$WBST= 1024
##$WBSW= 4
##$XGAIN= (0..3)
0 0 0 0 
##$XL= 0
##$YL= 0
##$YMAX_a= 256543
##$YMIN_a= -233983
##$ZGOPTNS= <>
##$ZL1= 120
##$ZL2= 120
##$ZL3= 120
##$ZL4= 120
##$ABSF1= 10
##$ABSF2= 0
##$ABSG= 5
##$ABSL= 3
##$ALPHA= 0
##$AQORDER= 0
##$ASSFAC= 0
##$ASSFACI= 0
##$ASSFACX= 0
##$ASSWID= 0
##$AUNMP= <proc_1d>
##$AZFE= 0.1
##$AZFW= 0.1
##$BCFW= 1
##$BC_mod= 2
##$BYTORDP= 1
##$COROFFS= 0
##$CY= 11.3945322036743
##$DATMOD= 1
##$DC= 2
##$DFILT= <>
##$DTYPP= 0
##$F1P= 15.9154993809931
##$F2P= -4.1035820241983
##$FCOR= 0.5
##$FTSIZE= 0
##$FT_mod= 4
##$GAMMA= 1
##$GB= 0.15
##$INTBC= 1
##$INTSCL= 1
##$ISEN= 128
##$LB= 0.24
##$LEV0= 0
##$LPBIN= 0
##$MAXI= 10000
##$MC2= 0
##$MEAN= 0
##$ME_mod= 0
##$MI= 1.114404
##$NCOEF= 0
##$NC_proc= 0
##$NLEV= 6
##$NOISF1= 3.799351
##$NOISF2= 2.8
##$NSP= 1
##$NTH_PI= 0
##$NZP= 0
##$OFFSET= 15.70392
##$PC= 1
##$PHC0= -12184.21
##$PHC1= -0.5989847
##$PH_mod= 1
##$PKNL= yes
##$PPARMOD= 0
##$PSCAL= 0
##$PSIGN= 0
##$REVERSE= no
##$SF= 200.130013532006
##$SI= 16384
##$SIGF1= 3
##$SIGF2= 2
##$SINO= 400
##$SIOLD= 16384
##$SREGLST= <1H.CDCl3>
##$SSB= 0
##$STSI= 0
##$STSR= 0
##$SW_p= 3612.71676300578
##$SYMM= 0
##$S_DEV= 0
##$TDeff= 0
##$TDoff= 0
##$TI= <>
##$TILT= no
##$TM1= 0
##$TM2= 0
##$TOPLEV= 0
##$USERP1= <user>
##$USERP2= <user>
##$USERP3= <user>
##$USERP4= <user>
##$USERP5= <user>
##$WDW= 1
##$XDIM= 8192
##$YMAX_p= 0
##$YMIN_p= 0
$$ End of Bruker specific parameters
$$ ---------------------------------
##NTUPLES= NMR FID
##VAR_NAME=  TIME,          FID/REAL,        FID/IMAG
##SYMBOL=    X,             R,               I
##VAR_TYPE=  INDEPENDENT,   DEPENDENT,       DEPENDENT
##VAR_FORM=  AFFN,          ASDF,            ASDF
##VAR_DIM=   8192,          8192,            8192
##UNITS=     SECONDS,       ARBITRARY UNITS, ARBITRARY UNITS
##FACTOR=    0.0002496,     1,               1
##FIRST=     0,             0,               0
##LAST=      2.0444736,     0,               0
##MIN=       0,             -233983,         0
##MAX=       2.0444736,     256543,          0
$$ Real data points
##PAGE= N=1
##DATA TABLE= (X++(R..R)), XYDATA
0 0 0 0 0 0 0 0 0 0 0 0 0 0 0 0 -8 8 -8 8 -8 8 -16 16 -16 24 -24 32 -33 40 -48 53 -60 69 -77 88 -99 111
36 111 -125 141 -157 175 -193 215 -239 263 -294 322 -355 394 -433 477 -526 578 -638 705 -778
55 -778 862 -960 1071 -1200 1355 -1540 1770 -2065 2454 -2999 3813 -5162 7817 -15050 78473
70 78473 256543 161718 -14441 -185118 -223077 -107917 102622 228282 187475 8703 -171047
81 -171047 -229421 -115348 76955 212796 192640 34545 -150695 -222010 -132719 53124 198187
92 198187 198865 53523 -127288 -214649 -144708 29287 180309 198505 73658 -105662 -205957
103 -205957 -153436 7539 158289 197941 93814 -83850 -196385 -158367 -11433 137744
113 137744 192731 109320 -59721 -182688 -166055 -31508 120398 186094 118406 -37085 -165939
124 -165939 -170993 -50598 103128 179232 126658 -16510 -147909 -170683 -68532 82385 172784
135 172784 136278 -480 -133190 -165895 -82004 59349 161103 144192 18338 -117357 -164304
146 -164304 -94382 43676 150258 144359 34898 -95552 -158971 -108507 25575 140062 146521
157 146521 48311 -79941 -151555 -114943 6748 123134 147830 64759 -64349 -145274 -119903
168 -119903 -8276 108183 145657 77345 -46602 -135882 -125547 -23411 94128 141182 86968
179 86968 -29017 -125586 -130225 -37387 80266 135983 94879 -13338 -113555 -130532 -50516
190 -50516 64623 131152 103034 99 -102491 -128779 -61643 48576 123596 108813 13867
201 13867 -90488 -127303 -71609 34613 115084 112146 27561 -77032 -124548 -80374 21334
212 21334 106171 113974 39261 -63761 -119536 -88123 6507 96494 115934 49268 -52185 -113045
224 -113045 -92772 -7103 85147 115951 60046 -39084 -107218 -97395 -17894 74638 112637 68143
236 68143 -25208 -99839 -101794 -29151 64176 109353 74777 -13117 -91257 -103184 -39614 52783
248 52783 105748 81119 -1603 -82248 -103260 -49049 41210 100634 85891 9454 -73185 -102849
260 -102849 -57236 30083 94191 89353 20444 -63370 -101266 -64325 19384 87569 91824 30164
272 30164 -53362 -98023 -70621 8090 80065 93437 38900 -43658 -93999 -75644 -2708 71692
284 71692 93853 47495 -33439 -89266 -79433 -12439 62944 92854 55171 -23065 -83827 -82644
296 -82644 -21887 53889 90675 61414 -12898 -77302 -84743 -30917 44806 87947 66812 -3028
308 -3028 -69950 -85445 -39029 35521 84224 71210 6305 -62467 -85410 -46461 26018 79395
320 79395 74493 15398 -54339 -84325 -52991 16855 74089 76895 23988 -45682 -82074 -58738
332 -58738 7603 68085 78297 31662 -37248 -79032 -63469 -1503 61290 78756 38841 -28757
344 -28757 -75245 -66889 -9758 54184 78228 45409 -20119 -70788 -69666 -17709 46646 76648
356 76648 50959 -11618 -65640 -71586 -25340 38832 74365 55798 -3185 -59727 -72407 -32240
368 -32240 30939 71332 59818 4833 -53482 -72436 -38507 22903 67344 62846 12532 -46849
380 -46849 -71680 -44139 14974 62874 65047 19855 -39592 -69857 -49113 7106 57950 66401
392 66401 26491 -32304 -67311 -53326 -696 52274 66887 32623 -25067 -64174 -56507 -7869
404 -7869 46232 66552 38291 -17626 -60348 -58935 -14752 39951 65455 43023 -10481 -55926
416 -55926 -60658 -21391 33378 63555 47113 -3307 -51016 -61608 -27230 26861 60946 50545
428 50545 3741 -45643 -61771 -32623 20048 57797 53322 10041 -40285 -60946 -37278 13148
440 13148 53993 55391 16233 -34428 -59702 -41456 6905 49962 56305 21900 -28029 -57746
452 -57746 -45260 465 45383 56854 27090 -22162 -55176 -47793 -5897 40009 56936 32151
464 32151 -16222 -52158 -49721 -11607 34748 56044 36229 -9970 -48528 -51590 -17096 29688
476 29688 54465 39423 -3889 -44336 -52560 -22250 24059 52528 42727 1884 -40211 -52556
488 -52556 -26604 18143 49768 45308 7547 -35552 -52268 -30988 12542 46949 46851 12527 -30366
501 -30366 -51130 -34809 6967 43498 47997 17779 -25225 -50031 -37807 2011 39441 48153
513 48153 22393 -19897 -47873 -40528 -3725 35509 48814 26085 -15334 -44795 -41985 -9174
525 -9174 30875 48463 29939 -9992 -42110 -43769 -13389 26674 46672 32907 -4307 -38938
537 -38938 -45057 -17601 22071 45077 35736 417 -35395 -44928 -21722 16819 43442 38227 4693
550 4693 -31552 -44398 -25489 11897 40950 39713 9508 -27304 -44334 -28757 7782 37896
562 37896 40385 14183 -22665 -43289 -31644 2925 34708 41468 18045 -18677 -41324 -33738 -2076
575 -2076 31165 41732 21544 -13993 -39100 -36112 -6511 28073 41318 24356 -9342 -36395
587 -36395 -37429 -10732 23740 40499 27868 -5000 -34347 -38145 -14109 19484 39008 30312 -704
600 -704 -30904 -38403 -18364 15280 38185 32253 2763 -27426 -37908 -21671 10967 35925 33867
613 33867 7189 -24108 -38024 -24183 7265 33014 34878 11466 -20663 -37408 -26256 3246
625 3246 30078 35656 15021 -16974 -35994 -28526 -854 27521 35952 17757 -13111 -34067 -30369
638 -30369 -4658 24381 35537 20911 -8945 -32541 -31837 -7684 21114 34515 23499 -4937
650 -4937 -30188 -32733 -11343 17615 33888 25601 -1581 -27415 -33041 -14710 14288 32695 27028
663 27028 2177 -24114 -33382 -17972 11001 31244 28286 5483 -21149 -32842 -20342 7047
675 7047 28987 29822 8917 -18507 -32129 -22213 3485 26706 30500 11787 -15175 -30827 -24362
688 -24362 -70 24618 30805 14245 -11897 -29389 -25928 -3290 21825 30593 17036 -8602 -28054
701 -28054 -26904 -6165 18722 30118 19625 -5463 -26329 -27534 -9070 15657 29367 21525 -2234
714 -2234 -24014 -28182 -11989 12933 28345 22862 989 -21480 -28417 -14448 9952 26807 24271
727 24271 4155 -19193 -28319 -16457 6937 25084 25236 6868 -16547 -27645 -18547 3814 23451
740 23451 25925 9309 -13773 -26741 -20314 982 21473 26065 11736 -10885 -25737 -21775 -1743
753 -1743 19303 26080 13943 -8251 -24403 -22657 -4484 16812 25935 16001 -5597 -22853 -23412
766 -23412 -7027 14453 25364 17590 -2873 -21054 -23974 -9406 12029 24527 19008 -140 -19135
779 -19135 -24234 -11523 9471 23401 20279 2452 -17148 -24139 -13468 6832 22107 21288 4873
792 4873 -15006 -23800 -15238 4277 20631 21889 7186 -12634 -23239 -16853 1798 19016 22258
805 22258 9348 -10238 -22417 -18166 -681 17102 22444 11416 -7892 -21366 -19160 -3096 15120
818 15120 22364 13219 -5537 -20079 -19936 -5342 13084 21982 14748 -3158 -18662 -20568 -7454
831 -7454 10996 21346 16078 -838 -17074 -20839 -9384 8781 20551 17273 1399 -15374 -20868
844 -20868 -11164 6556 19505 18181 3579 -13531 -20716 -12785 4400 18317 18797 5599 -11584
857 -11584 -20334 -14178 2290 17000 19231 7484 -9604 -19704 -15361 164 15484 19443 9209
870 9209 -7645 -18932 -16329 -1892 13873 19486 10814 -5641 -17939 -17132 -3815 12187 19246
883 19246 12265 -3586 -16786 -17726 -5687 10392 18823 13512 -1600 -15501 -18072 -7452 8501
896 8501 18237 14618 364 -14076 -18206 -9041 6589 17455 15515 2263 -12553 -18159 -10516 4702
910 4702 16461 16189 4110 -10910 -17931 -11818 2838 15340 16681 5837 -9189 -17487 -12960 926
924 926 14103 16968 7412 -7456 -16852 -13948 -941 12720 17078 8889 -5682 -16050 -14722 -2676
938 -2676 11256 16960 10234 -3855 -15121 -15330 -4310 9742 16633 11409 -2096 -14047 -15706 -5907
952 -5907 8124 16204 12417 -412 -12838 -15894 -7370 6486 15587 13243 1298 -11526 -15966 -8704
966 -8704 4891 14803 13892 2896 -10173 -15832 -9833 3277 13888 14402 4409 -8796 -15538 -10835
980 -10835 1643 12858 14753 5811 -7311 -15041 -11785 32 11798 14896 7092 -5736 -14418
993 -14418 -12570 -1525 10582 14891 8327 -4225 -13701 -13106 -2967 9196 14736 9534 -2714 -12891
1007 -12891 -13518 -4389 7864 14426 10399 -1200 -11787 -13856 -5798 6549 14025 11157 266 -10733
1021 -10733 -13984 -6938 5123 13325 11869 1781 -9667 -14002 -7997 3677 12635 12408 3084 -8438
1035 -8438 -13716 -9025 2186 11896 12817 4325 -7122 -13419 -9966 850 10963 12944 5575 -5731
1049 -5731 -13022 -10761 -507 9915 13067 6785 -4468 -12459 -11237 -1892 8721 13100 7838 -3197
1063 -3197 -11731 -11660 -3244 7582 12968 8668 -1858 -10893 -12071 -4437 6466 12532 9418 -424 -10013
1078 -10013 -12349 -5495 5266 12057 10158 793 -9146 -12276 -6487 3836 11516 10840 2015 -8164
1092 -8164 -12196 -7439 2648 10904 11103 3185 -6887 -12043 -8389 1490 10182 11328 4328 -5811
1106 -5811 -11796 -9017 325 9222 11515 5445 -4707 -11356 -9617 -975 8384 11646 6242 -3605 -10658
1121 -10658 -10112 -2223 7436 11555 7086 -2334 -10064 -10585 -3198 6458 11214 7882 -1063 -9419 -10821
1136 -10821 -4195 5310 10945 8682 -38 -8692 -10838 -5151 4130 10589 9261 1040 -7722 -10808 -6148
1151 -6148 3054 10101 9631 2129 -6773 -10812 -6908 2060 9349 9872 3324 -5783 -10743 -7588 988
1166 988 8627 10158 4253 -4866 -10295 -8128 -267 7860 10374 5106 -3804 -9830 -8755 -1262 7164
1181 7164 10231 5837 -2612 -9302 -9239 -2242 6271 10090 6662 -1583 -8795 -9436 -3172 5237 9905 7357
1197 7357 -639 -8037 -9567 -4260 4265 9750 7826 302 -7209 -9651 -5127 3333 9250 8282 1440
1212 1440 -6408 -9724 -5814 2339 8638 8682 2433 -5641 -9555 -6432 1214 8025 9075 3331 -4795
1227 -4795 -9266 -7077 200 7423 9170 4144 -3748 -8928 -7656 -719 6701 9155 4990 -2806 -8600
1242 -8600 -8030 -1578 5830 9061 5799 -1837 -8148 -8335 -2512 4990 8967 6371 -939 -7492 -8532
1257 -8532 -3435 4171 8767 6889 31 -6798 -8730 -4228 3365 8399 7303 999 -6102 -8759 -4929
1272 -4929 2435 7958 7753 1862 -5415 -8635 -5576 1475 7485 8041 2629 -4597 -8432 -6218 571
1287 571 7008 8205 3389 -3734 -8203 -6738 -272 6345 8251 4213 -2879 -7909 -7128 -1127 5632
1302 5632 8294 4887 -2079 -7479 -7410 -2001 4890 8234 5491 -1222 -6989 -7686 -2786 4182 8034 5985
1318 5985 -322 -6436 -7890 -3505 3396 7731 6499 556 -5871 -7933 -4174 2540 7378 6885 1319
1333 1319 -5218 -7874 -4802 1711 7015 7168 2095 -4486 -7761 -5402 918 6531 7363 2839 -3723
1348 -3723 -7588 -5894 118 5990 7473 3536 -2998 -7307 -6262 -694 5376 7536 4171 -2252 -6940
1363 -6940 -6602 -1467 4739 7477 4730 -1445 -6516 -6860 -2215 4070 7344 5277 -630 -6050 -7049 -2903
1379 -2903 3338 7119 5712 138 -5521 -7122 -3551 2599 6815 6075 910 -4899 -7124 -4176 1860
1394 1860 6481 6370 1645 -4273 -7050 -4708 1104 6047 6568 2337 -3612 -6903 -5143 357 5566
1409 5566 6694 2983 -2933 -6686 -5531 -373 5035 6765 3574 -2222 -6354 -5843 -1081 4446 6729
1424 6729 4115 -1519 -5998 -6093 -1760 3843 6631 4600 -812 -5597 -6254 -2394 3200 6446 5004 -116
1440 -116 -5129 -6363 -3001 2545 6215 5346 562 -4604 -6368 -3537 1890 5915 5634 1226 -4043 -6319
1456 -6319 -4055 1209 5553 5841 1879 -3447 -6204 -4480 520 5124 5953 2471 -2828 -6020 -4845
1471 -4845 -134 4665 6033 3023 -2204 -5765 -5165 -775 4184 6021 3528 -1548 -5462 -5415 -1384 3642
1487 3642 5932 3978 -921 -5127 -5581 -1989 3052 5810 4374 -270 -4723 -5676 -2535 2463 5633
1502 5633 4700 358 -4251 -5709 -3043 1879 5377 4954 952 -3777 -5708 -3483 1278 5083 5178 1538
1518 1538 -3285 -5616 -3892 673 4710 5314 2045 -2745 -5459 -4234 52 4323 5403 2544 -2174
1533 -2174 -5255 -4535 -526 3900 5391 3030 -1588 -5027 -4756 -1046 3417 5344 3442 -1048 -4723
1548 -4723 -4927 -1604 2918 5281 3804 -480 -4348 -5025 -2127 2406 5127 4091 128 -3940 -5117
1563 -5117 -2579 1893 4887 4341 672 -3541 -5128 -2960 1335 4596 4559 1192 -3110 -5022 -3342 768
1579 768 4330 4709 1654 -2602 -4887 -3706 229 4021 4754 2101 -2093 -4749 -3958 -259 3628 4755
1595 4755 2560 -1576 -4555 -4167 -773 3170 4801 2943 -1107 -4297 -4300 -1265 2743 4734 3263 -610
1611 -610 -3959 -4440 -1737 2339 4587 3507 -83 -3629 -4511 -2142 1845 4384 3773 432 -3321 -4521
1627 -4521 -2476 1335 4159 4008 873 -2915 -4437 -2847 836 3962 4126 1306 -2448 -4362 -3173
1642 -3173 400 3677 4164 1739 -1977 -4295 -3441 -49 3301 4204 2155 -1583 -4108 -3587 -557 2918
1658 2918 4261 2498 -1141 -3854 -3752 -1024 2581 4227 2757 -655 -3561 -3926 -1417 2182 4092
1673 4092 3041 -166 -3336 -4018 -1747 1734 3925 3333 267 -3038 -3998 -2119 1260 3785 3522 637
1689 637 -2652 -3974 -2483 856 3585 3633 1084 -2226 -3945 -2789 475 3318 3717 1505 -1858 -3852
1705 -3852 -3004 35 2961 3805 1879 -1505 -3701 -3190 -418 2696 3820 2134 -1077 -3470 -3386 -850
1721 -850 2386 3776 2433 -632 -3244 -3529 -1172 2007 3668 2722 -209 -3022 -3585 -1531 1601 3585
1737 3585 2971 161 -2735 -3575 -1879 1189 3438 3152 536 -2381 -3587 -2221 838 3259 3231 928
1753 928 -2033 -3548 -2446 448 2962 3331 1313 -1735 -3477 -2651 46 2700 3426 1630 -1383 -3305
1769 -3305 -2849 -375 2413 3453 1908 -987 -3140 -3047 -712 2155 3364 2165 -577 -2940 -3153 -1018
1785 -1018 1817 3283 2445 -222 -2729 -3172 -1332 1444 3197 2643 119 -2447 -3202 -1678 1120 3090
1801 3090 2753 466 -2130 -3214 -1966 779 2899 2873 830 -1857 -3185 -2159 431 2655 2978 1136
1817 1136 -1560 -3074 -2351 47 2422 3043 1407 -1238 -2913 -2527 -282 2194 3020 1657 -885 -2792
1833 -2792 -2676 -573 1923 2991 1896 -572 -2620 -2752 -880 1604 2918 2132 -263 -2428 -2792 -1166
1849 -1166 1298 2820 2289 66 -2184 -2818 -1439 1019 2699 2401 397 -1927 -2836 -1669 717 2530
1865 2530 2518 690 -1678 -2798 -1867 393 2352 2590 943 -1405 -2708 -2031 101 2140 2662 1208
1881 1208 -1093 -2573 -2194 -192 1948 2640 1436 -819 -2451 -2318 -469 1685 2618 1640 -534 -2315
1897 -2315 -2393 -717 1434 2568 1820 -248 -2125 -2425 -986 1188 2472 1967 23 -1937 -2461 -1206
1913 -1206 937 2381 2095 278 -1715 -2474 -1404 680 2258 2189 538 -1500 -2408 -1564 423 2109
1929 2109 2242 773 -1275 -2361 -1727 174 1932 2281 976 -1037 -2276 -1855 -64 1759 2296 1178
1945 1178 -817 -2181 -1971 -324 1557 2292 1366 -556 -2050 -2039 -561 1361 2251 1508 -311 -1914 -2106
1962 -2106 -760 1142 2209 1657 -81 -1753 -2142 -946 915 2107 1769 137 -1577 -2150 -1136 700
1978 700 2012 1872 363 -1394 -2117 -1309 469 1899 1930 572 -1209 -2087 -1457 247 1764 1993 760
1995 760 -1000 -2024 -1580 27 1589 1985 938 -804 -1959 -1678 -169 1439 2006 1115 -605 -1847
2011 -1847 -1736 -370 1278 1980 1251 -382 -1723 -1799 -561 1100 1931 1378 -174 -1594 -1842 -736 918
2028 918 1867 1487 12 -1449 -1858 -904 709 1772 1554 203 -1304 -1850 -1039 516 1695 1633 403
2045 403 -1146 -1827 -1192 316 1588 1688 574 -966 -1794 -1301 126 1442 1713 736 -772 -1723 -1397
2062 -1397 -68 1294 1734 905 -603 -1618 -1482 -256 1152 1715 1031 -398 -1512 -1527 -395 999 1675
2079 1675 1133 -225 -1422 -1569 -573 841 1597 1244 -42 -1302 -1592 -740 654 1561 1337 122 -1157
2096 -1157 -1591 -877 484 1479 1398 297 -1012 -1549 -1002 317 1366 1423 453 -861 -1527 -1082 161 1255
2114 1255 1467 614 -724 -1486 -1171 -41 1153 1487 729 -540 -1406 -1261 -193 1028 1475 852 -387
2131 -387 -1324 -1335 -308 900 1432 965 -215 -1241 -1350 -465 731 1397 1073 -73 -1140 -1373 -621 587
2149 587 1352 1140 86 -1017 -1365 -742 464 1301 1183 257 -878 -1378 -861 311 1197 1242 391 -757
2167 -757 -1339 -936 123 1112 1308 522 -642 -1304 -1015 -15 1020 1293 611 -494 -1235 -1109 -147 906
2185 906 1268 746 -346 -1182 -1150 -272 797 1266 869 -196 -1112 -1170 -407 653 1259 940 -94 -1008 -1198
2204 -1198 -533 532 1207 1004 58 -893 -1236 -646 412 1153 1050 204 -801 -1217 -738 282 1063 1105 331
2223 331 -705 -1196 -816 132 990 1139 433 -561 -1134 -915 4 916 1136 527 -425 -1098 -974 -125 802 1105
2243 1105 655 -306 -1061 -1012 -233 695 1109 745 -204 -976 -1025 -342 570 1096 797 -85 -874 -1069 -472 464
2263 464 1060 856 55 -793 -1072 -576 359 985 915 180 -719 -1052 -653 218 917 971 294 -611 -1042 -722 105
2284 105 871 986 359 -499 -994 -795 5 785 973 492 -364 -961 -849 -91 705 994 583 -276 -904 -877
2304 -877 -225 590 986 659 -173 -828 -920 -322 494 949 704 -56 -755 -942 -428 390 894 751 70 -700
2324 -700 -936 -502 287 849 805 168 -601 -916 -562 177 795 843 255 -496 -872 -643 72 750 842 336 -405
2345 -405 -865 -685 -18 673 856 430 -299 -830 -734 -122 579 848 501 -232 -768 -747 -211 493 836 554 -120
2366 -120 -694 -782 -298 396 801 606 -18 -653 -801 -384 320 756 672 70 -580 -790 -413 231 728 692 156
2387 156 -489 -778 -499 137 666 734 234 -412 -749 -543 71 623 739 305 -349 -721 -598 -16 548 713
2407 713 381 -251 -703 -619 -99 482 715 440 -174 -656 -638 -186 411 702 478 -110 -600 -656 -262 350 700
2428 700 508 -15 -551 -671 -305 287 641 537 36 -499 -659 -348 206 620 572 122 -420 -657 -399 129
2448 129 578 585 180 -364 -634 -460 61 528 593 249 -292 -616 -491 -11 464 599 291 -219 -579 -514 -85
2469 -85 403 624 354 -169 -529 -526 -130 371 586 393 -79 -492 -548 -187 295 563 416 -28 -455 -557 -239
2490 -239 243 540 452 50 -396 -549 -303 174 508 465 97 -350 -536 -336 121 472 488 154 -292 -536 -379
2511 -379 47 433 508 214 -230 -498 -406 -29 385 520 254 -165 -471 -434 -81 345 503 294 -107 -451 -449 -137
2533 -137 280 488 348 -66 -412 -462 -189 231 478 373 8 -367 -462 -233 162 448 420 67 -325 -466 -275
2554 -275 112 404 416 113 -273 -457 -331 32 375 430 173 -222 -456 -360 -9 343 452 227 -174 -429 -380
2575 -380 -46 296 446 253 -109 -406 -421 -102 266 448 318 -57 -381 -429 -163 209 443 332 -12 -340 -432
2596 -432 -214 166 417 363 66 -297 -432 -249 126 395 410 91 -265 -446 -298 55 372 408 162 -204 -421
2617 -421 -320 13 341 422 199 -141 -418 -343 -37 309 422 251 -103 -377 -381 -83 245 429 275 -61 -352
2638 -352 -399 -146 220 406 312 -19 -339 -415 -189 152 381 343 42 -293 -401 -227 97 382 365 85 -257 -392
2660 -392 -260 82 361 388 134 -191 -391 -301 25 322 416 184 -147 -376 -329 -38 278 389 230 -105 -345
2681 -345 -339 -76 250 405 246 -71 -322 -373 -117 194 380 278 -19 -311 -385 -167 151 350 315 14 -297 -367
2703 -367 -190 97 355 336 78 -232 -368 -249 60 332 356 104 -190 -361 -262 29 318 352 159 -138 -367
2724 -367 -285 -23 279 365 203 -116 -350 -319 -56 229 376 229 -64 -319 -334 -105 189 362 254 -47 -289
2745 -289 -344 -157 168 366 293 14 -262 -361 -189 122 325 316 74 -242 -346 -221 58 317 348 125 -202 -347
2767 -347 -256 38 311 360 134 -169 -360 -284 -5 278 337 171 -127 -335 -311 -51 244 355 222 -100 -338 -319
2789 -319 -85 211 354 244 -70 -309 -341 -133 185 348 263 -14 -273 -340 -166 140 326 298 48 -261 -351 -181
2811 -181 104 321 316 70 -229 -361 -222 63 329 336 104 -186 -356 -260 24 305 323 149 -165 -362 -289 2
2833 2 253 346 176 -111 -336 -304 -41 243 368 207 -77 -310 -307 -80 208 355 231 -44 -292 -317 -123 185
2855 185 352 263 3 -279 -328 -137 162 329 291 22 -241 -340 -173 117 308 309 38 -231 -328 -226 67 306
2877 306 303 78 -191 -343 -230 23 278 318 125 -159 -323 -271 -4 255 331 179 -131 -311 -274 -36 228 340
2899 340 194 -78 -305 -282 -73 208 318 213 -44 -277 -313 -117 164 324 227 -29 -249 -308 -142 124 314
2920 314 260 16 -225 -315 -181 83 288 286 40 -194 -318 -210 63 283 297 94 -173 -329 -215 24 252 318
2942 318 124 -120 -311 -235 -15 226 328 170 -102 -276 -261 -45 217 337 191 -62 -272 -279 -78 177 307
2963 307 202 -41 -272 -296 -118 147 306 249 -10 -240 -311 -139 124 287 261 28 -228 -310 -189 100 270 270
2985 270 70 -188 -322 -202 58 279 316 115 -153 -300 -227 13 246 297 138 -128 -273 -241 -37 231 308 158
3007 158 -104 -287 -275 -53 197 310 216 -64 -280 -292 -101 171 315 223 -36 -250 -284 -132 138 318 250 5
3029 5 -237 -306 -152 110 286 259 39 -201 -315 -188 80 289 289 83 -175 -304 -207 49 277 306 123 -148 -305
3052 -305 -230 15 255 312 140 -133 -291 -260 -21 221 293 180 -95 -293 -283 -75 179 296 196 -76 -276 -302
3074 -302 -107 158 303 227 -30 -250 -303 -118 134 295 254 28 -225 -309 -165 108 296 264 41 -212 -313 -204
3096 -204 65 276 269 82 -189 -307 -203 33 260 285 118 -152 -292 -230 -8 242 293 147 -117 -281 -243 -46
3118 -46 218 308 170 -86 -269 -266 -71 199 285 204 -46 -270 -294 -89 162 310 235 -15 -233 -287 -116 131 294
3141 294 254 27 -232 -295 -154 86 286 257 43 -195 -293 -200 56 252 266 87 -165 -296 -214 36 256 287 90
3164 90 -142 -303 -227 1 243 302 153 -101 -282 -254 -37 204 305 165 -91 -271 -263 -54 183 307 189 -57
3186 -57 -256 -281 -86 165 293 232 -36 -228 -274 -122 133 287 227 -5 -220 -297 -147 104 280 246 42 -199
3208 -199 -309 -164 83 261 253 64 -178 -293 -203 50 252 282 93 -155 -300 -218 25 244 278 133 -126 -282
3230 -282 -235 -20 224 281 154 -107 -284 -249 -43 174 289 181 -68 -267 -259 -81 172 291 198 -43 -257 -274
3252 -274 -116 145 289 222 -13 -230 -292 -127 134 290 234 12 -216 -280 -158 97 268 249 49 -202 -290 -169
3274 -169 62 268 278 83 -155 -286 -185 18 246 271 96 -143 -288 -223 3 218 268 116 -114 -272 -235 -42
3296 -42 183 267 148 -85 -276 -256 -68 172 283 177 -64 -251 -270 -82 142 254 191 -22 -233 -281 -122 135
3318 135 269 211 35 -194 -272 -128 103 258 233 20 -193 -273 -162 82 252 232 56 -165 -281 -190 34 215
3340 215 252 93 -144 -262 -216 -5 210 244 123 -109 -273 -226 -17 182 272 158 -71 -255 -233 -44 160 263
3362 263 164 -46 -226 -258 -69 140 254 197 -4 -221 -265 -104 121 267 208 18 -196 -271 -141 73 227 226 46
3385 46 -166 -267 -164 49 231 228 81 -141 -269 -199 7 214 259 104 -113 -255 -207 3 190 255 125 -104
3407 -104 -251 -221 -17 185 254 151 -81 -247 -218 -64 168 248 175 -31 -202 -243 -82 126 244 180 -13 -212
3429 -212 -239 -131 114 262 192 25 -183 -268 -144 74 236 205 43 -191 -253 -181 45 241 238 87 -128 -261 -193
3452 -193 22 218 248 109 -104 -253 -197 -2 198 272 139 -96 -237 -224 -42 176 266 144 -66 -239 -231 -73
3474 -73 162 260 171 -29 -223 -243 -75 129 246 184 -7 -195 -244 -112 110 241 219 27 -182 -266 -149 59 230
3497 230 232 37 -164 -264 -147 54 224 246 67 -135 -246 -169 22 219 251 106 -106 -252 -193 -23 187 249
3519 249 116 -93 -253 -223 -35 160 248 145 -71 -242 -227 -72 159 252 157 -41 -219 -252 -84 120 245 187
3541 187 -7 -207 -253 -112 90 239 201 18 -188 -244 -142 68 246 208 41 -156 -274 -161 42 221 232 90
3563 90 -141 -253 -180 19 186 244 102 -118 -247 -214 -16 184 239 128 -102 -249 -227 -55 142 238 147 -59 -238
3586 -238 -236 -65 142 247 184 -26 -212 -233 -101 118 249 206 -6 -209 -251 -113 93 247 211 24 -183 -258 -145
3609 -145 64 221 221 45 -165 -252 -184 35 232 230 75 -141 -264 -185 19 201 248 103 -131 -253 -218 -17 185
3632 185 247 126 -98 -242 -220 -31 176 268 163 -66 -226 -231 -55 173 275 194 -44 -219 -240 -76 138 254
3654 254 193 -12 -207 -255 -106 107 235 221 15 -191 -258 -124 72 240 213 35 -175 -250 -150 60 240 236 61
3677 61 -156 -269 -171 40 231 247 74 -138 -263 -184 21 210 255 103 -98 -240 -200 -7 195 265 130 -80
3699 -80 -242 -227 -39 166 253 133 -65 -231 -254 -62 156 257 183 -47 -219 -229 -100 134 234 194 -23 -219
3721 -219 -240 -111 107 244 208 11 -191 -265 -132 80 231 213 32 -166 -261 -157 71 230 231 66 -140 -250
3743 -250 -178 25 222 241 74 -134 -259 -201 2 199 241 113 -102 -250 -233 -18 193 244 124 -86 -229 -223 -59
3766 -59 151 249 159 -47 -230 -222 -77 139 255 183 -22 -207 -232 -98 127 261 204 14 -190 -235 -109 100 247
3789 247 214 24 -176 -227 -141 91 252 231 35 -152 -239 -164 61 237 230 70 -123 -241 -196 18 213 238 92
3812 92 -122 -253 -201 -5 176 241 111 -88 -232 -211 -28 175 262 153 -60 -220 -213 -55 165 266 164 -34
3834 -34 -200 -219 -68 128 260 189 -11 -204 -245 -108 101 225 192 5 -177 -248 -113 90 242 218 40 -163
3856 -163 -245 -156 46 231 239 62 -161 -262 -178 42 213 250 83 -129 -241 -177 21 201 242 116 -113 -239 -196
3879 -196 -9 192 264 142 -68 -235 -214 -34 161 252 144 -48 -232 -236 -66 126 239 161 -36 -218 -229 -82
3901 -82 120 249 192 -7 -183 -229 -117 95 240 208 18 -184 -241 -131 76 236 218 62 -147 -243 -151 44 217
3924 217 236 80 -132 -258 -176 22 203 229 93 -113 -230 -180 -11 198 240 115 -99 -231 -217 -24 167 238
3946 238 146 -68 -218 -216 -64 151 249 169 -53 -221 -225 -64 132 242 192 -14 -194 -226 -101 121 239 188 26
3969 26 -180 -209 -116 108 233 216 28 -176 -244 -143 63 224 216 54 -128 -241 -156 11 195 234 77 -125 -251
3992 -251 -199 6 190 243 106 -87 -248 -188 -22 175 232 130 -94 -220 -204 -43 161 248 141 -62 -204 -223
4014 -223 -61 155 251 168 -18 -210 -225 -88 131 238 185 -4 -191 -253 -118 102 227 192 6 -172 -255 -127
4036 -127 74 219 210 38 -167 -242 -149 50 229 230 53 -142 -226 -166 22 190 219 90 -110 -245 -177 5 188
4059 188 248 112 -84 -221 -197 -15 179 257 153 -79 -215 -215 -34 151 251 154 -50 -195 -221 -66 142 240 166
4082 166 -24 -207 -244 -83 126 239 176 2 -199 -248 -113 109 241 211 25 -185 -236 -125 64 241 226 47
4104 47 -143 -227 -139 62 236 228 74 -134 -232 -162 33 220 240 97 -103 -219 -177 10 193 233 126 -95 -200
4127 -200 -202 -13 169 238 127 -80 -238 -212 -41 158 246 150 -36 -196 -226 -52 143 255 182 -20 -202 -236 -75
4150 -75 118 246 190 6 -178 -240 -96 100 233 197 25 -169 -234 -124 83 212 200 39 -151 -239 -144 59 204
4173 204 224 60 -122 -243 -158 36 200 223 72 -112 -234 -177 7 187 240 107 -95 -231 -187 -14 166 211
4195 211 135 -62 -211 -208 -21 148 247 152 -33 -194 -204 -54 141 219 166 -19 -188 -220 -77 112 232 162 -3
4218 -3 -185 -214 -102 95 226 199 25 -159 -232 -132 71 202 203 29 -152 -234 -153 40 208 225 68 -140 -235 -151
4242 -151 27 196 226 84 -118 -217 -157 15 183 228 95 -82 -207 -187 -8 158 236 118 -62 -212 -211 -48 140
4265 140 226 146 -49 -195 -224 -49 124 204 181 -9 -188 -214 -95 104 221 185 11 -171 -220 -102 88 215 189
4288 189 16 -142 -225 -125 59 200 204 37 -142 -236 -141 49 187 210 74 -116 -208 -157 16 178 218 88 -99
4311 -99 -218 -167 -5 157 226 113 -79 -206 -187 -27 151 212 126 -70 -210 -211 -62 127 208 157 -24 -183 -204 -86
4335 -86 121 211 163 -18 -182 -198 -85 101 207 170 11 -166 -210 -113 64 208 182 50 -152 -217 -146 52 178
4358 178 174 45 -120 -203 -149 18 175 202 76 -101 -209 -164 15 170 210 88 -81 -209 -172 -11 147 208 111
4381 111 -79 -191 -188 -21 140 223 118 -49 -194 -191 -55 127 207 141 -21 -169 -208 -85 107 204 160 -2 -167
4404 -167 -212 -117 75 202 156 7 -151 -228 -110 61 190 199 53 -119 -204 -115 38 181 187 66 -115 -209 -147 19
4428 19 182 206 97 -93 -196 -160 -1 180 209 98 -68 -197 -156 -11 139 202 142 -47 -198 -184 -53 125 210
4451 210 139 -38 -180 -192 -69 110 193 167 -16 -178 -197 -88 88 203 169 9 -172 -206 -102 82 204 196 27
4474 27 -157 -196 -124 62 197 196 56 -120 -207 -152 31 176 203 78 -113 -213 -159 14 169 204 91 -76 -198
4497 -198 -181 -20 154 197 111 -81 -197 -193 -25 132 199 113 -53 -190 -204 -71 124 222 149 -30 -171 -200 -78 106
4521 106 215 172 -10 -174 -204 -89 95 223 193 12 -160 -206 -108 72 203 191 32 -144 -225 -144 39 197 188
4544 188 56 -122 -225 -155 25 172 198 68 -100 -200 -156 16 170 219 97 -89 -226 -181 -30 147 203 111
4566 111 -70 -199 -195 -41 150 201 141 -31 -180 -198 -61 116 224 142 -17 -171 -203 -74 106 214 174 -12 -175
4589 -175 -198 -104 72 196 181 13 -157 -201 -112 59 198 182 41 -146 -213 -129 45 187 195 59 -115 -202 -144 19
4613 19 194 215 63 -102 -212 -164 -15 173 207 109 -81 -205 -179 -19 141 212 117 -62 -182 -184 -35 124 218 130
4637 130 -45 -192 -195 -73 105 208 146 -17 -152 -209 -66 97 211 172 2 -161 -200 -103 83 200 181 28 -140
4660 -140 -194 -130 60 205 200 48 -130 -228 -131 50 192 190 54 -110 -204 -138 34 169 200 70 -113 -195 -171 -2
4684 -2 161 210 114 -81 -199 -171 -23 128 213 102 -66 -196 -190 -40 132 229 156 -44 -185 -186 -70 119 213 152 -23
4709 -23 -162 -209 -91 108 205 177 8 -154 -204 -92 83 207 188 36 -146 -213 -119 63 187 196 45 -134 -220 -155
4733 -155 42 189 196 65 -110 -213 -167 -5 168 197 103 -100 -206 -159 -10 165 224 114 -69 -190 -173 -29 171
4756 171 218 121 -40 -198 -189 -53 132 223 156 -34 -199 -181 -67 122 221 162 -17 -167 -214 -94 79 198 175 22
4780 22 -158 -203 -115 75 203 187 29 -152 -211 -129 62 192 195 57 -133 -211 -139 32 183 190 86 -97 -208 -168
4804 -168 1 165 214 102 -83 -210 -187 -21 148 227 107 -59 -191 -188 -41 138 216 133 -51 -185 -195 -56 118
4827 118 218 144 -33 -174 -202 -91 93 208 155 -6 -169 -217 -105 82 219 177 32 -148 -212 -98 58 202
4849 202 193 49 -132 -209 -132 38 186 198 59 -126 -208 -148 28 178 194 89 -93 -208 -186 -3 160 205 104
4872 104 -97 -209 -177 -31 160 210 122 -56 -195 -208 -56 124 220 149 -35 -189 -204 -68 115 229 150 -10 -163
4895 -163 -188 -82 98 213 181 28 -156 -200 -91 86 202 194 21 -136 -207 -139 45 196 186 36 -131 -209 -160
4918 -160 23 190 220 75 -99 -203 -165 22 182 210 99 -83 -210 -180 -18 166 218 104 -70 -200 -177 -24
4940 -24 145 217 139 -42 -200 -194 -60 131 223 149 -22 -177 -192 -76 112 231 173 -5 -164 -205 -79 77 201
4963 201 168 9 -160 -230 -124 65 217 196 36 -150 -226 -149 57 201 201 59 -116 -217 -153 19 183 223 86
4986 86 -119 -209 -150 22 184 245 103 -85 -211 -178 2 157 226 117 -71 -204 -209 -45 159 238 155 -39 -192
5009 -192 -203 -45 143 217 139 -24 -197 -224 -81 111 229 168 -18 -175 -232 -115 93 227 193 14 -164 -218 -126
5032 -126 76 220 209 39 -149 -230 -127 56 205 221 59 -132 -231 -156 32 213 219 71 -111 -223 -171 -11 189
5055 189 221 102 -96 -212 -176 -25 172 226 137 -60 -211 -208 -44 147 229 132 -49 -195 -206 -62 142 244 166
5078 166 -21 -183 -217 -75 107 237 185 2 -181 -221 -92 96 228 199 27 -152 -243 -137 66 211 209 43
5100 43 -143 -225 -146 47 197 220 66 -115 -233 -166 1 198 215 88 -109 -218 -181 -2 190 238 114 -80 -227
5123 -227 -187 -22 172 227 140 -60 -227 -206 -58 148 237 150 -52 -194 -224 -73 132 228 189 -28 -191 -240 -84
5146 -84 111 233 172 -5 -183 -231 -114 83 229 204 33 -156 -249 -139 56 231 233 48 -145 -233 -148 43 219
5169 219 234 88 -109 -245 -175 28 205 245 84 -108 -227 -187 -1 176 246 109 -88 -212 -202 -24 157 244
5191 244 142 -57 -209 -207 -58 146 245 156 -22 -224 -216 -81 120 224 178 -11 -196 -240 -111 109 232 206 20
5214 20 -156 -248 -107 85 216 213 46 -180 -233 -148 66 221 215 58 -154 -267 -182 27 207 225 85 -133 -234
5237 -234 -175 4 206 242 124 -106 -239 -188 -8 178 246 132 -82 -231 -219 -58 159 238 125 -68 -213 -206 -67
5260 -67 127 266 180 -17 -203 -233 -87 121 235 202 -8 -181 -225 -105 91 244 220 30 -172 -247 -115 73
5282 73 238 225 44 -148 -251 -154 29 209 216 68 -135 -239 -174 14 199 237 95 -132 -239 -197 -11 187 252
5305 252 113 -76 -239 -196 -26 177 262 143 -39 -225 -221 -52 147 256 156 -35 -204 -232 -81 130 245 173
5327 173 -11 -196 -246 -95 111 239 205 7 -197 -254 -130 67 216 213 41 -149 -259 -146 63 224 232 67
5349 67 -139 -240 -169 38 225 250 99 -129 -233 -196 11 195 242 113 -106 -247 -217 -17 181 240 135 -83
5371 -83 -223 -227 -53 159 256 150 -46 -216 -227 -89 140 245 174 -23 -211 -241 -104 125 246 206 2 -193 -254
5394 -254 -136 89 236 201 25 -171 -263 -148 63 242 257 81 -151 -261 -165 47 216 261 86 -137 -256 -189
5416 -189 26 205 238 108 -117 -256 -204 -17 195 267 128 -93 -240 -219 -51 191 255 146 -60 -231 -241 -66
5438 -66 151 250 190 -30 -220 -255 -86 128 266 192 -4 -204 -237 -118 94 266 217 28 -193 -266 -135 80 235
5461 235 236 47 -165 -263 -154 57 224 249 70 -157 -250 -182 25 223 254 95 -121 -248 -201 -18 208 260 118
5484 118 -101 -248 -217 -25 176 271 157 -74 -234 -238 -56 157 271 193 -52 -232 -238 -69 157 263 187 -2 -215
5507 -215 -261 -95 116 273 221 10 -190 -265 -140 95 256 229 34 -174 -262 -162 67 227 246 59 -162 -271
5529 -271 -172 24 234 248 95 -131 -268 -206 5 225 261 116 -110 -250 -220 -13 181 272 157 -93 -234 -220
5551 -220 -35 177 258 166 -59 -239 -253 -83 165 270 201 -39 -216 -267 -88 127 277 211 -13 -210 -273 -131
5573 -131 105 253 224 40 -194 -272 -152 77 259 229 68 -166 -276 -168 62 234 262 86 -146 -260 -191 21
5595 21 219 269 104 -121 -270 -214 -9 194 272 127 -90 -257 -249 -45 195 255 157 -81 -259 -237 -56 163 268
5618 268 172 -37 -235 -258 -100 144 267 205 -16 -222 -263 -111 110 264 224 28 -203 -261 -148 89 258 237
5640 237 59 -195 -280 -168 68 256 256 68 -146 -269 -190 48 232 258 86 -139 -277 -227 -9 197 257 121
5662 121 -111 -289 -230 -31 197 269 138 -87 -247 -252 -49 179 274 173 -57 -247 -256 -77 158 278 207 -19 -240
5685 -240 -261 -102 119 269 227 8 -218 -285 -144 97 257 219 35 -170 -279 -181 74 261 260 60 -168 -283
5707 -283 -184 47 234 253 89 -149 -283 -220 12 208 266 109 -118 -267 -221 -13 200 272 158 -82 -260 -232
5729 -232 -44 179 292 167 -59 -255 -244 -73 147 282 190 -41 -242 -281 -111 122 272 207 -19 -218 -270 -128
5751 -128 105 273 235 20 -203 -278 -160 55 240 251 65 -177 -290 -184 41 248 249 68 -153 -278 -206 18
5773 18 224 263 127 -119 -262 -215 -9 223 275 135 -99 -259 -250 -47 188 288 167 -81 -265 -260 -73 150 271
5796 271 191 -37 -253 -271 -102 125 257 206 -12 -226 -267 -130 111 268 239 2 -215 -295 -140 90 260 247
5818 247 46 -192 -286 -159 61 244 266 72 -166 -288 -198 25 238 284 99 -143 -281 -218 -3 230 263 136
5840 136 -103 -277 -241 -27 199 277 156 -91 -279 -259 -70 172 294 179 -41 -249 -266 -60 166 288 202 -18
5862 -18 -236 -269 -131 122 290 239 0 -215 -275 -129 107 268 241 47 -195 -283 -174 73 268 240 69 -165
5884 -165 -274 -191 52 241 263 84 -137 -288 -226 27 226 274 120 -119 -286 -232 -20 212 293 144 -89 -261
5906 -261 -236 -41 190 288 181 -57 -257 -251 -78 171 284 195 -32 -233 -265 -104 143 279 227 -3 -221 -293 -134
5929 -134 112 282 224 18 -225 -286 -158 72 268 237 57 -190 -285 -191 46 252 259 88 -154 -291 -193 33 247
5952 247 291 109 -139 -298 -227 -4 226 282 151 -102 -268 -240 -27 217 290 181 -60 -281 -267 -66 177 279
5974 279 216 -45 -254 -273 -113 139 292 227 -16 -241 -281 -139 121 270 239 24 -217 -302 -156 102 273 270 48
5997 48 -184 -298 -177 65 270 275 75 -171 -293 -204 21 254 271 117 -143 -298 -222 12 233 277 133 -112
6019 -112 -274 -236 -22 212 280 171 -85 -268 -261 -64 189 283 190 -63 -283 -285 -93 174 290 194 -35 -246 -279
6042 -279 -119 129 278 244 32 -233 -285 -122 119 288 257 41 -192 -300 -164 91 264 276 59 -180 -290
6063 -290 -186 46 269 276 84 -145 -297 -219 27 242 283 131 -128 -284 -249 -18 221 309 147 -102 -280 -251
6085 -251 -53 204 301 154 -72 -275 -259 -95 177 297 186 -48 -250 -282 -100 157 289 236 -16 -233 -284 -125
6107 -125 123 281 253 11 -216 -291 -154 75 268 241 58 -174 -298 -169 61 259 275 70 -166 -291 -204 33
6129 33 247 287 101 -135 -280 -220 1 237 287 129 -126 -291 -235 -12 200 288 169 -63 -262 -252 -41 185
6151 185 299 195 -60 -263 -257 -95 153 299 210 -11 -234 -283 -110 138 298 232 -8 -228 -296 -161 100 288
6173 288 231 35 -195 -296 -151 80 256 271 70 -177 -297 -193 45 278 275 96 -146 -283 -207 21 234 292
6195 292 125 -114 -282 -240 -24 224 298 142 -94 -269 -257 -40 196 289 166 -69 -258 -269 -69 171 283 191
6217 191 -55 -241 -268 -102 140 284 213 -6 -232 -277 -147 125 280 227 27 -216 -284 -152 99 277 257 55
6239 55 -186 -294 -178 78 264 258 73 -161 -291 -202 33 247 269 92 -148 -266 -207 2 234 287 139 -128
6261 -128 -274 -238 -20 203 278 173 -67 -270 -247 -53 179 282 179 -59 -264 -254 -78 152 284 209 -40 -233
6283 -233 -285 -131 148 289 228 -3 -238 -294 -138 96 287 252 41 -206 -294 -183 78 248 266 62 -185 -302
6305 -302 -187 51 250 283 94 -155 -291 -203 12 223 272 118 -126 -277 -234 -11 213 306 163 -111 -278 -247
6327 -247 -43 202 275 171 -62 -247 -272 -78 169 284 202 -31 -238 -275 -93 154 277 213 -8 -223 -297 -140
6349 -140 124 264 224 22 -212 -296 -157 78 261 257 45 -195 -292 -178 58 256 269 79 -157 -292 -209 29
6371 29 248 271 113 -139 -269 -233 5 205 277 142 -107 -270 -233 -14 198 300 156 -69 -262 -239 -42 186
6393 186 273 180 -32 -257 -270 -91 167 275 183 -8 -220 -263 -119 116 263 224 -8 -219 -292 -147 88 260
6415 260 225 37 -200 -287 -170 84 249 261 65 -173 -281 -202 55 227 265 100 -136 -275 -213 21 226 261
6437 261 116 -100 -290 -239 -29 204 281 137 -79 -276 -247 -37 179 273 176 -81 -245 -270 -77 140 248 176
6459 176 -45 -233 -271 -102 121 276 225 0 -216 -276 -121 118 256 230 12 -203 -286 -135 75 268 248 69
6481 69 -186 -271 -183 63 255 263 77 -149 -281 -207 24 231 269 88 -125 -277 -218 9 211 264 134 -108 -274
6504 -274 -242 -34 188 283 144 -74 -253 -261 -44 176 287 176 -43 -242 -257 -70 159 287 209 -13 -226 -254
6526 -254 -99 121 273 220 17 -217 -263 -143 106 261 229 34 -191 -289 -169 62 245 252 67 -169 -265 -183 45
6549 45 229 262 96 -142 -275 -204 21 227 259 121 -110 -257 -223 -17 211 278 155 -88 -259 -251 -45 192 270
6572 270 176 -53 -242 -242 -57 167 277 192 -30 -247 -272 -98 130 256 213 4 -234 -268 -124 111 249 225 25
6595 25 -196 -274 -147 85 264 244 56 -179 -269 -143 45 244 263 91 -142 -276 -173 36 237 278 110 -121
6617 -121 -260 -205 -4 204 273 144 -91 -245 -245 -34 182 269 169 -64 -261 -245 -73 166 256 173 -58 -252 -259
6640 -259 -101 152 266 203 -15 -230 -282 -125 120 246 215 0 -209 -261 -147 93 246 236 57 -171 -284 -159
6662 -159 69 258 242 63 -170 -268 -175 42 228 255 106 -140 -253 -196 -4 203 248 128 -103 -281 -229 -51
6684 -51 185 265 148 -90 -252 -247 -48 169 265 172 -69 -247 -252 -90 152 274 180 -21 -234 -262 -102 145 272
6707 272 230 6 -190 -265 -126 109 254 236 28 -177 -291 -142 65 253 241 49 -167 -267 -172 37 218 242
6729 242 68 -143 -266 -214 21 207 273 109 -109 -263 -221 -5 201 273 141 -90 -259 -216 -49 185 263 149
6751 149 -69 -236 -240 -49 171 270 186 -46 -230 -244 -106 128 253 199 -9 -212 -256 -124 109 248 213 27 -194
6774 -194 -265 -148 76 227 226 52 -182 -265 -183 45 232 234 83 -146 -262 -196 6 227 264 110 -124 -253 -211
6797 -211 2 236 268 144 -84 -245 -217 -23 171 258 154 -68 -258 -229 -62 162 265 159 -35 -233 -244 -85
6819 -85 150 257 187 0 -217 -275 -107 113 236 222 10 -195 -259 -143 83 239 220 28 -169 -261 -160 73
6841 73 233 249 64 -149 -263 -171 55 222 258 90 -137 -262 -201 20 211 254 106 -112 -262 -227 -30 186
6863 186 259 138 -92 -248 -232 -44 174 255 157 -65 -243 -250 -75 130 272 172 -18 -218 -257 -94 131 262
6885 262 209 10 -202 -278 -125 99 261 215 35 -186 -268 -166 71 249 246 69 -168 -266 -172 45 235 264 79
6908 79 -158 -271 -186 19 215 260 92 -113 -265 -221 -14 203 253 148 -85 -238 -228 -50 180 268 153 -49
6930 -49 -230 -222 -77 162 286 175 -34 -209 -226 -100 143 270 191 -15 -201 -263 -104 102 276 201 21 -188
6952 -188 -248 -134 101 237 235 44 -174 -274 -162 49 222 230 80 -142 -273 -192 34 208 252 96 -140 -262
6974 -262 -207 -1 208 255 126 -90 -266 -205 -19 185 251 136 -71 -245 -234 -57 170 275 180 -59 -222 -254
6996 -254 -86 115 248 187 -41 -216 -262 -109 105 248 208 11 -188 -259 -132 80 229 211 26 -167 -266 -162
7018 -162 54 226 233 64 -150 -260 -185 43 219 251 90 -126 -243 -188 4 211 239 121 -101 -241 -205 -13
7040 -13 182 244 129 -86 -234 -232 -43 167 239 144 -60 -227 -231 -76 142 244 182 -33 -220 -243 -97 135 253
7063 253 190 -13 -217 -250 -113 105 251 211 38 -164 -264 -139 74 243 235 70 -150 -255 -154 21 229 238
7085 238 82 -133 -254 -179 25 213 238 91 -111 -253 -216 -7 183 235 115 -118 -255 -238 -36 166 254 152
7107 152 -50 -231 -233 -58 145 244 169 -34 -208 -234 -65 134 247 200 -15 -211 -232 -88 111 250 201 12 -186
7130 -186 -238 -142 75 226 211 39 -156 -254 -150 47 230 232 58 -145 -246 -164 29 199 228 89 -136 -244 -189
7153 -189 16 190 245 132 -100 -261 -216 -27 189 257 134 -59 -232 -217 -48 180 259 164 -45 -198 -217 -87
7175 -87 135 256 190 1 -188 -243 -101 104 237 200 18 -175 -253 -138 80 224 213 25 -174 -263 -150 57
7197 57 225 219 53 -141 -251 -155 25 205 230 98 -126 -249 -182 17 201 247 100 -93 -231 -180 -6 186 231
7220 231 130 -69 -230 -205 -35 172 248 135 -49 -218 -226 -67 140 240 157 -23 -215 -233 -95 118 234 168
7242 168 4 -194 -238 -120 115 232 190 13 -179 -243 -131 81 242 218 57 -139 -248 -156 48 222 228 90
7264 90 -138 -236 -173 24 197 242 103 -107 -235 -179 -4 191 252 126 -87 -233 -204 -25 169 241 136 -65 -217
7287 -217 -221 -60 138 237 158 -37 -199 -231 -77 122 230 171 1 -183 -224 -98 102 230 178 15 -180 -229 -113
7310 -113 85 226 213 38 -152 -233 -128 62 220 217 55 -145 -239 -171 30 198 222 95 -109 -218 -180 12 186
7333 186 232 103 -107 -227 -183 -35 175 244 112 -79 -214 -209 -40 161 242 144 -55 -212 -196 -61 132 244 168
7356 168 -16 -181 -210 -90 121 227 178 2 -178 -219 -122 85 205 180 23 -169 -238 -127 69 201 198 57 -139
7379 -139 -236 -141 43 196 210 56 -113 -226 -167 20 188 213 86 -104 -209 -176 7 156 224 113 -69 -222
7401 -222 -181 -28 161 224 134 -46 -194 -200 -59 136 228 147 -25 -185 -198 -74 120 221 155 -18 -190 -228 -103
7424 -103 78 212 169 0 -163 -218 -129 77 203 193 36 -146 -210 -118 53 201 213 64 -124 -203 -144 32 186
7447 186 221 69 -102 -211 -162 16 173 231 89 -83 -209 -179 -24 151 210 119 -53 -201 -189 -50 112 195 124
7470 124 -35 -208 -211 -72 111 202 148 -9 -179 -202 -95 100 212 165 8 -149 -194 -98 84 221 196 48 -142
7493 -142 -206 -109 43 197 196 51 -113 -216 -131 19 171 201 68 -109 -211 -148 18 166 206 104 -100 -207 -163
7516 -163 -13 165 204 107 -76 -205 -178 -26 143 204 129 -35 -192 -189 -58 125 206 148 -8 -179 -202 -56 112
7539 112 200 156 25 -166 -187 -92 77 205 153 17 -140 -214 -110 61 196 164 31 -135 -203 -122 39 170 183
7562 183 61 -123 -202 -148 25 170 210 76 -89 -202 -152 1 142 222 108 -78 -197 -170 -26 154 201 115 -45
7585 -45 -186 -179 -35 113 213 137 -30 -172 -182 -57 117 196 137 -12 -173 -189 -81 84 199 158 -9 -157 -209
7608 -209 -105 63 168 169 22 -143 -193 -132 40 177 171 48 -114 -204 -131 41 177 198 74 -91 -192 -145 1
7631 1 159 200 92 -76 -180 -143 -12 146 199 104 -72 -178 -178 -32 135 194 120 -45 -173 -174 -66 107 198 133 -10
7656 -10 -167 -194 -72 71 167 153 -20 -150 -196 -100 76 186 153 24 -141 -208 -100 65 170 173 51 -107 -185 -118
7680 -118 38 168 185 49 -103 -185 -143 11 143 181 81 -80 -190 -158 -11 146 175 95 -63 -184 -170 -40 128
7703 128 195 104 -41 -183 -171 -52 100 184 111 -30 -165 -180 -72 85 184 148 -6 -163 -175 -87 83 172 145 16
7727 16 -127 -178 -85 63 176 162 41 -109 -191 -127 26 172 164 51 -116 -187 -145 11 148 153 60 -98 -193 -148 -3
7752 -3 136 188 94 -85 -156 -144 -8 116 181 87 -58 -164 -154 -31 123 176 125 -26 -148 -152 -37 104 180 140 -16
7777 -16 -160 -168 -72 95 185 143 6 -152 -182 -89 59 166 144 23 -133 -173 -109 31 153 164 52 -91 -183 -126 41
7802 41 145 164 69 -86 -167 -127 3 128 177 84 -71 -187 -152 -6 126 186 95 -41 -171 -153 -30 116 175 101
7826 101 -19 -164 -138 -26 97 188 113 -15 -152 -146 -55 87 174 126 -13 -133 -171 -83 65 163 140 10 -142 -167
7850 -167 -90 50 148 149 33 -108 -171 -107 30 159 173 47 -75 -162 -134 0 137 172 67 -69 -177 -115 -13 117
7874 117 166 84 -59 -147 -143 -38 104 160 88 -51 -163 -167 -36 85 163 112 -36 -146 -154 -66 99 172 115 -13 -138
7899 -138 -166 -89 69 162 129 15 -109 -158 -90 60 146 146 49 -102 -161 -103 40 155 135 36 -99 -161 -120 16 130
7924 130 164 61 -74 -162 -138 -20 116 149 58 -68 -158 -135 -16 98 166 93 -56 -147 -152 -49 101 156 95 -35 -143
7949 -143 -144 -62 97 148 113 -13 -150 -152 -66 73 150 139 -8 -119 -153 -81 59 156 127 18 -107 -158 -94 51 138 157
7975 157 36 -100 -159 -117 14 108 121 42 -88 -169 -118 -5 107 140 61 -75 -147 -122 -15 124 161 92 -33 -152
7999 -152 -143 -34 94 146 101 -24 -137 -138 -36 92 146 124 -17 -129 -146 -70 74 145 107 -6 -126 -156 -79 42 143
8024 143 120 12 -113 -150 -92 23 125 126 24 -102 -159 -107 25 122 138 46 -75 -161 -111 16 118 149 65 -66 -134
8049 -134 -116 0 110 149 92 -44 -140 -124 -30 86 142 80 -38 -152 -140 -48 79 145 103 -28 -124 -129 -64 65 146 100
8075 100 -8 -109 -136 -68 61 136 117 19 -112 -148 -80 46 125 124 42 -86 -146 -84 16 129 125 29 -69 -136 -95 26
8101 26 120 129 61 -52 -138 -112 -11 102 140 66 -59 -129 -127 -27 88 138 71 -40 -125 -138 -47 86 137 85 -28 -125 -120
8128 -120 -54 71 148 104 5 -98 -131 -54 51 130 109 15 -110 -128 -63 42 137 117 21 -87 -128 -75 23 112 130 32 -71
8155 -71 -130 -98 11 126 126 52 -54 -125 -92 1 95 120 51 -64 -136 -112 -20 86 124 69 -39 -139 -113 -22 88 144 79
8182 79 -14 -116 -111 -42 64 131 89 -6 -92
8191i2
$$ Imaginary data points
##PAGE= N=2
##DATA TABLE= (X++(I..I)), XYDATA
0 0 0 0 0 0 0 0 0 0 0 0 0 0 -8 8 -8 8 -8 8 -16 16 -18 24 -25 32 -40 46 -54 58 -70 81 -89 105 -120 135 -152
35 -152 171 -191 215 -240 267 -298 330 -369 410 -450 499 -548 605 -668 737 -811 893 -985
53 -985 1085 -1200 1327 -1474 1643 -1836 2065 -2341 2676 -3102 3653 -4405 5501 -7238 10446
68 10446 -18356 80765 47807 -180641 -220661 -141560 55362 207508 218967 52771 -138583
79 -138583 -233983 -153339 33447 199215 211678 76827 -115827 -220973 -167171 11539 176871
90 176871 215149 94512 -92375 -211376 -173748 -12703 157410 210061 110473 -68696 -196372
101 -196372 -181531 -31941 137257 202740 123899 -41589 -181619 -187038 -49873 118271 192781
112 192781 133428 -18939 -163265 -188279 -69833 96026 185583 142088 -932 -144576 -183788
123 -183788 -86934 73624 177073 149815 16377 -126483 -178015 -100181 50940 163517 156257
134 156257 35430 -111228 -174433 -108455 32210 146275 157684 54775 -91754 -168627 -118847
145 -118847 13998 134497 158695 66071 -73856 -155739 -126192 -8243 119153 160047 78840
156 78840 -58078 -146823 -130586 -23057 102534 154000 91599 -37082 -136924 -136219 -36591 88324
168 88324 147885 100228 -19533 -124332 -138211 -51596 72148 142023 107159 -4117 -110374
179 -110374 -137794 -65558 56462 135748 112943 10386 -96637 -135160 -75873 40471 126001
190 126001 117942 25428 -84568 -133123 -83913 25810 114677 120186 39196 -70751 -128848 -91691
202 -91691 11625 104683 121309 50590 -56389 -122325 -98550 -2617 94070 120990 60408 -43061
214 -43061 -115148 -103136 -16173 81366 119518 70901 -30122 -108430 -105511 -26911 68673 115542
226 115542 79636 -15998 -99834 -108374 -38360 57497 111529 84701 -4004 -89135 -108920 -49812
238 -49812 45413 107259 89907 7344 -79067 -107654 -58426 33326 100869 94260 18787 -69204
250 -69204 -105932 -66092 21313 93358 96892 29204 -58773 -103117 -72906 10101 85856 98163
262 98163 38751 -47486 -98900 -78800 -764 77812 98403 47272 -36934 -94095 -83140 -11388
274 -11388 68431 97529 55440 -26414 -88710 -86210 -20951 58944 95491 62698 -15433 -82222
286 -82222 -88557 -30063 49486 92309 68356 -4936 -74959 -90011 -38868 39750 88444 73073
298 73073 4984 -66925 -89804 -46698 29791 83928 77151 14441 -58697 -88535 -53565 19792
310 19792 78280 79892 23225 -50278 -86585 -59590 10117 72076 81571 31549 -41225 -83403
322 -83403 -64692 737 65432 82373 39082 -32210 -79378 -68837 -8588 57923 82075 45903
334 45903 -23328 -74805 -71870 -17121 50096 80733 52100 -14256 -69502 -73960 -24787 42287
346 42287 78410 57111 -5472 -63597 -75322 -32236 34153 75243 61213 2932 -57096 -75569
358 -75569 -38971 25896 71469 64709 11185 -50084 -74817 -44891 17630 66873 67182 18838 -42938
371 -42938 -73397 -50176 9460 61628 68656 25968 -35393 -71017 -54605 1568 56019 69429
383 69429 32584 -27725 -67714 -58154 -6314 49727 69386 38529 -20232 -63898 -60851 -13753
395 -13753 43019 68388 43832 -12542 -59447 -62760 -20495 36357 66590 48304 -4993 -54405
407 -54405 -63938 -26877 29355 64027 51989 2099 -49055 -64166 -32634 22219 60862 55076
419 55076 9057 -43168 -63599 -37840 15284 57227 57184 15498 -36922 -62358 -42496 8299 52851
432 52851 58565 21635 -30767 -60621 -46083 1796 47906 59168 27421 -24295 -58089 -49222
444 -49222 -4670 43030 59239 32097 -18012 -54634 -51673 -11231 37551 58660 36582 -11699
456 -11699 -51109 -53373 -16733 31810 56908 40740 -4999 -47223 -54579 -21836 26114 54760
468 54760 43883 999 -42649 -54897 -27048 20177 52579 46405 6452 -37692 -54303 -31558
480 -31558 14225 49586 48470 12175 -32651 -53686 -35341 8634 45747 49537 17630 -27268
492 -27268 -52338 -38809 2801 41872 50501 22278 -22139 -50000 -41313 -2948 37541 50729
504 50729 26619 -16538 -47407 -43925 -8245 33468 50040 30054 -10975 -44129 -45506 -13388
516 -13388 28433 49180 34046 -5922 -41370 -46015 -17404 23077 47253 37260 -537 -37682
528 -37682 -46682 -21994 18455 45567 38994 4141 -33013 -46552 -26344 13674 43338 40699 8994
541 8994 -28864 -46077 -29403 8737 39957 42225 13878 -24938 -45156 -31945 3787 36465
553 36465 43065 17992 -20275 -43361 -34860 -1030 33600 43211 21270 -15278 -40905 -37198 -5820
566 -5820 29781 42985 25035 -10702 -38912 -38495 -9855 25354 42070 28412 -6137 -36027 -39311
579 -39311 -14321 21048 41484 31025 -2165 -32764 -39504 -18206 16616 39576 33150 2742
591 2742 -29385 -40276 -21539 12932 37282 34497 7066 -25647 -39672 -24464 8088 34758
603 34758 36547 11044 -22665 -38689 -26536 3703 31718 37239 14808 -18463 -37527 -29366 -117
616 -117 29267 37101 17939 -13914 -35908 -31630 -3757 26223 36611 21034 -9754 -34037 -33024
629 -33024 -7589 22631 36334 23836 -6255 -31694 -33610 -11270 18969 35499 26067 -2214
641 -2214 -28784 -34575 -14845 15895 34280 27489 1567 -25604 -34738 -17986 12039 32556 29375
654 29375 5211 -22923 -34333 -20419 8143 30603 30747 8371 -19692 -33201 -23010 3993
666 3993 28627 31835 11336 -16549 -32108 -24902 508 25784 31925 14795 -12898 -31270 -26606
679 -26606 -2493 23005 31723 17536 -9565 -29556 -27675 -5989 19881 31659 19978 -6564
691 -6564 -27609 -28371 -9096 16893 30902 21935 -3010 -25329 -29248 -11892 14106 29567 23532
704 23532 604 -22973 -29738 -14381 11056 28024 24940 3785 -20402 -29468 -16845 7696 26602
717 26602 26172 6520 -17634 -28742 -19045 4495 24788 26749 9292 -14640 -28135 -21033 1665
730 1665 22737 26973 11860 -11758 -27048 -22356 -1343 20322 27238 14327 -9084 -25697 -23389
743 -23389 -4261 17883 27056 16275 -6238 -23934 -24304 -7064 15463 26582 18054 -3400 -22194
756 -22194 -24868 -9377 12821 25588 19719 -496 -20346 -25169 -11559 10190 24503 20990 2090
769 2090 -18208 -25042 -13692 7483 23294 21975 4563 -15894 -24757 -15610 4885 21777 22645
782 22645 7040 -13513 -24241 -17237 2321 20009 23058 9358 -11092 -23477 -18566 -207 18135
795 18135 23264 11428 -8641 -22351 -19707 -2775 16150 23245 13264 -6191 -21032 -20605 -5164
808 -5164 14008 22868 14996 -3652 -19611 -21249 -7308 11785 22202 16498 -1184 -18020 -21583
821 -21583 -9354 9493 21421 17698 1099 -16240 -21659 -11281 7201 20406 18665 3321 -14308
834 -14308 -21472 -12979 4935 19177 19409 5510 -12325 -21168 -14445 2686 17746 19900 7541
847 7541 -10258 -20519 -15764 441 16226 20162 9340 -8175 -19666 -16792 -1704 14597 20209
860 20209 10990 -6094 -18676 -17630 -3732 12825 19995 12510 -4009 -17528 -18237 -5646 10975
873 10975 19570 13822 -1934 -16236 -18640 -7444 9083 18955 14952 85 -14747 -18832 -9157
886 -9157 7132 18185 15885 2061 -13178 -18803 -10668 5185 17203 16647 3973 -11506 -18579
899 -18579 -12022 3210 16037 17178 5787 -9787 -18195 -13234 1262 14778 17481 7451 -7971
912 -7971 -17549 -14293 -632 13400 17616 8959 -6103 -16734 -15138 -2493 11878 17545 10392 -4283
926 -4283 -15787 -15721 -4212 10249 17288 11669 -2447 -14697 -16160 -5847 8627 16813 12705 -639
940 -639 -13442 -16433 -7431 6970 16212 13588 1101 -12110 -16486 -8818 5240 15424 14342 2795
954 2795 -10718 -16371 -10041 3514 14475 14873 4380 -9219 -16058 -11174 1788 13460 15223 5838
968 5838 -7682 -15575 -12127 183 12325 15377 7222 -6098 -15016 -12907 -1341 11066 15385 8516
982 8516 -4533 -14275 -13498 -2904 9705 15280 9641 -3007 -13346 -13962 -4426 8318 14990 10645
996 10645 -1427 -12334 -14299 -5760 6915 14455 11492 231 -11260 -14505 -7022 5461 13844
1009 13844 12202 1665 -10074 -14389 -8198 3858 13175 12838 3018 -8865 -14182 -9243 2431 12333
1023 12333 13139 4371 -7456 -13936 -10211 1061 11415 13378 5657 -6153 -13494 -10878 -388 10284
1037 10284 13557 6879 -4858 -12911 -11498 -1851 9207 13576 7835 -3452 -12089 -12053 -3251 8057
1051 8057 13363 8795 -2025 -11331 -12456 -4387 6791 12928 9700 -574 -10525 -12684 -5491 5455
1065 5455 12482 10463 698 -9551 -12677 -6598 4150 11989 10989 1929 -8347 -12617 -7723 2893
1079 2893 11377 11399 3182 -7264 -12481 -8480 1682 10429 11675 4501 -6113 -12266 -9213 433 9587
1094 9587 11907 5458 -4967 -11658 -9874 -969 8720 12031 6379 -3761 -11102 -10448 -2076 7789 11823
1109 11823 7266 -2456 -10501 -10860 -3178 6690 11647 8154 -1344 -9833 -10966 -4217 5463 11365 8910
1124 8910 -213 -8953 -11149 -5352 4433 11017 9359 940 -7935 -11217 -6297 3356 10447 9797 2189
1139 2189 -7061 -11253 -7009 2241 9685 10199 3280 -6137 -10993 -7686 1009 8956 10522 4239 -5132
1154 -5132 -10624 -8390 -102 8310 10550 5067 -3902 -10151 -9087 -1178 7529 10525 5953 -2829 -9711
1169 -9711 -9405 -2138 6457 10389 6870 -1787 -9152 -9666 -3214 5509 10300 7444 -842 -8299 -9827
1184 -9827 -4293 4562 10019 7994 265 -7563 -10039 -5080 3610 9495 8470 1373 -6807 -9994 -5792
1199 -5792 2437 8952 9030 2315 -6039 -9777 -6488 1330 8380 9296 3210 -5015 -9517 -7245 387 7801
1215 7801 9373 4123 -3974 -9287 -7771 -529 6968 9378 5079 -3012 -8924 -8168 -1495 6118 9393
1230 9393 5806 -2091 -8360 -8483 -2527 5296 9301 6394 -1095 -7718 -8814 -3406 4515 8979 6915
1245 6915 -42 -7056 -9010 -4203 3609 8654 7451 895 -6386 -8993 -4921 2611 8228 7916 1778
1260 1778 -5652 -8871 -5667 1641 7814 8191 2566 -4784 -8690 -6307 762 7228 8354 3457 -3943
1275 -3943 -8506 -6806 -101 6551 8480 4245 -3120 -8168 -7191 -1067 5808 8547 4926 -2308 -7733
1290 -7733 -7530 -1939 5115 8464 5528 -1377 -7208 -7865 -2752 4383 8257 6105 -462 -6703 -8026
1305 -8026 -3474 3561 7965 6627 385 -6121 -8082 -4194 2698 7665 7005 1187 -5391 -8059 -4892
1320 -4892 1893 7287 7281 2008 -4650 -8001 -5484 1089 6783 7479 2820 -3915 -7817 -5958 240 6212
1336 6212 7646 3516 -3179 -7551 -6388 -607 5607 7717 4182 -2381 -7184 -6748 -1395 4971 7669
1351 7669 4785 -1568 -6766 -7020 -2125 4300 7534 5342 -763 -6320 -7184 -2837 3556 7348 5812
1366 5812 18 -5775 -7291 -3534 2770 7072 6198 783 -5169 -7321 -4161 2032 6713 6501 1547
1381 1547 -4508 -7266 -4733 1249 6284 6722 2261 -3840 -7114 -5210 470 5806 6895 2935 -3149
1396 -3149 -6867 -5635 -287 5271 6948 3556 -2403 -6575 -5974 -1002 4695 6932 4120 -1668 -6222
1411 -6222 -6256 -1715 4082 6830 4622 -940 -5814 -6439 -2364 3422 6654 5064 -223 -5339 -6540 -2990
1427 -2990 2743 6427 5443 507 -4804 -6591 -3550 2046 6131 5723 1159 -4253 -6548 -4054 1382
1442 1382 5750 5947 1822 -3665 -6428 -4511 686 5338 6107 2445 -3029 -6243 -4907 -15 4884
1457 4884 6190 3009 -2373 -5984 -5240 -688 4389 6207 3562 -1719 -5690 -5510 -1341 3816 6136
1472 6136 4008 -1053 -5323 -5691 -1946 3249 6016 4415 -415 -4905 -5800 -2525 2637 5827 4759
1487 4759 246 -4450 -5866 -3040 2037 5578 5051 873 -3949 -5865 -3527 1395 5264 5285 1460 -3434
1503 -3434 -5767 -3946 791 4924 5452 2033 -2885 -5624 -4319 174 4520 5510 2550 -2303 -5452
1518 -5452 -4615 -403 4077 5539 3038 -1731 -5203 -4840 -996 3585 5520 3472 -1157 -4878 -5022 -1569
1534 -1569 3072 5438 3850 -561 -4531 -5192 -2074 2569 5277 4158 31 -4138 -5255 -2553 2025
1549 2025 5053 4458 597 -3751 -5252 -2979 1456 4815 4671 1117 -3273 -5165 -3410 880 4543
1564 4543 4821 1614 -2759 -5071 -3762 341 4172 4883 2121 -2211 -4951 -4028 -190 3757 4957 2579
1580 2579 -1736 -4724 -4253 -741 3350 4945 2962 -1217 -4426 -4432 -1245 2945 4885 3284 -674 -4129
1596 -4129 -4579 -1696 2475 4739 3614 -124 -3847 -4658 -2086 1968 4549 3885 352 -3476 -4638 -2525
1612 -2525 1454 4380 4079 809 -3052 -4589 -2906 979 4130 4189 1282 -2579 -4573 -3214 526 3820
1628 3820 4283 1738 -2161 -4435 -3447 2 3449 4392 2170 -1739 -4246 -3655 -504 3112 4404 2466
1644 2466 -1251 -3982 -3880 -975 2764 4327 2790 -736 -3770 -4043 -1349 2329 4192 3106 -259
1659 -259 -3512 -4101 -1746 1830 4101 3384 145 -3191 -4086 -2159 1400 3951 3550 589 -2766 -4121
1675 -4121 -2515 1026 3750 3673 1048 -2387 -4114 -2761 571 3429 3818 1478 -2055 -3999 -2997 109
1691 109 3135 3918 1821 -1622 -3805 -3270 -370 2862 3943 2119 -1176 -3617 -3464 -752 2516 3861
1707 3861 2443 -726 -3432 -3613 -1122 2120 3785 2746 -352 -3177 -3645 -1507 1680 3709 2998 47
1723 47 -2868 -3685 -1875 1342 3585 3146 473 -2512 -3713 -2199 951 3346 3312 901 -2213 -3704
1739 -3704 -2428 552 3089 3432 1254 -1881 -3567 -2679 103 2853 3529 1584 -1507 -3423 -2921 -280
1755 -280 2592 3499 1871 -1073 -3268 -3106 -620 2276 3445 2191 -695 -3115 -3207 -954 1897 3417
1771 3417 2470 -340 -2858 -3260 -1341 1571 3357 2634 11 -2548 -3311 -1679 1251 3209 2795 414
1787 414 -2277 -3342 -1930 890 2992 2931 776 -2016 -3292 -2161 500 2797 3063 1078 -1699 -3182
1803 -3182 -2378 117 2585 3125 1381 -1352 -3061 -2589 -201 2328 3118 1658 -985 -2942 -2739 -509
1819 -509 2027 3083 1944 -656 -2782 -2809 -854 1711 3062 2146 -321 -2524 -2885 -1166 1424 2959
1835 2959 2311 -12 -2305 -2952 -1440 1125 2817 2467 349 -2049 -2952 -1669 806 2639 2576 628
1851 628 -1800 -2887 -1892 452 2480 2670 915 -1512 -2790 -2091 165 2289 2713 1155 -1191 -2693
1867 -2693 -2248 -138 2060 2721 1430 -898 -2592 -2364 -437 1812 2709 1654 -616 -2424 -2451 -713
1883 -713 1545 2671 1836 -330 -2217 -2520 -977 1289 2590 1976 -43 -2035 -2554 -1209 1018 2481
1899 2481 2130 235 -1834 -2556 -1424 744 2354 2244 498 -1605 -2518 -1602 461 2206 2312 742
1915 742 -1345 -2458 -1783 205 2024 2359 980 -1109 -2376 -1910 -54 1836 2382 1195 -875 -2277
1931 -2277 -2040 -315 1632 2355 1372 -620 -2154 -2120 -544 1431 2339 1546 -369 -2009 -2182 -759 1216
1948 1216 2272 1703 -135 -1862 -2200 -978 983 2201 1831 118 -1675 -2222 -1164 744 2089 1915
1964 1915 344 -1474 -2206 -1339 521 1985 2000 557 -1280 -2162 -1495 281 1824 2045 757 -1078 -2114
1981 -2114 -1614 42 1678 2067 947 -851 -2028 -1712 -164 1506 2072 1130 -648 -1906 -1821 -373 1348
1998 1348 2063 1287 -417 -1796 -1882 -573 1157 2008 1397 -212 -1678 -1912 -753 957 1948 1535 -10
2015 -10 -1529 -1921 -911 750 1870 1614 197 -1366 -1917 -1069 547 1748 1689 382 -1193 -1901 -1223
2032 -1223 339 1658 1726 553 -1019 -1859 -1341 150 1505 1772 737 -841 -1775 -1449 -30 1384 1784
2049 1784 893 -648 -1693 -1525 -222 1236 1776 1036 -474 -1605 -1584 -416 1062 1756 1177 -262 -1504
2066 -1504 -1628 -585 897 1685 1279 -80 -1382 -1648 -760 712 1641 1373 91 -1229 -1650 -895 545
2083 545 1542 1431 267 -1082 -1646 -1007 370 1451 1492 437 -923 -1603 -1101 189 1356 1545 597 -768
2101 -768 -1528 -1204 15 1223 1537 730 -590 -1482 -1302 -149 1080 1525 853 -434 -1417 -1359 -302 950
2119 950 1499 978 -263 -1304 -1395 -473 784 1478 1073 -109 -1207 -1413 -630 643 1423 1151 41 -1072
2137 -1072 -1436 -739 497 1348 1204 210 -963 -1430 -840 334 1256 1286 359 -832 -1394 -944 169 1171
2155 1171 1326 486 -688 -1343 -1046 24 1077 1319 620 -524 -1296 -1136 -108 946 1309 743 -395
2172 -395 -1257 -1181 -262 813 1310 850 -243 -1157 -1196 -406 711 1318 940 -120 -1051 -1243 -541 599 1242
2191 1242 992 44 -937 -1263 -648 458 1178 1076 193 -871 -1254 -732 293 1109 1138 309 -750 -1202 -829
2210 -829 164 1043 1154 410 -625 -1184 -931 34 966 1137 539 -477 -1165 -980 -79 849 1137 656 -362
2229 -362 -1101 -1026 -205 736 1181 737 -248 -1022 -1059 -340 659 1134 802 -103 -916 -1102 -465 538 1097 882
2249 882 32 -862 -1108 -534 385 1040 949 145 -788 -1092 -636 265 1007 978 249 -658 -1066 -750 153 932 1004
2270 1004 358 -545 -1053 -812 42 833 1007 465 -418 -1019 -842 -85 738 1017 579 -327 -957 -894 -196 662
2290 662 1040 643 -203 -878 -930 -310 573 995 714 -72 -813 -965 -403 445 936 778 55 -743 -956 -487
2310 -487 337 898 836 141 -644 -939 -591 214 859 865 227 -539 -932 -659 118 801 858 334 -441 -907 -704
2331 -704 11 703 901 441 -350 -874 -748 -84 622 897 515 -250 -817 -777 -177 546 873 557 -156 -758
2351 -758 -818 -291 447 848 631 -40 -690 -831 -357 364 799 676 54 -615 -834 -437 266 766 726 133 -531
2372 -531 -810 -501 164 714 726 229 -449 -788 -571 88 658 746 304 -373 -777 -595 12 594 770 379 -295
2393 -295 -742 -631 -75 530 751 438 -212 -695 -661 -175 457 729 465 -121 -652 -696 -247 386 706 529 -40
2414 -40 -596 -707 -299 306 678 581 47 -518 -683 -355 233 660 594 109 -462 -687 -417 151 608 614 186 -399
2436 -399 -674 -454 85 554 632 239 -314 -652 -490 14 506 640 300 -236 -622 -526 -59 439 639 333 -181
2457 -181 -573 -554 -139 373 607 391 -115 -536 -567 -181 327 602 451 -34 -497 -580 -227 272 571 470 36
2478 36 -437 -555 -283 200 550 499 76 -383 -562 -332 141 509 518 137 -326 -548 -367 74 464 518 208 -264
2500 -264 -529 -407 -3 430 528 252 -210 -505 -435 -61 370 509 301 -136 -475 -464 -112 311 499 323 -76
2521 -76 -454 -489 -175 253 511 377 -20 -395 -477 -224 202 486 404 30 -356 -474 -268 147 448 422 108 -308
2543 -308 -498 -314 80 412 455 168 -240 -481 -347 35 378 454 200 -194 -456 -374 -33 334 460 252 -128
2564 -128 -424 -404 -92 297 463 304 -95 -397 -424 -127 256 459 336 -33 -366 -428 -192 198 430 364 24
2585 24 -332 -435 -234 134 408 387 73 -290 -456 -279 80 388 409 120 -241 -431 -310 14 345 423 176
2606 176 -191 -421 -339 -23 345 432 220 -147 -398 -382 -76 297 425 254 -84 -381 -404 -120 220 410 305
2627 305 -37 -347 -408 -154 191 401 339 3 -318 -420 -208 140 373 359 56 -280 -421 -261 74 367 384
2648 384 105 -223 -403 -287 52 332 394 186 -175 -398 -314 -2 306 402 208 -136 -362 -327 -73 266 411
2669 411 231 -89 -362 -367 -99 227 387 262 -39 -343 -384 -160 165 375 296 -1 -301 -382 -186 125 375 324
2691 324 49 -260 -383 -222 77 347 354 102 -206 -378 -269 54 315 357 153 -166 -368 -292 9 291 359 183
2713 183 -136 -357 -309 -38 271 389 209 -87 -326 -336 -85 212 341 249 -45 -316 -370 -134 183 351 291 3
2735 3 -293 -366 -182 138 351 309 39 -247 -353 -202 94 347 331 84 -209 -363 -250 57 321 340 116 -172
2757 -172 -355 -276 22 283 356 156 -133 -353 -316 -28 266 365 204 -105 -319 -308 -72 229 373 230 -60 -297
2779 -297 -339 -132 198 365 262 -5 -287 -356 -150 148 341 289 29 -266 -363 -180 109 326 318 59 -234 -353
2801 -353 -209 82 319 346 81 -200 -360 -252 57 292 344 134 -168 -360 -283 -4 281 336 160 -135 -337
2822 -337 -299 -37 250 352 192 -94 -325 -317 -90 209 369 235 -51 -304 -327 -104 186 353 264 -19 -289 -337
2844 -337 -138 157 335 301 22 -256 -320 -168 111 315 305 39 -227 -360 -203 90 303 309 87 -206 -358 -233
2866 -233 43 300 327 136 -166 -343 -256 -2 267 353 155 -134 -318 -273 -24 239 342 172 -99 -312 -306 -69
2888 -69 212 330 222 -50 -293 -305 -103 174 335 252 -20 -264 -317 -130 134 314 264 10 -247 -330 -164 102
2910 102 296 275 40 -220 -318 -192 57 289 284 84 -185 -325 -235 37 264 302 122 -148 -309 -240 9 252
2932 252 325 143 -111 -303 -266 -28 225 329 184 -89 -291 -280 -65 207 333 207 -34 -259 -291 -116 168
2953 168 314 239 -2 -257 -305 -140 125 296 257 23 -220 -322 -181 76 287 281 66 -202 -312 -216 56 265
2975 265 301 88 -173 -304 -213 40 254 299 145 -128 -295 -230 -9 251 316 174 -113 -297 -275 -44 214 302
2997 302 167 -63 -281 -287 -78 172 318 217 -50 -256 -299 -97 143 291 241 -7 -232 -319 -156 122 309 272
3019 272 35 -212 -310 -190 90 302 300 79 -203 -309 -199 53 260 293 86 -157 -300 -227 22 254 306 126
3041 126 -136 -308 -252 -33 230 319 164 -108 -303 -285 -60 206 314 196 -64 -283 -287 -74 164 305 225 -14
3063 -14 -259 -312 -121 149 309 241 -7 -237 -315 -162 118 294 262 34 -207 -309 -189 83 276 291 61 -163
3085 -163 -311 -205 49 268 290 99 -162 -292 -225 -5 249 311 142 -127 -308 -252 -29 214 291 159 -92 -278
3107 -278 -261 -61 179 313 189 -54 -274 -282 -93 163 311 212 -28 -249 -291 -119 140 304 240 0 -236 -290
3129 -290 -141 105 278 242 36 -202 -300 -177 74 268 267 65 -180 -296 -197 38 267 270 75 -142 -303 -232 14
3152 14 221 298 123 -140 -298 -247 -17 196 284 157 -93 -271 -270 -72 193 300 181 -55 -259 -279 -81 165
3174 165 300 214 -20 -240 -297 -112 136 281 236 1 -247 -294 -145 116 270 245 23 -219 -303 -182 81 262
3196 262 260 72 -181 -292 -200 58 251 282 91 -160 -299 -240 25 237 289 118 -132 -305 -234 -9 225 294 135
3219 135 -97 -282 -247 -39 199 295 181 -74 -260 -266 -75 169 293 191 -35 -245 -287 -106 154 274 213 -16
3241 -16 -242 -288 -122 115 274 237 22 -204 -288 -159 95 282 261 39 -186 -285 -163 71 280 275 76 -174 -291
3264 -291 -199 43 262 278 100 -136 -276 -209 5 223 274 135 -114 -274 -233 -24 218 300 164 -95 -278 -258
3286 -258 -51 187 283 168 -57 -253 -271 -90 163 262 180 -20 -240 -275 -100 130 272 219 5 -214 -269 -114
3308 -114 118 274 240 28 -194 -273 -147 96 255 244 69 -164 -268 -169 51 234 259 92 -153 -270 -185 18
3330 18 221 269 126 -111 -259 -227 -17 201 269 137 -90 -243 -237 -51 174 272 159 -54 -248 -250 -78 159 274
3353 274 198 -18 -226 -257 -83 121 268 199 10 -197 -268 -127 101 246 219 24 -174 -265 -156 60 240 225
3375 225 54 -167 -261 -172 25 224 247 96 -120 -270 -209 16 195 263 130 -103 -257 -215 -23 197 252 146
3397 146 -71 -237 -236 -51 167 251 168 -53 -217 -240 -82 138 262 186 -7 -217 -249 -103 125 248 206 13 -179
3420 -179 -251 -130 87 244 208 34 -166 -259 -156 57 234 225 78 -163 -260 -186 21 218 240 103 -125 -266 -193
3443 -193 0 206 264 132 -98 -233 -228 -19 185 254 144 -71 -229 -246 -63 172 235 179 -51 -240 -251 -88 132
3466 132 242 179 -23 -220 -256 -106 91 233 188 9 -197 -267 -146 76 232 216 30 -178 -269 -182 37 211
3488 211 251 77 -134 -261 -166 35 216 243 84 -127 -257 -206 -11 191 250 116 -108 -243 -214 -23 175 249
3510 249 130 -58 -239 -225 -55 155 252 175 -32 -228 -229 -83 125 253 184 -9 -185 -254 -111 98 248 202 24
3533 24 -172 -264 -143 76 243 227 60 -176 -253 -157 56 237 232 79 -138 -268 -174 33 205 228 94 -114 -256
3556 -256 -198 -16 177 242 107 -87 -253 -222 -54 170 248 138 -73 -247 -237 -73 156 254 161 -42 -228 -247 -82
3579 -82 124 257 199 -1 -188 -253 -111 116 254 212 42 -179 -252 -132 79 238 225 47 -170 -252 -165 55 214
3602 214 230 68 -146 -255 -190 24 206 237 82 -119 -264 -205 -17 197 249 109 -95 -239 -198 -39 179 260
3624 260 154 -62 -231 -219 -66 167 247 174 -51 -226 -237 -88 136 248 205 -2 -213 -248 -123 119 245 203
3646 203 5 -200 -243 -137 95 236 214 36 -182 -268 -162 62 227 228 67 -154 -274 -177 34 209 256 83
3668 83 -141 -263 -188 20 196 242 116 -97 -248 -210 -5 204 271 142 -85 -235 -213 -33 183 263 146 -67
3690 -67 -233 -244 -56 154 264 181 -42 -227 -249 -89 113 255 191 -11 -218 -251 -119 108 251 207 -3 -191
3712 -191 -263 -145 77 249 224 43 -178 -256 -154 55 235 242 77 -148 -255 -162 36 235 248 94 -124 -232
3734 -232 -179 21 193 257 106 -111 -241 -209 -15 178 246 130 -83 -245 -224 -53 164 261 156 -70 -222 -237
3756 -237 -66 143 250 165 -24 -209 -233 -80 120 248 188 -1 -186 -238 -96 103 248 207 19 -179 -255 -144
3778 -144 82 248 227 58 -163 -253 -164 56 211 221 82 -128 -251 -173 7 193 235 97 -142 -250 -203 -14
3800 -14 190 260 127 -92 -236 -216 -24 175 259 154 -68 -224 -220 -48 153 249 151 -20 -216 -247 -71 126 236
3823 236 194 -12 -196 -238 -113 104 251 206 10 -188 -261 -125 95 230 206 24 -180 -261 -160 63 229 220 68
3846 68 -154 -267 -166 39 211 239 91 -132 -254 -198 0 208 245 99 -98 -226 -213 -14 186 235 137 -62
3868 -62 -229 -204 -40 163 238 142 -78 -239 -235 -82 153 259 178 -43 -215 -252 -96 102 236 174 -4 -202 -253
3891 -253 -123 101 249 213 27 -191 -264 -144 76 241 224 44 -148 -257 -162 35 205 224 59 -141 -233 -172
3913 -172 36 219 251 85 -113 -271 -185 8 183 245 126 -82 -253 -210 -30 186 244 131 -75 -223 -245 -57
3935 -57 150 246 174 -61 -222 -229 -75 134 239 178 -2 -198 -234 -96 99 236 199 6 -192 -243 -110 95 231
3958 231 213 27 -182 -250 -136 60 228 212 59 -149 -254 -149 35 224 228 87 -132 -251 -186 13 189 214
3980 214 104 -118 -253 -190 -30 176 243 116 -76 -236 -215 -36 155 246 142 -54 -220 -218 -50 154 241 173 -30
4003 -30 -201 -233 -84 117 233 182 1 -202 -240 -96 90 233 186 27 -182 -237 -143 63 217 225 29 -151 -244
4026 -244 -146 60 221 206 55 -145 -250 -170 18 189 210 80 -124 -241 -190 2 171 232 99 -95 -237 -199
4048 -199 -23 170 249 133 -54 -219 -212 -41 143 236 151 -49 -209 -222 -78 149 243 151 -43 -216 -225 -101 110
4071 110 241 184 -5 -177 -253 -119 96 236 191 21 -176 -247 -130 73 233 214 27 -157 -236 -153 36 219
4093 219 208 81 -123 -239 -174 33 213 238 94 -118 -225 -195 21 196 252 110 -85 -222 -208 -40 176 259
4115 259 147 -66 -236 -226 -58 150 221 150 -51 -218 -216 -74 132 234 182 -34 -221 -212 -80 121 244 181 0
4138 0 -174 -231 -97 97 240 176 22 -179 -258 -132 67 231 210 48 -151 -243 -146 62 227 211 49 -144 -218
4161 -218 -170 23 203 229 88 -108 -239 -193 1 166 229 104 -91 -214 -189 -24 177 247 122 -73 -212 -193
4183 -193 -51 159 233 151 -37 -202 -227 -57 132 232 170 -29 -196 -222 -82 106 229 176 -3 -182 -239 -107
4205 -107 98 222 168 19 -163 -227 -125 75 220 210 42 -153 -239 -157 41 206 221 46 -124 -224 -164 38
4227 38 186 213 61 -88 -218 -160 11 186 238 115 -88 -209 -178 -26 166 224 124 -75 -207 -187 -40 143
4249 143 231 146 -39 -197 -195 -59 112 209 162 -12 -185 -213 -102 105 214 177 -11 -162 -227 -107 86 239 194
4272 194 29 -155 -220 -100 53 191 206 51 -150 -240 -143 38 183 214 64 -114 -209 -163 22 182 215 90 -101
4295 -101 -206 -185 -14 174 215 123 -82 -202 -187 -29 147 223 129 -50 -204 -199 -38 141 238 147 -26 -178 -201 -68
4319 -68 119 220 160 -20 -148 -199 -88 94 219 170 20 -161 -200 -97 74 213 188 42 -136 -219 -126 53 197
4342 197 198 39 -118 -223 -150 23 188 197 73 -107 -225 -165 -8 180 216 85 -102 -218 -197 -21 177 207 111
4365 111 -78 -190 -179 -35 153 232 141 -50 -193 -181 -55 129 213 135 -19 -166 -207 -73 107 209 154 -3 -180
4388 -180 -222 -102 93 212 184 11 -139 -205 -114 66 184 197 43 -138 -213 -140 56 182 193 68 -107 -202 -165
4411 -165 27 181 197 94 -94 -200 -156 10 176 212 99 -77 -190 -173 -9 149 227 127 -56 -193 -187 -43
4433 -43 130 203 131 -31 -181 -196 -51 91 202 141 -12 -174 -214 -74 83 202 160 5 -158 -215 -102 83 221
4456 221 186 18 -142 -208 -119 30 184 177 37 -127 -211 -135 26 180 208 64 -115 -214 -146 15 177 204 107 -92
4480 -92 -224 -153 -16 172 224 106 -76 -213 -191 -32 138 213 124 -51 -202 -184 -63 130 211 139 -42 -166 -181
4503 -181 -75 116 217 156 -6 -164 -206 -93 89 213 173 13 -139 -213 -123 72 201 169 38 -142 -204 -137 36
4526 36 194 183 42 -129 -216 -126 20 175 218 79 -105 -222 -160 16 169 201 78 -88 -205 -186 -35 159 221
4549 221 106 -61 -200 -194 -32 144 216 146 -53 -174 -202 -62 126 227 147 -16 -177 -206 -74 102 206 161 -2
4572 -2 -160 -208 -100 87 213 164 27 -159 -211 -115 74 200 186 37 -136 -202 -131 38 180 193 70 -117 -209 -140
4596 -140 13 178 200 74 -110 -196 -184 5 160 211 101 -83 -193 -171 -24 147 215 136 -57 -186 -190 -51 143
4619 143 217 125 -54 -198 -191 -78 96 194 144 -28 -171 -187 -87 101 212 151 7 -158 -220 -94 85 204 167
4642 167 16 -143 -207 -120 50 196 191 44 -142 -200 -124 49 180 200 58 -111 -198 -151 16 186 216 97 -99
4665 -99 -208 -152 5 154 196 96 -74 -203 -183 -28 128 199 115 -70 -222 -192 -45 125 213 123 -33 -189 -201
4688 -201 -62 107 202 164 -8 -165 -209 -80 87 210 174 9 -160 -209 -108 72 205 171 20 -140 -218 -117
4710 -117 55 195 190 38 -125 -223 -131 18 177 197 59 -110 -215 -162 23 171 202 78 -101 -218 -176 -8 160
4733 160 193 108 -68 -203 -180 -19 155 215 142 -50 -174 -183 -39 140 237 142 -25 -172 -194 -71 122 211 152 -14
4757 -14 -175 -197 -85 99 204 181 11 -154 -221 -109 68 196 189 28 -127 -202 -127 51 190 199 47 -121 -213 -132
4781 -132 39 186 192 78 -116 -194 -160 0 166 216 102 -87 -194 -157 -7 158 211 111 -64 -197 -186 -48 133
4804 133 220 131 -47 -192 -193 -67 110 204 156 -27 -180 -204 -88 109 209 141 -11 -182 -215 -84 79 221 174
4827 174 21 -156 -215 -111 63 209 181 24 -144 -204 -127 46 181 207 63 -109 -213 -156 9 171 198 70
4849 70 -90 -204 -148 -4 163 216 93 -85 -200 -178 -30 149 214 104 -64 -206 -193 -60 116 215 126 -37 -177
4872 -177 -212 -50 111 216 156 -7 -157 -211 -88 82 209 172 5 -162 -221 -109 82 206 189 39 -135 -204
4894 -204 -116 45 205 196 65 -153 -211 -146 21 184 210 73 -123 -210 -171 8 179 200 84 -93 -216 -172 -22
4917 -22 154 215 105 -69 -219 -184 -28 124 220 132 -47 -193 -196 -63 132 227 143 -15 -157 -205 -59 109 215
4940 215 152 -8 -171 -215 -98 91 194 168 29 -176 -207 -120 65 207 184 35 -131 -225 -142 52 201 185 57
4963 57 -133 -221 -148 21 183 211 74 -108 -223 -172 -5 180 210 108 -71 -209 -169 -23 150 220 128 -76 -214
4986 -214 -193 -34 144 232 128 -44 -187 -208 -70 116 214 162 -35 -200 -225 -85 106 220 160 3 -180 -227 -97
5009 -97 84 222 190 33 -149 -230 -121 80 217 192 30 -138 -231 -139 39 215 209 66 -125 -223 -149 30 184
5032 184 224 103 -107 -220 -181 6 171 240 111 -88 -216 -191 -18 164 228 129 -62 -217 -196 -36 142 220 147
5055 147 -50 -193 -216 -73 122 227 174 -15 -190 -219 -65 117 247 177 8 -186 -216 -104 84 227 190 21
5077 21 -159 -215 -115 51 233 208 40 -155 -222 -151 49 203 224 67 -133 -226 -154 18 190 223 87 -130 -223
5100 -223 -175 -16 186 237 105 -89 -211 -193 -21 159 240 120 -66 -214 -201 -34 154 246 146 -32 -198 -220
5122 -220 -69 126 234 181 -33 -185 -227 -98 111 237 182 9 -181 -254 -108 70 234 196 21 -183 -239 -135
5144 -135 61 226 209 56 -139 -231 -151 47 201 215 91 -126 -236 -178 27 211 224 96 -99 -228 -189 -3
5166 -3 188 233 107 -88 -217 -197 -27 171 255 161 -57 -218 -221 -60 150 251 165 -34 -214 -235 -96 119 248
5189 248 177 -11 -198 -229 -102 109 237 183 19 -175 -248 -137 95 214 217 33 -162 -234 -149 51 225 227 62
5212 62 -137 -241 -169 26 206 222 78 -113 -246 -171 -13 188 231 90 -97 -250 -200 -16 179 230 117 -95
5234 -95 -223 -204 -41 177 256 153 -64 -218 -219 -65 136 252 180 -32 -210 -224 -87 121 247 203 -10 -189 -233
5257 -233 -118 104 243 202 17 -149 -235 -134 70 224 207 35 -154 -253 -147 33 199 216 66 -132 -246 -165
5279 -165 19 206 246 103 -108 -235 -192 -4 186 245 107 -80 -234 -207 -19 173 245 143 -65 -244 -216 -53
5301 -53 145 250 163 -47 -206 -225 -79 124 250 176 -7 -208 -243 -99 112 251 202 4 -191 -247 -125 87
5323 87 242 208 40 -162 -237 -134 54 234 227 51 -150 -238 -157 29 218 254 88 -121 -244 -187 1 205 243
5346 243 97 -99 -232 -211 -20 179 255 123 -83 -226 -214 -50 163 270 157 -60 -226 -226 -70 136 248 171
5368 171 -30 -226 -248 -89 111 242 197 -7 -203 -246 -113 102 243 204 23 -182 -241 -130 71 241 237 55
5390 55 -150 -274 -165 47 227 231 81 -134 -247 -177 16 210 267 112 -136 -254 -197 1 187 255 132 -73
5412 -73 -259 -211 -29 163 262 152 -62 -230 -243 -57 136 252 165 -30 -216 -249 -88 142 260 218 2 -198
5434 -198 -253 -118 115 249 222 23 -185 -252 -142 80 244 216 67 -153 -259 -155 67 234 235 70 -154 -270
5456 -270 -187 32 224 243 96 -133 -254 -208 6 205 256 114 -94 -237 -207 -20 191 271 151 -84 -236 -222
5478 -222 -46 167 258 175 -51 -225 -239 -86 150 264 206 -22 -207 -238 -115 132 256 194 -1 -200 -269 -127
5500 -127 90 257 211 25 -184 -267 -167 57 248 245 67 -177 -272 -162 51 246 247 92 -131 -252 -203 13 203
5523 203 259 122 -105 -259 -202 -12 197 273 142 -60 -246 -209 -35 168 261 163 -62 -229 -230 -67 155 259 177
5546 177 -38 -217 -254 -95 131 268 193 -3 -202 -278 -131 97 263 216 27 -189 -263 -132 87 250 221 40
5568 40 -162 -264 -148 49 245 254 86 -146 -254 -187 40 231 255 116 -135 -267 -186 0 202 272 125 -92
5590 -92 -259 -240 -37 179 282 153 -71 -239 -234 -55 158 279 181 -42 -236 -256 -72 143 268 210 -10 -223
5612 -223 -244 -116 126 273 235 24 -195 -265 -135 95 272 242 58 -174 -273 -155 65 253 248 63 -177 -294
5634 -294 -198 38 234 269 94 -148 -280 -210 4 214 260 122 -113 -266 -221 -24 191 280 160 -69 -259 -252 -52
5657 -52 177 278 176 -64 -236 -250 -96 149 281 195 -20 -232 -258 -109 128 294 221 8 -203 -272 -129 113
5679 113 260 225 26 -188 -271 -155 71 254 248 48 -180 -281 -184 33 225 261 88 -154 -279 -210 17 220
5701 220 256 99 -126 -274 -226 -4 193 276 132 -95 -260 -225 -67 187 279 162 -63 -240 -252 -71 163 279
5723 279 198 -30 -220 -270 -100 130 271 223 -9 -226 -285 -119 97 282 233 31 -188 -280 -167 68 241 244 46
5746 46 -184 -289 -181 49 249 256 82 -148 -274 -194 22 232 279 110 -129 -267 -207 10 205 273 154 -90
5768 -90 -270 -222 -38 206 282 162 -67 -252 -256 -52 173 287 187 -41 -252 -271 -97 144 259 218 -21 -227
5790 -227 -271 -128 129 276 229 6 -201 -277 -147 86 259 244 48 -183 -280 -173 65 243 253 71 -156 -267
5812 -267 -199 34 242 270 91 -136 -282 -214 9 215 282 123 -115 -266 -246 -22 198 279 147 -97 -270 -245
5834 -245 -38 176 291 184 -61 -241 -256 -88 162 289 207 -19 -231 -264 -109 137 291 235 -6 -210 -282 -132
5856 -132 100 283 235 46 -198 -281 -157 78 283 256 73 -173 -292 -183 50 248 267 87 -159 -292 -225 6
5878 6 231 277 119 -129 -287 -224 -2 204 296 138 -84 -263 -232 -44 211 285 170 -50 -259 -267 -60 183 286
5901 286 194 -23 -239 -261 -99 146 298 217 1 -235 -272 -131 138 274 237 12 -201 -272 -148 96 260 256 51
5924 51 -201 -307 -184 63 259 258 87 -158 -302 -201 31 239 261 96 -142 -272 -233 -2 221 274 130 -112
5946 -112 -278 -237 -32 224 316 164 -83 -263 -281 -66 171 296 189 -27 -259 -261 -92 151 298 210 -19 -238
5968 -238 -287 -110 136 294 251 8 -216 -277 -149 107 282 251 54 -181 -294 -176 87 271 265 65 -155 -290
5990 -290 -187 49 248 286 100 -136 -277 -201 22 246 296 140 -109 -287 -251 -20 203 290 152 -91 -262 -259
6012 -259 -61 196 295 191 -50 -265 -285 -84 171 299 200 -40 -252 -283 -117 150 302 229 16 -244 -314 -141
6034 -141 107 282 249 33 -197 -295 -154 81 273 273 60 -189 -297 -185 71 253 280 93 -155 -289 -216 30
6056 30 244 292 111 -126 -300 -250 -11 222 274 158 -99 -288 -245 -38 211 287 176 -79 -270 -259 -74 180
6078 180 299 198 -36 -252 -280 -90 139 292 223 -14 -227 -284 -132 139 288 234 11 -211 -291 -138 106 291
6100 291 262 47 -199 -298 -189 68 251 264 75 -179 -296 -196 50 260 280 89 -143 -291 -234 13 215 293
6122 293 126 -96 -285 -245 -14 216 301 165 -91 -271 -252 -51 191 297 199 -44 -250 -268 -68 156 293 209
6144 209 -26 -251 -277 -111 129 293 219 -1 -232 -297 -143 101 276 223 31 -207 -292 -173 82 249 245 40
6166 40 -180 -290 -185 37 245 285 90 -149 -286 -192 24 227 284 100 -126 -275 -228 -14 221 304 142 -104
6188 -104 -263 -233 -35 195 286 164 -64 -270 -268 -67 168 295 187 -54 -259 -277 -105 150 291 210 -19 -238
6210 -238 -288 -121 125 276 243 20 -200 -277 -145 106 279 253 54 -200 -288 -174 52 272 261 78 -167 -295
6232 -295 -202 33 230 264 122 -137 -277 -212 12 233 286 146 -116 -284 -225 -27 195 286 150 -91 -269 -256
6254 -256 -50 192 289 175 -51 -255 -270 -74 165 290 216 -29 -232 -265 -95 133 290 238 6 -210 -272 -139
6276 -139 122 270 239 37 -199 -280 -166 81 269 256 65 -176 -296 -191 59 256 261 90 -156 -284 -205 35
6298 35 228 282 113 -129 -291 -234 3 223 294 133 -91 -266 -249 -30 195 298 181 -65 -252 -247 -59 182
6320 182 311 203 -34 -250 -262 -91 153 303 206 -29 -225 -271 -134 111 273 229 16 -206 -273 -137 102 276
6342 276 248 58 -198 -285 -176 55 265 266 74 -171 -276 -202 35 248 264 107 -144 -277 -221 14 230 289 136
6365 136 -112 -270 -236 -27 212 295 158 -67 -270 -233 -53 176 279 190 -46 -257 -258 -80 146 279 201 -27
6387 -27 -237 -285 -116 129 267 208 3 -230 -272 -119 116 277 248 33 -190 -280 -155 69 267 260 76 -171 -291
6410 -291 -180 48 244 268 100 -145 -287 -212 21 239 263 127 -119 -283 -219 -18 211 275 141 -87 -258 -240
6432 -240 -55 186 282 164 -87 -252 -258 -64 175 277 196 -41 -242 -267 -96 144 280 208 -12 -226 -263 -113
6454 -113 121 272 235 29 -190 -292 -150 96 257 267 47 -190 -281 -165 57 254 264 69 -165 -294 -187
6475 -187 31 245 264 104 -131 -263 -209 3 224 282 135 -100 -277 -242 -11 188 268 145 -78 -250 -243 -55
6497 -55 183 288 170 -41 -234 -252 -78 173 290 208 -35 -232 -273 -111 127 264 218 0 -209 -285 -123 107
6519 107 263 224 43 -173 -289 -161 72 253 246 65 -171 -277 -185 55 232 265 80 -148 -292 -205 19 223
6541 223 267 136 -126 -269 -213 -11 210 288 158 -97 -253 -240 -39 197 287 185 -56 -254 -247 -65 177 273 195
6564 195 -36 -233 -268 -93 132 274 208 -24 -223 -266 -132 99 263 217 19 -194 -267 -142 94 256 235 49
6586 49 -192 -266 -176 57 251 247 83 -153 -258 -192 29 230 279 108 -130 -270 -208 15 222 280 114 -109 -254
6609 -254 -227 -26 169 265 152 -83 -249 -236 -62 168 286 178 -49 -235 -240 -94 143 259 185 -20 -216 -268
6631 -268 -111 113 242 202 5 -203 -253 -121 100 272 230 34 -188 -279 -155 70 242 242 67 -156 -270 -174
6653 -174 48 248 260 86 -133 -273 -218 21 209 268 114 -110 -266 -224 -25 193 263 152 -91 -259 -229 -53
6675 -53 179 276 160 -64 -240 -252 -67 129 268 183 -20 -233 -272 -105 148 268 214 16 -222 -259 -133 101
6697 101 251 237 29 -187 -260 -149 72 241 237 48 -174 -277 -167 46 226 257 79 -142 -273 -189 2 215
6719 215 268 100 -116 -251 -198 0 197 274 140 -87 -274 -222 -24 183 269 145 -63 -237 -244 -65 163 272
6741 272 184 -38 -237 -262 -100 134 267 200 -7 -213 -267 -107 96 259 211 -1 -190 -267 -138 82 250 225
6763 225 36 -174 -285 -174 66 245 242 79 -148 -267 -181 44 234 255 103 -103 -253 -202 -3 210 279 122
6785 122 -83 -269 -214 -26 191 284 144 -90 -241 -234 -45 174 258 185 -50 -230 -235 -72 144 280 186 -23 -233
6808 -233 -268 -101 119 262 212 -1 -203 -266 -135 92 258 238 37 -168 -277 -144 75 245 242 82 -155 -265
6830 -265 -173 24 235 254 86 -143 -259 -203 9 203 256 111 -116 -267 -218 -9 190 260 140 -91 -234 -220
6852 -220 -43 175 259 167 -53 -235 -247 -74 152 275 173 -27 -221 -254 -100 127 259 211 -7 -217 -250 -122
6874 -122 91 250 216 41 -181 -267 -137 92 245 233 67 -153 -260 -166 43 234 244 75 -146 -259 -178 39
6896 39 208 261 120 -130 -250 -187 3 203 253 129 -85 -239 -211 -27 189 270 164 -70 -237 -236 -58 156 264
6919 264 186 -46 -227 -252 -84 125 272 190 -11 -216 -251 -117 127 264 212 24 -207 -252 -138 85 246 238 50
6942 50 -160 -268 -155 42 235 254 59 -155 -265 -187 27 216 260 95 -124 -258 -199 21 210 266 124 -86
6964 -86 -249 -204 -20 187 247 144 -75 -241 -230 -40 170 272 179 -46 -226 -239 -73 138 250 188 -36 -210
6986 -210 -244 -109 120 260 222 5 -191 -269 -134 68 263 207 40 -177 -262 -153 75 241 226 69 -158 -251
7008 -251 -165 42 234 255 97 -128 -247 -190 15 199 258 107 -102 -244 -208 -6 189 242 130 -83 -256 -231
7030 -231 -34 173 266 157 -60 -222 -242 -65 162 260 162 -32 -227 -228 -90 137 244 196 3 -206 -245 -118 110
7053 110 244 230 21 -172 -251 -137 76 236 244 57 -164 -256 -151 41 234 237 70 -141 -257 -180 30 216 257
7076 257 113 -111 -250 -193 -12 203 241 115 -103 -258 -238 -27 171 246 137 -71 -237 -227 -46 157 246 168
7098 168 -43 -228 -238 -75 146 260 178 -1 -203 -236 -109 104 260 218 11 -176 -256 -135 95 239 206 51
7120 51 -186 -244 -145 49 217 226 51 -143 -260 -172 43 211 239 85 -125 -246 -187 0 203 245 117 -108 -238
7143 -238 -207 -13 190 265 133 -76 -247 -202 -45 178 250 168 -60 -217 -232 -72 128 244 174 -22 -205 -251 -84
7166 -84 107 246 177 0 -195 -247 -117 87 223 217 34 -171 -249 -122 86 225 200 51 -160 -257 -167 44 215
7189 215 232 81 -139 -249 -186 23 199 251 111 -106 -226 -197 5 195 239 115 -72 -219 -205 -34 166 223
7211 223 123 -43 -223 -219 -54 147 231 156 -48 -209 -260 -79 126 249 178 -23 -187 -235 -105 102 227 195 20
7234 20 -182 -231 -132 87 231 215 22 -162 -233 -141 45 209 233 69 -142 -241 -165 20 212 242 95 -101 -221
7257 -221 -174 9 167 244 108 -101 -232 -197 -27 171 234 144 -70 -217 -220 -50 156 237 141 -43 -188 -214 -77
7280 -77 135 242 191 -13 -204 -224 -87 113 245 193 5 -168 -242 -102 86 238 206 34 -164 -260 -149 60
7302 60 218 208 54 -144 -232 -154 32 208 227 76 -131 -241 -193 18 178 218 95 -117 -234 -201 -21 168 229
7325 229 122 -88 -215 -210 -35 160 254 147 -57 -205 -204 -58 141 239 157 -27 -200 -214 -73 122 241 180 -1
7348 -1 -192 -223 -114 87 216 186 17 -160 -236 -127 79 205 200 29 -142 -233 -140 39 205 200 67 -119 -224 -159
7372 -159 16 185 232 90 -97 -228 -179 -12 194 214 116 -73 -226 -191 -33 172 232 147 -63 -210 -206 -40 133
7395 133 215 141 -41 -199 -225 -76 107 221 156 -24 -187 -238 -106 88 225 181 2 -165 -229 -139 82 217 185
7418 185 32 -141 -215 -141 63 197 207 61 -126 -217 -145 41 180 198 87 -126 -208 -165 24 170 234 103 -95
7441 -95 -204 -195 6 159 218 117 -77 -214 -185 -35 150 230 132 -56 -191 -213 -66 128 221 151 -38 -182 -212 -95
7465 -95 105 220 154 -14 -171 -210 -106 76 218 199 27 -144 -213 -118 75 203 192 45 -127 -216 -144 28 178
7488 178 205 58 -131 -239 -154 5 182 192 87 -96 -209 -161 -30 161 211 104 -75 -208 -193 -27 141 216
7510 216 124 -68 -210 -169 -47 122 212 153 -21 -161 -189 -64 108 214 162 -11 -166 -189 -82 89 208 165 31
7533 31 -156 -223 -111 76 193 173 33 -149 -210 -127 53 177 196 60 -125 -210 -141 29 188 193 70 -99 -210
7556 -210 -169 -10 152 211 92 -60 -205 -161 -16 140 219 121 -51 -188 -174 -30 132 198 139 -40 -175 -199 -63
7579 -63 104 196 159 -16 -174 -198 -80 90 195 158 5 -160 -214 -115 76 196 184 28 -143 -184 -117 55 196
7602 196 174 55 -127 -197 -125 30 169 175 88 -100 -186 -144 24 164 189 98 -84 -182 -168 -3 144 200 92 -69
7626 -69 -190 -167 -41 123 208 110 -39 -182 -175 -47 115 199 125 -27 -170 -184 -68 94 183 154 -9 -153 -194 -88
7650 -88 74 186 159 18 -144 -181 -94 58 193 176 41 -112 -186 -128 52 170 182 62 -109 -202 -148 17 155
7673 155 180 71 -88 -187 -148 -8 144 187 76 -77 -190 -144 -21 108 186 115 -58 -166 -179 -36 121 195 125
7696 125 -35 -153 -167 -54 99 180 149 -8 -153 -164 -71 92 184 158 7 -140 -189 -92 62 188 160 34 -114
7719 -114 -192 -136 40 176 155 42 -113 -201 -125 30 142 165 62 -97 -187 -154 4 155 184 88 -60 -171 -145 -18
7743 -18 140 187 91 -55 -158 -174 -46 122 186 110 -29 -159 -169 -47 107 188 136 0 -155 -177 -80 98 174 143
7767 143 15 -128 -168 -94 85 170 140 15 -120 -183 -100 59 168 160 26 -113 -181 -120 29 149 165 58 -78 -166
7791 -166 -126 27 162 190 92 -66 -171 -147 6 129 183 102 -69 -169 -150 -24 121 190 113 -44 -158 -156 -54 109
7815 109 181 108 -23 -150 -158 -63 74 157 127 -11 -140 -174 -74 52 160 140 21 -124 -185 -90 42 152 159 40
7839 40 -108 -179 -95 41 155 155 52 -92 -160 -125 14 147 175 69 -91 -160 -144 2 141 160 77 -61 -165 -153
7863 -153 -40 104 170 101 -31 -158 -144 -19 101 171 115 -34 -153 -166 -52 96 151 130 -10 -139 -159 -82 73
7886 73 169 138 6 -130 -158 -83 61 152 146 35 -103 -160 -84 41 157 162 54 -89 -170 -121 22 137 157 50 -93
7911 -93 -158 -119 -14 131 153 71 -50 -155 -157 -11 120 169 84 -48 -151 -144 -24 104 160 91 -34 -143 -139 -36 88
7936 88 179 125 -27 -134 -149 -76 77 179 131 6 -112 -159 -74 52 153 119 23 -105 -157 -102 27 151 146 36 -115
7961 -115 -160 -114 22 139 144 47 -83 -159 -126 -8 114 143 63 -70 -136 -125 -10 116 164 104 -62 -143 -134 -21 107
7986 107 165 96 -38 -129 -145 -54 86 164 111 -18 -127 -150 -56 59 162 112 -3 -137 -152 -59 70 153 120 4 -123
8011 -123 -147 -97 34 141 113 35 -90 -154 -101 37 126 146 50 -83 -149 -96 3 117 156 58 -43 -141 -113 6 111
8036 111 143 77 -40 -143 -129 -22 96 144 71 -34 -126 -139 -32 91 149 103 -25 -127 -142 -49 71 146 112 -1
8060 -1 -101 -143 -57 65 150 131 16 -100 -135 -89 47 120 119 18 -74 -138 -73 45 130 132 42 -66 -147 -92 18 127 143
8087 143 46 -64 -120 -123 -2 101 135 63 -54 -136 -120 -36 96 125 72 -51 -132 -122 -31 83 131 102 -21 -132 -122 -51
8113 -51 72 167 111 -9 -118 -142 -59 52 148 112 9 -106 -142 -77 61 131 114 25 -93 -126 -85 36 120 124 41 -68
8139 -68 -127 -88 25 102 119 44 -73 -143 -94 1 88 120 52 -65 -139 -116 -26 94 127 52 -61 -124 -112 -34 85 141 81
8166 81 -34 -108 -114 -41 77 128 98 -1 -106 -131 -66 68 126 98 -2 -105 -143 -60 57 117 103 10 -103 -141 -75
8191g5
##END NTUPLES=NMR FID
##END=
