##TITLE=1H_Pr PhPr
 CDCl3, 8 sc, 
 30.06.2021
##JCAMPDX= 6.0         $$ Bruker NMR JCAMP-DX V2.0
##DATA TYPE= NMR FID
##DATA CLASS= NTUPLES
##ORIGIN= UXNMR, Bruker Analytische Messtechnik GmbH
##OWNER= root
$$ XWIN-NMR		Version 3.5
$$ Wed Jun 30 13:07:40 2021 Russian Standard Time (UT+4h)  she@DPX200
##.OBSERVE FREQUENCY= 200.131506
##.OBSERVE NUCLEUS= ^1H
##.DELAY= (6, 6)
##.ACQUISITION MODE= SIMULTANEOUS
##.ACQUISITION SCHEME= undefined
##.AVERAGES= 8
##.DIGITISER RES= 18
##SPECTROMETER/DATA SYSTEM= spect
##.PULSE SEQUENCE= zg30
##.SOLVENT NAME= DMSO
##.SHIFT REFERENCE= (INTERNAL, DMSO, 0, 15.7039)
##AUDIT TRAIL= $$ (NUMBER, WHEN, WHO, WHERE, WHAT)
$$ ##TITLE= Audit trail, XWIN-NMR		Version 3.5
$$ ##JCAMPDX= 5.01
$$ ##ORIGIN= Bruker BioSpin GmbH
$$ ##OWNER= she
$$ F:/spectra/data/she/nmr/H-F/1/audita.txt
$$ ##AUDIT TRAIL=  $$ (NUMBER, WHEN, WHO, WHERE, WHAT)
(   1,<2021-06-30 13:06:21.34 +0400>,<she>,<DPX200>,
      <created by zg, POWCHK disabled, PULCHK disabled
       configuration hash MD5:
       00 E9 B6 7A A2 85 ED C7 34 08 36 98 17 FE 4E 26
       data hash MD5: 16K
       09 8E A9 E4 AA C0 D2 9B 34 8A 5A 5C FD 9B B5 85>)
$$ ##END=
$$ 
$$ hash MD5
$$ 52 F3 BD 83 05 8D EC B7 DA 92 EB 37 87 9F A5 3A
##$RELAX= 
##$RELAX= 
##$RELAX= 
##$RELAX= 
##$RELAX= 
##$RELAX= 
$$ Bruker specific parameters
$$ --------------------------
##$DU= <F:/spectra>
##$EXPNO= 1
##$NAME= <H-F>
##$PROCNO= 1
##$TYPE= <nmr>
##$USER= <she>
##$AMP= (0..31)
100 100 100 100 100 100 100 100 100 100 100 100 100 100 100 100 100 100 
100 100 100 100 100 100 100 100 100 100 100 100 100 100 
##$AQSEQ= 0
##$AQ_mod= 1
##$AUNM= <au_zg>
##$AUTOPOS= <>
##$BF1= 200.13
##$BF2= 200.13
##$BF3= 200.13
##$BF4= 200.13
##$BF5= 200.13
##$BF6= 200.13
##$BF7= 200.13
##$BF8= 200.13
##$BYTORDA= 1
##$CFDGTYP= 0
##$CFRGTYP= 5
##$CHEMSTR= <none>
##$CNST= (0..31)
1 1 145 1 1 1 1 1 1 1 1 1 1 1 1 1 1 1 1 1 1 1 1 1 1 1 1 1 1 1 1 1 
##$CPDPRG= <>
##$CPDPRG1= <>
##$CPDPRG2= <>
##$CPDPRG3= <>
##$CPDPRG4= <mlev>
##$CPDPRG5= <mlev>
##$CPDPRG6= <mlev>
##$CPDPRG7= <mlev>
##$CPDPRG8= <mlev>
##$CPDPRGB= <>
##$CPDPRGT= <>
##$D= (0..31)
0 1.2 0 0 0 0 0 0 0 0.06 0 0.03 0 0 0 0 0.0002 0 0 0 0 0 0 0 0 0 0 0 0 
0 0 0 
##$DATE= 1625043980
##$DBL= (0..7)
120 120 120 120 120 120 120 120 
##$DBP= (0..7)
150 150 150 150 150 150 150 150 
##$DBP07= 0
##$DBPNAM0= <>
##$DBPNAM1= <>
##$DBPNAM2= <>
##$DBPNAM3= <>
##$DBPNAM4= <>
##$DBPNAM5= <>
##$DBPNAM6= <>
##$DBPNAM7= <>
##$DBPOAL= (0..7)
0.5 0.5 0.5 0.5 0.5 0.5 0.5 0.5 
##$DBPOFFS= (0..7)
0 0 0 0 0 0 0 0 
##$DE= 6
##$DECBNUC= <off>
##$DECIM= 32
##$DECNUC= <off>
##$DECSTAT= 4
##$DIGMOD= 1
##$DIGTYP= 9
##$DL= (0..7)
0 120 120 120 120 120 120 120 
##$DP= (0..7)
150 150 150 150 150 150 150 150 
##$DP07= 0
##$DPNAME0= <>
##$DPNAME1= <>
##$DPNAME2= <>
##$DPNAME3= <>
##$DPNAME4= <>
##$DPNAME5= <>
##$DPNAME6= <>
##$DPNAME7= <>
##$DPOAL= (0..7)
0.5 0.5 0.5 0.5 0.5 0.5 0.5 0.5 
##$DPOFFS= (0..7)
0 0 0 0 0 0 0 0 
##$DQDMODE= 0
##$DR= 18
##$DS= 0
##$DSLIST= <SSSSSSSSSSSSSSS>
$$ [...]
##$SUBNAM2= <"">
##$SUBNAM3= <"">
##$SUBNAM4= <"">
##$SUBNAM5= <"">
##$SUBNAM6= <"">
##$SUBNAM7= <"">
##$SUBNAM8= <"">
##$SUBNAM9= <"">
##$SW= 20.0188882624521
##$SWIBOX= (0..15)
0 0 2 0 0 0 0 0 0 0 0 0 0 0 0 0 
##$SW_h= 4006.41025641026
##$TD= 16384
##$TD0= 1
##$TE= 0
##$TE2= 300
##$TE3= 300
##$TEG= 300
##$TL= (0..7)
0 120 120 120 120 120 120 120 
##$TP= (0..7)
150 150 150 150 150 150 150 150 
##$TP07= 0
##$TPNAME0= <>
##$TPNAME1= <>
##$TPNAME2= <>
##$TPNAME3= <>
##$TPNAME4= <>
##$TPNAME5= <>
##$TPNAME6= <>
##$TPNAME7= <>
##$TPOAL= (0..7)
0.5 0.5 0.5 0.5 0.5 0.5 0.5 0.5 
##$TPOFFS= (0..7)
0 0 0 0 0 0 0 0 
##$TUNHIN= 0
##$TUNHOUT= 0
##$TUNXOUT= 0
##$USERA1= <user>
##$USERA2= <user>
##$USERA3= <user>
##$USERA4= <user>
##$USERA5= <user>
##$V9= 5
##$VALIST= <valist>
##$VCLIST= <CCCCCCCCCCCCCCC>
##$VD= 0
##$VDLIST= <DDDDDDDDDDDDDDD>
##$VPLIST= <PPPPPPPPPPPPPPP>
##$VTLIST= <TTTTTTTTTTTTTTT>
##$WBST= 1024
##$WBSW= 4
##$XGAIN= (0..3)
0 0 0 0 
##$XL= 0
##$YL= 0
##$YMAX_a= 132205
##$YMIN_a= -228791
##$ZGOPTNS= <>
##$ZL1= 120
##$ZL2= 120
##$ZL3= 120
##$ZL4= 120
##$ABSF1= 10
##$ABSF2= 0
##$ABSG= 5
##$ABSL= 3
##$ALPHA= 0
##$AQORDER= 0
##$ASSFAC= 0
##$ASSFACI= 0
##$ASSFACX= 0
##$ASSWID= 0
##$AUNMP= <proc_1d>
##$AZFE= 0.1
##$AZFW= 0.1
##$BCFW= 1
##$BC_mod= 2
##$BYTORDP= 1
##$COROFFS= 0
##$CY= 11.3945322036743
##$DATMOD= 1
##$DC= 2
##$DFILT= <>
##$DTYPP= 0
##$F1P= 15.9154993809931
##$F2P= -4.1035820241983
##$FCOR= 0.5
##$FTSIZE= 0
##$FT_mod= 4
##$GAMMA= 1
##$GB= 0.15
##$INTBC= 1
##$INTSCL= 1
##$ISEN= 128
##$LB= 0.24
##$LEV0= 0
##$LPBIN= 0
##$MAXI= 10000
##$MC2= 0
##$MEAN= 0
##$ME_mod= 0
##$MI= 1.114404
##$NCOEF= 0
##$NC_proc= 0
##$NLEV= 6
##$NOISF1= 3.799351
##$NOISF2= 2.8
##$NSP= 1
##$NTH_PI= 0
##$NZP= 0
##$OFFSET= 15.70392
##$PC= 1
##$PHC0= -11912.41
##$PHC1= 3.801012
##$PH_mod= 1
##$PKNL= yes
##$PPARMOD= 0
##$PSCAL= 0
##$PSIGN= 0
##$REVERSE= no
##$SF= 200.130013532006
##$SI= 16384
##$SIGF1= 3
##$SIGF2= 2
##$SINO= 400
##$SIOLD= 16384
##$SREGLST= <1H.CDCl3>
##$SSB= 0
##$STSI= 0
##$STSR= 0
##$SW_p= 3612.71676300578
##$SYMM= 0
##$S_DEV= 0
##$TDeff= 0
##$TDoff= 0
##$TI= <>
##$TILT= no
##$TM1= 0
##$TM2= 0
##$TOPLEV= 0
##$USERP1= <user>
##$USERP2= <user>
##$USERP3= <user>
##$USERP4= <user>
##$USERP5= <user>
##$WDW= 1
##$XDIM= 8192
##$YMAX_p= 0
##$YMIN_p= 0
$$ End of Bruker specific parameters
$$ ---------------------------------
##NTUPLES= NMR FID
##VAR_NAME=  TIME,          FID/REAL,        FID/IMAG
##SYMBOL=    X,             R,               I
##VAR_TYPE=  INDEPENDENT,   DEPENDENT,       DEPENDENT
##VAR_FORM=  AFFN,          ASDF,            ASDF
##VAR_DIM=   8192,          8192,            8192
##UNITS=     SECONDS,       ARBITRARY UNITS, ARBITRARY UNITS
##FACTOR=    0.0002496,     1,               1
##FIRST=     0,             0,               0
##LAST=      2.0444736,     0,               0
##MIN=       0,             -228791,         0
##MAX=       2.0444736,     132205,          0
$$ Real data points
##PAGE= N=1
##DATA TABLE= (X++(R..R)), XYDATA
$$ [...]
$$ plain form
1786 504 -143 -278 607 -39 -288 100 188 -289 82 -19 -329 -88 674 -472 -197 412 -408 -18 240 -479
1806 -479 -157 378 -125 -394 -68 -322 -300 -157 -152 -533 188 288 -542 -81 61 -375 -231 -182 -831 -154 186
1827 186 -84 -513 -48 -253 -115 -44 38 -563 547 126 -604 317 -23 -340 263 75 -212 165 362 -340
1847 -340 79 652 -104 81 231 -213 174 844 67 -159 573 276 214 363 206 133 347 253 22 204 252
1868 252 -100 -279 510 99 140 642 137 -88 457 414 -86 558 -107 -96 271 189 -118 114 211 -320 -70 -130
1890 -130 -359 66 96 -490 -134 41 -185 -540 -216 -349 -309 -289 -69 -534 -184 128 -274 -203 9 -390 -275
1911 -275 -84 -513 -134 -24 -480 -103 97 -283 -49 7 -85 -78 -250 36 -142 100 -57 -197 217 115 53 -9
1933 -9 172 -93 323 -44 130 259 -54 134 106 37 119 284 241 40 21 484 -60 67 235 235 -54 315 260
$$ packed form
1786E04o47j35Q85o46k49L88Q8m77L71j01l10K41P62j146K75O09q20L90K58p19
1806d79L22N35n03k69L26k54K2J43Nl81P21J00q30M61J42m36J44M9o49O77L40
1827A86k70m29M65k05J38P1Q2o01J110m21p30R21l40l17O03j88k87L77J97p02
1847c40M19N73p56J85J50m44L87O70p77k26P32k97o2J49j57p3K14r4k31J82M8
1868B52l52j79P89m11M1N02n05k25N45m3n00O44o65J1L67q2l07K32R7n31K50o0
1890a30k29M25L0n86L56J75k26l55L24j33M0K0K20m65L50L12m02P1K12l99J15
1911b75J91m29L79J10m56L77K00l80K34N6r2Pj72K86j78K42j57j40M14j02o2o2
1933iJ81k65M16l67J74J29l13J88k8o9Q2J65m3k01j9M63n44J27J68%k89L69n5
$$ plain form
1956 260 43 256 10 -66 -113 159 233 256 186 17 -17 152 -9 -147 81 59 1 22 -24 67 -211 -294 -32 -86
1980 -86 109 -246 -84 88 -264 -69 23 196 26 -256 -186 78 -188 -234 -229 -137 147 -156 66 51 -407 83 30
2003 30 -322 57 164 43 120 -130 -223 -242 -98 -24 -130 -95 363 -61 37 94 86 239 133 54 20 -100 -149 28
2027 28 29 -13 205 30 299 -113 65 48 50 255 316 178 328 29 58 30 32 35 75 192 176 194 79 -47 -103 150
2053 150 40 46 13 61 113 200 -283 455 1 235 -129 -4 35 185 -156 -185 -382 158 14 194 8 -166 -271
2076 -271 65 -306 -301 1 -224 190 -207 -322 -13 -95 -238 -96 -277 41 -339 -383 -64 -317 -328 -184 -297 -189
2098 -189 -41 -224 -136 13 -102 131 -232 33 52 182 207 99 27 248 -121 87 281 158 -158 13 -36 225
2120 225 143 -39 -60 -107 167 244 365 276 32 50 445 -282 173 266 -32 294 295 109 103 240 286 222 155 377 -116
$$ packed form
1956B60k17K13k46p6m7K72P4K3p0j69l4J69j61j38K28k2n8K1m6R1k78q3K62n4
1980h6J95l55J62J72l52J95R2J73j70k82P0K64k66m6NR2K84l03K22j5m58M90n3
2003C0l52L79J07j21P7k50r3j9J44P4j06L5M58m24R8N7qJ53j06p9l4j20m9J77
2027B8Jm2K18j75K69m12J78j7KK05O1j38J50k99K9k8KLM0J17j6J8j15j26n6K53
2053A50j10Ol3M8N2Q7m83P38m54K34l64J25L9J50l41k9j97N40j44J80j86j74j05
2076b71L36l71NL02k25M14l97j15L09q2j43J42j81L18l80m4L19k53j1J44j13J08
2098a89J48j83Q8J49j15K33l63K65J9J30K5j08p2K21l69K08J94j23l16J71m9K61
2120B25q2j82k1m7K74P7J21q9k44J8L95p27M55R3k98L26Jj86oJ37M6o4o7K22m93
$$ plain form
2145 -116 106 85 -87 161 129 -125 153 -2 -238 -59 -218 -134 -24 37 -72 -212 -10 -338 3 24 11 -302
2167 -302 39 -4 -96 -201 -224 -26 100 34 -107 -90 50 -198 -34 -64 -48 -263 124 -196 -86 -17 -123 -57 -107
2190 -107 -60 -79 141 -112 -187 95 -44 65 -8 -105 -167 -41 305 -418 -2 389 -68 73 417 26 194 353
2212 353 -82 73 223 153 -15 64 86 89 243 387 74 171 276 -45 118 191 186 444 104 -151 -43 265 166
2235 166 -344 36 114 -134 205 -29 -119 28 -89 -192 -109 164 -442 -63 -135 -332 -41 5 -312 -476 87 -341
2257 -341 -69 396 -411 -296 235 -114 -515 70 28 12 -158 163 -254 -130 59 -619 67 -231 -344 25 257
2278 257 -356 -157 19 41 -51 72 -154 -247 -152 -3 -252 198 177 -285 126 195 -26 137 290 -136 280 127
2300 127 103 138 219 106 128 22 238 106 162 161 -377 158 164 18 121 137 240 215 152 -467 245 454 198 -203
$$ packed form
2145a16K22k1j72K48l2k54K78j55k36J79j59Q4J10O1j09j40K02l28L41K1j3l13
2167c02L41m3r2j05k3J98J26o6j41J7J40k48J64l0J6k15L87l20J10O9j06O6n0
2190a07M7j9K20k53p5K82j39J09p3r7o2J26L46p23M16L91m57J41L44l91J68J59
2212C53m35J55J50p0j68P9K2LJ54J44l13R7J05l21J63P3nK58l40k55J08L08r9
2235A66n10L80P8k48L39k34r0J47j17j03Q3K73o06L79p2j97K91M6l17j64N63m28
2257c41K72M65q07J15N31l49m01N85m2j6j70L21m17J24J89o78O86k98j13L69K32
2278B57o13J99J76K2r2J23k26r3R5J49k49M50k1m62M11O9k21J63J53m26M16j53
2300A27k4L5Q1j13K2j06K16j32N6jn38N35Oj46J03J6J03k5o3o19P12K09k56m01
$$ plain form
2324 -203 97 52 195 219 134 -341 166 220 -185 -28 -120 -198 381 -141 -226 -45 -107 -264 -213 122 -236 52 78
2347 78 -373 -312 251 -138 -323 -193 -100 -157 -71 -411 -82 63 76 4 47 -90 -40 -185 276 -325 115 -17 -117
2370 -117 97 1 -298 -94 338 89 -2 136 311 -344 -17 -23 -247 546 303 -549 150 327 -178 219 144 30
2392 30 450 139 -7 62 243 -28 -382 106 182 -105 162 150 -198 214 -98 -103 119 -71 -2 142 388 26
2414 26 -29 146 269 -39 -131 22 57 132 -84 -32 317 -54 -180 41 -164 0 -50 135 -100 27 116 -322 101
2437 101 57 -279 113 8 -201 191 -78 -338 -212 58 -93 -156 -288 193 -278 -81 -122 -228 282 39 -30
2458 -30 -161 41 -162 149 -61 -60 224 -21 -58 -142 -8 46 -127 40 130 -60 406 -123 15 98 81 157 -43
2481 -43 110 -27 -157 189 155 -179 89 -49 255 183 263 87 266 107 78 384 167 -153 -11 25 -62 121
$$ packed form
2324b03L00m5J43K4q5m75N07N4m05J57r2p8N79n22q5J81o2j57N1L35l58K88K6
2347G8m51O1N63l89j85J30R3n7Q6l40L29J45J3p2M3j37N0j45M61o01M40j32j00
2370a17K14r6k99K04M32k49r1J38J75o55L27ok24P93k43q52O99J77n05L97p5j14
2392C0M20l11j46O9J81k71l54M88P6k87K67j2l48M12l12nK22j90O9J44K46l62
2414B6n5J75J23l08r2J53L5P5k16N2L49l71j26K21k05J64n0J85k35J27Q9m38M23
2437A01m4l36L92j05k09L92k69k60J26K70j51o3j32M81m71J97m1j06N10k43o9
2458c0j31K02k03L11k10JK84k45l7q4J34N4j73J67R0j90M66n29J38Q3j7P6k00
2481d3J53j37j30L46l4l34K68j38L04p2Q0j76J79j59k9L06k17l20J42L6q7J83
$$ plain form
2503 121 65 -286 -23 269 43 -89 -98 -154 -227 -146 -210 13 125 -143 100 -246 -270 -277 -322 -126 -144 -39 47 -33 -192
2528 -192 59 106 -186 135 -65 130 -97 -95 1 51 43 -238 -24 36 92 -87 -36 -361 -94 -210 52 107 -98 286
2552 286 114 -164 -301 160 -294 -356 -4 -119 92 155 -77 -51 -218 281 56 11 246 -109 18 139 128 46
2574 46 63 -2 196 -26 169 52 -149 35 12 151 265 15 181 449 12 103 25 4 193 126 -158 62 -76
2597 -76 281 -73 -194 -180 46 -91 -41 -190 7 -59 24 107 -27 -116 -19 -231 65 160 -245 350 -114 -112 -114 -140 0
2622 0 -141 -138 -100 14 -132 -78 -246 -48 54 209 -92 -199 2 220 -33 -277 106 -56 35 -177 -47 -114 -138
2645 -138 -179 -107 -155 -78 72 37 -112 65 162 -33 190 258 -166 -41 -4 -76 192 -187 2 6 364 148 46 50
2669 50 191 71 -157 46 -97 -160 4 172 58 163 -10 -29 -20 183 219 224 -37 243 -214 -88 19 110 38
$$ packed form
2503A21n6l51K63K92k26j32rn6p3Q1o4K23J12k68K43l46k4pm5J96j8J05Q6q0j59
2528a92K51M7k92L21k00J95k27KR6N0qk81K14O0N6j79N1l25K67j16K62N5k05L84
2552B86j72k78j37M61m54o2L52j15K11O3k32K6j67M99k25m5K35l55J27J21j1q2
2574D6J7o5J98k22J95j17k01J84k3J39J14k50J66K68m37R1p8k1J89o7k84K20j38
2597g6L57l54j21J4K26j37N0j49J97o6Q3Q3j34q9R7k12K96R5m05N95m64Kkk6J40
2622@j41LL8J14j46N4j68J98J02J55l01j07K01K18k53k44L83j62R1k12J30o7k4
2645a38m1P2m8P7J50l5j49J77R7j95K23O8m24J25L7p2K68l79J89ML58k16j02M
2669E0J41j20k28K03j43o3J64J68j14J05j73j9RK03L6Nk61K80m57J26J07R1p2
$$ plain form
2692 38 -39 -87 191 -109 127 -88 -212 -60 -93 91 29 41 12 -44 15 77 70 75 64 -213 -169 -148 -407 272 171 -148
2718 -148 43 -405 36 -54 -222 49 -8 87 -239 56 37 106 -87 18 -51 45 106 84 -149 39 150 8 201
2741 201 -91 232 -50 -151 -208 65 261 44 -280 299 11 -224 400 23 -120 151 165 31 81 305 204
2762 204 126 351 21 108 -173 42 200 -126 -97 39 6 62 17 -79 -110 115 -1 155 -12 -109 -62 -266 280
2785 280 53 114 112 -129 -10 221 -48 -289 94 -123 33 -52 -103 -109 -303 -152 -43 71 -15 -96 -148 186 -96
2808 -96 -82 147 -113 -404 -49 -33 -86 -172 -122 -289 -83 -93 -101 -8 127 -208 -269 84 -64 -151 -55 38 198 173 31
2833 31 52 -24 14 31 4 112 -68 -109 19 -161 235 191 -110 136 -146 -76 334 75 97 -128 191 -99 -110 115
2857 115 22 -129 257 274 89 -132 15 -79 243 215 -323 166 -3 88 -170 -14 150 -36 148 76 93 75 12
$$ packed form
2692C8p7m8K78l00K36k15j24J52l3J84o2J2k9n6N9O2pNj1k77M4K1k59O79j01l19
2718a48J91m48M41r0j68K71n7R5l26K95j9O9j93J05o9R6O1k2k33J88J11j42J93
2741B01k92L23k82j01n7K73J96k17l24N79k88k35O24l77j43K71J4j34N0K24j01
2762B04p8K25l30Q7k81K15J58l26K9J36l3N6m5r6l1K25j16J56j67r7M7k04N46
2785B80k27O1kk41J19K31k69k41L83k17J56q5n1oj94J51J09J14q6q1n2L34k82
2808i6J4K29k60k91L55J6n3q6N0j67K06j0qR3J35l35o1L53j48q7R6R3J60k5j42
2833C1K1p6L8J7k7J08j80m1J28j80L96m4l01K46k82P0M10k59K2k25L19k90j1K25
2857A15r3j51L86J7j85k21J47r4L22k8n38M89j69R1k58J56J64j86J84p2J7j8o3
$$ plain form
2880 12 19 -53 195 57 46 -42 -153 -179 118 -173 -89 75 -363 -111 -11 -71 18 20 -158 -4 -68 24 -124 -92 -55
2905 -55 -142 34 9 -104 -263 -15 196 -129 334 82 -54 403 -186 97 -2 -182 76 68 27 193 19 209
2927 209 -144 328 -114 150 126 4 30 318 87 -154 348 -73 303 -6 217 79 385 137 93 -36 108
2948 108 -42 9 68 187 -63 154 102 -170 334 -59 -168 68 -179 -72 -82 196 -164 -96 72 -38 -126 -255
2970 -255 32 -157 -56 -41 150 228 -177 23 -233 5 -80 -187 166 -183 -201 201 -257 179 168 121 -49 -37
2992 -37 -255 -74 139 -7 -314 -47 57 252 165 116 -147 -107 -266 -108 -150 72 -98 26 246 170 -137 209
3014 209 15 -155 -97 155 113 -77 154 -69 142 -281 155 -84 -34 16 218 427 223 142 37 -89 -134 303
3036 303 -162 73 14 44 42 29 -7 -97 96 -74 40 -41 30 -257 -61 -25 201 49 35 -4 -229 -99 94 128
$$ packed form
2880A2Pp2K48j38j1q8j11k6K97k91Q4J64m38K52J00o0Q9Kj78J54o4R2j48L2L7
2905e5q7J76k5j13j59K48K11l25M63k52j36M57n89K83r9j80K58qm1J66j74J90
2927B09l53M72m42K64k4j22K6K88k31k41N02m21L76l09K23j38L06k48m4j29J44
2948A08j50N1N9J19k50K17n2k72N04l93j09K36k47J07j0K78l60O8J68j10q8j29
2970b55K87j89J01J5J91P8m05K00k56K38q5j07L53l49j8M02m58M36j1m7j70J2
2992c7k18J81K13j46l07K67J04J95q7m9k63M0j59J58m2K22j70J24K20p6l07L46
3014B09j94j70N8K52m2j90K31k23K11m23M36k39N0N0K02K09k04q1j05j26m5M37
3036C03m65K35n9L0kj3l6r0J93j70J14q1P1k87J96L6K26j52j4l9k25J30J93L4
$$ plain form
3060 128 -167 117 -185 -135 -166 152 -105 -67 -152 108 -144 -386 -89 -156 -86 -100 169 -86 -179 -197 -7 146 -139
3083 -139 -53 69 -96 -239 -12 -94 275 -311 131 -21 126 -62 -58 -93 40 167 -4 -70 -12 51 114 72 210
3106 210 -31 -51 -74 -4 152 29 -75 -75 19 149 142 147 -153 175 -216 77 141 -57 -45 7 169 -58 83 135 -67
3131 -67 18 56 -93 -254 264 -224 232 15 66 325 -194 -2 79 264 10 212 -120 202 -42 152 139 15
3153 15 176 -8 -239 92 42 -53 60 -25 60 -188 -213 20 17 91 161 67 18 14 -50 -124 -75 309 -113 22 54 46 29
3180 29 63 -41 -13 -16 -25 92 -17 -203 22 5 23 -23 -100 -93 6 47 154 71 148 16 147 402 1 163 -2 125
3206 125 -15 -7 149 67 80 3 362 1 0 226 155 39 -144 43 -107 -19 -40 -76 -46 121 180 112 -24 122 37
3231 37 -96 187 107 -59 -14 89 -119 168 81 -177 109 86 -3 36 186 -27 -72 -83 -193 -15 2 -27 -2 85
$$ packed form
3060A28k95K84l02N0l1L18k57L8q5K60k52k42K97o7P0j4K69k55r3j8J90J53k85
3083a39Q6J22j65j43K27q2L69n86M42j52J47j88Ml5J33J27j71o6N8O3O3m2J38
3106B10k41k0k3P0J56j23j04%R4J30pNl00L28l91K93O4j98J2N2J62k27J41N2k02
3131f7Q5L8j49j61N18m88M56k17N1K59n19J92Q1J85k54K02l32L22k44J94j3j24
3153A5J61j84k31L31n0r5J13q5Q5k48k5K33lP4P0r4m9mo4p4M9L84m22J35L2qj7
3180B9L4j04K8lrJ17j09j86K25j7J8m6p7PR9M1J07q3P7j32J31K55m01J62j65J27
3206A25j40QJ56q2J3p7L59l61jK26p1j16j83J87j50Q8k1l6L0J67N9o8j36J46q5
3231C7j33K83q0j66M5J03k08K87q7k58K86k3q9L9J50k13m5j1j10J78J7k9K5Q7
$$ plain form
3255 85 45 17 -94 58 -36 52 60 -77 -103 6 175 -118 186 -295 71 112 325 -5 178 91 -14 -24 169 185
3279 185 252 23 166 194 -58 122 45 -106 222 17 20 4 17 47 203 -43 294 -62 -270 258 94 256 67
3302 67 -28 -225 378 -260 -18 24 50 91 10 244 23 132 -96 166 -87 -15 27 27 127 118 77 -283 141 -113
3326 -113 -15 146 -51 -25 -1 70 -84 -104 -136 36 -123 -321 251 36 73 -12 -251 57 -162 85 75 -145 90
3349 90 138 -119 63 222 -97 -48 -129 -229 -52 34 48 73 40 135 76 17 279 171 -89 -173 -71 269 -132 160
3373 160 330 4 -107 -163 -16 31 44 87 200 43 -122 144 -74 13 93 -155 345 194 321 164 -198 132
3395 132 201 86 396 91 -92 1 -42 327 -334 -179 2 -100 28 68 107 129 -80 -57 -200 -307 -105 58
3417 58 -239 -124 72 -18 -204 -80 74 55 61 -8 21 -26 -25 -169 -230 -314 -155 -98 -94 -152 -227 -68 151 -83 134 -340
$$ packed form
3255H5m0k8j11J52r4Q8Qj37k6J09J69k93L04m81L66M1K13l30J83q7j05j0J93J6
3279A85O7k29J43K8k52J80p7j51L28k05Lj6J3L0J56k46L37l56k08N28j64J62j89
3302F7r5j97O03o38K42M2K6M1q1K34k21J09k28K62k53P2M2%J00rm1l60M24k54
3326a13R8J61j97K6K4P1j54k0l2J72j59j98N72k15L7q5k39L08k19K47j0k20K35
3349I0M8k57J82J59l19M9q1j00J77Q6J4K5l3R5n9n9K62j08k60q4J02L40m01K92
3373A60J70l26j11n6J47M7J3M3J13j57j65K66k18Q7Q0k48N00j51J27j57l62L30
3395A32O9j15L10l05j83R3m3L69o61J55J81j02J28M0L9K2k09K3j43j07K02J63
3417E8k97J15J96r0j86J24J54j9Oo9K9m7Jj44o1q4J59N7Mn8p5J59K19k34K17m74
$$ plain form
3443 -340 92 90 -64 9 110 -133 61 -167 18 -203 -64 -234 189 -94 -232 18 -83 -56 -227 170 122 -45
3465 -45 0 153 232 -70 32 -145 -91 -105 242 167 59 4 -44 152 -71 243 171 207 -117 19 159 254 -33 42
3489 42 135 351 -271 119 -336 -36 -82 53 18 116 -153 15 189 -189 -210 -112 140 -73 87 -58 190 -171
3511 -171 117 -239 -159 87 -58 77 352 -243 -339 -323 -220 192 -204 15 -199 -25 54 -24 -83 230 -71 79
3533 79 -37 212 9 61 94 29 287 -64 94 289 92 170 50 -66 -234 -4 -54 34 3 -35 37 92 -13 184
3557 184 98 -77 -32 81 95 1 -74 -163 -20 89 -91 77 196 6 90 -22 -83 -105 -203 -101 87 30 30 -36 118
3582 118 170 113 -82 -252 -241 -390 268 99 98 135 -98 -220 57 113 -113 -98 -262 -151 -57 -120 72 -20 30 -146
3606 -146 -94 -176 80 81 -47 -42 -124 -62 23 -14 -169 -37 -59 -212 18 -127 41 -7 82 -165 97 232 -48 -16 -26
$$ packed form
3443c40M32kj54P3J01k43J94k28J85k21J39j70M23k83j38K50j01K7j71L97m8j67
3465d5M5J53P9l02J02j77N4j4L47p5j08n5m8J96k23L14p2L6l24J36J40R5k87P5
3489D2R3K16o22L90m55L00m6J35l5R8k69J68J74l78k1R8K52k13J60j45K48l61
3511a71K88l56Q0K46j45J35K75n95r6J6J03M12l96K19k14J74P9p8n9L13l01J50
3533G9j16K49k03N2L3o5K58l51J58J95j97P8j20j16j68K30n0Q8l1l8P2N5j05J97
3557A84q6j75M5J13J4r4p5q9J43J09j80J68J19j90Q4j12o1k2r8J02J88n7%o6J54
3582A18N2n7j95j70J1j49O58j69jL7k33j22K77N6k26J5j64J11R4o3J92r2N0j76
3606a46N2q2K56Jj28Nq2O2Q5l7j55J32k2j53K30j45J68m8Q9k47K62J35k80L2j0
$$ plain form
3631 -26 -41 163 17 21 41 -71 19 50 36 -114 -35 -45 -195 264 236 146 116 8 94 98 91 -47 -84 103 49 79 25
3658 25 394 148 191 -73 -105 39 123 -84 239 20 -27 -140 -4 -96 -130 41 -132 175 -172 -244 -25 -46 117
3681 117 194 -150 -51 266 84 -4 46 -6 21 -296 137 -26 -237 -45 90 -131 151 -193 138 -211 3 29
3703 29 -70 -31 418 80 13 83 -84 141 99 172 169 40 -130 -175 16 -228 -307 -74 26 110 -271 -29 98 -2
3727 -2 -189 310 -235 0 -107 -167 -80 106 -115 -1 113 -110 47 -98 269 -90 -150 -289 124 -38 127 -44
3749 -44 -148 -291 -257 94 52 -64 -81 105 9 -51 -130 -39 61 -338 92 -100 -46 -105 -148 -86 -119 -305 -11 -9 -273
3774 -273 315 -68 101 -232 -345 -28 -86 -92 104 -122 188 -45 -77 249 195 34 -190 -249 -120 -129 83 -4 110
3797 110 -66 -26 157 -23 -60 18 14 170 217 -92 -86 211 72 105 27 -27 190 -3 -433 -85 254 41 162 204
$$ packed form
3631b6j5K04j46MK0j12R0L1j4j50P9j0j50M59k8r0l0j08Q6Mpj38l7J87n4L0n4
3658B5L69k46M3k64l2J44Q4k07L23k19m7j13J36r2l4J71j73L07l47p2K19k1J63
3681A17P7l44R9L17j82q8N0n2K7l17M33j63k11J92J35k21K82l44L31l49K14K6
3703B9r9L9M49l38o7P0j67K25m2P3lj29j70m5J91k44p9K33J00Q4l81K42J27j00
3727bj87M99n45K35j07o0Q7J86k21J14J14k23J57j45L67l59o0j39M13j62J65j71
3749d4j04j43L4L51m2j16j7J86r6o0p9R1J00l99M30j92N4n9m3O2l3j86K94Kk64
3774b73N88l83J69l33j13L17n8oJ96k26L10k33l2L26n4j61k24n9J29rK12q7J14
3797A10j76M0J83j80l7P8mJ56M7l09OK97j39L3p8n4K17j93m30L48L39k13J21M2
$$ plain form
3821 204 67 -143 -106 346 189 -54 242 58 255 32 -51 -13 55 186 101 -182 373 41 60 282 -102 -64
3843 -64 60 71 -146 166 59 -1 5 -128 0 110 78 47 -145 -119 54 -82 162 100 -141 -34 49 -17 72 -235
3867 -235 117 65 -88 80 113 253 147 184 -47 -89 -107 -154 -101 70 -118 42 -35 -48 -142 107 -36 -316 50
3890 50 -130 178 54 -11 -117 273 -207 -96 69 -149 -78 -111 -187 -276 155 219 335 -88 -157 -157 -119 44 128 -181
3914 -181 -55 -278 -92 33 179 -143 -10 134 -2 -417 36 67 -56 -163 -77 -104 46 7 64 75 141 93 9
3937 9 57 -142 187 99 63 470 134 -43 197 -77 -129 -186 54 48 59 -68 36 36 -49 147 21 -101 82 -86
3961 -86 100 1 -239 60 16 -145 -64 -8 -182 -185 47 -111 -84 86 90 -199 -287 21 25 -101 -3 -2 117 72 -25 -225
3987 -225 18 168 -29 90 -242 -34 23 -23 -58 -171 26 -7 20 -37 96 -4 64 -30 37 4 -228 259 -117
$$ packed form
3821B04j37k10L7M52j57k43K96j84J97k23q3L8O8J31q5k83N55l32J9K22l84L8
3843f4J24J1k17L12j07o0Oj33J28J10l2l1j92K6J73j36K44o2k41J07Q3o6Q9l07
3867b35L52n2j53J68L3J40j06L7k31m2j8m7N3J71j88J60p7j3r4K49j43k80L66
3890E0j80L08j24o5j06L90m80J11J65k18P1l3p6q9M31O4J16m23o9%L8J63Q4l09
3914a81J26k23J86J25J46l22J33J44j36m15M53L1j23j07Q6k7J50l9N7J1O6m8q4
3937IM8j99L29q8l6M07l36j77K40k74n2n7K40oJ1j27J04%q5J96j26j22J83j68
3961h6J86r9k40K99m4j61Q1N6j74lK32j58K7J70Mk89q8L08Mj26R8JJ19m5r7k00
3987b25K43J50j97J19l32K08N7m6l5j13J97l3K7n7J33j00O8r4O7l3k32M87l76
$$ plain form
4010 -117 -260 70 159 172 -208 -78 -11 -186 79 210 -100 -204 -29 -75 134 160 130 -23 28 -42 274 55 -23
4033 -23 -278 -150 -31 -95 -153 139 195 -328 -47 3 -207 -51 -281 -50 -61 -170 -121 -165 -101 42 70 -65 119
4056 119 184 -82 -247 191 -83 67 3 -195 88 -154 -86 -102 -15 -268 -122 -247 -155 42 -174 -279 -99 -43
4078 -43 108 101 -88 69 -14 -87 162 53 34 8 201 108 -271 114 -12 90 -69 31 -130 241 111 157 292
4101 292 -198 62 108 261 56 65 -298 253 -67 -132 142 296 96 137 168 44 59 -78 -112 -359 75 92 51
4124 51 45 -30 -34 -99 123 -80 125 17 23 77 144 82 157 30 153 -12 61 30 96 -194 81 0 72 180 -23 -35
4150 -35 23 -91 -25 107 -93 51 95 58 1 69 -81 -129 -115 246 2 16 -47 96 299 99 -115 37 -68 297
4174 297 143 84 49 -22 74 -90 -177 -5 94 99 137 -98 45 -146 22 -135 43 36 -145 -50 -143 -243 57 -185
$$ packed form
4010a17j43L30Q9J3l80J30O7j75K65J31l10j04J75m6K09K6l0j53N1p0L16k19p8
4033b3k55J28J19o4n8K92N6n23K81N0k10J56k30K31j1j09M9m4O4J43K8j35J84
4056A19O5k66j65M38k74J50o4j98K83k42O8j6Q7k53J46j25R2J97k16j05J80N6
4078d3J51pj89J57q3p3K49j09j9k6J93r3l79L85j26J02j59J00j61L71j30M6J35
4101B92m90K60M6J53k05Rl63N51l20o5K74J54k00M1L1j24J5j37l4k47M34J7m1
4124E1op5mo5K22k03K05j08ON4O7o2P5j27J23j65P3l1O6k90K75q1P2J08k03j2
4150c5N8j14O6J32k00J44M4l7n7O8j50m8J4L61k44J4o3J43K03k00k14J52j05L65
4174B97j54n9l5p1R6j64q7J72R9NL8k35J43j91J68j57J78pj81R5r3j00L00k42
$$ plain form
4198 -185 221 271 43 -58 37 60 -30 -153 243 -311 -17 113 24 57 149 214 146 154 48 -3 -28 -172 150 108 -162
4223 -162 153 85 -125 226 168 106 -4 -11 145 13 -52 -271 -124 -199 -47 -392 -70 16 -216 -30 -88 82 103
4246 103 96 -231 233 -21 104 147 208 15 13 280 -342 -95 52 -294 -9 89 -210 -72 96 -220 167 167 -207
4269 -207 269 204 58 -78 135 138 147 144 37 -39 -112 -150 287 -200 -89 -11 136 213 -122 61 403 254 -77 -94
4293 -94 115 -50 21 3 -194 70 81 161 -97 -205 22 199 -33 133 14 -145 131 -139 126 -150 -247 123
4315 123 -380 -9 69 86 -212 -104 -270 -101 -71 -47 -125 -71 -52 -253 -148 -219 -12 263 61 -203 -114 -33 63 -112
4339 -112 -57 27 -366 -7 213 234 -144 36 -36 -72 -168 159 47 -134 -18 29 -90 36 -43 -121 126 166 29
4362 29 -131 127 3 105 20 -71 -123 -263 258 44 -188 -68 -58 210 -29 144 0 95 -9 -167 -6 74
$$ packed form
4198a85M06N0k28j01R5K3r0j23L96n54K94J30q9L3R2O5o8Qj06n1k5j44L22m2k70
4223a62L15o8k10L51n8o2j10pJ56j32o5k19J47p5J52l45L22Q6k32J86n8J70K1
4246A03pl27M64k54J25M3O1j93kK67o22K47J47l46K85R8k99J38J68l16L87%l74
4269b07M76o5j46j36K13LRlj07p6p3l8M37m87J11P8J47P7l35J83L42j49l31j7
4293i4K09j65P1j8j97K64J1Q0k58j08K27J77k32J66j19j59K76k70K65k76r7L70
4315A23n03L71P8J7k98J08j66J69L0K4p8N4J9k01J05p1K07K75k02k64Q9Q1R6j75
4339a12N5Q4l93L59K20K1l78J80p2l6r6L27j12j81J16M7j19J26p9p8K47M0j37
4362B9j60K58j24J02q5r1n2j40N21k14k32J20J0K68k39J73j44R5j04j58J61Q0
$$ plain form
4384 74 92 194 -173 1 -66 108 19 79 -154 59 375 187 34 -66 180 -282 -386 -70 204 -59 34 150
4406 150 -84 231 -208 -355 -17 -183 37 7 77 -20 -124 126 111 85 131 -247 -138 -105 183 139 81 -137 5
4429 5 325 -147 -53 144 -147 -182 75 -100 178 -22 2 -93 1 195 -48 -2 -127 -77 75 -35 204 176 -19
4452 -19 185 -56 180 21 -32 -105 101 63 -63 -138 -40 25 -237 51 -19 -67 -17 -117 29 187 -260 159 -74
4475 -74 8 -171 191 -234 209 -160 -241 5 -138 -87 206 149 -24 313 -201 -127 79 157 34 99 -10 167 132
4498 132 156 -214 -24 163 -189 -40 -343 -75 111 -67 -106 167 326 -9 261 -254 185 94 -85 -161 -70 -163
4520 -163 -170 64 167 7 -170 121 80 -147 79 -74 145 157 -10 -11 -174 26 47 -99 -123 38 125 -108 -151
4543 -151 -99 18 206 -136 -200 -51 54 -132 -202 54 163 43 126 -273 282 212 30 98 -314 -36 -17 -167
$$ packed form
4384G4J8J02l67J74o7J74q9O0k33K13L16j88j53j00K46m62j04L16K74k63R3J16
4406A50k34L15m39j47L38j66K20l0P0r7j04K50j5k6M6l78J09L3K88m4n8k18J42
4429EL20m72R4J97k91l5K57j75K78k00K4r5R4J94k43M6j25N0J52j10K39k8j95
4452a9K04k41K36j59n3p3K06l8j26p5R8O5k62K88p0m8N0j00J46J58m47M19k33
4475g4Q2j79L62m25M43l69q1K46j43N1K93n7j73L37n14P4K06P8j23O5j09J77l5
4498A32K4l70J90J87l52J49l03K68J86j78l9K73J59l35K70n15M39r1j79p6R1r3
4520a63pK34J03j60j77K91m1k27K26j53K19J2j67jj63K00K1j46k4J61Q7k33m3
4543a51N2J17J88l42o4J49J05j86p0K56J09j20Q3l99N55p0j82O8m12K78J9j50
$$ plain form
4565 -167 39 31 -276 36 -205 47 223 -16 -211 -95 228 296 123 79 116 -200 -98 90 -36 -12 170 231
4587 231 -88 -21 231 -93 14 -176 -102 -20 38 -216 -28 -93 -177 120 30 48 -171 109 44 -214 14 300 42
4610 42 -65 30 263 144 -295 21 145 -55 -122 -154 -126 -45 35 -187 -87 -102 -172 44 -92 -37 218 88 -90
4633 -90 -96 146 45 -223 229 -38 -11 352 -37 -77 160 -87 111 -107 48 -147 -155 62 234 -78 73 -46
4655 -46 -32 265 0 230 -232 -191 48 136 5 -246 -212 38 -203 88 22 -38 55 -16 97 49 24 -15 -11 -32 -223
4680 -223 55 -116 -312 72 -185 67 53 -51 71 217 -287 254 22 71 280 143 165 307 -67 -10 65 -36
4702 -36 -270 -34 206 152 -2 189 33 128 93 19 -43 12 163 -116 74 242 33 -203 198 104 -7 -19 60
4725 60 154 -165 -141 339 207 204 263 -112 -143 216 -64 142 186 -112 72 -55 -148 55 -15 -293 27 58 53 -38 -183
$$ packed form
4565a67K06ql07L12k41K52J76k39j95J16L23O8j73m4L7l16J02J88j26K4J82O1
4587B31l19O7K52l24J07j90P4Q2N8k54J88o5q4K97r0J8k19K80o5k58K28K86k58
4610D2j07R5K33j19m39L16J24k00o7l2K8Q1Q0k22J00j5p0K16j36N5K55j30j78
4633i0oK42j01k68M52k67K7L63l89m0K37k47J98k18J55j95qK17J72l12J51j19
4655d6J4K97k65K30m62M1K39Q8j31k51L4K50k41K91o6o0R3p1J13m8k5l9Mk1j91
4680b23K78j71j96L84k57K52j4j04J22J46n04N41k32M9K09j37K2J42l74N7P5j01
4702c6k34K36K40n4j54J91j56R5l5p4o2N5J51k79J90J68k09k36M01r4j11j2P9
4725F0R4l19K4M80j32lN9l75l1L59k80K06M4k98J84j27r3K03p0k78L20L1nr1j45
$$ plain form
4750 -183 -85 50 43 -35 219 -215 65 -104 -157 25 -90 -117 153 26 -153 40 -145 0 -135 -84 38 -15 -63
4773 -63 85 34 -94 -18 59 167 -79 121 -147 -147 -145 -86 55 246 149 -150 -68 -144 -195 49 177 -78 -61 84 143
4798 143 25 -102 -138 248 150 -15 -18 -75 -98 67 -123 142 81 35 -175 -138 212 -76 -126 -12 -43 -155 1 -64
4822 -64 -135 -69 73 -29 -36 159 131 -2 -107 44 346 -66 -60 0 -115 64 -143 116 134 109 28 90 -75 -4 185
4847 185 80 108 71 11 -212 35 170 22 -182 -41 195 75 299 84 82 -80 -154 82 -149 -485 33 156
4869 156 -17 -152 31 -162 -235 80 -22 57 99 47 -158 107 32 -32 -63 55 167 194 -138 -362 195 -65 -38
4892 -38 156 51 228 -266 -33 128 -26 -84 -39 79 175 -66 -65 49 -98 276 -17 -110 -14 31 76 -157 91
4915 91 -15 -29 -123 64 -57 324 -164 -156 -274 343 24 -43 -94 242 100 -155 395 -33 -282 -7 90 118 -108
$$ packed form
4750a83R8J35pp8K54m34K80j69n3J82j15k7K70j27j79J93j85J45j35N1J22n3m8
4773f3J48n1j28P6P7J08k46K00k68%KN9J41J91r7k99Q2p6n1K44J28k55J7J45N9
4798A43j18j27l6L86r8j65ln7k3J65j90K65o1m6k10L7L50k88n0J14l1j12J56o5
4822f4p1O6J42j02pJ95k8j33j05J51L02m12OO0j15J79k07K59J8k5q1O2j65P1J89
4847A85j05K8l7o0k23K47J35j48k04J41K36j20K24k15kj62p4K36k31l36N18J23
4869A56j73j35J83j93p3L15j02P9M2n2k05K65p5o4l1J18J12K7l32k24N57k60K7
4892c8J94j05J77m94K33J61j54n8M5J18R6k41JJ14j47L74k93r3R6M5M5k33K48
4915I1j06j4r4J87j21L81m88Qj18O17l19o7n1L36j42k55N50m28k49K75R7K8k26
$$ plain form
4938 -108 102 -85 -234 42 -244 29 209 -34 175 44 -18 -272 -296 17 -134 -252 -309 -221 9 -338 111
4959 111 164 115 16 -117 -203 -31 -20 -106 -134 14 -68 -129 64 267 -74 -16 -73 116 132 119 -1 47 -102 4 -252
4984 -252 126 -178 -63 0 -174 -28 139 115 49 76 33 98 -13 -41 190 -53 23 70 -171 46 -65 98 7
5007 7 278 -172 47 222 17 127 128 -119 -16 48 58 200 -40 31 -53 184 -74 66 138 -20 91 -80 -200
5030 -200 64 -148 24 198 -217 207 -161 -241 15 -230 -269 -114 -38 67 -157 -118 76 -79 120 -43 37 -58
5052 -58 -85 -135 218 -154 -141 -87 42 112 -213 -229 -25 -68 -5 -167 56 -124 -292 -5 294 -227 -54 -203 246
5075 246 -181 -191 15 -353 166 -52 175 -250 261 -77 10 70 131 -80 -132 -58 -40 66 -7 194 -107 1 -21
5098 -21 272 136 49 -90 -41 -49 -147 13 64 -131 20 -176 15 -29 55 211 127 240 300 124 84 -173 -218 -79
$$ packed form
4938a08K10j87j49K76k86K73J80k43K09j31o2k54k4L13j51j18n7Q8K30l47M49
4959A11N3m9r9j33q6J72J1q6k8J48q2o1J93K03l41N8n7J89J6j3j20M8j49J06k56
4984b52L78l04J15O3j74J46J67k4o6K7m3O5j11k8K31k43P6M7k41K17j11J63r1
5007GK71m50K19J75k05J10Jk47J03O4J0J42k40P1q4K37k58J40P2j58J11j71j20
5030b00K64k12J72J74m15M24l68q0K56k45l9J55P6J05k24L9J94j55J99j63Q0r5
5052e8k7n0L53l72J3N4J29P0l25j6K04m3O3j62K23j80j68K87K99n21J73j49M49
5075B46m27j0K06l68N19k18K27m25N11l38Q7O0O1k11n2P4J8J06p3K01l01J08k2
5098b1K93j36q7j39M9qr8J60N1j95J51j96J91m4Q4J56q4J13O0j76m0k57m5J39
$$ plain form
5122 -79 174 30 47 64 51 97 -175 -113 -89 7 -213 86 -89 -171 -85 -106 -62 -164 -135 147 -1 -111 301 -110
5146 -110 159 62 -90 -357 91 215 32 85 249 -129 -16 -271 23 215 -13 51 -86 264 66 50 -227
5167 -227 171 -32 -123 -85 -73 -30 -164 -238 -95 -144 1 17 0 51 -142 254 45 53 77 207 -47 5 54 -91 -31
5192 -31 -15 130 89 -19 -26 -193 -16 245 136 -221 -13 -97 -195 73 267 -251 5 -39 -35 -358 337 -49 43 262
5216 262 -82 -84 -64 75 -37 196 -63 128 -168 -11 53 -9 -91 100 85 -64 -180 -97 -75 44 -104 84 -13
5239 -13 -122 -22 -220 160 349 55 163 -19 206 158 28 78 -39 -187 181 -32 39 149 -52 -189 -30
5260 -30 -52 -312 -84 214 110 62 49 -109 0 -43 -14 285 -4 -185 -52 -7 -184 48 -239 205 173 149 266
5283 266 23 90 3 -251 -342 193 203 -202 71 -49 146 12 22 3 14 42 -41 108 -139 -155 -20 142 121 -184
$$ packed form
5122g9K53j44J7J7j3M6k72O2K4R6k20K99j75q2Q6k1M4j02K9K82j48j10M12m11
5146a10K69r7j52k67M48J24j83N3J64l78J13k55K94J92k28O4j37L50j98j6k77
5167b27L98k03r1L8J2M3j34p4J43m9J45J6j7N1j93L96k09QK4J30k54N2M9j45O0
5192c1J6J45m1j08pj67J77K61j09l57K08q4r8K68J94n18K56m4Ml23O95l86R2K19
5216B62l44kK0J39j12K33k59J91k96J57O4o2q2J91j5j49j16Q3K2J19j48J88r7
5239a3j09J00j98L80J89k94J08j82K25m8j30N0j17j48L68k13P1J10k01j37J59
5260c0k2k60K28K98j04m8j3j58J09m3K9K99k89j81J33M5j77K32k87M44l2k4J17
5283B66k43O7q7k54r1N35J0m05K73j20J95j34J0j9J1K8q3J49k47j6J35J62k1l05
$$ plain form
5307 -184 58 64 253 73 -179 59 7 -120 -6 -29 106 -89 142 11 142 -97 203 -129 -244 -21 -228
5328 -228 -82 92 265 46 25 -298 48 -177 -142 -252 99 7 296 -179 -139 200 -253 39 8 -313 183 212
5350 212 -83 -129 -95 106 86 -200 35 193 127 295 44 183 -64 80 -302 -180 139 97 115 168 -110 44
5372 44 176 133 317 39 27 153 -62 -78 -222 -112 -136 161 -67 184 -112 -81 27 -26 -60 -54 -48 124 -72 14
5396 14 -25 -25 -9 -288 -303 -163 2 -54 -87 -184 7 47 169 -173 -91 51 -188 -310 133 147 -131 -259 -209 292
5420 292 35 115 -103 44 32 24 -53 128 226 -243 196 25 210 45 -147 174 71 -72 -114 126 -72 75
5442 75 108 -33 300 -142 -39 80 -182 106 -155 -9 -131 93 -149 -42 -164 134 77 35 -157 -359 171
5463 171 54 122 -73 51 -28 -19 -192 -104 86 43 -95 -31 197 58 -249 -7 42 -46 12 198 -263 -187 129 140
$$ packed form
5307a84K42OJ89j80k52K38n2j27J14k3J35j95K31j31J31k39L00l32j15K23k07
5328b28J46J74J73k19k1l23L46k25L5j10L51r2K89m75M0L39m53K92l1l21M96K9
5350B12k95m6L4K01k0k86K35J58o6J68k51J39k47J44l82J22L19m2J8N3k78J54
5372D4J32m3J84k78j2J26k15j6j44J10k4K97k28K51k96L1J08n3l4OOJ72j96Q6
5396A4l9%J6k79j5J40J65n6l3r7J91M0J22l42Q2J42k39j22M43J4k78j28N0N01
5420B92k57Q0k18J47j2qp7J81R8m69M39j71J85j65j92L21j03j43m2K40j98J47
5442G5L3j41L33m42J03J19k62K88k61J46j22K24k42J07j22K98n7m2j92k02N30
5463A71j17O8j95J24p9Rj73Q8J90m3j38O4K28j39l07K42M9q8N8J86m61P6L16J1
$$ plain form
5487 140 31 113 5 47 -263 -142 -82 117 -123 -15 287 -49 -108 -174 227 -13 216 -16 176 347 94 56
5509 56 27 192 -31 91 -41 219 190 234 228 93 15 -113 85 353 -286 -260 -230 210 46 127 -40 1 87 268
5533 268 -35 14 -118 80 -30 35 125 98 -58 79 102 51 -280 75 -161 -16 29 -32 -213 -34 -41 45 26 299
5557 299 -146 24 64 148 184 -94 -209 -143 52 -39 76 -177 188 36 327 169 -42 -126 -145 -41 -6 -68 -54
5580 -54 174 11 280 234 -120 -204 179 -24 263 49 -73 -99 -271 -39 -56 54 159 49 244 -125 -65 -179
5602 -179 88 -86 15 42 250 248 165 -39 129 -335 -171 -150 -199 314 135 94 46 1 38 -33 83 -43 159 153
5626 153 107 72 67 -197 -197 121 75 18 -226 39 -231 -164 -43 -53 287 4 250 -49 25 -35 229 -152 72 49
5650 49 65 -74 91 10 -151 30 -82 116 -33 -6 125 209 -223 141 -60 -95 -137 103 126 41 -116 167 120
$$ packed form
5487A40j09Q2j08M2l10J21O0J99k40J08L02l36n9o6M01k40K29k32J92J71k53l8
5509E6k9J65k23J22j32K60k9M4oj35p8j28J98K68o39K6L0M40j64Q1j67M1Q6J81
5533B68l03M9j32J98j10O5R0k7j56J37K3n1l31L55k36J45M5o1j81J79pQ6j9K73
5557B99m45J70M0Q4L6k78j15O6J95r1J15k53L65j52K91j58k11q4j9J04L5o2J4
5580e4K28j63K69m6l54q4L83k03K87k14j22k6j72K32j7J10J05j10J95l69O0j14
5602a79K67j74J01K7K08kq3k04J68m64J64K1m9N13j79m1m8m5L7p1J16j26K02o
5626A53m6l5nk64%L18m6n7k44K65k70O7J21j0L40k83K46k99P4o0K64l81K24k3
5650D9J6j39J65q1j61J81j12J98j49K7J31Q4m32L64k01l5m2K40K3q5j57K83m7
$$ plain form
5673 120 -70 245 72 374 -416 -367 -197 22 -79 -134 2 141 -50 -175 11 222 -59 -135 37 192 126
5694 126 -13 -2 -169 -333 -13 -54 0 281 -201 -66 33 -159 -2 151 -168 31 -50 -23 158 37 -198 86
5716 86 -69 -33 243 -138 -59 316 -8 -103 -153 -65 -47 41 30 -151 -214 5 31 -15 -40 -21 341 20 -101 -54 -247
5741 -247 -38 20 22 -100 60 7 1 -13 -147 138 -157 -201 -89 120 -248 -113 -28 371 -150 -143 41 188 -269 -82
5765 -82 208 -159 -254 37 90 -62 -116 -320 -189 -64 -77 162 190 179 190 198 -49 133 152 35 -31 -173 -106 300
5789 300 -197 141 140 -127 -161 29 1 3 -96 -1 190 115 130 147 207 106 101 84 192 -101 -106 -96 -40 -169 18 -48 15
5816 15 -174 -102 184 401 -130 150 133 202 -16 123 -8 -22 205 -69 -169 119 18 -14 -1 -107 -167 8 164
5839 164 42 -166 -21 -42 135 41 -229 74 -46 -46 -77 -140 -62 3 -159 5 -183 -210 -160 -54 -12 22 178 -92
$$ packed form
5673A20j90L15j73L02p90M9J70K19j01n5J36J39j91j25J86K11k81p6J72J55o6
5694A26j39J1j67j64L20m1N4K81m82J35R9j92J57J53l19J99q1K7J81j21k35K84
5716H6j55L6K76l81P9L75l24r5n0Q8J8Q8j1j81o3K19K6m6k5J9L62l21j21M7j93
5741b47K09N8Kj22J60n3oj4j34K85k95m4J12K09l68J35Q5L99n21PJ84J47m57J87
5765h2K90l67r5K91N3j52n4k04J31J25j3K39K8j1J1Qk47J82J9j17o6j42O7M06
5789C00m97L38jk67l4J90k8Kr9R5J91p5J5J7O0j01nj7J08k93nJ0N6j29J87o6O3
5816A5j89P2K86K17n31K80j7O9k18J39j31j4K27k74j00K88j01l2J3j06o0J75J56
5839A64j22k08J45k1J77r4k70L03j20%l1o3P8O5j62J64j88k7N0J06M2L4J56k70
$$ plain form
5863 -92 93 -51 -124 183 -22 -49 -146 -3 -83 -122 -86 -336 141 20 89 -36 -1 89 32 -162 150 -37 152 -178
5887 -178 -60 -245 47 5 -28 292 -251 85 139 -153 -66 122 74 -89 98 19 13 -15 93 245 43 160 33
5910 33 -35 192 16 -17 104 100 50 -15 -93 -147 -254 0 5 27 -119 -109 20 -114 11 -111 62 -71 -116 -142 -125
5935 -125 55 -5 -181 -152 -113 75 88 -89 -48 -136 -62 -102 -99 -10 -114 -210 222 29 253 82 13 -28 42 151 52
5960 52 234 327 -53 184 -154 -131 -47 -219 14 -115 -328 -53 120 61 58 -24 -15 -330 211 -294 72 179 -56
5983 -56 -76 -21 -107 235 -212 -58 77 -133 29 135 -61 253 -48 86 -26 -189 -4 124 28 61 -104 185
6005 185 39 231 178 -133 -40 128 200 -260 25 37 134 -141 247 34 -182 75 -114 34 10 209 127 150 11
6028 11 -114 -168 2 86 -314 -297 -2 34 -87 -114 23 -2 -10 65 9 134 95 100 151 -24 -37 215 -241 214 -74
$$ packed form
5863i2J85j44p3L07k05k7r7J43q0l9L6k50M77j21O9j25L5R0n7j94L12j87J89l30
5887a78J18j85K92m2l3L20n43L36N4k92Q7J88m8j63J87p9ok8J08J52k02J17j27
5910C3o8K27j76l3J21mn0o5p8n4j07K54NK2j46J0J29j34J25j22J73j33m5k6J7
5935a25J80o0j76K9L9J88J3j77M1q8P4m0LQ9j04r6M32j93K24j71o9m1P0J09r9
5960E2J82R3l80K37l38K3Q4j72K33j29k13K75J73n9lq2Rl15N41n05L66J07k35
5983e6k0N5q6L42m47J54J35k10J62J06j96L14l01J34j12j63J85J28r6L3j65K89
6005A85j46J92n3l11R3J68P2m60K85J2R7k75L88k13k16K57j89J48k4J99q2K3j39
6028A1j25n4J70Q4m00J7K95L6j21k7J37k5qP5n6J25l9NN1j75j3K52m56M55k88
$$ plain form
6053 -74 18 101 -224 242 -21 149 -292 -146 52 -42 -177 49 -104 118 85 -72 87 -40 -75 -107 -213 -215 4
6076 4 116 217 -49 162 -98 294 92 64 -1 -11 98 -136 -75 92 -137 -189 36 11 -25 -50 146 -172 176
6099 176 173 83 121 0 -170 -41 -10 -165 1 55 48 -18 -25 216 -101 356 146 -58 -56 21 -30 -87 -167 65 47 -157
6125 -157 -197 -74 -381 24 -133 58 -249 29 -179 58 4 46 72 -234 137 160 115 53 242 -179 -87 -184 228
6148 228 127 314 -42 -30 -98 -79 -55 67 -72 -217 103 -58 -199 250 93 135 21 -26 -24 -165 -126 -77 90
6171 90 -24 -35 55 65 -119 170 -69 86 -335 38 -3 -61 -83 -249 -279 -180 -255 77 -254 38 -9 257 -260 56
6195 56 54 272 178 -142 -35 -113 -181 131 10 -66 -89 52 99 169 130 -285 51 47 152 124 17 38 131 -382 91
6220 91 58 -123 22 -181 -20 -269 -60 174 -40 -22 40 -156 81 18 -166 -136 -87 -159 109 -216 -136 -72 82
$$ packed form
6053g4R2Q3l25M66k63J70m41J46J98r4j35K26j53K22l3j57J59j27l5l2j06kK19
6076DJ12J01k66K11k60L92k02k8o5j0J09k34O1J67k29n2K25k5l6k5J96l18L48
6099A76lr0L8j21j70J29L1j55J66N4po6pK41l17M57k10k04KP7n1n7q0K32j8k04
6125a57m0J23l07M05j57J91l07K78k08K37n4M2K6l06L71K3m5o2J89m21R2r7M12
6148B28j01J87l56J2o8J9K4J22j39j45L20j61j41M49j57M2j14m7Kj41L9M9J67
6171I0j14j1R0J0j84K89k39J55m21L73m1n8k2j66l0R9p5L32l31K92m7K66n17L16
6195E6kK18r4l20J07p8o8L12j21p6k3J41M7P0l9m15L36mJ05k8j07K1R3n13M73
6220I1l3j81J45k03J61k49K09K34k14J8O2j96K37o3j84L0M9p2K68l25Q0O4J54
$$ plain form
6243 82 156 121 -77 57 127 65 -184 -33 92 134 -17 212 166 -156 -5 -184 137 -142 -50 101 28 175 -100
6266 -100 50 -210 143 -64 -50 248 63 30 167 91 142 67 -130 -113 206 25 -291 21 -90 131 -71 -109
6288 -109 -36 118 21 -214 152 229 -66 166 -108 109 13 186 -221 106 -122 -25 -65 50 -286 41 88 71 -107
6311 -107 -96 -122 -96 -185 20 -217 223 140 137 105 180 88 139 545 -39 99 33 -53 10 -64 134 -28 12 62 -185 -298
6337 -298 198 42 -32 92 -29 -130 -92 -174 143 243 -94 160 -177 66 175 148 -99 -20 -141 -103 -33 187
6359 187 -182 138 85 -126 203 -78 -5 33 5 -23 117 11 -7 102 -253 -107 268 64 117 -24 180 56
6381 56 17 -106 -204 87 189 175 -254 117 -114 -19 -32 51 -144 61 253 7 49 21 -154 69 75 -199 66 152
6405 152 155 9 -66 -88 81 -67 -49 -15 -180 246 101 -59 -207 -116 -187 106 -56 -59 -31 -84 -12 -74 -28 -20 199 96
$$ packed form
6243H2P4l5j98J34P0o2k49J51J25M2j51K29m6l22J51j79L21k79R2J51p3J47k75
6266a00J50k60L53k07J4K98j85l3J37p6N1p5j97J7L19j81l16L12j11K21k02l8
6288a09P3J54r7k35L66P7k95K32k74K17r6J73m07L27k28R7m0J15l36L27M7j7j78
6311a07J1k6K6q9K05k37M40q3ll2P5r2N1M06n84J38o6q6O3p4J98j62M0N0k47j13
6337b98M96j56p4J24j21j01L8q2L17J00l37K54l37K43J09k7k47P9j21L8P0K20
6359A87l69L20n3k11L29k81P3L8k8k8J40j06j8J09l55J46L75k04N3j41K04j24
6381E6l9j23r8K91J02j4m29L71k31R5j3Q3j95K05J92k46M2k8j75K23Ok74K65Q6
6405A52Lj46p5k2J69j48J8L4j65M26j45j60j48R1p1K93j62lK8n3P2o2M6QK19j03
$$ plain form
6431 96 -100 155 201 36 -41 -29 364 6 27 162 30 108 -38 146 203 -31 -50 42 40 18 -367 -13 -13 -218 -136
6456 -136 -21 152 125 -53 -63 -103 -172 11 -89 -126 -54 -69 -16 -73 -13 10 175 -111 226 -207 -103 148 224 -318
6480 -318 -60 -156 -30 -118 1 105 387 -74 -243 -68 -148 -160 -215 123 -79 48 27 127 -17 66 -86 -14 -204
6503 -204 112 -1 170 100 24 119 -185 15 99 -114 -110 -104 -27 66 177 234 -254 -166 6 191 53 215 -80 -71 -192
6528 -192 25 -18 -111 81 -86 127 -266 -31 159 -33 -75 -53 -5 152 -15 -77 -96 147 -171 33 -180 26
6550 26 -217 -35 -160 123 228 105 242 -106 3 -154 -178 102 -98 -166 121 98 -46 -72 244 159 -96 68
6572 68 -51 -49 244 156 44 -252 -49 -35 100 -43 -79 32 228 -151 -104 40 306 -278 -8 -91 -214 -24 38
6595 38 -47 84 -13 84 -244 -56 106 59 118 48 168 231 112 -212 102 86 146 38 -33 -50 11 -48 176 -125 -36
$$ packed form
6431I6j96K55M6j65p7J2L93l58K1J35j32P8j46J84N7k34j9R2kk2l85L54%k05Q2
6456a36J15J73k7j78j0m0o9J83j00l7P2j5N3n7O0K3J65k86L37m33J04K51P6n42
6480c18K58r6J26q8J19J04K82m61j69J75q0j2n5L38k02J27k1J00j44Q3j52P2j90
6503b04L16j13J71p0p6R5l04K00Q4k13MOP7R3J11N7m88Q8J72J85j38J62k95Rj21
6528a92K17m3r3J92j67K13l93K35J90j92m2K2M8J57j67o2j9K43l18K04k13K06
6550B6k43J82j25K83J05j23J37l48J09j57k4K80k00o8K87k3j44k6L16q5k55J64
6572F8j19KK93q8j12k96K03J4J35j43l6J11J96l79M7J44K66n84K70q3j23J90O2
6595C8q5J31r7R7l28J88J62m7N9p0J20O3j19l24L14j6O0j08p1j7O1n9K24l01Q9
$$ plain form
6620 -36 -6 -189 -27 166 -70 151 38 -115 114 177 196 -17 157 -451 -214 -196 317 -239 -304 102 -44 15
6642 15 -299 116 132 2 -50 -62 13 275 -30 261 211 -270 295 77 53 43 -52 148 -39 -73 -36 223 66 -59
6666 -59 137 -102 -77 312 60 79 160 36 9 282 -228 -211 -157 -63 189 -233 -266 24 191 -89 -91 237 79 -201
6690 -201 131 -66 214 39 91 -278 -18 89 -285 34 -124 217 -107 -62 -155 -214 -104 47 10 285 179 -49
6712 -49 73 79 75 -69 -78 -391 -108 115 -56 -26 -282 99 -121 103 223 32 91 113 26 -15 -238 120 -203 -182
6736 -182 -300 -156 187 195 -166 27 127 6 -2 -84 188 252 -139 -217 -113 -24 -34 -17 -8 4 -67 154 104 -34 -28 -239
6762 -239 -92 3 47 -59 -199 36 133 158 52 -28 63 -291 -13 -27 -33 -153 -114 -140 15 40 4 -74 -47 -201 5
6787 5 -197 260 -100 95 5 143 1 61 -93 -141 -99 160 -50 38 -113 -28 82 -20 30 -70 38 86 -81
$$ packed form
6620c6L0j83J62J93k36K21j13j53K29O3J9k13J74o08K37J8N13n56o5M06j46N9
6642A5l14M15J6j30n2j2P5K62l05K91n0m81N65k18k4j0r5K00j87l4L7K59j57j25
6666e9J96k39K5L89k52J9Q1j24k7K73n10J7N4R4K52m22l3K90J67k80kL28j58k80
6690b01L32j97K80j75N2l69K60J07l74L19j58L41l24M5r3n9J10J51l7K75j06k28
6712d9J22Omj44rl13K83K23j71L0k56L81k20K24J20j91N9K2q7m1k23L58l23K1
6736a82j18J44L43Ql61J93J00j21qq2K72O4l91p8J04Q9j0J7RJ2p1K21n0j38Ok11
6762b39J47R5M4j06j40K35R7K5j06q0R1l54K78j4oj20L9k6J55K5l6p8K7j54K06
6787Ek02M57l60J95r0J38j42O0j54m8M2K59k10Q8j51Q5J10j02N0j00J08M8j67
$$ plain form
6810 -81 58 120 -1 -165 25 3 142 136 -25 -44 21 -28 -117 53 -175 50 -151 -34 -296 -25 -72 307 -2
6833 -2 -281 204 256 -183 -131 211 -250 160 -42 -4 -43 -40 -127 -129 67 185 -1 -149 -31 93 -318 -78 -183 19
6857 19 -49 -123 39 -110 -17 78 5 72 195 -7 85 0 12 127 -200 -2 294 85 102 85 194 -12 -44 -74 -64
6882 -64 5 301 15 167 -44 -187 21 25 -38 -97 -118 84 153 93 -102 114 22 175 -37 -42 -72 -217 -155 128 73
6907 73 -140 189 44 -7 -28 14 18 157 -75 -125 100 -252 -177 138 7 261 127 -57 211 -164 -33 -85 33
6930 33 -23 2 -41 71 168 31 30 -86 -67 9 51 80 -27 111 -91 -78 251 133 96 118 17 -50 -127 333 202
6955 202 8 186 141 -66 -99 46 122 -52 -190 -83 158 29 32 41 -104 73 63 47 2 -286 -102 -21 -14 55 47
6980 47 -8 100 -4 -87 142 176 183 -104 -15 -25 13 -83 -116 -82 -178 -217 31 0 62 -23 70 77 -149 -223 -274 -54 22 -40
$$ packed form
6810h1J39O2j21j64J90k2J39oj61j9O5m9q9J70k28K25k01J17k62K71m7L79l09
6833bk79M85N2m39N2L42m61M10k02L8l9Lq7kJ96J18j86j48J18J24m11K40j05K02
6857A9o8p4J62j49R3R5p3O7J23k02R2q5J2J15l27J98K96k09J7j7J09k06l2l0J0
6882f4O9K96k86J52k11j43K08Mo3n9k1K02O9o0j95K16r2J53k12nl0j45O2K83n5
6907G3k13L29j45n1k1M2MJ39k32n0K25l52P5L15j31K54j34j84K68l75J31n2J18
6930C3n6K5m3J12R7j37jj16J9P6M2K9j07J38k02J3L29j18l7K2j01o7p7M60j31
6955B02j94J78m5k07l3J45P6j74j38J07K41j29LRj45J77j0j6m5k88J84Q1PO9q
6980D7n5J08j04q3K29L4Pk87Q9j0L8r6l3L4r6l9K48l1O2q5R3Pk26p4n1K20P6o2
$$ plain form
7008 -40 84 18 243 159 166 74 -36 242 -95 66 223 40 -110 -89 171 -247 63 -12 -32 -152 -54 -103 28 -69
7032 -69 -45 -61 -80 -244 -57 34 -118 -60 190 18 -84 24 61 -183 -117 -176 113 120 222 -171 65 6 198 -46
7056 -46 -26 -62 93 -91 -22 -20 -134 190 -180 -23 55 146 18 50 167 12 174 78 -75 21 240 -102 -113 79
7080 79 -171 92 -86 -20 -68 162 42 -158 106 26 -204 63 78 -9 -111 -178 -121 -37 -62 -154 -73 -368 72 -50
7104 -50 93 -160 108 104 -140 188 -55 -56 -6 24 201 -82 -10 154 90 -38 46 199 -26 30 -184 86 11 45
7128 45 198 102 95 251 -83 79 366 42 300 -128 223 61 129 33 -217 20 2 80 -105 106 -152 125 54
7151 54 172 134 210 198 -144 64 -130 83 87 252 55 -32 -199 -97 -36 -48 100 -132 -53 -11 221 -118 76 -29
7175 -29 -53 303 -81 -83 -3 -91 10 160 73 1 -77 -134 26 -63 -198 -145 -28 113 -99 -25 -35 -39 53 176 -188 -70
$$ packed form
7008d0J24o6K25q4Pr2j10K78l37J61J57j83j50K1K60m18L10p5k0j20R8m9J31r7
7032f9K4j6j9j64J87R1j52N8K50j72j02J08L7k44O6n9K89PJ02l93K36n9J92k44
7056d6K0l6J55j84O9Kj14L24l70J57P8R1j28L2J17j55J62r6j53R6K19l42j1J92
7080G9k50K63j78O6m8K30j20k00K64q0k30K67J5q7j02o7N7Q4k5r2Q1k95M40j22
7104e0J43k53K68mk44L28k43jN0L0J77k83P2J64o4j28Q4J53k25N6k14K70p5L4
7128D5J53r6pJ56l34J62K87l24K58m28L51j62O8r6k50K37j8P8j85K11k58K77p1
7151E4J18l8P6j2l42K08j94K13MJ65j97q7j67J02O1j2J48k32P9M2K32l39J94j05
7175b9k4L56l84kQ0q8J01J50q7p2p8n7J60q9j35N3J17J41k12P4j0mR2J23l64J18
$$ plain form
7201 -70 145 24 40 -189 182 45 -17 -191 43 -200 189 -135 -219 101 -47 -64 54 -82 -248 -28 48 -158
7223 -158 -29 -194 60 58 -161 219 5 242 80 -145 106 5 189 77 112 -96 13 47 151 -78 -40 -71
7245 -71 -131 213 -67 -8 29 51 -138 -44 24 80 216 263 -119 -21 81 25 -215 -80 -249 -312 109 201 105 104 171 108
7271 108 -66 -89 -269 -76 207 -344 -49 -44 -57 12 -412 56 228 -251 -215 -57 35 -206 -93 -21 45 -164 116
7294 116 22 27 74 108 207 190 54 299 -120 2 87 77 -24 -88 -359 101 -34 -170 -217 -70 -53 106 50 -121
7318 -121 -228 -114 -249 -30 -7 -146 -92 -15 179 15 -150 -275 -252 78 -169 131 73 138 -216 -89 -79 -229
7340 -229 -115 -56 159 -88 -77 -191 -133 -103 112 122 55 -43 82 -6 9 3 -26 41 39 -38 35 -86 -97 -209 135 36
7366 36 101 330 -76 396 210 -48 -160 173 -126 -137 -215 122 -295 -168 23 80 8 54 195 -185 6 -190
$$ packed form
7201g0K15j21J6k29L71j37o2j74K34k43L89l24q4L20j48j7J18j36j66K20P6k06
7223a58J29j65K54kk19L80k14K37j62k25K51j01J84j12L5k08J09L4J04k29L8l1
7245g1o0L44k80N9L7K2j89R4O8N6J36M7l82R8J02n6k40J35j69o3M21R2r6jO7o3
7271A08j74k3j80J93K83n51K95Nj3O9m24M68J72m79L6J58R2k41J13P2O6k09K80
7294A16r4NM7L4R9j7j36K45m19J22Q5j0j01o4k71M60j35j36m7J47J7J59n6j71
7318a21j07J14j35K19K3j39N4P7J94j64j65j25K3L30k47L00n8O5l54J27J0j50
7340b29J14N9K15k47J1j14N8L0K15J0o7r8J25q8J5ok9O7kp7P3j21j1j12L44r9
7366C6O5K29m06M72j86k58j12L33k99j1p8L37m17J27J91N7p2M6J41l80J91j96
$$ plain form
7388 -190 -86 120 -41 -93 -224 -122 -137 -130 -38 8 100 11 -33 285 -186 -68 28 -20 46 23 96 101 -55 189 114 -23
7414 -23 -39 65 -294 107 -9 -45 404 71 188 165 90 -42 91 -111 -262 175 5 86 151 -25 -326 -187
7436 -187 86 -291 271 37 112 -51 251 31 2 -15 -25 -313 -109 -124 82 -55 -32 84 -30 94 88 79 -116
7459 -116 -8 179 201 109 -24 -61 57 94 -322 -122 54 80 124 -84 132 16 0 0 -78 -86 -180 218 -165 -52
7483 -52 91 -7 -277 172 -120 105 30 -118 -17 -215 9 47 38 106 112 -52 24 73 -83 113 -176 -2 28 -219
7507 -219 14 136 -269 18 -131 -64 160 -101 155 26 -13 -270 -3 70 -53 -339 -134 -35 153 -337 -73
7528 -73 -32 99 -221 -82 113 278 45 81 422 -99 -42 57 -142 23 -21 -99 -117 43 -205 52 37 217 -27
7551 -27 -173 -139 108 -52 -333 3 -24 179 240 185 56 -113 13 92 -60 -80 155 97 18 238 -178 160 230
$$ packed form
7388a90J04K06j61n2j31J02j5PR2M6R2q9m4L18m71J18R6m8O6k3P3Nj56K44p5j37
7414b3j6J04l59M01j16l6M49l33J17k3p5j32J33k02j51M37j70Q1O5j76l01J39
7436a87K73l77N62k34P5j63L02k20k9j7j0k88K04j5K06j37K3J16j14J24orj95
7459a16J08J87K2r2j33l7J18L7m16K00J76K6M4k08K16j16j6%p8qr4L98l83J13
7483e2J43r8k70M49k92K25p5j48J01j98K24L8rO8Oj64P6M9j56J96k89J74L0k47
7507b19K33J22m05K87j49O7K24k61K56j29l9k57K67P3j23k86K05R9J88m90K64
7528g3M1J31l20J39J95J65k33L6L41n21N7R9j99J65m4p8j8J60k48K57j5J80k44
7551b7j46L4K47j60k81L36k7K03O1n5j29j69J26P9j52k0K35n8p9K20m16L38P0
$$ plain form
7574 230 189 444 -179 61 110 83 180 -13 8 274 368 -301 -184 261 -68 -204 -75 -155 -107 -241 284 -67 -330
7597 -330 85 -122 247 -249 -36 204 -41 51 156 215 34 27 -86 264 -112 135 150 234 -26 -18 36 -259 -48
7620 -48 156 -25 164 -4 -58 27 220 -64 -109 -20 8 -31 23 -95 -16 -123 -313 36 -74 -217 55 171 107
7643 107 126 -104 113 -87 51 69 77 -27 117 -168 217 -12 -100 -66 -88 50 -4 -161 -20 75 53 22 91 11
7667 11 14 -94 -97 233 141 158 295 105 117 18 155 164 -66 -252 163 -73 19 26 -5 138 170 -69 134 -135 106
7692 106 110 38 125 42 -29 -20 33 118 94 106 -235 -94 13 173 -8 -42 218 91 119 -161 -184 -209 262 -241 198
7717 198 167 -77 -150 140 -87 148 183 61 -295 -306 -247 -28 -242 -90 -136 -56 -125 50 -79 11 97 -327 89
7740 89 -102 -83 -18 259 -188 20 -65 -180 -192 122 226 133 152 -144 114 -123 -43 -154 13 -71 131 209 174 125
$$ packed form
7574B30m1K55o23K40M9k7R7j93K1K66R4o69J17M45l29j36J29q0M8j34N25l51k63
7597c30M15k07L69m96K13K40k45R2J05N9j81pj13L50l76K47J5Q4k60QN4k95K11
7620d8K04j81J89j68n4Q5J93k84m5Q9K8l9N4j18P9j07j90L49j10j43K72J16o4
7643A07J9k30K17k00J38J8Qj04J44k85L85k29q8L4k2J38n4j57J41R5k2l1O9q0
7667A1Lj08lL30r2J7J37j90J2r9J37Rk30j86M15k36R2Pl1J43L2k39K03k69K41
7692A06Mp2Q7q3p1RN3Q5k4J2l41J41J07J60j81l4K60j27K8k80k3k5M71n03M39
7717A98l1k44p3K90k27K35L5j22l56j1N9K19k14J52m6Q0o9J75j29R0Q6m24M16
7740H9j91J9O5K77m47K08q5j15j2L14J04r3J9k96K58k37Q0j11J67q4K02P8l5m9
$$ plain form
7764 125 -34 125 118 -119 -225 -130 -96 -15 21 -50 -183 76 61 261 24 393 -156 70 -10 255 230 107 -99
7787 -99 167 -80 -242 59 -92 -248 -5 27 -164 -11 351 194 -8 -56 -34 -42 -228 -252 55 77 -146 303 -18
7810 -18 157 34 -32 -135 -183 28 -14 -95 314 -235 18 -22 353 -14 -168 99 -172 -34 -91 43 175 -135
7832 -135 -78 -22 -363 -106 -79 -36 -45 -191 -48 -179 -39 102 -158 289 129 184 -64 0 -38 158 290 -207 -22
7855 -22 -45 170 -69 72 222 199 -138 3 151 -185 135 181 34 46 -26 -41 -65 -15 221 52 -166 -81 100
7878 100 160 236 110 129 126 227 174 146 -119 100 -67 5 162 -106 -104 -72 -27 -78 214 -438 129 195 39 -41 -140
7903 -140 -33 35 91 -9 -10 -30 -21 223 -1 66 -169 98 186 -16 52 -255 52 -156 228 107 -130 122 159 -109
7927 -109 146 -59 -144 -26 -98 -114 7 68 -56 -343 -189 154 -174 -157 44 -123 -29 17 80 -53 -155 33 -47
$$ packed form
7764A25j59J59pk37j06R5L4Q1L6p1j33K59j5K00k37L69n49K26q0K65k5j23k06
7787i9K66k47j62L01j51j56K43L2j91J53L62j57k02m8K2qj86k4L07K2k23M49l21
7810a8J75j23o6j03m8K11m2q1M09n49K53m0L75l67j54K67k71J38n7J34J32l10
7832a35N7N6l41K57K7M3rj46J43j31J40J41k60M47j60N5k48O4l8J96J32m97J85
7855b2k3K15k39J41J50k3l37J41J48l36L20M6j47J2p2j5k4N0K36j69k18Q5J81
7878A00O0P6j26J9lJ01n3k8k65K19j67P2J57k68KL2M5n1K92o52N67O6j56q0r9
7903a40J07O8N6j00jk0RK44k24O7k35K67Q8k02O8l07L07k08L84j21k37K52L7k68
7927a09K55k05q5J18p2j6J21O1j24k87J54L43l28J7K01j67R4M6O3j33j02J88q0
$$ plain form
7950 -47 88 -119 -148 -103 -276 -67 99 201 -37 44 -72 246 -23 -41 95 87 -46 -148 31 38 -152 17 115
7973 115 -104 23 166 -103 21 -75 -138 161 -121 21 -14 -12 -89 -167 -131 113 135 -67 348 -103 -4 -3 60 32 -117
7998 -117 119 14 -139 127 -364 -56 -57 31 -41 37 51 -111 -28 13 127 -235 -46 -88 -150 68 45 208 -51 -218
8022 -218 219 37 71 -173 -64 42 -66 -241 56 16 128 59 -84 -63 374 -374 -17 46 123 -146 -8 -53
8044 -53 53 128 7 93 84 -66 -70 -57 -69 -33 -10 -11 -87 -118 -81 -156 217 205 -149 204 29 -24 179 -69 321 -96
8070 -96 -33 216 -195 22 -38 -168 -328 -239 -184 -29 143 196 -260 -64 -136 -206 -68 181 6 -141 -92 153 128
8093 128 9 47 97 6 160 51 337 35 -185 39 -95 -202 -70 -47 -216 168 198 -172 86 -200 52 46
8115 46 198 -338 138 79 176 188 -8 63 129 101 13 -158 -51 -198 -63 -169 -463 -100 -66 34 117 198 -60 -8
$$ packed form
7950d7J35k07k9M5j73K09J66J02k38Q1j16L18k69j8J36qj33j02J79Pj90J69R8
7973A15k19J27J43k69J24r6o3K99k82J42l5Kp7p8L6K44K2k02M15m51R9JO3k8j49
7998a17K36j05j53K66m91L08jQ8p2P8J4j62Q3M1J14l62J89m2o2K18k3J63k59j67
8022b18M37j82L4k44J09J06j08j75K97m0J12o9j43K1M37p48L57O3P7k69J38m5
8044e3J06P5j21Q6rj50mJ3j2L6K3jp6l1L7p5L73j2l54L53j75n3K03k48L90m17
8070i6O3K49m11K17o0j30j60Q9N5J55J72N3m56J96p2p0J38K49j75j47M9K45k5
8093A28j19L8N0r1J54j09K86l02k20K24j34j07J32K3j69L84L0l70K58k86K52o
8115D6J52n36M76n9R7J2j96P1O6k8q8j71J07j47J35j06k94L63L4J00Q3Q1k58N2
$$ plain form
8139 -8 -94 87 126 54 144 89 -78 -57 -147 -188 -27 -231 -82 22 37 182 -23 -43 -206 -66 -34 -58 -33 -1 60 -27
8165 -27 139 15 40 -138 45 64 -64 -59 245 61 -100 -205 -16 -139 -1 147 66 328 261 68 -49 -121 -115
8188 -115 -142 -236 285
$$ packed form
8139hq6J81L9p2R0n5j67K1r0m1J61k04J49J04J5J45k05k0j63J40L2k4K5L2O1q7
8165b7J66j24K5j78J83J9j28NL04j84j61j05J89j23J38J48q1K62o7j93j17p2O
8188a15k7r4N21
8191B85
$$ Imaginary data points
##PAGE= N=2
##DATA TABLE= (X++(I..I)), XYDATA
$$ plain form
0 0 0 0 0 0 0 0 0 0 0 0 0 0 0 0 8 -8 8 -8 8 -16 16 -16 24 -24 32 -38 40 -48 56 -64 72 -83 95 -107 119 -135
36 -135 151 -169 188 -210 234 -259 287 -317 351 -388 428 -469 518 -571 630 -694 765 -845 935
55 935 -1037 1154 -1290 1445 -1636 1864 -2150 2516 -3004 3690 -4721 6442 -9825 18903 -92961
70 -92961 -228791 66548 94422 -98970 -104618 -3770 -10382 -31247 -66144 -84929 -22400 17895
82 17895 -64525 -98764 -42236 -10084 -25044 -62027 -67728 3253 -8442 -88703 -35478 39551
94 39551 -29917 -62518 12193 14630 -43223 -12079 23840 -8810 1530 21885 -18896 -2475
106 -2475 49404 16997 -18269 21576 50881 20520 -637 25488 42171 33155 27266 22994 22994 28332
120 28332 32505 34479 16709 14464 42770 25778 -6624 18200 37350 16475 9858 12797 873
$$ packed form
0@%%%%%%%%%%%%%%Qj6J6j6J6k4L2l2M0m8N6p0P8q8J04j20J36j55J78k02K26k54
36a35K86l20L57l98M44m93N46o04O68p39Q16q97R87j089J201j324J459j610J780
55I35j972K191k444K735l081L500m014M666n520O694q411J1163j6267K8728j11864
70i2961j35830K95339K7874j93392n648J00848o612k0865l4897j8785O2529M0295
82A7895q2420l4239N6528L2152j4960l6983n701P0981j1695q0261N3225P5029
94C9551o9468l2601P4711K437n7853L1144L5919l2650J0340K0355m0781J6421
106b475N1879l2407l5266L9845K9305l0361k1157K6125J6683r016n889m272%N338
120B8332M173J974j7770k245K8306j6992l2402K4824J9150k0875o617K939j1924
$$ plain form
133 873 5272 30229 14914 -18837 2266 27343 -1133 -26105 -5167 27609 6791 -41959 -19102
146 -19102 19937 -9105 -27442 -4991 -4876 -14786 -11529 -18786 -17964 7786 -448 -35747 -13890 11049
160 11049 -18304 -19219 4191 -7360 -13230 -10875 -14236 1304 3623 -17716 -8857 10618 -7258
173 -7258 -16484 8186 6464 -9273 6119 1573 -13285 13283 11839 -19037 2321 21897 -5938
186 -5938 -13160 7532 7778 335 3381 -2656 -2913 13353 2428 -13545 9684 14989 -5911 -2473
200 -2473 1275 -1406 9105 4069 -10771 1211 12117 -7840 -13354 11887 8470 -11627 -488
213 -488 3751 -5915 3016 4098 -2112 5134 944 -7570 1894 9305 -337 -3277 4910 1053 -4153
228 -4153 3952 2088 78 8090 -713 -5919 6592 5722 -115 4526 3541 -671 2447 6211 -230
$$ packed form
133H73M399K4957j5315l3751K1103K5077k8476k4972K0938L2776k0818m8750K2857
146a9102L9039k9042j8337K2451J15r910L257p257Q22K5750q234l5299K1857K4939
160A1049k9353r15K3410j1551n870K355l361J5540K319k1339Q859J9475j7876
173g258r226K4670j722j5737J5392m546j4858K6568j444l0876K1358J9576k7835
186e938p222K0692K46p443L046o037k57J6266j0925j5973K3229N305k0900L438
200b473L748k681J0511n036j4840J1982J0906j9957n514K5241l417k0097J1139
213d88M239r666Q931J082o210P246m190q514R464P411r642k940Q187l857n206
228d153Q105j864k010Q012q803n206J2511q70n837M641r85m212L118L764o441
$$ plain form
243 -230 -2318 8323 5343 -6097 -2399 3353 3595 1053 -3120 -211 2027 -857 -602 -2079 -10
258 -10 3746 -2360 -4900 -1334 -412 -572 -3090 -3063 -1238 -4049 -4451 -3331 -3032 -1030 -4290 -3918 -2295
275 -2295 -6716 -2327 1188 -5683 -2530 729 -5614 -4860 1599 1321 -5377 -3222 2759 -3481 -3832 2965
291 2965 -853 -266 2495 -3554 -1448 4290 2330 428 1123 3222 2078 503 2565 2978 4629 3531
307 3531 -2227 3019 7011 -1278 2249 7290 1173 387 3774 3604 1480 4073 5877 -563 1126 6112
323 6112 -33 -32 5914 901 -713 1800 -256 129 1032 1011 -862 -1332 834 -1786 -1803 1509 -1294 -1311
341 -1311 -446 -4732 -1020 1132 -4590 -2447 329 -3528 -5250 -2364 -6 -4573 -3729 300 -5350 -4962
357 -4962 1002 -3172 -3876 207 -2512 -4280 -2002 -587 -1605 -2083 -372 -2231 -2983 491 -1534 -1438
$$ packed form
243b30k088J0641k980j1440L698N752K42k542m173K909K238k884K55j477K069
258a0L756o106k540L566R22j60k518K7J825k811m02J120K99K002l260L72J623
275b295m421M389L515o871L153L259o343P54O459k78o698K155N981o240l51O797
291B965l818N87K761o049K106N738j960j902O95K099j144j575K062M13J651j098
307C531n758N246L992q289L527N041o117p86L387j70k124K593J804o440J689M986
323F112o145JN946n013j614K513k056L85R03k1j873m70K166k620j7L312k803j7
341a311Q65m286L712K152n722K143K776l857j722K886K358m567Q44M029n650L88
357d962N964m174p04M083k719j768K278J415j018m78J711j859p52L474k025R6
$$ plain form
373 -1438 1535 -1341 -959 1339 -868 1097 2472 762 326 1098 2750 759 653 4797 1590 36
389 36 3452 921 1516 4668 1610 1099 3279 3252 1412 1025 5190 3350 -210 3283 2607 1006 3548
406 3548 1788 865 2989 1098 -343 964 1949 676 -694 1700 199 -1998 1475 247 -2132 1850
422 1850 -842 -3406 317 55 -2919 -1783 -325 -2321 -4109 -591 -1816 -4220 594 -1977 -5451
437 -5451 206 -1005 -4691 -431 -450 -3880 -2307 -123 -2746 -2885 1036 -1063 -3330 532 -2075 -2888
453 -2888 3219 -755 -4072 2342 1073 -2476 526 1242 76 1776 2127 -2647 155 6704 95 -3637
469 -3637 4489 3284 -529 1838 227 1682 5068 595 -1711 3009 4194 96 153 3494 498 567
485 567 3394 -904 -86 4107 -618 -761 1856 -1500 -251 2941 -31 -2716 -97 1808 -922 -1971
$$ packed form
373a438K973k876L82K298k207J965J375j710m36P72J652j991j06M144l207j554
389C6L416k531N95L152l058n11K180k7j840l87M165j840l560L493o76j601K542
406C548j760r23K124j891j441J307R85j273j370K394j501k197L473j228k379L982
422A850k692k564L723k62k974J136J458j996j788L518j225k404M814k571l474
437e451N657j211l686M260j9l430J573K184k623j39L921k099k267L862k607q13
453b888O107l974l317O414j269l549L002P16j166J700L51m774K802O549o609l732
469c637Q126j205l813K367j611J455L386m473k306M720J185m098N7L341k996O9
485E67K827m298Q18M193m725j43K617l356J249L192k972k685K619J905k730j049
$$ plain form
501 -1971 -548 -1570 833 354 -4844 -836 1855 -1943 -1350 -1496 -2401 955 -570 -3935 -265 1785
517 1785 -2388 -3141 1799 94 -3511 1606 1567 -2280 48 -702 539 3924 -2205 -3330 4553 3399
533 3399 -2097 -818 1647 2352 3250 -327 -4506 3831 8579 -4300 -4394 7508 3354 -2474 672 308
549 308 2589 4134 -2654 -2838 4901 2822 -4472 233 3638 -2244 -338 2086 -3782 386 2765 -4765
565 -4765 -601 3069 -5228 -2673 4189 -2554 -6125 1648 917 -5411 -1371 209 -3930 1403 5
580 5 -8824 -136 5873 -4302 -5671 816 1012 240 -1904 -4281 1340 5541 -3378 -5971 5418 3133
596 3133 -4896 2229 3161 -3688 3131 3851 -3043 1486 5053 -155 448 4118 715 -247 5381 2959
612 2959 -1322 1767 2129 3346 4781 -3452 -2222 9594 2906 -6378 1271 5622 519 -369 -128 -1181
$$ packed form
501a971J423j022K403m79n198M008K691l798N93j46r05L356j525l365L670K050
517A785m173p53M940j705l605N117l9l847K328p50J241L385o129j125P883j154
533C399n496J279K465P05Q98l577m179Q337M748j2879r4J1902m154n828L146l64
549C08K281J545o788j84P739k079p294M705L405n882J906K424n868M168K379p530
565d765M164L670q297K555O862o743l571P773p31o328M040J580m139N333j398
580Eq829Q688O009j0175j369O487J96p72k144k377N621M201q919k593J1389k285
596C133q029P125R32o849O819P20o894M529L567n208O03L670l403r62N628k422
612B959m281L089L62J217J435q233J230J1816o688r284P649M351n103q88K41j053
$$ plain form
628 -1181 2407 3987 -4347 -3230 4476 -196 -2885 -206 -2697 -701 2116 -3500 -3645 433 -1859
643 -1859 -1986 451 -3293 -5018 1948 1653 -6071 -3552 1278 -1308 197 -1904 -6607 1388 4928 -4653
659 -4653 -5385 1599 2507 -305 -2475 -2440 1708 4998 -1655 -5098 3300 4374 -1409 841 -191 -982
675 -982 5480 2161 -3873 1928 5361 30 -373 3146 603 229 4854 834 -2182 3232 2318 -69
691 -69 2791 -881 -1092 4536 980 -4043 1439 3079 -1503 14 806 -2679 249 4126 -3309 -4151
707 -4151 2833 -251 -2347 1045 -2694 -2124 2908 -1148 -4376 -528 1090 -1910 -1073 -772 -3099 493
723 493 1538 -4396 -1844 3019 -1417 -1688 275 -1780 163 2444 -1972 -2458 1800 1375 -1406 -6
739 -6 965 -967 1707 1684 -2123 1148 3145 -531 287 1407 228 1107 1003 -109 840 1822 615 -693
$$ packed form
628a181L588J580q334J117P706m672k689K679k491J996K817n616j45M078k292
643a859j27K437l744j725O966k95p724K519M830k586J505k101m703P995L540r581
659d653p32O984R08k812k170L5M148L290o653l443Q398J074n783K250j032p91
675i82O462l319o034N801L433n331m03L519k543l74M625m020l016N414r14k387
691f9K860l672k11N628l556n023N482J640m582J517P92l485K928L877p435q42
707d151O984l084k096L392l739N70N032m056l228L848J618l000Q37L01k327L592
723D93J045n934K552M863m436k71J963k055J943K281m416m86M258m25k781J400
739fR71j932K674k3l807L271J997l676Q18J120j179Q79j04j112R49R82j207j308
$$ plain form
757 -693 1670 1381 -917 1167 990 -876 1550 918 -740 866 667 -537 560 222 -269 166 301
774 301 -591 -361 934 -801 -1188 836 -668 -1127 792 -842 -1077 442 -593 -541 69 -1161 -1045 375
792 375 320 -1597 -620 1078 -555 -434 326 -1435 298 1394 -1689 -456 1213 -677 -397 507 -125
809 -125 -115 576 -213 -642 764 843 -1125 426 507 -1250 1198 890 -1214 238 733 -199 218 103 -49
828 -49 -46 884 -117 -1350 767 716 -1182 453 189 -685 310 -26 -226 368 -41 -7 -397 -152 -41 -67 521
849 521 -72 -528 749 340 -586 548 -176 -626 424 67 -514 -71 209 477 -633 540 524 -544 722
868 722 536 -411 878 227 -346 552 461 171 102 -15 602 -107 114 791 -94 497 193 -165 1002 164
888 164 -303 746 100 325 -227 -186 656 -208 -112 269 -427 84 -74 -886 324 277 -471 -408 -220 47 -670
$$ packed form
757f93K363k89k298K084j77j866K426o32j658J606j99j204J097l38m91M35J35
774C01q92K30J295j735l87K024j504m59J919j634k35J519j035N2O10j230J16J420
792C75n5j917R77J698j633J21P60j761J733J096l083J233J669j890K80R04o32
809a25J0O91p89m29J406P9j968J551Q1j757K448l08k104J452M95r32M17j15j52
828d9LR30j001j233K117n1j898J635k64q74R95l36k00N94m09L4l90K45J11k6N88
849E21n93m56J277m09r26J134p24m50J050l57n81M43K80K68j110J173j6j068J266
868G22j86r47J289o51n73Q98r1k90o9j17O17p09K21O77q85N91l04l58J167q38
888A64m67J049o46K25n52M1Q42q64R6L81o96N11j58q12J210m7p48O3J88K67p17
$$ plain form
909 -670 -1048 129 -305 -651 -99 -912 -289 -162 -1114 -245 -221 -710 -457 -690 -77 -405 -716 88 -481 -410 592
930 592 -713 -220 272 -503 489 522 -196 372 92 347 444 77 1037 143 134 1045 56 300 1168 284 753
951 753 914 372 885 672 655 412 761 941 285 456 1409 21 321 982 -342 234 578 -139 -29 293
971 293 122 -64 -259 -20 -515 -225 274 -1083 -212 447 -1448 -611 -169 -1180 -472 -646 -1157 -548 -367
990 -367 -817 -1181 -521 -497 -1169 -700 -563 -1312 -319 -375 -1365 -88 -452 -1351 -461 -430 -362 -364 -358 201 -147 -160 150
1013 150 -42 606 -27 13 1420 545 -50 862 283 509 1104 316 438 1220 1092 618 252 1338 790 1159
1033 1159 1164 -2 932 1761 251 459 1360 26 903 1269 -221 -95 1007 352 -310 -16 393 44 546
1052 546 255 -1276 878 677 -1896 -785 323 -457 -295 -819 -1170 294 505 -1747 -1644 538 -210
$$ packed form
909f70l78J177m34l46N52q13O23J27r52Q69K4m89K53k33O13l28l11Q04n69P1J002
930E92j305M93M92p75R92L3p18N68k80K55R7l67R60q94rR11r89K44Q68q84M69
951G53J61n42N13k13j7k43L49J80o56J71R53j388L00O61j324N76L44p17J10L22
971B93j71j86j95K39m95K90M99j357Q71O59j895Q37M42j011P08j74n11O09J81
990c67m50l64O60K4o72M69J37p49R93n6r90J277l64q99Q90L1O8kON59l48j3L10
1013A50j92O48o33M0J407q75n95R12n79K26N95p88J22P82j28m74l66J086n48L69
1033A159Nj166R34Q29j510K08R01j334Q77L66j490J26J102o55o62K94M09l49N02
1052E46k91j531K154k01k573J111J108p80J62n24l51J464K11k252J03K182p48
$$ plain form
1069 -210 -1950 -139 -637 -2056 418 -529 -2158 113 92 -1807 -400 153 -1014 -1051 474 -903 -1249
1086 -1249 510 -593 -428 559 -1093 -709 2046 -320 -1749 1173 886 -590 288 121 -310 1142 1407
1103 1407 -1155 220 2597 189 -420 1693 169 642 2000 -199 103 1865 359 407 1202 221 -44
1120 -44 1813 1094 -1144 565 2171 -605 410 970 -1262 1143 1913 -1517 -1149 1776 756 -992
1136 -992 -767 349 550 299 -1045 -1357 685 365 -1688 99 158 -1405 646 -292 -2100 72 673
1153 673 -1419 -1417 105 -840 -976 389 -932 -1722 1056 129 -1204 -206 -941 -755 1078 -1191 -2429 939
1171 939 823 -1416 -677 127 -120 77 159 -1484 17 2090 -984 -1044 1500 -119 -70 1469 -762 -407
1189 -407 1762 541 -682 274 1058 40 915 797 -1166 1003 1864 -763 9 1536 -238 808 1655
$$ packed form
1069b10j740J811m98j419K474r47j629K271k1j899J407N53j167l7J525j377l46
1086a249J759j103J65R87j652L84K755k366j429K922k87j476Q78j67m31J452K65
1103A407k562J375K377k408o09K113j524M73J358k199L02J762j506M8P95r81k65
1120d4J857p19k238J709J606k776J015N60k232K405P70l430L68K925j020j748
1136i92K25J116K01k51j344l12K042l20k053J787N9j563K051r38j808K172O01
1153F73k092KJ522r45j36J365j321p90K778r27j333R98p35J86J833k269j238L368
1171I39j16k239P39Q04k47J97Q2j643J501K073l074o0K544j619M9J539k231L55
1189d07K169j221j223R56P84j018Q75j18j963K169Q61k627P72J527j774J046Q47
$$ plain form
1206 1655 -1236 193 2441 462 -923 681 1167 -236 469 351 -1047 1474 1263 -1581 13 1013
1222 1013 -363 484 161 -1205 440 1557 -644 -1262 877 230 -835 640 -611 -1315 1309 267
1238 267 -2343 357 492 -949 -383 -334 -895 122 588 -1160 -940 610 -255 -1139 47 -1030 -721 1096
1256 1096 -821 -1947 731 -155 -733 -1 -312 -789 404 462 -1165 -383 915 -126 -324 391 -723
1273 -723 75 924 -1096 -282 918 304 30 439 -614 153 968 165 -787 380 749 -377 449 496 -461
1292 -461 1258 889 -918 617 1231 182 183 185 -89 590 854 89 -618 753 728 -474 493 159 -126 1069
1312 1069 -97 -624 411 651 -591 375 385 -422 83 370 -555 -686 383 -367 -612 583 -580 -814
1330 -814 421 -379 -748 259 31 -820 -272 -249 -647 -407 42 -1031 -360 369 -686 -948 363 -805
$$ packed form
1206A655k891J429K248j979j385J604M86j403P05j18j398K521k11k844J594J000
1222A013j376Q47l23j366J645J117k201o18K139o47j065J475j251p04K624j042
1238B67k610K700J35j441N66M9n61J017M66j748K20J550q65q84J186j077L09J817
1256A096j917j126K678q86n78P32l11m77J193N8j627P82J298j041j98P15j114
1273g23P98Q49k020Q14J200o14k74M09j053P67Q15q03r52J167L69j126Q26M7r57
1292d61J719l69j807J535O14j049JKk74O79K64p65p07J371k5j202R67l34k85J195
1312A069j166n27J035K40j242R66J0q07N05K87r25j31J069p50k45J195j163k34
1330h14J235q00l69J007k28q51N48K3l98K40M49j073O71P29j055k62J311j168
$$ plain form
1348 -805 -743 338 -395 -238 329 -99 -614 28 139 -324 -316 284 -86 -247 446 -314 -180 396 -234 284 720
1369 720 -42 289 552 100 -144 388 380 -72 394 631 -168 499 708 -97 550 531 260 724 121 273 402
1390 402 20 324 190 427 287 -107 97 257 -155 309 408 63 125 65 -161 59 -183 -29 114 -317 13
1411 13 -295 -380 -119 -327 6 -214 -289 -155 -553 -308 74 -564 -462 -606 -762 -351 -560 -141 -324 -291 -169
1432 -169 -190 -383 -357 -196 -425 66 -373 103 -196 -272 202 191 -346 -232 86 -55 32 13 -5 -265 135 320
1454 320 30 24 109 -113 494 248 -141 529 98 188 301 180 356 162 239 265 186 618 427 -78 537 516 53
1477 53 504 -86 -31 533 44 67 244 333 71 -53 580 45 -211 177 387 -293 133 -239 111 -106 -389
1498 -389 238 8 -92 199 -39 79 -146 -8 281 -200 -172 51 -198 -360 -220 -453 62 -183 -182 -86 -411
$$ packed form
1348h05O2J081p33J57N67m28n15O42J11m63QO00l70j61O93p60J34N76o30N18M36
1369G20p62L31K63m52k44N32qm52M66K37p99O67K09q05O47j9k71M64o03J52J29
1390D02l82L04j34K37j40l94K04J60m12M64R9l45O2o0k26K20k42J54J43m31L30
1411A3l08q5K61k08L33k20p5J34l98K45L82o38J02j44j56M11k09M19j83L3J22
1432a69k1j93K6J61k29M91m39M76k99p6M74j1n37J14L18j41Q7j9j8k60M00J85
1454C20k90oQ5k22O07k46l89O70m31R0J13j21J76j94P7K6p9M32j91n05O15k1m63
1477E3M51n90N5N64m89K3J77Q9k62j24O33n35k56L88K10o80M26l72L50k17k83
1498c89O27k30j00K91k38J18k25J38K89m81K8K23k49j62J40k33N15k45JR6l25
$$ plain form
1519 -411 -416 -397 -434 69 5 -191 195 -209 -174 169 -188 -187 -94 -279 -74 -188 -212 305 70 -251 -185 59 174 -312
1543 -312 -80 42 -82 319 13 -140 511 303 -245 126 54 177 151 340 141 196 181 392 154 459 -50
1564 -50 -90 577 315 167 622 18 117 368 -267 146 522 317 -33 176 479 341 -251 394 -32 217 315
1585 315 -294 189 136 -460 -52 297 -344 -363 126 -266 -334 -170 303 -413 -190 -24 -329 122 -92 -681 -451
1606 -451 284 -445 -407 -134 24 47 -117 -466 -552 58 123 -713 0 -6 -533 93 304 -559 69 -72 -192 146
1628 146 119 106 -118 333 -158 -184 752 400 -361 379 332 79 414 8 15 643 278 -337 -2 303 141 112
1650 112 271 -25 323 653 -235 1 809 21 -266 346 -14 -75 451 -88 26 253 81 -124 135 104 -218
1671 -218 84 486 -546 -86 260 -485 299 -9 -617 -23 211 -381 -474 427 95 -191 -101 -262 -650 461
$$ packed form
1519d11nJ9l7N03o4j96L86m04L5L43l57JR3j85K05j14k4N17k35l21O6K44J15m86
1543c12K32J22j24M01l06j53O51k08n48L71p2J23k6J89j99N5j5K11k38L05n09
1564e0m0O67k62j48M55o04R9K51o35M13L76k05l50K09L03j38n92O45m26K49R8
1585C15o09M83n3n96M08L49o41j9M89l92o8J64M73p16K23J66l05M51k14n89K30
1606d51P35p29L8K73J58K3j64l49q6O10O5q36P13on27O26K11q63O28j41j20L38
1628A46k7j3k24M51m91k6R36l52p61P40m7k53L35m06PO28l65o15L35L05j62k9
1650A12J59k96L48L30q88K36Q08p88k87O12l60o1N26n39J14K27j72k05K59l1l22
1671b18L02M02j032M60L46p45P84l08o08N94K34n92r3R01l32k86R0j61l88J111
$$ plain form
1691 461 78 -921 -36 311 -528 -330 -172 -212 312 175 -675 -261 504 -67 -484 114 -213 -411 464 11
1711 11 -897 661 96 -514 57 -195 -412 370 344 -674 -178 298 -160 -244 285 181 134 588 -475 -330
1731 -330 758 298 -295 207 -294 -131 454 -37 -530 409 609 -330 -172 518 21 121 665 -681 -197
1750 -197 693 -160 -193 367 66 249 570 44 -767 284 591 -493 -148 429 24 487 591 -808 330
1769 330 400 -141 5 218 -25 233 136 -286 -223 441 -7 -670 324 136 -464 329 -240 -684 103 149 -659
1790 -659 -68 271 -235 -307 -10 -475 -338 239 -354 -636 245 -224 -213 241 -452 -661 267 -141 -451 -21 223
1811 223 80 -214 -94 -332 -42 423 -310 -329 826 -131 -150 419 -322 -111 560 -159 -356 258 -122 157
1831 157 188 241 -225 502 335 -111 272 527 -57 27 548 -34 276 503 -49 112 454 63 3 234 122
$$ packed form
1691D61l83r99Q85L47q39J98J58m0N24j37q50M14P65n71m17N98l27j98Q75m53
1711A1r08J558n65o10N71k52k17P82k6j018M96M76m58q4N29j04m7M54j063J45
1731c30J088m60n93N02n01J63N85m91m93R39K00r39J58O90m97J00N44j346M84
1750a97Q90q53l3N60l01J83L21n26q11J051L07j084L45N77m05M63J04j399J138
1769C30P0n41J46K13k43K58r7m22O3O64m48o63R94j88o00P93n69m44P87M6q08
1790f59N91L39n06p2K97m65J37N77n93k82Q81m69J1M54o93k09R28m08l10M30K44
1811B23j43k94J20k38K90M65p33j9J155r57j9N69p41K11O71p19j97O14l80K79
1831A57L1N3m66P27j67m46L83K55n84Q4N21n82L10K27n52J61L42l91o0K31j12
$$ plain form
1852 122 -193 152 3 -658 272 365 -253 273 153 -292 260 324 -327 -488 477 -18 -317 -13 -116 -204 163
1873 163 -322 -309 158 -66 -457 -79 -176 -367 -15 -215 -390 -328 131 -209 -459 -95 -303 65 85 -334 -491
1894 -491 324 -278 -219 159 -123 -109 -111 -71 -339 49 193 -130 241 197 108 111 301 -145 57 576 140 139 282 10
1918 10 273 86 275 18 198 357 -159 387 320 -66 218 282 5 363 269 114 317 126 8 50 -115 335
1940 335 132 -56 -48 107 166 -168 -233 -80 -241 26 149 86 -191 27 12 -118 -227 -207 -222 -243 -173 174 23
1963 23 -71 -74 -409 -139 -335 -239 64 -154 -293 63 -49 86 -243 -247 -209 -197 -69 -254 -101 168 -238 334 265
1986 265 -114 -218 161 -268 -90 -21 104 -88 -117 130 -73 -74 207 258 297 365 -186 70 148 -60 110 244 81
2009 81 252 61 180 2 -104 167 136 -148 -10 196 -116 447 -52 410 87 59 252 57 -79 89 -175
$$ packed form
1852A22l15L45j49o61R30R3o18N26j20m45N52O4o51j61R65m95k99L04j03q8L67
1873A63m85J3M67k24l91L78r7j91L52k00j75O2M59l40k50L64k08L68K0m19j57
1894d91Q15o02N9L78k82J4kM0k68L88J44l23L71m4q9LJ90m46K02N19m36jJ43k72
1918A0K63j87J89k57J80J59n16N46o7l86K84O4k77L58r4j55K03j91j18M2j65M50
1940C35k03j88QJ55N9l34o5J53j61K67J23o3k77K18j5j30j09K0j5k1P0L47j51
1963B3r4ll35K70j96R6L03k18j39L56j12J35l29mL8J2J28j85J53K69m06N72o9
1986B65l79j04L79m29J78O9J25j92k9K47k03jK81N1L9O8n51K56P8k08J70J34j63
2009H1J71j91J19j78j06K71l1k84J38K06l12N63m99M62l23k8J93j95j36J68k64
$$ plain form
2030 -175 -34 -320 107 219 -156 171 162 -140 -129 -35 -29 174 -179 161 69 -287 104 -249 -181 27 -279 -262 11
2053 11 -267 -169 -119 -277 -153 -394 13 56 -160 25 -200 -561 -180 -269 -236 -233 -239 -103 81 -276 -201 -3 -263 -312
2077 -312 -190 225 111 -288 120 156 -80 380 41 28 292 323 251 -81 67 81 -6 151 120 -210 303 211 197
2100 197 138 227 328 131 107 260 35 117 274 44 224 174 7 380 21 -237 165 188 -4 229 182 306
2122 306 84 -77 11 102 288 -337 -47 116 -184 -229 185 -249 185 204 -274 -12 -169 3 -429 -125 -10
2143 -10 150 -293 84 -247 -174 67 -268 -90 -106 -261 -2 -153 -310 143 14 108 -248 -191 -121 -118 98 -86 43
2166 43 55 -8 -196 -184 -88 -104 356 60 -40 152 117 145 -147 198 435 -95 248 129 -55 520 171 36 307
2189 307 -176 41 235 97 37 196 543 -80 152 126 114 203 195 -19 36 424 7 211 32 314 92 284
$$ packed form
2030a75J41k86M27J12l75L27rl02J1R4OK03l53L40r2l56L91l53O8K08l06J7K73
2053A1k78R8N0j58J24k41M07M3k16J85k25l61L81q9L3LoJ36J84l57P5J98k60m9
2077c12J22M15j14l99M08L6k36M60l39j3K64L1p2l32J48J4q7J57l1l30N13r2j4
2100A97n9Q9J01j97k4J53k25Q2J57k30J80n0j67L73l59k58M02K3j92K33m7J24
2122C06k22j61Q8R1J86o25K90J63l00m5M14m34M34J9m78K62j57J72m32L04J15
2143a0J60m43L77l31P3K41l35J78j6j55K59j51j57M53j29R4l56N7P0LK16j84J29
2166D3J2o3j88J2R6j6M60k96j00J92l5K8k92L45K37n30L43j19j84N75l49j35K71
2189C07m83K17J94j38o0J59L47o23K32k6j2Q9qk14N5L88m17K04j79K82k22J92
$$ plain form
2211 284 -80 -11 118 192 -100 -52 341 -115 104 151 52 -191 -16 -192 -179 -101 -72 -163 90 -276 -112 50 45 -284
2235 -284 174 222 -617 32 206 -238 -165 -41 -540 -54 69 18 -193 -96 -204 -239 8 51 -238 51 173 -123
2257 -123 195 8 -158 74 77 -214 297 74 -209 134 32 125 9 210 37 34 396 138 -67 95 200 -98
2279 -98 265 133 -69 383 293 -19 -31 355 180 320 163 -157 161 545 24 117 155 -260 259 76 -111 70
2301 70 295 -36 -59 -119 -31 78 219 -59 -254 4 313 -157 27 36 -225 -213 -281 -197 -226 -3 146 26 -64 176
2325 176 -343 -170 -127 -458 84 -8 -346 -230 -92 15 135 -62 -357 99 -34 -226 -62 -127 -141 -223 -18 -164
2347 -164 -183 136 25 -323 359 -145 -29 224 111 36 222 334 -368 295 295 82 54 125 149 54 513 57 -255
2370 -255 413 161 236 161 68 102 520 544 -65 118 357 57 108 98 -65 142 255 -63 -67 331 -105 4 72
$$ packed form
2211B84l64O9J29P4k92M8L93m56K19M7r9k43J75j76J3P8K9r1K53l66J64J62nl29
2235b84M58M8q39O49J74m44P3J24m99M86J23n1k11R7j08l5K47M3k89K89J22k96
2257a23L18j87j66K32Lk91N11k23k83L43j02R3j16K01j73lL62k58k05J62J05k98
2279i8L63j32k02M52r0l12j2L86j75J40j57l20L18L84n21R3L8m15N19j83j87J81
2301G0K25l31k3o0Q8J09J41k78j95K58L09m70J84Rk61J2o8Q4k9K23J49j20r0K40
2325A76n19J73M3l31N42r2l38J16J38J07J20j97k95M56j33j92J64o5j4q2K05j46
2347a64j9L19j11l48O82n04J16K53j13p5J86J12p02O63%k13k8P1K4r5M59m56l12
2370b55O68k52P5p5r3L4M18K4o09J83K39l00N1j0j63K07J13l18mL98m36J09O8
$$ plain form
2393 72 -215 -240 220 84 -13 16 29 -126 -69 62 -101 54 212 -268 -90 -289 103 61 170 -144 -32 85
2415 85 -66 99 95 -20 105 -228 -96 -224 -53 -5 -328 191 115 -78 -53 -422 -260 -31 83 -177 -502 -32
2437 -32 -75 -429 -46 -199 -274 20 50 59 99 45 -131 -19 216 -133 173 130 -240 185 71 -23 -63 461 -58 66
2461 66 107 -6 132 282 -114 175 99 117 226 220 -26 145 159 287 -187 231 25 -156 282 116 -213 148
2483 148 341 -8 -9 212 214 -21 88 -48 -276 111 -16 -245 151 -47 -261 -373 32 87 -87 -33 -125 -325
2505 -325 -61 -207 -164 -46 44 -377 -140 -100 -18 110 -146 -120 -233 64 100 -132 -111 -137 -107 -126 -54 23 -36 -14 77
2530 77 69 -182 -144 32 -225 211 206 146 -79 2 137 40 0 12 -71 87 133 -109 47 39 -115 39 155 -194 132
2555 132 -53 -66 50 -77 143 179 -183 147 144 -68 157 9 196 131 -94 -90 229 110 131 273 -49 -108 -318
$$ packed form
2393G2k87k5M60j36r7K9J3j55N7J31j63J55J58m80J78j99L92m2J09l14J12J17
2415H5j51J65mj15J25l33J32j28J71M8l23N19p6j93K5l69J62K29J14k60l25M70
2437c2m3l54L83j53p5K94L0RM0n4j76J12K35l49L06m3l70M25j14r4m0N24n19J24
2461F6M1j13J38J50l96K89p6J8J09ok46J71J4J28m74M18k06j81M38j66l29L61
2483A48J93l49jK21Kk35J09j36k28L87j27k29L96j98k14j12M05N5j74N4r2k00
2505c25K64j46M3J18R0m21K37M0Q2J28k56K6j13K97L6k32K1k6L0j9P2P7n9K2R1
2530G7qk51L8J76k57M36no0k25Q1J35r7m0J2q3J58M6k42J56qj54J54J16l49L26
2555A32j85j3J16j27K20L6l62L30lk12K25j48J87o5k25ML19j19K1J42l22n9k10
$$ plain form
2578 -318 -143 -31 -89 -97 -140 -166 -230 -276 305 -26 4 12 -48 87 -70 -270 -24 79 -363 -90 190 212 305 -142
2602 -142 -259 -120 -40 43 -48 -296 89 -176 -124 -125 45 -34 -247 85 -153 -35 -18 78 -161 59 -182 -138 38
2625 38 -113 254 3 52 181 34 154 -146 276 121 160 150 97 144 55 131 56 327 332 159 303 57 -128 44
2649 44 -78 40 268 -36 55 22 -131 -129 59 25 -195 237 365 36 -113 49 124 -15 -63 -20 63 -168 57
2672 57 -151 45 152 -365 -109 170 -171 -259 -48 49 21 123 -11 109 45 -180 -142 22 -117 14 40 -26 -297
2695 -297 -191 291 -284 151 114 -136 -278 -68 -95 -127 -135 -265 -271 -140 50 -26 -174 58 -243 197 130 -170 -11
2718 -11 48 -68 109 -149 -44 -14 65 -273 87 83 175 28 53 236 160 102 80 51 20 234 -4 87 315 -40 -179
2743 -179 168 299 -166 15 141 -216 324 -107 -57 167 272 71 84 131 138 -108 -77 208 -114 64 -3 -221
$$ packed form
2578c18J75J12n8qm3k6o4m6N81l31L0Qo0J35j57k00K46J03m42K73K80K2R3m47
2602a42j17J39Q0Q3r1k48L85k65N2jJ70p9k13L32k38J18J7R6k39K20k41M4J76
2625C8j51L67k51M9J29j47J20l00M22j55L9j0n3M7q9P6p5K71Nj73J44k46j85J72
2649D4j22J18K28l04R1l3j53KJ88l4k20M32J28l29j49J62P5j39m8M3Q3k31K25
2672E7k08J96J07n17K56K79l41q8K11R7k8J02j34J20o4k25L8J64j39J31K6o6k71
2695b97J06M82n75M35l7k50j42K10k7l2qj30oJ31J90p6j48K32l01M40o7l00J59
2718a1N9j16J77k58J05L0P9l38L60mR2j47K5J83p6n8k2k9l1K14k38R1K28l55j39
2743a79L47J31m65J81J26l57N40m31N0K24J05k01J3M7Pk46L1K85l22J78o7k18
$$ plain form
2765 -221 226 -125 -161 -142 -47 -108 5 -205 -162 -104 119 75 32 -40 121 -33 -33 -77 -205 -81 -214 -108 91 -145
2789 -145 -67 -23 -164 76 179 73 -233 -85 -111 201 -207 33 -92 28 -56 13 -269 46 139 -14 126 -134
2811 -134 258 -125 -151 -310 42 177 334 84 -310 -111 23 247 -50 186 -2 96 269 80 42 -28 -60 -69
2833 -69 220 130 203 53 181 196 -57 416 264 -317 188 23 -46 344 -25 -304 -185 12 -137 -80 -34 7 104
2856 104 153 11 126 50 -323 54 -112 110 -181 -269 -47 -241 -87 -33 -170 93 184 -238 -169 71 -204 59
2878 59 -35 -30 1 111 -60 -248 121 -9 -191 -6 84 -5 -14 -103 201 -3 85 -46 54 -245 -47 6 293 -221
2902 -221 13 -27 -175 210 -10 272 104 165 121 -168 23 44 126 81 163 -70 241 -14 -85 -170 104 -11 -14 -46
2926 -46 -5 176 165 55 99 373 214 99 287 -105 -70 -113 -209 42 -194 89 -122 -26 -58 -107 -87 49 -226 116
$$ packed form
2765b21M47l51l6J9R5o1J13k10M3N8K23m4m3p2J61j54%m4j28J24j33J06J99k36
2789a45P8M4j41K40J03j06l06J48k6L12m08K40j25J20q4O9k82L15R3j53J40k60
2811a34L92l83k6j59L52J35J57k50l94J99J34K24k97K36j88R8J73j89l8p0l2r
2833f9K89r0P3j50J28J5k53M73j52n81N05j65o9L90l69k79J19J97j49N7M6M1R7
2856A04M9j42J15p6l73L77j66K22k91q8K22j94J54N4j37K63R1m22O9K40k75K63
2878E9r4NL1J10j71j88L69j30j82J85R0q9rq9L04k04Q8j31J00k99J98N3K87n14
2902b21K34m0j48L85k20K82j68O1m4k89J91K1Q2m5Q2k33L11k55p1q5K74j15ll2
2926d6M1J81j1j10M4K74j59j15J88l92L5m3r6K51k36K83k11R6l2m9K0J36k75L42
$$ plain form
2950 116 -34 17 140 -207 -53 50 -79 -461 -111 -57 -6 148 47 311 96 -8 10 -67 -6 -19 -134 -2
2972 -2 -34 -29 -167 155 174 98 10 -104 -32 135 103 -91 -72 36 84 -121 -3 -71 58 -134 218 216 -58 18 86 284
2998 284 -108 -71 152 -9 107 -4 42 155 218 37 59 26 61 87 189 4 202 66 -75 7 190 113 25
3021 25 -73 263 7 -36 -4 -220 -14 -66 16 -124 -89 198 173 -24 245 -49 -119 -215 -17 -76 -99 79 -46 -96
3045 -96 129 -74 -53 -39 -40 -266 -175 47 45 118 156 38 24 -5 -171 -294 144 -1 -164 -169 -85 -20 -76 -282 -7 43
3071 43 -19 6 -77 -44 86 91 31 74 -31 37 207 63 102 -55 -81 259 31 -51 -4 295 39 39 146 202 124 148
3097 148 -23 -97 150 311 -77 13 133 218 -32 -248 218 -53 104 -35 -131 227 227 -92 153 0 12 21 206
3120 206 -222 31 -225 132 192 -143 76 137 157 -60 -129 -39 -8 -94 75 -134 -45 200 125 -209 151 -157 -78
$$ packed form
2950A16j50N1J23l47J54J03j29l82L50N4N1J54j01K64k15j04J8p7O1j3j15J32
2972bl2Nj38L22J9p6q8j14P2J67l2j94J9J08M8k05J18o8J29j92L52kk74P6O8J98
2998B84l92L7K23j61J16j11M6J13O3j81K2l3L5K6J02j85J98j36j41Q2J83p7q8
3021B5r8L36k56m3L2k16K06n2Q2j40L5K87k5j97K69k94p0r6J98n9k3J78j25n0
3045i6K25k03K1J4jk26R1K22kP3L8j18j4k9j66j23M38j45j63nQ4O5n6k06K75N0
3071D3o2K5q3L3J30No0M3j05O8J70j44L9j57k6L40k28q2M7K99k56%J07N6p8K4
3097A48j71p4K47J61l88R0J20Q5k50k16M66k71J57j39r6L58%l19K45j53J2RJ85
3120B06m28K53k56L57O0l35K19O1K0k17o9R0L1q6J69k09Q9K45p5l34L60l08P9
$$ plain form
3143 -78 -204 -43 43 -132 64 86 0 -57 -104 38 186 13 -36 58 -66 -28 96 -37 113 162 86 -36 -126 -35
3167 -35 -96 -141 66 176 -84 146 70 37 207 78 174 -240 -166 -13 245 16 260 144 69 -165 -10 71 65 258
3191 258 149 37 66 -32 56 109 68 39 320 145 87 -32 -26 90 -45 273 -89 -102 -65 91 13 -114 8 255
3215 255 -271 6 -371 -162 293 -67 -37 -50 185 -54 -19 -47 -120 205 -170 -273 77 13 406 23 -256 180
3237 180 -8 -244 186 110 332 -164 -347 249 -172 19 -11 -40 79 -189 -203 130 -42 -6 163 111 120 -275 -65
3260 -65 37 67 -148 -268 30 141 152 44 -71 -121 199 176 -50 -43 -254 22 156 98 141 136 -31 133 -13 232
3284 232 219 12 92 133 -101 31 -61 -6 47 -107 36 -185 47 74 -350 140 143 -125 9 -16 -211 -2 -93 -32
3308 -32 -94 -25 171 -138 -155 -8 -118 -231 79 -112 -234 38 267 294 177 -134 -54 -30 48 -176 -23 -38 -179
$$ packed form
3143g8j26J61Q6j75J96K2q6n7m7J42J48j73m9R4j24L8J24j33J50M9p6j22r0R1
3167c5o1m5K07J10k60K30p6l3J70j29R6m14P4J53K58k29K44j16p5k34J55Q1oJ93
3191B58j09j12K9r8Q8N3m1k9K81j75n8j19OJ16j35L18l62j3L7J56p8j27J22K47
3215B55n26K77l77K09M55l60L0j3K35k39L5k8p3L25l75j03L50o4L93l83k79M36
3237A80j88k36M30p6K22m96j83N96m21J91l0k9J19k68j4L33j72L6J69n2Rl95K10
3260f5J02L0k15j20K98J11J1j08j15n0L20k3k26Pk11K76J34n8M3nj67J64j46K45
3284B32j3k07Q0M1k34J32r2N5N3j54J43k21K32K7m24M90Lk68J34k5j95K09r1O1
3308c2o2O9J96l09j7J47j10j13L10j91j22K72K29K7j17l11Q0K4P8k24J53j5j41
$$ plain form
3331 -179 272 130 -237 -10 16 62 103 -123 -12 73 14 100 321 92 95 1 -218 71 105 -65 10 -7 -75 259
3355 259 -104 -183 -126 77 -122 -130 -69 -89 147 53 77 -101 -302 -71 49 -214 -356 130 168 188 17 127 142 70
3379 70 105 -194 56 83 -31 3 -29 99 207 84 146 0 -73 132 185 295 -10 -95 -171 -411 44 -196 128
3402 128 -471 -168 -126 -110 54 -65 -56 -420 -172 -17 -34 -149 70 182 217 -207 -62 -138 126 148 -170 269 -107
3425 -107 -18 201 75 62 -60 -129 -175 95 -95 -84 -21 53 -176 -14 -115 -156 63 -229 -276 -57 -37 81 240
3448 240 2 -70 59 18 -89 108 491 150 -240 44 -128 -40 77 -186 -92 70 -57 -83 -191 6 207 73
3470 73 -159 115 191 129 456 9 -114 -85 -74 240 -56 120 74 96 139 19 -185 106 207 31 -96 -120 -104
3493 -104 -47 -23 97 -22 -77 197 -57 -114 -216 63 176 -148 -2 9 -182 -72 -152 105 -15 -102 -288 -292 -48
$$ packed form
3331a79M51j42l67K27K6M6M1k26J11Q5n9Q6K21k29Lr4k19K89L4j70P5j7o8L34
3355B59l63p9N7K03j99qO1k0K36r4K4j78k01K31J20k63j42M86L8K0j71J10J5p2
3379G0L5k99K50K7j14L4l2J28J08j23O2j46p3K05N3J10l05q5p6k40M55k40L24
3402A28n99L03M2J6J64j19Rl64K48J55j7j15K19J12L5m24J45p6K64K2l18M39l76
3425a07Q9K19j26j3j22o9m6K70j90J1O3P4k29J62j01m1K19k92m7K19K0J18J59
3448B40k38p2J29m1j07J97L83l41l90K84j72Q8J17k63R4J62j27k6j08J97K01j34
3470G3k32K74P6o2L27m47j23K9J1L14k96J76m6K2M3j20k04K91J01j76j27k4J6
3493a04N7K4J20j19n5K74k54n7j02K79J13l24J46J1j91J10q0K57j20q7j86mK44
$$ plain form
3516 -48 102 143 -75 -32 106 146 198 6 90 150 102 171 -67 -11 -26 110 231 -57 -71 61 -107 36 122 -140
3540 -140 273 -27 161 261 -245 192 -223 123 -86 -25 102 -58 24 81 -33 -144 -59 218 -75 130 147 75
3562 75 -98 50 -201 -147 155 46 186 -58 93 -231 37 -83 -79 141 -165 141 116 84 -166 -22 190 -137
3584 -137 306 136 -85 30 -11 164 -316 112 -164 -278 180 4 -217 -150 -93 -216 109 74 -70 72 50 90
3606 90 46 54 151 83 -41 -94 -56 155 109 68 105 170 16 91 -17 -215 88 -253 122 -4 10 115 -201 363 109
3631 109 -74 -40 -124 -194 87 21 -100 -60 -64 69 -24 -15 397 65 236 146 -2 290 11 -33 125 232 150 -116
3655 -116 83 46 31 -1 123 -85 -72 -91 46 -50 48 155 -61 -373 56 -127 -66 -53 -65 42 -204 -167 85 81
3679 81 30 -320 17 -30 -89 -70 -138 84 -207 -24 -69 76 -188 -289 -207 -77 -128 19 -240 154 101 -112 239
$$ packed form
3516d8J50M1k18M3J38M0N2j92Q4O0m8O9k38N6j5J36J21k88j4J32j68J43Q6k62
3540a40M13l00J88J00n06M37m15L46k09O1J27j60Q2N7j14j11Q5K77k93K05J7p2
3562G5j73J48k51N4L02j09J40k44J51l24K68j20MK20l06L06k5l2k50J44K12l27
3584a37M43j70k21J15m1J75m80M28k76j14M58j76k21O7N7j23L25l5j44J42k2M0
3606I0m4QR7o8j24n3L8K11m6m1L7O5j54P5j08j98L03l41L75j26J4J05l16N64k54
3631A09j83L4q4p0K81o6j21M0mJ33r3RM12l32J71r0j48K92k79m4J58J07q2k66
3655a16J99l7j5l2J24k08J3j9J37r6R8J07k16l12M29j83O1J3j2J07k46L7K52m
3679H1n1l50L37m7n9J9o8K22k91J83m5J45k64j01Q2J30n1J47k59L94n3k13L51
$$ plain form
3702 239 30 -203 -48 60 43 -220 211 180 -86 106 199 -260 200 -107 186 57 -351 -50 13 351 198
3723 198 -102 -45 -157 -29 66 -23 137 -64 53 -130 22 -119 15 61 144 156 -122 -17 -63 143 -205 221
3745 221 1 -128 -76 -130 -158 -103 -64 -100 3 -200 216 -28 83 240 15 -145 282 26 -87 -23 -12 96 -79
3768 -79 -48 -94 98 -4 131 -184 -96 52 287 -192 142 280 14 -49 -245 -126 154 55 -187 -85 49 232
3790 232 74 -213 196 26 -16 212 131 115 4 80 -91 11 30 17 132 -122 -152 170 24 -17 -259 -43 247
3813 247 -62 193 144 42 -94 179 -76 -145 109 -326 -185 -171 91 128 148 -132 10 12 -138 -55 -159 -97 -1
3836 -1 48 -55 -51 -49 -13 -292 36 -283 5 -125 -38 -112 65 -38 118 -117 -9 171 -264 -27 138 -177 -157 -137
3860 -137 -21 84 -339 -190 80 -29 237 149 8 -176 -55 -257 -80 -5 26 43 -256 -78 28 75 145 -125
$$ packed form
3702B39k09k33J55J08j7k63M31l1k66J92R3m59M60l07K93j29m08L01O3L38j53
3723A98l00N7j12J28R5q9J60k01J17j83J52j41J34M6Q3J2k78J05m6K06l48M26
3745B21k20j29N2n4k8N5L9l6J03k03M16k44J11J57k25j60M27k56j13O4J1J08j75
3768g9L1m6J92j02J35l15Q8J48K35m79L34J38k66o3j96J19K80r9k42J02J34J83
3790B32j58k87M09j70m2K28q1j6j11P6j71J02J9j3J15k54l0L22j46m1k42K16K90
3813B47l09K55m9j02j36K73k55o9K54m35J41J4K62L7K0k80J42Kj50Q3j04O2R6
3836aM9j03MKL6k79L28l19K88j30Q7p4J77j03J56k35J08J80m35K37J65l15K0K0
3860a37J16J05m23J49K70j09K66q8j41j84J21k02J77P5L1J7k99J78J06M7P0k70
$$ plain form
3882 -125 102 -11 295 -19 -9 -98 24 -48 -10 144 10 -19 -147 172 -63 -156 151 78 -59 -22 -309 -33 127
3905 127 179 -66 121 -226 9 -91 161 17 -85 -130 -77 -181 81 36 -7 14 59 39 -223 -52 178 -87 121
3928 121 -114 300 147 155 -35 -175 158 -55 6 -108 214 55 -11 56 -230 89 216 -65 -158 53 126 35 -46
3951 -46 -92 75 -74 -38 78 -151 93 -3 -119 -49 50 -154 -81 156 -138 41 -58 312 53 84 69 137 -120 -136
3975 -136 -151 -1 -194 -150 -144 -191 -23 99 147 -90 2 -41 -99 -96 -10 109 124 -42 -109 56 -38 -142 46 44 -15 353
4001 353 7 184 93 -61 -97 -132 -55 94 46 -109 45 -65 -58 -6 -173 -1 -317 -56 101 70 6 -65 -2 -11 -280
4026 -280 91 151 -439 -160 88 -128 98 -36 -436 46 -232 96 33 -38 436 -151 -71 -17 -280 125 140 -67
4048 -67 -24 -287 -71 277 152 18 -112 -170 -212 70 7 98 135 -238 82 -112 46 42 34 109 -53 39 -78 49
$$ packed form
3882a25K27j13L06l14J0q9J22p2L8J54j34k9j28L19k35r3L07p3j37L7k87K76J60
3905A27N2k45J87l47K35j00K52j44j02m5N3j04K62m5m3K1M5k0k62J71K30k65K08
3928A21k35M14j53Qj90j40L33k13O1j14L22j59o6O7k86L19J27k81r3K11P3r1q1
3951d6m6J67j49L6J16k29K44r6j16P0R9k04P3K37k94J79r9L70k59L1j5O8k57j6
3975a36j5J50j93M4Om7J68J22M8k37R2m3n8LQ6J19J5j66o7J65r4j04J88kn9L68
4001C53l46J77r1j54l6l5P7J49m8j55J54j10PN2j67J72l16K61J57l1o4p1O3rk69
4026b80L71O0n90K79K48k16K26j34m00M82k78L28o3p1M74n87Q0N4k63M05J5k07
4048f7M3k63K16L48j25j34j30n8m2K82o3R1L7l73L20j94J58mqP5j62R2j17J27
$$ plain form
4072 49 -10 -124 108 47 -92 131 -74 61 -215 52 258 161 78 118 120 117 91 190 49 258 133 212 -330 53
4096 53 168 -119 216 51 35 98 -13 205 -60 180 51 -149 -73 -41 104 32 256 -186 272 161 109 -2
4118 -2 151 82 259 -39 79 -14 -98 -59 29 -12 8 46 -37 -26 -57 20 84 -260 -104 -31 189 56 57 -242 -122 -76
4144 -76 150 56 -93 93 -151 108 64 42 -180 -265 -302 40 289 205 195 86 -101 -29 117 -19 -62 -85 -123 116
4168 116 12 203 278 -38 -37 -19 22 -98 -177 286 -55 242 93 155 133 -31 145 79 4 29 52 231 172 -35
4192 -35 209 166 13 -27 -117 104 -264 -143 72 137 -31 -262 -61 94 81 -41 64 -124 218 -135 65 13
4214 13 -2 -173 223 -170 -276 -181 -70 -154 199 222 11 55 -68 150 -71 137 -19 -66 49 90 -105 -300 122
4237 122 173 230 58 -108 93 17 28 47 180 -218 57 34 -177 240 59 -1 -109 154 -296 -121 131 -185
$$ packed form
4072D9n9j14K32o1j39K23k05J35k76K67K06r7q3M0Klk6R9j41K09j25P9n42L83
4096E3J15k87L35j65j6O3j11K18k65K40j29k00P6L2J45p2K24m42M58j11n2j11
4118bJ53o9J77k98J18r3q4L9Q8m1K0L8q3J1l1P7O4l44J56P3K20j33Jk99J20M6
4144g6K26r4j49J86k44K59m4k2k22q5l7L42K49q4j0j09j87P2J46j36m3k3l8K39
4168A16j04J91P5l16JJ8M1j20p9M63l41K97j49O2k2j64J76o6p5K5K3J79n9k07
4192c5K44m3j53m0r0K21l68J21K15O5j68k31K01J55j3j22J05j88L42l53K00n2
4214A3j5j71L96l93j06R5J11q4L53K3k11M4j23K18k21K08j56m7J15M1j95j95M22
4237A22N1N7j72j66K01p6J1J9J33l98K75k3k11M17j81o0j08K63m50J75K52l16
$$ plain form
4259 -185 -61 -112 59 94 118 -28 -106 133 5 10 -135 -80 49 -209 194 151 31 158 96 73 100 93 15 86 -57
4284 -57 -104 57 -144 -71 -190 45 50 124 268 118 123 -243 -186 32 -197 -194 84 -53 235 -290 23 191 250 -149
4308 -149 -80 172 157 -182 205 -93 -31 199 -307 94 309 206 -376 133 -157 -235 144 -83 138 93 -5 86
4330 86 134 51 -5 -82 -154 19 46 227 -184 -27 22 -25 -19 -27 -30 -76 -203 -4 -224 -187 283 176 -92 -26 225 67
4356 67 -174 309 65 -230 120 -194 192 277 24 -155 108 -88 127 -18 -332 41 135 -188 -156 162 180 98
4378 98 39 39 -223 267 57 -96 39 152 -230 -173 187 -15 157 -274 -34 -152 -56 97 247 -56 -112 129
4400 129 84 -103 172 -90 -94 -85 73 70 -184 192 67 -161 19 362 116 190 94 -6 -65 208 -31 -51 87 -125
4424 -125 -129 75 167 -223 -14 32 96 -121 -35 -101 167 -123 -89 277 19 -143 132 6 48 114 145 292 -102 19
$$ packed form
4259a85J24n1J71L5K4j46p8K39j28Nj45N5J29k58M03m3j20J27o2k3K7pp8P1j43
4284e7m7J61k01P3j19K35NP4J44j50Nl66N7K18k29LK78j37K88n25L13J68N9l99
4308a49O9K52j5l39L87k98O2K30n06M01K15j03n82N09k90p8L79k27K21m5r8R1
4330H6M8q3n6p7p2J73K7J81m11J57M9m7Oqlm6j27J99k20L7M70j07k68O6K51j58
4356F7k41M83k44k95L50l14L86Q5k53j79K63j96K15j45l14L73R4l23L2L18J8q2
4378I8n9%k62M90k10j53J35J13l82N7L60k02J72m31K40j18R6J53J50l03n6K41
4400A29m5j87K75k62mRJ58lk54L76j25k28J80L43k46P4r6j00n9K73k39k0J38k12
4424a25mK04R2l90K09M6O4k17Q6o6K68k90L4L66k58j62K75j26M2O6L1J47l94J21
$$ plain form
4448 19 -60 31 80 181 252 70 -32 73 -223 15 148 199 -62 -96 164 262 -61 40 36 -38 -14 -122 168 84
4472 84 48 121 62 11 -60 188 -167 64 -311 116 -191 -5 43 299 -31 -77 -111 -28 45 -244 -183 157 130 207 -139
4497 -139 -14 -312 -25 92 34 68 185 -32 10 93 -149 -270 66 24 -41 -43 103 -54 6 -113 -27 87 246
4520 246 215 119 -119 -43 -19 -5 95 328 -143 119 161 26 41 71 -13 -40 -46 -88 24 -166 -98 242 163 -171 -185
4545 -185 -14 -146 -58 85 -77 112 -50 158 113 -18 67 366 114 -95 -266 30 97 -175 -154 -40 -32 162
4567 162 22 -73 -110 -46 -140 40 -74 68 162 23 117 -134 -154 -82 -168 218 -219 -144 -24 -248 159 48 169
4590 169 27 -23 87 52 133 -24 -150 -125 108 37 -471 224 1 -36 -57 164 -12 82 43 -13 -159 196 -10
4613 -10 -146 177 -19 -48 -79 -170 130 165 -245 -360 20 -108 12 237 -19 -2 61 -175 22 33 219 24 104
$$ packed form
4448A9p9R1M9J01P1j82j02J05k96K38J33N1k61l4K60R8l23J01mp4K4j08K90q4
4472H4l6P3n9n1p1K48l55K31l75M27l07J86M8K56l30m6l4Q3P3k89O1L40k7P7l46
4497a39J25k98K87J17n8L4J17k17M2Q3k42j21L36m2o5kJ46j57O0j19Q6J14J59
4520B46l1r6k38P6K4J4J00K33m71K62M2j35J5L0q4k7om2J12j90O8L40p9l34j4
4545a85J71j32Q8J43j62J89j62K08m5j31Q5K99k52k09j71K96O7k72K1J14QJ94
4567A62j40r5l7O4r4J80j14J42R4j39R4k51k0P2q6L86m37P5J20k24M07j11J21
4590A69j42n0J10l5Q1j57j26K5K33p1n08O95k23l7k1K21j76R4l9n6j46L55k06
4613a0j36L23j96k9l1r1L00L5m10j15L80j28J20K25k56J7O3k36J97J1J86j95Q0
$$ plain form
4636 104 34 351 -116 -120 43 107 189 152 279 -27 -43 -104 -183 -193 228 -58 2 -42 -81 48 -54 -90 104 97 155 298
4662 298 26 -227 -113 182 -225 -231 -175 10 96 -2 -93 -96 23 -129 201 54 -109 -127 -55 71 -163 -40 -140
4685 -140 126 0 12 254 -1 20 40 -211 -7 27 111 -70 -240 47 -13 -38 198 -244 -32 -102 139 -4 54
4708 54 122 -27 -78 -203 -33 285 -99 172 28 -121 13 -34 379 -115 19 162 71 70 -81 -268 246 -45
4730 -45 -92 252 64 -205 -70 456 -40 19 -116 -59 -101 -34 99 -364 -45 -338 -191 74 -239 124 29 17 -146
4753 -146 -110 164 87 -313 -291 -58 -34 -79 49 -139 -179 -88 29 138 -294 -135 2 -230 75 -32 17 199 104
4776 104 3 169 196 -68 206 103 -163 -51 139 -82 40 222 55 -126 95 -24 -110 -311 -204 45 38
4797 38 41 136 55 114 7 97 -145 8 127 -101 -7 20 -53 101 89 88 -77 108 177 15 -325 -134 62 74 -222
$$ packed form
4636A04p0L17m67mJ63O4Q2l7J27l06j6o1p9j0M21k86O0m4l9J29j02l6J94pN8J43
4662B98k72k53J14K95m07oN6J85Q6r8r1lJ19j52L30j47j63j8P2J26k34J23j00
4685a40K66j26J2K42k55K1K0k51K04L4Q4j81j70K87o0k5K36m42K12p0K41j43N8
4708E4O8j49n1j25J70L18l84K71j44j49J34m7M13m94J34J43r1jj51j87N14k91
4730d5m7L44j88k69J35N26m96N9j35N7m2O7J33m63L19k93J47K65l13L63r5j2j63
4753a46L6K74p7m00K2K33K4m5J28j88m0R1J17J09m32J59J37k32L05j07M9J82r5
4776A04j01J66K7k64K74j03k66J12J90k21J22J82j67j81K21j19q6k01J07K49p
4797C8LR5q1N9j07R0k42J53J19k28R4K7p3J54j2jj65J85O9j62l40J91J96J2k96
$$ plain form
4822 -222 -100 87 41 132 -194 121 201 -19 236 -121 138 28 -25 112 24 81 -69 -2 -190 -294 11 2 62
4845 62 -11 78 -272 -21 0 152 36 -263 -93 -245 -79 13 -9 -17 -124 33 -329 160 70 110 174 311 19 -25
4869 -25 94 -47 92 -36 50 -88 48 -87 205 27 139 -87 -51 -231 58 86 170 66 -61 123 56 4
4891 4 -73 -46 245 185 90 -122 -26 117 186 147 -3 -228 -7 361 57 -62 -55 -99 4 -102 14 -5 -40 -8 -56
4916 -56 10 -175 -107 -143 -199 33 21 -65 -98 -151 -18 141 209 -46 -86 148 -1 106 199 -220 109 -164 -119 107
4940 107 44 221 169 46 -20 225 222 143 -11 231 -264 232 -156 -199 -98 -202 133 52 -279 255 -232 95 -174
4963 -174 -74 -54 5 -201 -129 26 95 84 2 221 118 271 -24 33 -188 300 219 164 99 178 -55 -33 -33 175 55
4988 55 -131 6 -56 -118 202 91 -88 390 167 200 148 226 187 -137 15 -114 -83 -157 -91 107 -56 -145 -30 174
$$ packed form
4822b22J22J87m6R1l26L15Q0k20K55l57K59j10n3J37q8N7j50O7j88j04L05rO0
4845F2p3Q9l50K51K1J52j16k99J70j52J66R2k2qj07J57l62M89r0M0O4J37k92m4
4869b5J19j41J39j28Q6j38J36j35K92j78J12k26L6j80K89K8Q4j04j27J84o7n2
4891Dp7K7K91o0r5k12R6J43O9l9j50k25K21L68l04j19Pm4J03j06J16j9l5L2m8
4916e6O6j85O8l6n6K32j2q6l3n3J33J59O8k55m0K34j49J07R3m19L29k73M5K26
4940A07o3J77n2j23o6K45lp9j54K42m95M96l88m3J01j04L35q1l31N34m87L27k69
4963a74J00K0N9k06P2J55O9j1q2K19j03J53k95N7k21M88q1n5o5P9k33K2%K08j20
4988E5j86J37o2o2L20j11j79M78k23L3n2P8l9l24J52j29L1p4O6J98j63q9J15K04
$$ plain form
5012 174 -237 48 -40 125 -78 -192 -164 -238 135 -246 -188 -6 -247 114 -147 38 -164 -257 159 -280 -188 -236
5034 -236 10 -47 -59 61 -170 172 153 174 157 65 -70 4 -254 -171 118 370 49 -77 -54 18 -71 214 294 -145
5058 -145 102 182 169 -60 140 -125 27 -15 162 30 28 -72 -105 62 -173 -23 209 -46 39 -95 208 -45
5080 -45 96 35 -37 -27 -123 -206 -6 -98 -22 -134 -135 -105 97 -108 -152 158 175 -17 -119 52 48 103 5 -348 295 210
5106 210 -252 93 39 122 30 133 -168 152 37 -47 81 61 -76 -142 190 -253 -3 -103 -14 31 -49 201 85
5129 85 263 -23 -84 11 -46 150 181 -176 -122 68 -60 -32 98 9 -51 113 97 27 245 -59 169 162 -58 135
5153 135 -202 -123 2 183 200 47 43 -76 154 -40 152 51 7 -312 -188 28 -24 320 -101 -267 85 -117
5175 -117 57 -66 -37 45 86 85 169 -35 186 140 187 -12 10 240 -71 83 -267 47 -270 88 -256 280 26
$$ packed form
5012A74m11K85q8J65k03j14K8p4L73l81N8J82k41L61k61J85k02r3M16m39R2m8
5034b36K46n7j2J20k31L42j9K1j7r2j35P4k58Q3K89K52l21j26K3P2q9K85Q0m39
5058a45K47Q0j3k29K00k65J52m2J77j32kj00l3J67k35J50K32k55Q5j34L03k53
5080d5J41o1p2J0r6q3K00r2P6j12jL0K02k05m4L10J7j92j02J71mN5r8l53O43q5
5106B10m62L45n4Q3r2J03l01L20j15q4J28k0j37o6L32m43K50j00Q9M5q0K50j16
5129H5J78k86o1R5n7J96L1l57N4J90j28K8J30q9o0J64j6p0K18l04K28pk20J93
5153A35l37P9J25J81J7j53mj19K30j94J92j01m4l19J24K16n2L44m21j66L52k02
5175a17J74j23K9Q2M1jQ4k04K21m6M7j99K2K30l11J54l50L14l17L58l44N36k54
$$ plain form
5198 26 44 -93 -146 14 44 45 -57 26 -223 233 192 48 94 -178 -75 143 40 -111 -51 332 -318 11 -69 -138
5222 -138 -21 -6 198 89 -168 -18 -282 196 202 -153 -245 -198 -164 102 102 -53 -11 72 -1 97 -55 -195 249 158
5246 158 255 -5 23 261 129 149 -158 -166 87 -131 -39 183 -94 93 -193 90 60 6 168 -86 -32 197 349
5269 349 102 187 -65 -288 142 162 -84 -4 95 280 -292 -132 -126 -143 -120 -96 -34 -208 47 99 9 90 -128 -8
5293 -8 -25 70 -58 24 122 -121 -17 153 -257 212 -10 -63 -56 -58 -99 34 19 154 3 27 -207 -91 45 -172 -62
5318 -62 192 32 -160 -5 -9 -175 -7 -133 -76 158 -1 -161 253 -315 -191 -152 -16 45 -67 139 -203 156
5340 156 16 18 12 -108 42 -126 14 271 27 -156 -144 179 -249 65 160 -26 -156 8 -156 -36 49 95 364
5363 364 28 -16 98 -91 -129 -60 38 -179 -111 113 -42 50 116 342 41 -179 118 -50 -46 46 94 37 -51 -183
$$ packed form
5198B6J8j37n3J60L0Jj02Q3k49M56m1j44M6k72J03K18j03j51O0L83o50L29q0o9
5222a38J17J5K04j09k57J50k64M78Ol55r2M7L4K66%j55M2Q3p3R8j52j40M44r1
5246A58R7k60K8K38j32K0l07qK53k18R2K22k77J87k86K83l0n4J62k54N4K29J52
5269C49k47Q5k52k23M30K0k46Q0R9J85n72J60Oj7K3K4O2j74K55N2r0Q1k18J20
5293hj7R5j28Q2R8k43J04J70m10M69k22n3Pkm1J33j5J35j51K4k34J16J36k17J10
5318f2K54j60j92J55mj66J68j26N7K34j59j60M14n68J24L9J36O1j12K06l42L59
5340A56j40Koj20J50j68J40K57k44j83J2L23m28L14R5j86j30J64j64J20Q5M6K69
5363C64l36m4J14j89l8O9R8k17O8K24j55R2O6K26l01k20K97j68MR2M8n7q8j32
$$ plain form
5387 -183 105 -105 70 -161 -130 115 117 111 -109 4 -17 -137 81 -86 -337 -101 -126 -17 -203 -41 34 258 -43
5410 -43 -25 -49 258 118 -205 -207 162 121 15 -186 -52 -21 -89 -120 -32 271 -52 -105 64 25 131 -10 163 109
5434 109 -17 122 130 35 -41 -150 412 -152 -35 57 -78 126 -67 -78 -342 -105 -216 102 -22 -367 171 -233
5456 -233 151 67 -162 -40 103 -38 -197 -285 -55 162 128 -22 259 120 -140 -59 41 18 32 -162 175 -98
5478 -98 144 -3 162 -3 -93 -117 84 129 -101 19 -545 -249 -40 -124 10 -114 142 63 116 -259 -311 -18 -42
5501 -42 17 215 -94 -180 0 -71 -180 -29 28 -86 158 -139 57 163 -22 126 -197 80 -174 213 119 103
5523 103 68 162 66 200 46 84 81 -9 240 27 119 98 -191 -48 181 -115 159 -32 1 -45 -38 -198 66 248
5547 248 -197 147 -23 285 -112 40 -191 -97 277 -103 95 32 45 -94 -67 124 -1 114 -48 -128 56 282
$$ packed form
5387a83K88k10J75k31L1K45Kok20J13k1j20K18j67k51K36k5J09j86J62P5K24l01
5410d3J8k4L07j40l23kL69m1j06k01J34L1o8l1Q8L03l23n3J69l9J06j41J73n4
5434A09j26J39Qr5p6j09N62n64J17R2j35K04j93j1k64K37j11L18j24l45N38m04
5456b33L84q4k29J22J43j41j59q8K30K17l4j50K81j39k60Q1J00k3J4j94L37k73
5478i8K42j47J65j65r0k4K01M5k30J20n64K96K09q4J34j24K56p9N3l75n2K93k4
5501d2N9J98l09q6J80p1j09J51N7j14K44k97J96J06j85J48l23K77k54L87r4j6
5523A03l5R4r6J34j54L8lr0K49k13R2k1k89J43K29k96K74j91L3m6Pj60K64J82
5547B48m45L44j70L08l97J52k31R4L74l80J98o3J3j39K7J91j25J15j62q0J84K26
$$ plain form
5569 282 -154 -7 -75 -25 -23 172 -124 14 -103 69 134 153 47 91 -26 -22 52 111 11 46 51 -262 63 -159 89
5594 89 15 -79 -5 290 -97 212 23 37 70 -137 -136 -212 14 40 57 211 93 332 -61 79 -12 -223 76 -71
5618 -71 4 -119 91 56 -23 100 -111 166 58 -64 62 517 3 -73 48 -208 -70 -245 -41 78 -2 101
5640 101 -129 -119 78 -143 -63 32 138 -10 -182 -19 -11 93 -66 11 -92 -104 38 -39 115 201 -141 103 83
5663 83 -151 -157 72 -74 179 59 -165 -107 -290 105 -33 56 -32 -120 241 68 -43 -35 -221 -26 -96 212 226 -17
5687 -17 268 184 -147 -16 -52 -129 -146 -256 67 194 131 323 -240 -60 -38 19 132 85 242 72 -158 43 191
5710 191 -16 -15 272 -154 -28 -317 118 85 -51 -160 -323 140 162 -199 66 112 -236 154 -200 -155 220 46
5732 46 133 -132 16 -69 -26 -11 35 -28 4 50 -89 -36 14 -37 -128 -66 1 -19 -211 245 -204 327 -155 -47 -42 -77
$$ packed form
5569B82m36J47o8N0KJ95k96J38j17J72O5J9j06M4j17MP4N9j00L5Nl13L25k22K48
5594H9p4r4P4K95l87L09j89J4L3k07Jp6K26K6J7J54j18K39l93J40r1k11K99j47
5618g1P5j23K10l5p9J23k11K77j08j22J26M55n14p6J21k56J38j75K04J19q0J03
5640A01k30J0J97k21Q0R5J06j48j72J63QJ04j59P7j03j2J42p7J54Q6l42K44k0
5663H3k34oK29j46K53j20k24N8j83L95j38Q9q8q8L61j73j11Qj86J95p0L08J4k43
5687a7K85q4l31J31l6p7j7j10L23J27o3J92n63J80K2N7J13m7J57j70k30K01J48
5710A91k07JK87m26J26k89M35l3j36j09j63M63K2l61K65M6l48L90l54M5L75j74
5732D6Q7k65J48q5M3J5M6o3L2M6j39N3N0n1r1O2O7k0j92M56m49N31m82J08Nl5
$$ plain form
5758 -77 -111 -1 -149 56 -145 -115 122 50 -131 -44 171 131 -36 204 -34 345 204 -15 -97 0 -121 -213 128
5781 128 -13 -8 56 -57 -4 -133 -122 61 70 206 -115 -251 145 193 -115 -11 122 -193 -300 14 -192 146 106
5804 106 115 -225 -200 62 116 123 215 -118 -68 18 191 -137 52 15 -3 308 -69 35 -38 -122 -215 36 -127 -173 -144
5829 -144 205 303 -106 -233 97 -90 -169 50 93 130 13 -109 -36 -110 95 -40 37 23 45 -30 181 107 160 184
5853 184 -98 119 36 87 176 -182 -57 95 -283 -1 -87 199 121 144 141 219 -32 -41 211 234 -133 -75 14 251 151
5878 151 -183 -24 297 155 129 -35 -82 11 -31 1 -304 201 -30 -118 -89 66 -27 122 73 246 144 130 131 22
5902 22 142 -136 -135 -84 99 -68 77 49 119 -34 100 57 124 49 -2 18 -96 14 -6 -251 111 89 -408 -127
5926 -127 -242 101 -124 -60 -1 -7 128 220 58 410 -26 196 154 -145 9 203 14 177 179 -149 58 -8 -33
$$ packed form
5758g7l4J10j48K05k01L0K37p2j81Q7K15m0j67K40k38L79j41k19q2R7j21r2L41
5781A28j41NO4j13N3j29J1J83RJ36l21j36L96M8l08J04J33l15j07L14k06L38m0
5804A06Rl40K5K62N4PR2l33N0Q6J73l28J89l7j8L11l77J04p3q4r3K51j63m6K9
5829a44L49R8m09j27L30j87p9K19M3L7j17j22P3p4K05j35P7j4K2p5K11p4N3K4
5853A84k82K17q3N1Q9l58J25J52l78K82q6K86p8K3lP8k51rK52K3l67N8Q9K37j00
5878A51l34J59L21j42k6j64m7R3m2L2l05N05k31q8K9J55r3J49m9J73j02j4Jj09
5902B2J20k78JN1J83j67J45k8P0j53J34m3O7p5n1K0j14J10k0k45L62k2m97K81
5926a27j15L43k25O4N9oJ35R2j62L52m36K22m2k99J54J94j89J63Kl28K07o6k5
$$ plain form
5949 -33 94 150 174 19 -147 340 65 -172 242 12 10 -6 -144 -209 372 201 -103 -189 -61 103 193 -89 154
5972 154 -87 46 31 424 63 57 21 -11 201 17 75 40 -18 -134 -188 204 214 179 -117 44 -3 -148 105 62
5996 62 -164 -174 -4 -102 -29 253 127 110 -100 242 -118 109 175 408 295 -175 -160 -48 -50 112 196 -109 4
6019 4 31 -87 118 -276 406 12 57 -196 -298 58 41 -6 64 -12 22 -33 50 142 51 -39 -127 151 -205 -131 76
6044 76 -75 143 10 -99 356 324 -4 -164 121 -128 205 -78 -203 -133 94 263 -84 196 147 17 -90
6065 -90 -124 -192 5 -102 -46 -38 149 -116 12 52 -39 38 -4 212 188 -177 29 -35 81 121 219 81 -48 297 -34
$$ packed form
5949c3J27N6K4j55j66M87k75k37M14k30kj6j38o5N81j71l04q6J28J64R0k82K43
5972A54k41J33j5L93l61ol6l2K12j84N8l5n8j16n4L92J0l5k96J61m7j45K53m3
5996F2k26j0J70r8P3K82j26j7k10L42l60K27O6K33j13m70J5J12kJ62Q4l05J13
6019DK7j18K05l94O82l94M5k53j02L56j7m7P0p6L4n5Q3R2r1r0q8K78l56P4K07
6044G6j51K18j33j09M55l2l28j60K85k49L33k83j25P0K27J69l47K80m9j30j07
6065i0l4o8J97j07N6QJ87k65J28M0r1P7m2K16k4l65K06o4J16M0R8j38j29L45l31
$$ [...]
8191a88
##END NTUPLES=NMR FID
##END=
