##TITLE=1H_Pr PhEt_D
 DMSO
 8 sc, 
 11.05.2022
##JCAMPDX= 6.0         $$ Bruker NMR JCAMP-DX V2.0
##DATA TYPE= NMR FID
##DATA CLASS= NTUPLES
##ORIGIN= UXNMR, Bruker Analytische Messtechnik GmbH
##OWNER= root
$$ XWIN-NMR		Version 3.5
$$ Wed May 11 11:23:33 2022 Russian Standard Time (UT+4h)  she@DPX200
##.OBSERVE FREQUENCY= 200.1313499996
##.OBSERVE NUCLEUS= ^1H
##.DELAY= (6, 6)
##.ACQUISITION MODE= SIMULTANEOUS
##.ACQUISITION SCHEME= undefined
##.AVERAGES= 8
##.DIGITISER RES= 18
##SPECTROMETER/DATA SYSTEM= spect
##.PULSE SEQUENCE= zg30
##.SOLVENT NAME= DMSO
##.SHIFT REFERENCE= (INTERNAL, DMSO, 0, 15.7039)
##AUDIT TRAIL= $$ (NUMBER, WHEN, WHO, WHERE, WHAT)
$$ ##TITLE= Audit trail, XWIN-NMR		Version 3.5
$$ ##JCAMPDX= 5.01
$$ ##ORIGIN= Bruker BioSpin GmbH
$$ ##OWNER= she
$$ F:/spectra/data/she/nmr/H-F/1/audita.txt
$$ ##AUDIT TRAIL=  $$ (NUMBER, WHEN, WHO, WHERE, WHAT)
(   1,<2022-05-11 11:22:18.03 +0400>,<she>,<DPX200>,
      <created by zg, POWCHK disabled, PULCHK disabled
       configuration hash MD5:
       00 E9 B6 7A A2 85 ED C7 34 08 36 98 17 FE 4E 26
       data hash MD5: 16K
       5A 7E 8D DE 01 5F A1 43 F1 08 B8 C9 A0 A6 CB 3E>)
$$ ##END=
$$ 
$$ hash MD5
$$ 3D 4A AD 90 85 FE 06 B5 CA 6A DA 2C 0B 53 61 95
##$RELAX= 
##$RELAX= 
##$RELAX= 
##$RELAX= 
##$RELAX= 
##$RELAX= 
$$ Bruker specific parameters
$$ --------------------------
##$DU= <F:/spectra>
##$EXPNO= 1
##$NAME= <H-F>
##$PROCNO= 1
##$TYPE= <nmr>
##$USER= <she>
##$AMP= (0..31)
100 100 100 100 100 100 100 100 100 100 100 100 100 100 100 100 100 100 
100 100 100 100 100 100 100 100 100 100 100 100 100 100 
##$AQSEQ= 0
##$AQ_mod= 1
##$AUNM= <au_zg>
##$AUTOPOS= <>
##$BF1= 200.13
##$BF2= 200.13
##$BF3= 200.13
##$BF4= 200.13
##$BF5= 200.13
##$BF6= 200.13
##$BF7= 200.13
##$BF8= 200.13
##$BYTORDA= 1
##$CFDGTYP= 0
##$CFRGTYP= 5
##$CHEMSTR= <none>
##$CNST= (0..31)
1 1 145 1 1 1 1 1 1 1 1 1 1 1 1 1 1 1 1 1 1 1 1 1 1 1 1 1 1 1 1 1 
##$CPDPRG= <>
##$CPDPRG1= <>
##$CPDPRG2= <>
##$CPDPRG3= <>
##$CPDPRG4= <mlev>
##$CPDPRG5= <mlev>
##$CPDPRG6= <mlev>
##$CPDPRG7= <mlev>
##$CPDPRG8= <mlev>
##$CPDPRGB= <>
##$CPDPRGT= <>
##$D= (0..31)
0 1.2 0 0 0 0 0 0 0 0.06 0 0.03 0 0 0 0 0.0002 0 0 0 0 0 0 0 0 0 0 0 0 
0 0 0 
##$DATE= 1652253737
##$DBL= (0..7)
120 120 120 120 120 120 120 120 
##$DBP= (0..7)
150 150 150 150 150 150 150 150 
##$DBP07= 0
##$DBPNAM0= <>
##$DBPNAM1= <>
##$DBPNAM2= <>
##$DBPNAM3= <>
##$DBPNAM4= <>
##$DBPNAM5= <>
##$DBPNAM6= <>
##$DBPNAM7= <>
##$DBPOAL= (0..7)
0.5 0.5 0.5 0.5 0.5 0.5 0.5 0.5 
##$DBPOFFS= (0..7)
0 0 0 0 0 0 0 0 
##$DE= 6
##$DECBNUC= <off>
##$DECIM= 32
##$DECNUC= <off>
##$DECSTAT= 4
##$DIGMOD= 1
##$DIGTYP= 9
##$DL= (0..7)
0 120 120 120 120 120 120 120 
##$DP= (0..7)
150 150 150 150 150 150 150 150 
##$DP07= 0
##$DPNAME0= <>
##$DPNAME1= <>
##$DPNAME2= <>
##$DPNAME3= <>
##$DPNAME4= <>
##$DPNAME5= <>
##$DPNAME6= <>
##$DPNAME7= <>
##$DPOAL= (0..7)
0.5 0.5 0.5 0.5 0.5 0.5 0.5 0.5 
##$DPOFFS= (0..7)
0 0 0 0 0 0 0 0 
##$DQDMODE= 0
##$DR= 18
##$DS= 0
##$DSLIST= <SSSSSSSSSSSSSSS>
$$ [...]
##$SUBNAM2= <"">
##$SUBNAM3= <"">
##$SUBNAM4= <"">
##$SUBNAM5= <"">
##$SUBNAM6= <"">
##$SUBNAM7= <"">
##$SUBNAM8= <"">
##$SUBNAM9= <"">
##$SW= 18.0517283424761
##$SWIBOX= (0..15)
0 0 2 0 0 0 0 0 0 0 0 0 0 0 0 0 
##$SW_h= 3612.71676300578
##$TD= 16384
##$TD0= 1
##$TE= 0
##$TE2= 300
##$TE3= 300
##$TEG= 300
##$TL= (0..7)
0 120 120 120 120 120 120 120 
##$TP= (0..7)
150 150 150 150 150 150 150 150 
##$TP07= 0
##$TPNAME0= <>
##$TPNAME1= <>
##$TPNAME2= <>
##$TPNAME3= <>
##$TPNAME4= <>
##$TPNAME5= <>
##$TPNAME6= <>
##$TPNAME7= <>
##$TPOAL= (0..7)
0.5 0.5 0.5 0.5 0.5 0.5 0.5 0.5 
##$TPOFFS= (0..7)
0 0 0 0 0 0 0 0 
##$TUNHIN= 0
##$TUNHOUT= 0
##$TUNXOUT= 0
##$USERA1= <user>
##$USERA2= <user>
##$USERA3= <user>
##$USERA4= <user>
##$USERA5= <user>
##$V9= 5
##$VALIST= <valist>
##$VCLIST= <CCCCCCCCCCCCCCC>
##$VD= 0
##$VDLIST= <DDDDDDDDDDDDDDD>
##$VPLIST= <PPPPPPPPPPPPPPP>
##$VTLIST= <TTTTTTTTTTTTTTT>
##$WBST= 1024
##$WBSW= 4
##$XGAIN= (0..3)
0 0 0 0 
##$XL= 0
##$YL= 0
##$YMAX_a= 67488
##$YMIN_a= -89659
##$ZGOPTNS= <>
##$ZL1= 120
##$ZL2= 120
##$ZL3= 120
##$ZL4= 120
##$ABSF1= 10
##$ABSF2= 0
##$ABSG= 5
##$ABSL= 3
##$ALPHA= 0
##$AQORDER= 0
##$ASSFAC= 0
##$ASSFACI= 0
##$ASSFACX= 0
##$ASSWID= 0
##$AUNMP= <proc_1d>
##$AZFE= 0.1
##$AZFW= 0.1
##$BCFW= 1
##$BC_mod= 2
##$BYTORDP= 1
##$COROFFS= 0
##$CY= 11.3945322036743
##$DATMOD= 1
##$DC= 2
##$DFILT= <>
##$DTYPP= 0
##$F1P= 2.36226072786647
##$F2P= -0.459571619588291
##$FCOR= 0.5
##$FTSIZE= 0
##$FT_mod= 4
##$GAMMA= 1
##$GB= 0.15
##$INTBC= 1
##$INTSCL= 1
##$ISEN= 128
##$LB= 0.24
##$LEV0= 0
##$LPBIN= 0
##$MAXI= 10000
##$MC2= 0
##$MEAN= 0
##$ME_mod= 0
##$MI= 1.114404
##$NCOEF= 0
##$NC_proc= 0
##$NLEV= 6
##$NOISF1= 3.799351
##$NOISF2= 2.8
##$NSP= 1
##$NTH_PI= 0
##$NZP= 0
##$OFFSET= 15.70392
##$PC= 1
##$PHC0= -18026.11
##$PHC1= 7.80075
##$PH_mod= 1
##$PKNL= yes
##$PPARMOD= 0
##$PSCAL= 0
##$PSIGN= 0
##$REVERSE= no
##$SF= 200.130013532006
##$SI= 16384
##$SIGF1= 3
##$SIGF2= 2
##$SINO= 400
##$SIOLD= 16384
##$SREGLST= <1H.CDCl3>
##$SSB= 0
##$STSI= 0
##$STSR= 0
##$SW_p= 3612.71676300578
##$SYMM= 0
##$S_DEV= 0
##$TDeff= 0
##$TDoff= 0
##$TI= <>
##$TILT= no
##$TM1= 0
##$TM2= 0
##$TOPLEV= 0
##$USERP1= <user>
##$USERP2= <user>
##$USERP3= <user>
##$USERP4= <user>
##$USERP5= <user>
##$WDW= 1
##$XDIM= 8192
##$YMAX_p= 0
##$YMIN_p= 0
$$ End of Bruker specific parameters
$$ ---------------------------------
##NTUPLES= NMR FID
##VAR_NAME=  TIME,          FID/REAL,        FID/IMAG
##SYMBOL=    X,             R,               I
##VAR_TYPE=  INDEPENDENT,   DEPENDENT,       DEPENDENT
##VAR_FORM=  AFFN,          ASDF,            ASDF
##VAR_DIM=   8192,          8192,            8192
##UNITS=     SECONDS,       ARBITRARY UNITS, ARBITRARY UNITS
##FACTOR=    0.0002768,     1,               1
##FIRST=     0,             0,               0
##LAST=      2.2672688,     0,               0
##MIN=       0,             -89659,          0
##MAX=       2.2672688,     67488,           0
$$ Real data points
##PAGE= N=1
##DATA TABLE= (X++(R..R)), XYDATA
$$ [...]
2060D42L1q87K15R65j192N74L93j466J233n41j30O70q36P04Q8o72O37k19n72J227
$$ 442 473 -414 -199 766 -426 148 541 -925 308 -233 -363 307 -529 175 263 -409 228 9 -563 664
2080F64n18K3L37p74N53k99j004J176O1j36m96O5P04L46j013k07K34m02J484j420
$$ 664 146 169 506 -268 285 -14 -1018 158 219 83 -413 -348 356 702 -311 -518 -284 -686 798 -622
2100f22Q56L01q89L47L37o04P65j231N81O52j189J073n00l8O59o10L1N33r38P71
$$ -622 234 535 -354 -7 330 -274 491 -740 -159 493 -696 377 -123 -161 498 -112 -81 452 -486 285
2120B85k18o41J026o48J32M43o62K34K32m89O69k02m82P08o42K22M69j017J033
$$ 285 67 -574 452 -196 -64 379 -283 -49 183 -306 363 161 -321 387 -255 -33 436 -581 452
2139D52k57o19J042r82L88L88r31O97K15r76R23l33j84O71j059N45K77p67J092
$$ 452 195 -424 618 -364 24 412 -519 178 393 -583 340 7 -177 494 -565 -20 257 -510 582
2158E82n73k02O98p89M01J50r28P24K3l92P50q89K47M69p89M51L03q52R51k56
$$ 582 9 -193 505 -284 117 267 -661 63 86 -306 444 -445 -198 271 -518 -67 236 -616 335 79
2178G9k80P68q84L29J93n10P43j44o40P92p51L90K85p72N35l10l79Q62n24q8Q16
$$ 79 -201 567 -317 12 205 -305 438 294 -346 446 -305 85 370 -402 133 -177 -556 306 -218 -306 510
2199E10j097Q27k09p14Q63l92l6M74j094Q15j79N8R8j062Q4J874j346K35O3k12
$$ 510 -587 240 31 -683 180 -212 -248 226 -868 -53 -232 -174 -76 -1138 -1054 820 -526 -291 -228 -440
2219d40O39K8j076J111j05O87J0o89J323k150J65K97K79R0K34j088P64l79o57
$$ -440 199 227 -849 262 157 844 854 165 1488 -662 -497 -200 79 169 403 -685 79 -300 -957
2238i57J745j244J139n89j564J282R26j956J268M02r62L51J9k94N54j86J36M99
$$ -957 788 -456 683 94 -1470 -188 738 -1218 50 452 -510 -159 -140 -434 120 -66 70 569
2256E69j166J399j041j76R46r87M21j64j37O01m69j57O46n70L24K66q43O86j08
$$ 569 -597 802 -239 -415 531 -456 -35 -199 -336 265 -204 -361 285 -285 39 305 -538 148 40
2275D0n33R13o88L84K00q18N85L85p73R94p60n9N86q91N88K63n24L92k84p5L36
$$ 40 -493 420 -268 116 316 -502 83 468 -305 689 -71 -130 456 -435 153 416 -108 284 0 -75 261
2296B61o64M54L26p49J022n05m14O09p62O72O6q14P42r6l66L19m15K74M11o65
$$ 261 -403 51 377 -372 650 145 -269 340 -422 250 316 -498 244 148 -218 101 -314 -40 371 -294
2316b94K83M77q88O02j76o9N47q32K19M10o63P56l11l05N26q79N55L94o83O15
$$ -294 -11 466 -422 180 4 -65 482 -350 -131 279 -384 372 61 -244 282 -597 -42 352 -331 284
2336B84m71j6M92k67J64J67p36L09J08n15R12m92m8Q02j125P05j89n43P29P5n92
$$ 284 -187 -203 289 22 186 353 -383 -74 34 -481 431 -61 -109 693 -432 273 84 -459 270 345 -247
2357b47O71o67J14N40q23P17k53m07O61n00P3N02o41L65J15m05K83l12k3O71o63
$$ -247 424 -243 -129 411 -412 305 52 -355 306 -194 -121 381 -260 105 220 -185 98 -214 -237 434 -229
2378b29K40q7k90P51n45l3N72q06K93L09p26O86j13m30P32q69K60P32q47N36J18
$$ -229 11 -76 -366 385 -160 -193 379 -427 -134 175 -551 135 22 -408 324 -545 -285 447 -400 136 254
2399B54n65P39o32L51K95q34M84L21o38N86m62j70Q50r03M27L00q41O86J8n65
$$ 254 -311 428 -204 147 442 -392 92 413 -225 361 -101 -271 579 -324 103 403 -438 248 266 -299
2419b99N95k99m2J89n21O33k32l26M82m14mO84q00M55M3o52J002m21l25N28m40
$$ -299 296 -3 -45 144 -377 256 24 -302 180 -234 -238 446 -354 101 144 -508 494 73 -252 276 -164
2440a64J81J21q10Q90q1m41O35m48L93J71n63K34q5n67Q57m99KM86o28M14o8n39
$$ -164 17 138 -672 218 137 -304 331 -117 276 447 -116 118 33 -534 323 -176 -174 312 -316 98 30 -509
2462e09P17k95m3N17n88j73M38l72L41j5m48R18r10N07L75p71O43k29k18M32k41
$$ -509 208 -87 -130 387 -201 -374 64 -308 33 18 -430 488 -422 85 460 -311 332 103 -115 317 76
2483G6m7L15n26K88p4k90N52m00p8M23n82N03o8k52L54m1m00L62l91L81M2m67
$$ 76 29 344 -182 106 32 -258 294 -106 -184 239 -343 160 92 -160 194 153 -247 115 -276 105 147 -320
2505c20O92k33k07O67q06J04L26n34L43K39m34N69l61j20J02l37L59n1j70L73
$$ -320 372 139 -68 599 -207 -103 223 -311 32 271 -163 406 45 -75 27 -310 49 -2 -172 201
2525B01m21j0O38o39L33K51o76N17l79NN59m46R3j16j93L49K4l44N16k69o2J39
$$ 201 -220 -230 408 -231 102 353 -323 194 -185 -180 379 -67 26 -90 -283 66 90 -254 262 -7 -69 70
2547G0k79L74j93k42M83l80K45M68p11K06K69l94K92j17m79P24m49PL38n01J22
$$ 70 -209 165 -28 -270 213 -167 78 546 -165 41 310 -84 208 91 -388 336 -113 -106 232 -269 -147
2568a47j42j4M3q05R16K3J53o78L92N93M22p84J15Q66o81m12j9J54N1L73p88P36
$$ -147 -289 -303 -260 -1065 -149 -126 27 -651 -259 334 756 -28 87 953 272 -140 -159 -5 46 419 -369 367
2590C67r14M45R1p50Q74j23p4K33m53K97M39r61M71J79l27N63n70Q8M74q61O65
$$ 367 -547 -102 -11 -761 113 -10 -84 149 -304 -7 432 -529 -58 121 -206 357 -213 -125 349 -512 153
2611A53O7m80N37j91m44O93m60J00K93q16P07P3p66P48l08j25P17q08L54q4k51
$$ 153 220 -260 277 86 -358 335 -125 -25 268 -548 159 232 -534 214 -94 -219 498 -310 44 -40 -291
2632b91O16n51L88m3l64M92K22r46O24m2k62L38m86j73L99j215J66J172o79P32
$$ -291 325 -226 162 119 -245 247 469 -477 147 105 -157 181 -305 -478 -79 -1294 -1128 44 -635 97
2652I7J94p54J18m16R75n51k65P62l83M89J45j63L1j76n06P96l55m66O21l04K49
$$ 97 291 -463 -345 -761 214 -337 -602 160 -223 266 411 248 279 103 -403 393 38 -428 193 -111 138
2673A38k99k73N72l41J76K93l75j5M52p16O72l89n26Q39l42K43L45o82L61J29
$$ 138 -161 -434 138 -203 -27 266 -109 -124 328 -388 284 -105 -631 208 -134 109 454 -228 133 262
2693B62m84L21j6k59N33q51N70K7m50M74qj96J44m06N23K39o17N50p99J7J48L53
$$ 262 -222 99 83 -176 357 -494 76 103 -347 127 119 -77 67 -339 184 423 -194 356 -443 -426 -278 75
2715G5R4m19n05J149j142Q06m18N82J35m71O81k41J6j634K039q4j090P48o84K40
$$ 75 169 -250 -755 394 -748 58 -360 222 357 -114 567 326 342 -1292 747 663 -427 321 -363 -123
2735a23M67r99Q66j05k05M52m46k13P85q53M44L2l40M62k91N4K07o20L86J75l38
$$ -123 344 -655 211 106 -99 353 -93 -306 479 -374 70 102 -238 224 -67 -13 194 -426 -40 135 -203
2756b03K50j95l53R77p96M30K07o1M9m93k1L69k01j95K58l45L82j00r4N62o25
$$ -203 47 -148 -501 476 -320 110 317 256 305 -188 -209 160 -41 -236 22 -323 59 -41 -135 427 -198
2777a98rO12m56J10P3m28N64k32k73M92m75L62K24o22L57k0k35L68l53j0L34l84
$$ -198 -207 405 -51 59 132 -296 268 36 -237 255 -220 142 366 -256 101 81 -154 214 -139 -149 185 -199
2799a99J60r8PN09j92l51J53q0O7Q7m81O12k34J13M09m20J2J14n60M42j89NN76
$$ -199 -39 -137 -130 379 187 -164 -11 -91 -24 63 -418 194 -40 73 482 62 74 188 -372 70 -119 -114 462
2822D62o61J72L05l72J71m6k70O73n85J78K18n00L64j01m09P00m77K05M32q66
$$ 462 -199 -27 278 -94 77 31 -239 434 -151 27 245 -255 109 8 -401 299 -178 27 459 -407
2842d07M82J62o15Q56n18j1K92n44Q8K27j70N39m73j61L30j80J49m9j94L22l70
$$ -407 75 237 -378 478 -40 -51 241 -303 -215 12 -158 381 -92 -253 77 -103 46 -3 -197 125 -245
2863b45M1N25m79J52L79n09J22J30o20P88k96o1N26o05K97J3l74M48l28k51N95
$$ -245 -204 321 -158 -6 373 -136 -14 116 -504 284 -12 -73 453 -152 145 158 -216 232 -96 -347 248
2884B48o05L81J67q07P48r5k18K70q1j03M05n07k6J32j24O28m02l92Q00m65L67
$$ 248 -357 24 191 -616 132 37 -181 89 8 -95 310 -197 -223 -91 -215 413 11 -381 419 -46 321
2905C21j3m30J97L8l95M34l7j86J66l92L73l67j7O71l61m11P51p43L45J12l58
$$ 321 308 -122 75 113 -282 152 115 -71 95 -297 76 -291 -308 363 2 -409 342 -401 -56 56 -302
2926c02N86l23q4M87o13K18J41l56M00k40J00M34n58L74J54n19M39l39j97M22
$$ -302 284 -39 -123 364 -249 -31 110 -246 154 -86 14 448 -110 264 418 -101 338 -1 -198 224
2946B24l43O0M47o56J40Jk8K04j21o0K37k77K42l5k36M22k23k96M84m60K48P5
$$ 224 -119 -59 388 -268 -128 -127 -155 49 -72 -132 105 -172 70 35 -201 221 -2 -298 186 -274 -26 49
2968D9m3J01n3l43N06l75KN97n77L46k14k18M87k45m5K39j92j10M33o14M20q1
$$ 49 6 107 54 -289 217 -158 -156 441 -136 210 -4 -222 265 20 -25 214 22 -88 345 -269 151 70
2990G0j37J52l47j6K07j9N13l65m08N56k98J77K69p61M31p8k67N86n54J82J85
$$ 70 -67 85 -262 -278 -71 -90 423 58 -350 206 -92 85 354 -407 24 -54 -321 265 -289 -107 78
3011G8l52K79K9l89O82k44k52M69o44L47Pm68M15k35K09K68n28O57p8l02K23k71
$$ 78 -274 5 34 -355 327 83 -169 300 -344 3 10 -458 -43 -278 -69 199 -329 328 250 -52 171 -100
3033a00j01P06o30N7R6j33L78k16o1M70k94p6q0m12M48n9m44P40m44mL99j86j97
$$ -100 -201 505 -125 -68 28 -105 273 57 -4 466 172 96 16 -396 52 -7 -451 289 -155 -159 240 54 -143
3056a43L39m37N96l83j82J54P6m1Pj30J68lm08Q35k31n21N07l49L31J27n19J66
$$ -143 196 -241 355 -28 -210 -56 20 -21 -14 -144 24 21 -387 448 217 -304 203 -146 185 312 -207 -41
3078d1R3k03N39n11P2L5k37K48O3k00M24k01r1K80m86L29R5l00L08m21K73M10
$$ -41 52 -151 388 -123 -51 -16 -253 -5 58 -142 282 81 -10 270 -216 113 208 -92 216 -205 68 478
3100D78q69N52j8j59J67k13o4L79o03L64K47m40M19m53k36N25k67L07r2m12L89
$$ 478 -391 161 143 -16 151 -62 -126 253 -350 14 261 -179 240 -213 -449 76 -191 116 24 -388 1
3121AQ5k00J48o2p5K95n39L05J16l20M06r6n2K28m59O3L21n42P76m70k09O67m91
$$ 1 86 -114 34 -28 -103 192 -347 -42 74 -246 160 64 12 240 -219 -156 165 -377 399 -71 -280 387 -104
3144a04Q7M19m85K11K7l01M37l76P9L51m51J90j42k49N64p2k94N04m54L9K21n33
$$ -104 -17 402 -83 128 155 -146 291 -85 -6 345 -106 84 -58 -307 257 185 -109 395 -59 -20 201 -332
3166c32M78R7m22L28l41J82n6l47Q26n95R5K97p5q5J68n38K78L67p00N14q1k31
$$ -332 146 243 -179 149 -192 -10 -66 -413 413 -182 -87 210 135 50 218 -320 -42 325 -375 139 58 -173
3188a73M45n96M89J14l62L17j80k49M56m49R6L15k62J23N4k26K38j43J60J77n59
$$ -173 272 -324 165 279 -83 234 54 -195 261 -188 -92 223 -39 84 138 -88 150 7 167 344 -215
3209b15K61J66m23L93m26J27L91n11L43Q5m85L80j60L2L63n28K86J23l49K51k63
$$ -215 46 212 -211 182 -244 -117 274 -237 106 191 -294 86 -74 -42 321 -207 79 202 -147 104 -159
3230a59j57K86j12kJ75k68M76j40m43M70j13j50L76k42J76l7j69L56n11j26J73
$$ -159 -316 -30 -142 -144 31 -237 239 99 -344 126 13 -137 239 -3 173 136 -33 323 -188 -314 -141
3251a41M0J09k5m61L36J27q5M17m69j7L25l63L14J28n04M36N0j25ok02K69K3m92
$$ -141 -101 8 -17 -478 -142 -15 -100 317 -152 -169 156 -207 107 235 -269 167 217 92 86 -116 153 176 -316
3274c16K34R0Q7J11k95J94J34o90M95k90J12L70k43l5K49o36N11k24k3M48m40
$$ -316 -82 8 95 206 -89 105 239 -451 44 -246 -134 236 -7 -42 207 -429 82 -142 -165 283 -157
3295a57K4L33n27L99r6l85O31m48K51K26n41M96k06j15K71l32P9K87k45J0J4j20
$$ -157 -133 200 -327 72 -24 -409 222 -226 25 251 -290 206 0 -115 156 -176 -97 190 -55 -45 -31 -151
3317a51L51j35n13N88k91P8J62q9J60j65N0J00k36J26L28o40L00r1j86O61m96
$$ -151 200 65 -448 140 -151 -73 89 0 160 -5 45 145 -91 35 363 -277 23 -68 -254 407 -89
3338h9qL35k43Qo7k29N09j84L5L38p18M33R4k36J32j79k4J56k19O2L25m40L29
$$ -89 -97 238 -5 3 -64 -293 216 32 67 405 -313 120 214 -22 110 -69 -93 63 -156 -94 231 -209 120
3361A20l41j60L60J45j29J01k15KJ65l33N48j71j79M11l12L6J5m90M40K6l07L81
$$ 120 -221 -381 -21 124 -5 96 -119 -117 48 -285 263 92 -87 324 12 48 63 -427 13 39 -268 113
3383A13l78J34M10p49N42o6j85K82o8o77O83l90L96j44j26O80l58k96P06o40J06
$$ 113 -265 -131 279 -470 72 6 -179 103 35 -642 41 -349 47 -97 -223 457 99 -197 509 -131 -25
3404b5J23l33K73l3j09K37k51j31N18m64M74q8n28M37l0j09L99o07K37K54m70
$$ -25 98 -235 38 5 -104 133 -118 -249 269 -195 279 191 -337 100 70 -39 360 -247 -10 244 -226
3425b26O77n51P0K39k77J09K03l53R4P1l68M94l39Q8m6q1L23k04J80J43l40l0
$$ -226 451 -100 -30 209 -68 41 244 -109 -15 56 -312 182 -157 -69 -115 -196 127 -77 103 246 -94 -124
3447a24K10k36J91K10l93K73m2l15J83o9J43J64j99L1J59m02O32m96L02r1n60
$$ -124 86 -150 41 251 -142 131 89 -226 -43 -112 31 195 -4 27 186 -216 416 -80 222 131 -429
3468d29N40k73J66J91j45j40K7p6R2R7n83P87k16j22q8L27q8j08j59L73j82j60
$$ -429 111 -162 4 195 50 -90 -63 -139 -47 50 -533 254 38 -84 -172 155 67 -41 -200 173 -9 -169
3490a69K53r6R0J62n00K83K3k47M56k33J22j00j54K32J14k48K09n12K21R6l31
$$ -169 84 -12 78 240 -260 23 46 -201 255 22 144 44 -110 122 236 -12 197 -315 -94 2 -329
3511c29L78Pk3O3k10L3K26j50k0k6j95L05l3j02L12l83J68L22m83J70N9k11K31
$$ -329 49 56 33 96 -114 -81 145 -5 -25 -51 -246 59 26 -76 236 -147 21 343 -140 30 89 -122 109
3534A09j45L6O5j26r2K82m00M62N9k67M12n56J89N1l37K35n3k19N01l45L19k61
$$ 109 -36 0 65 -61 -153 129 -271 191 250 -17 395 -161 28 79 -258 -23 -76 -295 206 -139 180 -81
3556h1o0J67K6m57O46k46j0l0k20J15N1J57Q7l60K62O7j67K44p5j24J44j48j99
$$ -81 -141 26 52 -405 241 -5 -15 -45 -265 -150 -99 58 145 -215 47 114 -53 191 116 -8 136 -12 -211
3579b11K31o4LJ32j19j74L03n36P05l12OL13p06M02J10n4J88j99k3L16l68r5K70
$$ -211 20 -44 -41 91 -28 -202 101 -435 270 -42 -36 277 -429 -27 83 29 217 18 -5 311 -57 -152 118
3602A18p9L65o04J28M55o28N06j27n0O8l68Q8K69j25q1K23l06L34r9m75O09n2
$$ 118 39 404 -200 -72 383 -245 261 134 84 152 -216 -128 141 16 -65 158 -148 186 87 -388 221 169
3624A69m4J32k89J49K9n10L67M4l47L67o8l3L38n33M11l7m2J13r9l6R4j58J8J48
$$ 169 125 257 -32 117 146 -364 3 47 -300 67 -1 -34 304 -229 182 145 103 216 117 81 175 17 35 183
3648A83k92K09j30l86P51n12K16J7r8L35l06RK47l30O9K77l05K3J6j54Q9K9J46
$$ 183 -109 100 -30 -416 335 -177 39 56 -42 293 -13 -4 243 -87 -18 259 -46 -23 -7 -161 -72 -43 103
3671A03R0l89K71J04j32O1N9j10J73m62J06j97K0L38k75K69Q4l00K06m7o7K50
$$ 103 193 -196 75 179 47 108 167 57 230 -232 -126 -323 -303 35 -240 29 113 -187 19 -28 -95 155
3693A55p6k29L57l07m9M10n58L41j44k88P44m37R8o2k46L80M9j92M54j00k17J35
$$ 155 79 -150 207 -100 -149 261 -297 44 -100 -388 356 -81 17 -45 -291 89 138 -54 400 300 83 218
3715B18k59o5M86l78K13j93j35N70l60j73J44k44K92j50l1M16m82K2M60m61L3
$$ 218 -41 -106 380 2 215 22 -113 457 97 -76 68 -176 116 -34 -65 351 -131 -109 351 -110 -77
3736g7L1j64L08j52k9L10k97J75k69j15L71o8k61O63m55l9Q5m5K15j37N3R3m90
$$ -77 -46 -210 98 -54 -83 227 -70 105 -164 -279 92 24 -237 426 -29 -68 17 -28 187 50 103 196 -294
3759b94Q5K32O3N8j15l50P42m55nK10m65M69j33j42L67k60j11J08j96K40J31l42
$$ -294 -209 23 86 144 29 -321 421 -34 -39 171 -294 175 42 -100 267 7 -104 4 -192 48 179 -163
3781a63K77k62j5K90k34J55m2k95L72Mj26M42l86o4J29l26L01m1k62O18n12Q9
$$ -163 114 -148 -163 127 -107 48 6 -289 83 87 -39 403 17 -47 82 -244 57 16 -246 372 -140 -51
3803e1%j51K61j63J0K39m57M3M47l3r8N5l19K96J70k19R3k56l1L31m98K82K44
$$ -51 -51 -202 59 -104 -94 145 -312 -269 178 145 47 102 -217 79 249 30 123 -133 -164 167 -331 -49 195
3826A95n06N11l25o4L97k46J54k86M0K25k53J71K34k53l3K4k07J92J69l74L16
$$ 195 -311 200 -125 -189 208 -38 116 -170 -130 95 -158 13 247 -6 -39 -15 -222 -30 139 -235 81
3847H1j33j2J44m11N61o8n78Q26l27k59L49m90M99lk53j3J55j5r8R7j65J46k76
$$ 81 -52 -64 80 -331 230 162 -416 410 83 -176 173 -317 182 179 -74 -87 68 53 -45 52 -113 33 -243
3870b43J36J09l49N89m45J22K07k45R0J11k89J78p9q9L81m47K83K02k97K39k3
$$ -243 -107 2 -347 242 -203 -81 126 -119 -29 82 -207 -29 -108 -197 184 -263 20 222 -75 164 141
3891A41m83O30l79J00J67k22R3J64j47J26k28qN6k55L73j72k75O05k25k8K24m37
$$ 141 -342 288 -91 9 176 -46 47 211 64 190 -38 -46 10 -245 128 -44 -319 286 61 33 257 -180
3913a80M1J25J19J38m37k12M04m4J79J49l88K14j01k2L20m76M89k09k12J44L2
$$ -180 -139 -14 105 243 -194 -406 -2 -46 133 282 -106 108 7 -15 305 -171 318 109 -103 41 73
3934G3j98N8j78K01Jk72K49j09K11K10m26N3n7K57j49K97k47O6j28J2K36k21r5
$$ 73 -125 -67 -245 -44 -43 -315 -66 -175 36 246 -180 -127 -184 73 -76 221 -26 40 -88 -76 160 -61 -156
3957a56L34n35L44L32l25Q5l8O9p7PK41k20k35J97k1j80L75k56J83O8m08M76k99
$$ -156 178 -357 -13 319 -6 79 41 110 33 40 281 61 -174 23 2 -178 197 -59 124 192 -216 260 -39
3980c9j10J75o2J21M0l23K84l2j07J53m3j46K85l46K94k85k9L77m69L03K9k75
$$ -39 -149 26 -36 85 125 -198 86 54 -53 100 57 -89 196 -150 144 -141 -170 207 -262 41 70 -205
4002b05J32P1k29L49k37PL40n92L98j69p4K38L3m16O53m55K71J14l74K89n3j19
$$ -205 -73 -2 -231 118 -119 -112 228 -364 34 -135 -209 29 62 -354 299 -156 115 229 -145 144 91 -28
4024b8L36k89k30J44n2K40l7k46M00j21L6j23j56K33R2m83M54j32k52M80n58L94
$$ -28 308 19 -211 -67 -119 121 84 -162 238 117 153 30 -126 107 199 -284 170 38 -214 266 -292 102
4046A02J09l52L01J05m33J64j52K64r4K0k6q5J37k01O4k86O29m61J03M0k07L21
$$ 102 211 -141 160 265 -168 -4 -156 108 14 34 8 -77 60 -141 -77 -363 266 -195 -92 -52 -259 62
4068F2j53L2N45o27j72L04K44m2j14j68M3J52m16L78k17P0K04r0P2l34K27K93
$$ 62 -91 -59 486 -141 -313 -9 235 193 79 -89 -46 106 -310 68 -149 -79 125 35 107 -227 0 293
4090B93k58P6P2k07KK09k93J38j6l4J8Q1J18j2l04K78j93k21L93r2r9l8k70N19
$$ 293 35 111 183 -24 -22 187 -106 32 16 -18 0 81 199 187 -117 161 -32 -253 140 48 -51 -89 -359 160
4114A60k82pM78p66N44l49l70K53r3K35L75n24M87l63j22N50j120Q18J9j44L24
$$ 160 -122 -129 349 -417 127 -222 -592 -339 -432 -197 178 -346 141 -222 -344 206 -914 -96 -77 -221 103
4135A03j35j41L55j97k08L99k03k70N61k50j24J8j68L34j91k59O26j91J26j17
$$ 103 -32 -173 182 -15 -223 176 -27 -297 264 14 -110 -92 -260 74 -117 -376 250 59 185 68
4155F8j78n8J93q0K56j60LL09j320Q42L63k38J3l73M42j43Pn5j2j4R7o5M8K28
$$ 68 -110 -168 25 -55 201 41 44 353 -967 -125 238 0 13 -360 82 -61 -54 -109 -121 -135 -38 -103 -55 173
4179A73k06K57l50nM03k35r5L61k94J30j70l1J41k92K72K21m39N0P1Kr6O7J38
$$ 173 -33 224 -126 -131 272 37 -58 303 9 139 -31 -62 79 -213 59 280 -159 -109 -38 -36 -132 -65 73
4202G3K30m55R7J20j56M54l33o1L96l90j01Q3k16M45n6l21k27P24j63m12J59K52
$$ 73 303 -152 -55 65 -91 363 30 -31 365 -25 -126 -43 -259 186 130 -191 -418 306 143 -269 -110 142
4224A42o4j87J8K85l23M03k25j43L41m19J3M13l13L71m28J20K44k48J18j03j18
$$ 142 78 -109 -91 194 -129 274 49 -94 247 -172 -159 254 -59 312 -116 4 248 0 118 15 -103
4245a03J64R5j69K03m22J58k66L41N92q70M12k08k07P7M16m32O9L05q29R34k65
$$ -103 61 156 -13 190 -232 -74 -340 1 593 -277 135 -73 -280 -203 213 -219 -150 155 -674 260 -5
4266eN47J89j023M1N44p51O01n65L56k77j45L72J050k06j160K89L69j65k62K75
$$ -5 542 731 -292 -251 293 -458 143 -422 -66 -343 -488 -116 934 728 -432 -143 226 61 -201 74
4286G4m13J16n7Q55p29O3k63J1K76l7k25M86o28L63J12l05M65l78K59L04m96R7
$$ 74 -339 -223 -280 575 -154 -91 -354 -343 -67 -104 -329 157 -471 -108 4 -301 164 -214 45 349 -147 -50
4308e0k1k00K31q9m3K29k00P6n8j37M36l9n41O27k93j16L26m85N32l66K58j6j76
$$ -50 -71 -271 -40 -129 -172 57 -143 -67 -125 -262 174 135 -406 221 -72 -188 138 -347 185 -181 77 61 -115
4331a15K55N5o45M33j38J80Q3m52L94N0k06J47J69m37L78M2l67M38l85N5K05j55
$$ -115 140 195 -450 -17 -155 25 108 -344 50 100 -106 41 210 -227 151 193 -174 264 -121 -66 139 -16
4353a6J39m0j62K57k34L2R8L6K20m64j50M20k34O9N4m71Q17k41N0o4l30k6M48
$$ -16 123 83 -79 178 -56 -24 74 110 330 -134 -284 136 -98 -29 25 -446 371 130 180 116 -214 -240 208
4376B08p7k78M16j74q0j63K85j29j30L13p2j97L96l43kL64l98J66j37j15M26l57
$$ 208 131 -147 269 95 15 -148 137 8 -122 191 119 -78 318 -25 -27 337 -61 105 -32 -147 279 -78
4398g8J16J71l13n6N23n35Q2k3l6L33l12j62K64j7K73m41R8K91j76n7J47m8L6
$$ -78 38 209 -104 -160 363 -172 -90 -113 -149 184 -128 -290 -26 -43 230 -211 -113 178 2 -55 92 44 80
4421H0j02lJ27p0j34J9r5K26J96l01J59J10l45J37j34n4L01k53J78p6L2K24l40
$$ 80 -22 -25 102 32 -102 -83 -178 48 244 -57 102 212 -133 4 -130 -184 117 -136 42 -34 -2 222 -118
4444a18R1Q1k49J85L33m24R8p7q1K29k20j2J74J41J6j56K0J14l03Q3L56l62N6
$$ -118 -27 54 -195 -10 323 -101 -3 -80 -161 68 -152 -164 10 151 167 11 31 145 -158 -75 281 -81 -25
4467b5J80k32R4r3k59O53o07K71K31n62L70J90k96k1K06l43M57n14K31l6p2N8
$$ -25 155 -77 17 -76 -335 318 -289 -18 213 -349 21 211 -85 -106 100 -243 214 -300 -69 -105 -177 -119
4489a19J32l37L00j78L24j5m02K36P5J65J63k42j5ol03L23k58N8J19o79L56J07
$$ -119 13 -324 -24 -202 122 107 -295 -59 16 181 344 102 87 81 -222 101 -157 -99 20 -659 -303 -196
4511a96J66r8L44n43N95l27R0p3j76j5M99o82noR0K48o2OM04n33K61J02R2q0r1
$$ -196 -30 -128 216 -327 268 -59 31 -42 -218 -233 266 -416 -421 -427 -337 -89 -151 -145 259 -274 -13 89 181 101 10
4536A0J86j57n5o0J32j01R2r2K59l2k69K04p2n3K35j71k22n2j51K97L73k92K38
$$ 10 196 39 -16 -76 56 -45 47 -45 214 182 -87 117 45 -8 227 56 -166 -218 -369 -72 301 9 247
4559B47j71j06K91j57k45q0K34K29p3k18L26k93j1R4k45M02k29M6J2q1m6M59m38
$$ 247 76 -30 261 104 -141 -221 13 242 169 -49 277 -16 -27 67 -178 224 -5 41 53 -28 -74 385 -53
4582e3L26m6k34N1m1Q3k9k11o4L07q0r5R7j18K54j59K1L0K3Rj58P6k4R1k54L72
$$ -53 273 227 -7 44 3 86 57 -154 -218 89 9 -86 11 -107 147 -12 9 39 62 71 -87 -11 -35 56 -198 174
4608A74j79O0O1j21K35j3k1l2m07K02q8M5L26k05j27O3J9J85l9j97J95m3p2J21
$$ 174 -5 55 116 -5 230 217 196 164 -243 -41 -129 -84 242 37 -90 -27 -8 177 138 -59 136 93 21 142
4632A42k52K49j34j18J44k44K0K60k47P4R2J49j62k4j09L34j97l60N21q6m84O62
$$ 142 -110 139 5 -113 31 -213 -193 67 -180 -106 -14 135 -27 -51 -160 174 -23 -383 138 52 -432 230
4654B30k70j39K56l03M15l2j20M05n00L48m8n81L81k04L31j45M9R0K9L0l03o4
$$ 230 -40 -179 77 -226 189 157 37 442 -58 290 242 -339 42 -162 169 24 73 163 192 222 -81 -145
4676a45j99L86M2j20J67k22J87k4L8k24j40J87L35n10K68O9l29K48j42J04k5M8
$$ -145 -344 42 84 -36 131 -91 96 72 110 -114 -254 -67 268 -242 26 95 -234 14 -128 -24 -49 -1
4698aL23k36m40L57m5J18r5M4L1J22k88K39j07k8J79j77J64j79J8Q3k67J03L71
$$ -1 322 86 -354 3 -42 76 -19 25 56 178 -110 129 22 -6 173 -4 160 -19 -1 82 -185 -82 289
4721B89m18r9K13j31K35k13Q9l0j0K8K49j60NJ24l93K14k15K15j55j4oM45q0J
$$ 289 -129 -228 -15 -146 89 -124 -35 -65 -75 -47 202 42 47 171 -222 -8 -223 -8 -163 -177 -183 262 182 183
4745A83J12m90J45n7J23K25k92j52L18l13J31J75j26o7r5K45RP7l4m19J33L80
$$ 183 295 -195 -50 -107 16 241 -51 -203 115 -198 -67 108 -18 -85 -180 65 74 151 117 -302 -169 211
4767B11l50Q1o9P5K5j29m7J75k65J66Kj4J02q3J02K63m52K83N7k51K90o7l41M19
$$ 211 -139 -58 -127 -52 -27 -156 -203 -28 -293 -127 -125 -139 -37 -120 -18 245 -207 76 133 -118 172 105 -236 183
4791A83l39O2M11m74J10K65k26P3P3l52L54j85N0P6k5N8j09J22k00j76O7K52r1
$$ 183 -156 -94 317 -157 -47 218 -8 65 138 -214 140 -45 5 81 56 114 5 127 -73 -249 -182 70 -21
4814b1j6j32J58K10n11L45J38k38J47j50m5P9K79k91K32l65K07J17m78L33k3j7
$$ -21 -37 -169 -11 199 -312 33 171 -67 80 -70 -115 -36 243 -48 184 -181 26 143 -335 -2 -25 -42
4836d2O6M1nJ88n71L63j91P0L67r0m36J61K96o3l2j26J58j04q7j8K85o4j59m01
$$ -42 24 65 60 248 -323 40 -151 -81 286 196 -240 -79 217 154 122 -4 154 50 -37 -55 230 166 7 -394
4860c94L70J20l82N81p7k32R7k42J35J27l9O5k21K4K23k38M4j26K33J78j39k12
$$ -394 -24 96 -286 295 218 -14 83 -159 -24 103 64 129 -92 -68 155 -83 -39 -165 68 246 107 -105
4882a05K17j64j29L78l12L25j52o7j6j96L36j78j61L24j76J15J95l48j87M05l10
$$ -105 112 -52 -181 197 -115 210 58 -9 -25 -221 115 -63 -224 100 -76 39 234 -114 -301 104 -206
4903b06J76J31m73J84K74m9J9j77N7J38k07J67R0k64J7K6l6M45m19K17J0k59K88
$$ -206 -30 101 -372 -188 86 37 56 -121 -64 74 -133 34 124 -140 -123 -97 -133 312 -107 110 120 -139 149
4926A49k12J40J33m59M2K78r2K9o3J58R2j85J7J86m03K70k6k47K01mM4n6O4j9
$$ 149 -63 77 210 -249 -207 71 -21 8 -55 103 195 10 27 213 -190 80 54 -193 8 4 48 -8 56 37
4950C7J9l09N87k88j95P1k44M24j12j2J55k11J67j27L5R1l9j78J41j05j54L31
$$ 37 56 -253 334 46 -149 -78 -322 102 -10 -22 133 -78 89 -38 -3 88 49 -129 12 -93 -247 84
4972H4k33J52K03k18J93j66j91M22j18j11j70k71P61o0k04l9K60k32K93k95j11
$$ 84 -149 3 206 -12 181 15 -176 246 128 17 -153 -424 337 277 73 34 294 62 355 60 -51
4993e1J20j69K1K95l19L0nm7J92l58L14Qq0L04k42O8n9j44J34l3k93K53j61K34
$$ -51 69 -100 -79 216 -103 -73 -78 -125 67 -291 23 31 -49 255 13 81 22 -122 12 -21 -314 -61 -222 12
5017A2Q7j74J25J4jm5j57j18L48j27j17L03k68n7K72k12K92l06J5K38l74M54K3
$$ 12 99 -75 50 64 63 18 -139 -257 91 -36 -153 150 -118 -175 97 -115 177 -129 -114 124 -250 204 227
5040B27k53p1j56J04O7m4K69M2k62j20L00J04K20l27l04L75l72K19j53N1K93m37
$$ 227 -26 -97 -253 -149 -82 -126 143 185 -77 -197 103 207 427 100 -204 171 -201 18 -135 -84 209 -228
5062b28P1K56l4q1K08k74J72o2j2J83l37J1L14l18J02R2p2O9N7K1p8M7j56pJ75
$$ -228 -157 99 65 -16 192 -82 90 28 16 199 -138 -127 187 -131 -29 63 -9 60 117 138 60 107 -49 -56 119
5087A19j43j32J21K80k19o6K10l14L19k12J61k03J40J15r2j33j29K05J12j7k14
$$ 119 -24 -156 -35 245 26 -40 170 -144 175 -37 124 -79 61 176 84 -49 -178 27 139 122 -92
5108i2L4p3K23J31j19k88M89l73R6K41l45j27K10r8p0k8O7K15k71K12j03q4K96
$$ -92 -58 -131 92 223 104 -184 305 -68 28 269 -76 -203 7 -91 -161 -189 -122 93 -178 34 -69 -153 143
5131A43j57R9O5m49N8L96l60L18j02J61j31k48J86K74m68K60j36J55r8M0k20M49
$$ 143 -14 85 150 -299 -241 155 -205 113 11 172 41 -207 -21 253 -215 45 -91 64 -34 6 -214 235
5153B35l39L01j29m13K87k11K15L25l30k7K47l60J83K4k89K13k4K66j46j72J08
$$ 235 -104 197 68 -345 -58 -269 -54 271 -59 -86 161 -199 -16 8 -281 -68 -92 174 28 -144 -36
5174c6O2j30J90l4j20K48l37K99n1k5j6K23n77N50m12J35J37l32L53k03L3q4n6
$$ -36 26 -104 86 52 -68 180 -157 142 91 66 50 273 -304 246 -166 -31 106 -226 127 -76 -43 -127 -183
5197a83M02k62J00j24J15r8K91m54q8M95m14L34j09k86K74j85J73K47k60J00M0
$$ -183 219 -43 57 -67 48 -50 241 -213 -301 194 -220 114 5 -281 -7 -192 -19 228 -32 68 108
5218A08Qp5k89J19J03J25k87K86j40J08K75o60L86k35K09r7k2L05J48m03L50k90
$$ 108 116 41 -248 -129 -26 99 -188 98 -42 66 341 -319 67 -168 41 -56 -78 227 375 -28 322 32
5240C2l81L04m3J72j23R3j51L48k73j60L1J63K33l44N9j40J26K48l04J88O8l25
$$ 32 -349 -45 -88 84 -39 54 -97 251 -22 -182 -151 12 245 -99 -40 -180 -54 194 -110 78 146 -179
5262a79J48l2K06j33J59k91J56j98J93l7J0L28l67r7J84j60J28K17l62J53KK9
$$ -179 -31 -63 143 10 169 -122 34 -164 29 -8 2 330 -37 -134 50 -110 18 235 -127 26 28 57
5284E7j20n4J02Q3j65J16p6k37N27l13K35K28m61J20j32j83K99j65K69K9k85K72
$$ 57 -63 -117 -15 68 -97 19 -57 -294 233 -80 155 383 -78 42 -90 -273 26 -139 130 159 -126 146
5306A46p3j74K49k49l8L74m34L38l4j37J42P3L3l66J54P2j03J5p4K46k36K01k97
$$ 146 73 -101 148 -101 -139 235 -199 139 105 -32 110 183 216 -150 4 76 -27 -12 -86 160 -76 125 -172
5329a72O1K61n41L20K9k5J26J90k65o1m9j9K02l7J24l25J22K79k93J83N7m73L63
$$ -172 -111 150 -391 -71 -42 -67 59 249 -16 -77 -126 -145 57 20 144 -181 -59 220 -73 110 167 -306 57
5352E7j86L9K73l28J09K73k13j03N1j80L03j15o0J23k72K37J38k02P0J65l86K44
$$ 57 -129 -90 183 -145 -36 237 24 -79 -28 -208 95 -20 -80 43 -229 8 146 -56 14 179 -207 37
5374C7l47J74K16k33L07l26J43Lj68J57J46m15J52j18J96K04j43N0K38k42j18
$$ 37 -310 -136 80 -153 154 -172 -29 -26 -194 -37 109 -306 -154 -272 -76 128 -15 35 273 31 -87
5395h7J28k63L49n4k2k71L33j17j4J67j38j36j08J66K0j53J59k01L12o1k03K56
$$ -87 41 -222 127 73 51 -220 113 -4 -18 149 11 -125 -233 -67 -47 -200 -41 -242 70 9 -194 62
5417F2j93J28J10l42L43L4l98M41k84J16mj05K64J34m07J00j7J95k61J44J17l2
$$ 62 -131 -3 107 -235 108 142 -256 185 -99 17 13 -92 172 306 -101 -1 -18 177 -84 60 177 145
5439A45k42L2j6J52j16R1j98K15k84L61P3k99J92o8k17L45mj63J14l01K54j39
$$ 145 -97 -65 -81 71 -45 46 -152 63 -221 140 213 -86 106 38 -179 166 162 -1 113 -188 66 -73
5461g3j5K8J2Q9N2n0K3O0k68J56m6L01o8l25K35j35k26K05Qj9J01kr3J48j86R6
$$ -73 -88 -60 -48 41 93 43 66 126 -142 14 -32 269 201 -124 111 -24 -250 -45 -37 -56 45 43 -50 98 -88 8
5487HL6o6m0K4q7J35Q1l2j12j02L81k40M4R6l63J38J96k96K91l25K40J32k03q4
$$ 8 44 -22 -62 -38 -125 10 91 59 -53 -155 226 -14 30 126 -237 -99 97 -199 92 -233 7 139 -64 -148
5511a48K24k08L05k74J48m1l42K67J1nO7J06j29P9m5r3J9R3O5p2j28J33l50J25
$$ -148 76 -132 173 -101 47 6 -336 -69 -58 -63 4 110 -19 60 15 -78 -59 34 99 27 -101 32 -318 -193
5535a93K09l0j3K76k81MJ83m62K86L8m7K7j86L10l9l04N39k90l40K57j0P9m9K99
$$ -193 16 -14 -27 249 -32 -28 155 -307 -21 17 -30 -3 -189 121 82 -222 317 27 -313 -56 -66 13 -36 263
5559B63k9l92K37o8L1J29k39K27k11K9P0M4j02j32J90k53M07N7m7r2k27K87n8
$$ 263 234 -158 79 11 42 171 -68 159 -52 -23 47 91 -11 -143 47 -206 201 258 211 119 -108 179 121
5582A21j50J93j60k08K18j1L4J3J52j43M9j50Q7k76J08Lp0K16k21J74K43J09m20
$$ 121 -29 164 4 -204 14 3 37 50 202 59 108 -42 45 -231 -123 -120 -190 26 -195 -21 222 331 -89
5605h9J23j89K12O9l97L03j39L15j7m77J0L48j73J28%p6Q5k22L58p7j30q3K3J52
$$ -89 34 -155 57 126 -271 32 -107 208 191 -286 -276 72 -101 27 27 -49 36 -186 172 95 -35 -118 -95 57
5629E7n8J27k41J67o5O7O4l60J70L0R9N1j72Q0J25m70K74P5k45K09o7L71q2k23
$$ 57 -1 126 -115 52 -13 54 118 -242 -72 -42 57 108 -64 16 141 -329 -55 20 -225 -16 -83 288 206 -17
5653a7J13k51N9J62j35K16j17k04J51K7l19L69m1k10M49l55N3K01j71P5Q3j50
$$ -17 96 -155 -96 66 -69 147 30 -174 -23 4 -315 54 13 -197 252 -103 -50 151 -20 55 138 -12
5675a2J24K0j58Q5m4k1J85l02K74p6k71R1J28L4L2O7j99K73m26K10j16J13P0l33
$$ -12 112 132 -26 59 15 -6 179 -123 151 75 -196 -105 23 57 89 156 -43 230 -196 14 -102 11 81 -252
5699b52L16k55K3K84l53K93k82J57K05n1j52j4j56J60Q9L0n6r9J1J54m0r1K28
$$ -252 64 -191 -168 116 -237 56 -226 -69 136 85 -67 -81 -237 -77 12 42 -14 -113 -102 52 12 -79 149
5722A49l21J8jM9J70k13K19J67l15K6L33k95M9J79R7k23k41m8K22J9P4k51m6L00
$$ 149 -172 -154 -155 -106 64 -149 70 237 -78 -52 281 -14 35 214 311 88 -153 -201 21 40 114 -137 -183 117
5746A17J59k18J54j21q9J13j84L8J4M1P6j85k43K81KoN6q7L42m72K46K4k82l7
$$ 117 276 58 212 91 2 115 -69 -31 -17 24 100 -85 -328 -47 -45 -51 5 -82 260 -212 34 58 -224 -261
5770b61J33J0L27k83J59k56L54n9k13q2K27j44PJ1Q7j25N7K25p3k5p4J37l33J07
$$ -261 -128 -118 209 -74 85 -171 183 124 -89 -171 56 -88 -81 -70 17 -108 -51 174 101 76 2 139 -194 -87
5794h7P3j62L61j26N5J70k11k97L97l84J96J75l24j04O0N8L17m41L82R1m08L36
$$ -87 -14 -176 185 59 114 284 73 -224 173 -211 -15 160 -164 -268 -208 -150 167 -274 108 199 -209 127
5816A27k66k7K0J01O2j53K25k4j93J78O5q2k7J45n63L46J85o1j41N5J92J04j61
$$ 127 -139 -166 -146 -45 17 -136 89 65 -128 50 115 33 6 151 -412 -66 119 58 -83 -28 164 268 107
5839A07Q7k26O7L71k51j91Nj61K07k7P1j32j49k3L82k55J11J67l09M69m27j68
$$ 107 194 -32 35 406 155 -36 -31 -192 15 -12 59 -73 -222 -245 137 -118 -7 160 -149 320 -107 -275
5861b75L70J72l63L38l10R3l3r9j42J85o5K64l7k15L91m00j3L2J67Joq2J30k37
$$ -275 95 267 -96 242 -68 25 -8 -107 -249 -64 -129 135 98 -117 274 -126 -139 -107 60 61 55 -27 103 -134
5885a34Q0J09j65P0J88k40J64r8J75o2k80J71K81j30J39j57J61l28k09K36J34
$$ -134 -54 55 -110 -40 148 -92 72 -26 149 87 -193 -22 259 129 268 111 272 -56 -265 -29 105
5906A05O1j04n7q5K45k58M22l2n84L12J9k5n5J8K51k59j91K64j52J4K77l82J87
$$ 105 166 62 5 -80 165 -93 329 297 -287 25 44 19 -36 -18 233 -26 -217 47 -105 -91 186 -196 -9
5929in7j55J95J36k65L52n54L57P0j3Q0j12qM8q0n9J90k41J08Qq9J99J8q6R4p7
$$ -9 -66 -221 -26 110 -155 197 -357 0 70 57 137 25 17 65 -15 -74 116 -125 -17 -9 -98 101 119 33 127 50
5955E0j06K1j1o7K84l83N19r5l64J42O3J1M7k16O2J26j47K62k45J05k1l79L04
$$ 50 -56 -35 -46 -113 171 -212 307 212 -152 -10 53 64 111 -105 -43 83 -64 198 -47 58 37 -342 -38
5978c8O2p8Q2j48J69M8j04L6k60K1M99k43j26K73k34K11k99J69r8J6N1K25l69
$$ -38 24 -54 28 -120 49 97 -7 29 -231 -210 289 46 -80 193 -41 170 -129 40 -58 -42 9 234 -135
6001a35OL67k89j8K32l3j93r4K27p0J9J84j47j60m1M4K8J15q1J28Q8j14o7q0J19
$$ -135 -129 238 -51 -69 163 130 -63 -157 70 0 19 203 56 -104 -145 -101 -73 42 -39 89 177 63 -4 -84 35
6026C5k0l06K30J42j82K6j23O08p11K43J12O7k64K73Q3l47L44pj46R5p5j38J89
$$ 35 15 -291 -61 81 -101 -75 -198 410 -301 -58 54 121 -143 130 213 -134 210 203 57 152 77 -61 128
6049A28j84J13p3J77j44k87L51j26K43k84j2kJ39m3j89K54p4N1J61j41N4k54J04
$$ 128 -56 57 -16 161 17 -270 81 -45 198 -86 -98 -100 39 -4 -193 61 -13 38 199 58 112 -142 -38
6072c8K84l94N0K71j91K31l57J30k6J38j76J63j43J04k79L4M20m24J26K16p5j44
$$ -38 246 -148 -98 173 -18 213 -144 -14 -40 98 -78 85 -58 46 -233 -199 221 -203 -77 139 64 -80
6094h0O2K0L03l47k04M86m64K79l7j12K19j51j64K57l09J95R6m09M99P7l72J81
$$ -80 -18 2 305 -42 -246 240 -224 55 18 -94 125 -26 -190 67 -242 -47 49 -360 139 216 -156 25
6116B5l76J86J39R0j72m2J24J45O0%k81l2n7L4K41K8j65O8J17j11K78j42k01L21
$$ 25 -351 -165 -26 64 -108 -150 -26 119 179 179 -102 -134 -191 -157 84 112 -53 15 132 21 299 157 -44 277
6140B77k36k77L6J17j8N6k8j21L57l7j07j5p0J21m4K47k12J28l6J8j79j00qJ41
$$ 277 41 -236 -200 -83 -101 -45 -73 -194 163 126 19 4 -66 55 11 258 46 174 138 156 -23 -123 -131 10
6164A0k9J9J02k2k6q4j16J51J4o2J2N5k42M19k71K6J92l54L26o9p8P1P2JJ31l94
$$ 10 -19 0 102 80 54 -30 -146 5 19 -43 -31 24 -218 201 -70 -44 148 -206 120 51 -27 44 116 117 248 -146
6190a46L72k78J92n0k76M20pl73K85p7k61J86K0j92J94r5M1K73k29j21R5M0o7
$$ -146 226 -52 140 90 -186 234 227 -146 139 62 -199 -13 7 -185 9 -86 -45 228 -1 -122 -27 13 -54
6213e4m7K9M10m66K15k20M6K21l12K84k13K0J01J38k80O6J83j29k1j95L84l46
$$ -54 -101 -72 338 -128 87 -133 -87 134 -178 106 -107 -87 14 152 -128 -62 121 -8 -29 -224 160 -186
6235a86J16K76m09j1L52l96N43k38j08K42j50j05L50k55k01M4J41l0K44q2r7Q6
$$ -186 -70 206 -203 -214 138 -258 285 47 -61 181 31 -74 276 21 -180 -136 5 -25 219 137 40 126
6257A26L7j32k31M53l58N0R7J5j69K27o7L5N7n27L62K20k57Mk56J98L01j82j12
$$ 126 163 31 -200 253 -105 -55 42 57 -112 115 48 83 140 -387 -25 195 -62 -58 -314 -116 185 3 -109
6280a09j00J09K16J2l73K00J2o0K42l52K59o8NK4J08L8J28o36K56j36J04l2J61
$$ -109 -209 -100 116 128 -245 -45 -33 -93 149 -203 56 -12 -7 17 125 163 291 -345 -89 -225 -121 -153 8
6303Hj26J70j56J0K97l74N33l82k79L15l17K94%J1K88k85J44q0L8k95J25K56l0
$$ 8 -118 52 -104 -94 203 -171 362 -20 -299 16 -301 -7 -7 4 292 7 151 71 109 -186 -61 195 165
6326A65j64l3Q3Q0j20L4j25P1k0k71L18l0j84Q4J5K26k78K72k40L43l01L22l04
$$ 165 1 -32 51 131 11 45 -80 -9 -29 -300 18 -12 -196 -112 -97 129 -149 123 -117 226 -75 247 -57
6349e7J26J31k24Q7J5l33L04m6j82O21m73k7J69p6J85l91j6J00J67k07J03o8k5
$$ -57 69 200 -24 63 78 -255 49 3 -179 442 -31 -58 111 35 220 -171 -187 -87 80 -127 -24 -92 -117
6372a17J64o1k95Q5L3k41n19J361l86l57M57m40N03k83k7M1J90j44j9J92k22J84
$$ -117 47 -14 -309 -224 -191 -432 -951 410 24 -333 124 -316 187 -96 -123 -82 108 -36 -55 137 -85 99
6394I9p9m4J58j43P7l5j0N2l71K18J74j23k9mj51QJ52J07n0k23L95q1j13j04K03
$$ 99 20 -24 134 -9 68 33 23 75 -296 -78 96 -27 -56 -60 -211 -203 -51 56 6 -217 178 97 -16 -120 83
6419H3n6j97k72j7Q1r0J128q38J15M33n38m30P15k2j47k40q0q0J026o38K40k18
$$ 83 27 -170 -442 -459 -378 -468 660 -178 -63 370 -168 -598 117 95 -52 -292 -372 -452 574 -64 176 -42
6441d2k85K80j63J66M0j12J29M66j224O31K52Q3k64k26J06Q2N9L24j00L9N8k29
$$ -42 -327 -47 -210 -44 -4 -116 13 479 -745 -114 138 221 -43 -269 -163 -81 -22 302 202 241 299 70
6463G0j12r3J00rp8K61k29l5J21Pj04L43l89J24J88j20J57k88L03l21J14j85L30
$$ 70 -42 -135 -35 -44 -122 139 -90 -125 -4 3 -101 242 -147 -23 165 45 202 -86 217 -104 10 -175 155
6486A55l17J69Kj97M02m70L01J07j79o9q5M04j59l00Q1L28j61k57K34j62M23l75
$$ 155 -162 7 9 -188 214 -256 45 152 -27 -96 -181 223 64 -236 -155 173 12 -245 -11 -173 250 -125
6508a25Q2J24l06K63jj83J81J53k68J81k70m3J88r9J97j91M7p9K50k23J95oL7
$$ -125 -43 81 -225 38 37 -146 35 188 -80 101 -169 -212 -24 -123 74 -117 -70 -149 101 -122 73 67 104
6531A04j32k8K52k56L8k2j60L59o4j36J84j71N1oj32J8L23l79M52l89p8K03m1
$$ 104 -28 -56 196 -60 -22 -44 -204 155 91 -45 139 -32 19 13 -119 -101 222 -157 295 -94 -172 31 -10
6554a0o5J39l1J56m31K20j00O8J4J32l03M62O7l91o4K58j57J64k15L37r1l54J84
$$ -10 -75 64 33 189 -242 -22 -122 -54 -40 92 -211 251 318 -73 -137 121 -36 128 -87 250 159 -195 -11
6577a1L4J1J36k58K15p1k91K55M7p2J44j97J03J04k51K93k31j00J22R2j2oJ92
$$ -11 23 34 170 -88 127 56 -235 20 67 -5 139 -58 45 149 -102 191 -40 -140 -18 74 62 56 248
6600B48l75J55q7R0R0j57K28l29K24Q0k31K51L9k51l6K8n1j18j16J40L81l19L22
$$ 248 -127 28 -59 31 121 -36 192 -137 87 167 -64 187 226 -25 -61 -33 -84 -202 -318 -178 203 -116 206
6623B06l52J30mP8J38l71J22Q1n4J62j32J34k91J17j17K83m1o9J3K66m52K88J48
$$ 206 -146 -16 -20 58 196 -175 -53 28 -26 136 4 138 -153 -36 -153 130 89 20 33 299 -153 135 283
6646B83n35K92j12K44p6j92K55l13L57k09o7J14j71K45l05Q5J82L5k52K83k14
$$ 283 -252 40 -72 172 96 -96 159 -154 203 -6 -73 41 -130 115 -190 -105 77 112 -140 143 -71
6667g1j98M34k55N1n4q9K81k29NJ06j10K64k6j57Qj6K18M5k08N5j46l1J25J93
$$ -71 -269 165 -90 -39 -93 -182 99 -130 -125 -19 -129 135 109 -48 -40 -56 162 207 -1 54 -92 -123 2 195
6691A95m9O7k42lL91m65j25K89r9K03q6l3N8j81K23j32k48L95j7l19J81o4j39
$$ 195 146 213 -29 -32 359 -106 -231 58 -41 162 76 43 101 -80 143 11 -237 158 141 -178 3 -61 -200
6714b00M13L5j66K7l1j12R4n1K2j31K4K0j52M1n4M5K27k6j09M58k76n9K8j06J47
$$ -200 213 248 82 109 78 -34 60 9 31 -100 -76 -56 -208 -167 -221 -176 51 25 -84 374 98 39 67 -39 108
6739A08j42J31L1m03K03m4R2K79j27j26R7j74L6k9j33L20l30K17J27k1j59K15
$$ 108 -34 97 128 -275 -72 -116 -24 255 128 2 99 -75 -39 -68 -201 119 -211 6 133 112 -47 168
6761A68k91kL53k8j19M1k48J25MM5n5j02rL09l35K01Kp7K72m22K8O7J78k4P8k14
$$ 168 -123 -125 228 200 81 122 -126 -1 3 48 -7 -109 -118 191 -144 57 59 -18 254 -168 -140 -73 105 81 159 -55
6787e5p3M1K44k82j53L00k66Q3M92p74L71J5L61j32m9l47L42m36J73L41k32R2
$$ -55 -128 -87 157 -125 -278 22 -244 -161 331 -443 -72 -57 304 172 123 -224 118 -318 -145 196 -36 56
6809E6J14l21K52M1q2O8l56K19O0o4K16j04J77m16J23Ko5j07j36K93p0n2N56n67
$$ 56 170 -151 101 142 60 128 -228 -9 51 -13 203 99 276 -140 -17 -15 -80 -187 -323 -30 -100 -152 404 -163
6833a63m8N0M16k14k66K56K22k39r8j32M17J7k06j4o3J27k36M7Q1Q6r2R5l25N00
$$ -163 -211 -161 255 41 -225 31 253 14 -84 -216 201 218 12 -2 -65 62 -174 -127 -46 40 -52 43 -282 218
6857B18J46m90l6J20j28J8K69j25K4m0l62K77j50O81p21M92o7n65M86j14J68J86
$$ 218 364 -126 -162 -42 -170 -152 117 -8 16 -24 -386 -109 -259 422 -299 193 126 -439 47 -67 101 287
6879B87J1m00K40p5j15J03M3j90K8j43J5J09k63N45o11J87N70l74k81K45k07N26
$$ 287 298 -102 138 63 -52 51 94 -96 -68 -211 -196 -87 -350 195 -416 -229 341 -33 -314 -69 -276 250
6901B50k76M56r2m61L95k52k56L88K61n64N20l65J15j59k98L64J28n11M31J70
$$ 250 -26 430 338 -123 272 20 -236 152 413 -151 369 4 119 -40 -338 26 154 -357 74 244
6921B44n73K66k23N82o19pJ51L55k36n95O74k21M2L1O02n51M82m43lL67K12o92
$$ 244 -329 -63 -286 296 -323 -330 -179 176 -60 -655 19 -202 -160 -129 473 -78 404 -39 -42 325 537 -155
6943a55P97o91q5j79J35O39l26k60M30m84L57J81n98Kk26N36j77J40l2J51L0k00
$$ -155 642 -49 -134 -313 -178 461 135 -125 305 -179 178 359 -239 -237 -463 73 -104 36 4 155 185 -15
6965a5R5m30L67J19l50K14j08L04n8k62L52l94N6K98k21q0J29r4m4J84j64K76
$$ -15 80 -350 17 136 -214 0 -108 196 138 -124 228 -166 -110 188 -33 -113 16 -78 -122 62 -102 174
6987A74j39k27K80l9j71K63j49j92K5J88o9Q4k17J84OM5k23R1J88k08J38k9N2
$$ 174 35 -192 88 49 -122 141 -8 -200 -175 13 -56 28 -189 -5 1 46 -177 -86 102 -106 32 3 55
7010E5k8j02j5Q5j61J01O6j13m9P3J42K5r7K65j93j24o5K24k51J50j6j89L56k67
$$ 55 27 -75 -90 -5 -166 -65 1 -112 -161 -88 54 79 -18 247 54 -70 -135 89 -162 -12 -28 -217 139 -128
7034a28K13m0r3j97L56k26R6n5J15J45m09J25J60l33L16J32l20J80j17J83M1k80
$$ -128 85 45 -48 -245 111 -115 -19 -74 41 186 -223 -98 62 -271 45 177 -143 37 -80 103 144 -136
7056a36J54J2QJ33J36m89J7J59K0j25Q4J81k04J7Q5l6J58l05J69r3M4k25N37p9
$$ -136 18 30 38 171 307 -182 -165 -6 14 -111 -27 154 -50 -33 52 16 174 -131 38 -55 -11 -236 301 222
7080B22k59j15J61J73n6r9J36k6k02j7J49j80q8K7O3K69l55K0R9J31J10j49Q5
$$ 222 -37 -152 9 182 126 27 163 137 -65 -82 67 -113 -201 -174 -111 158 -197 -177 -78 53 163 14 99
7103I9M3j82L9J46m46M26k19J65p8j15l8L1k4M00m09L13k05j58L78o5l33K29M8
$$ 99 142 -40 -1 145 -301 125 -94 71 -7 -122 -160 -129 -153 247 -162 151 -54 -212 166 101 -232 -3 45
7126D5k77L75l39L00n3k04K38k8o0L77l42j91K17M2m48R1n4J47K75j71M30o67
$$ 45 -232 143 -196 104 51 -153 85 57 -3 374 32 -159 58 100 -348 -257 -311 -164 111 -60 370 -297
7148b97L85j02o2O6p1k7J40j58N12m42j63L47k50M66k02l95M39m9j20j8j26J19
$$ -297 88 -14 -76 -10 -81 -108 32 -126 386 -56 -219 128 -122 344 142 -253 186 137 17 -1 -127 -8
7170hj39K60M2k27l9K14n01M06n5q7L72k40q6M2j36N7K41k90J00K79l35k5Q3o4
$$ -8 -147 113 155 -72 -111 103 -398 8 -47 -134 238 -2 -88 -46 -182 -125 116 -174 -74 205 -130 -155 -72 -136
7194a36J70j75K23M9q9N6j87NQ7k91L20q1P5j88L04j45NJ41N1k56j78K50K00j58
$$ -136 34 -141 82 131 42 98 -89 -84 3 -288 32 -49 26 -162 142 -3 2 143 194 -62 -240 10 210 52
7218E2j47K96k32K56j66K56m50J58P2l2j44K81j62j98KK53p5q9m1L52k34N5r2
$$ 52 -95 201 -31 225 59 315 -135 23 95 63 -81 200 38 -160 -158 95 20 -69 -110 242 8 63 -29
7241b9l2K17r8j57l36L74K21J66m57L12j80q6k05L85j78L73l50J07n2K06l4p8
$$ -29 -61 156 58 -99 -435 -61 160 326 -131 181 1 -85 -290 95 -83 290 -60 47 -5 201 167 89
7263H9N4j25lp7J34m3l7k09L91k97j28k5J02J38nj85K45M5k3j36J11K06j30j8
$$ 89 143 18 15 -62 72 29 -8 -217 174 -123 -251 -276 -174 -36 -41 -226 19 64 41 -95 16 222 92 74
7287G4L8q2J41j86j80L08j2N5l42J01%K10q8l23J04K98k2j74r0n3K67k10k12K65
$$ 74 112 30 171 -15 -195 113 101 156 -186 -85 -85 125 37 -286 -182 116 94 -80 -170 -223 44 -166 -378 -113
7311a13K09j09K46k64K7R5Mr3l23L04L26m39R6l74J46O50l80k8K25l53J35K03
$$ -113 96 -13 233 -31 -4 91 95 2 -321 -17 309 -130 -34 -408 -262 388 8 -20 205 -148 -13 190
7333A90n71L45j74L46j15K9Q8J60l29P7q4L3j02K10j73R0K0L1J8j80J2Q0J02j5
$$ 190 -381 -36 -210 136 21 50 138 298 -31 46 -38 -5 -107 103 -70 20 40 71 89 -91 -79 1 103 88
7357H8k37L84l54m4K78j08k60L73qr4j06K46k57K10k1j77p9q4M47l73J5L46j03
$$ 88 -149 235 -119 -163 115 7 -253 120 112 18 -88 158 -99 111 90 -87 -166 -250 197 -176 -161 185 82
7380H2l4R7l15M70J15o16k59J22N35L6l06j78J44J26k10M6K65J01k17O5n35M48
$$ 82 48 145 -170 300 415 -201 -460 -338 197 233 -73 -251 -107 19 -191 -145 120 221 4 69 -466 -18
7402a8P8j80K79N3j53K11k43r6J84M3p7O7k05k7p5l2K44k7k02N5K06l22J03J81
$$ -18 60 -120 159 212 59 270 27 -69 115 158 81 148 -57 -84 -159 -191 53 26 -176 -121 85 -237 -134 47
7426D7J0p5J63j81Q5r6%j57K81m00R01j96l61L5q3r53Q29N64M96q69l13L19k93
$$ 47 57 -18 145 -36 49 -47 -47 -204 77 -323 578 382 21 56 -27 -980 -151 413 909 40 -273 46 -247
7449b47j2Q34k82n32J234j659L81Q3j21L02p07L15J78K27J09j63m8q4l1L45j81
$$ -247 -259 575 293 -239 995 -664 -283 -200 -321 -19 -726 -411 -233 -6 103 -60 -108 -192 -223 122 -59
7470e9KL2k64l32O84k23K84j39K10R6k16L3J4j84J07j31R5N3J23k15k8L0P1j50
$$ -59 -57 -25 -289 -621 63 -160 124 -15 195 291 75 108 122 -62 45 -86 9 62 185 -30 -58 -28 43 -107
7494a07J3J07J53j57J23l7j61K32j91K72m0j45K4Lp8j13qn0K09j57J97r0K08j60
$$ -107 -94 13 166 9 132 95 -66 166 -25 247 207 62 86 89 11 -102 -110 -160 49 -108 89 -1 207 47
7518D7j04Nj35L76m33L13j74L21N7m84K49J27m0j34k5j24K16l10M32r5N7M2j28
$$ 47 -57 -52 -187 189 -244 69 -105 216 273 -211 38 165 125 -9 -34 -158 58 -252 180 85 142 184 56
7541E6k33K10j50J07L43l32j00K54m2k8j45np6M8j33J93J4o9o4K6qn1K72M7j25
$$ 56 -177 33 -117 -10 333 1 -99 155 113 85 -60 -65 -141 -93 -226 -33 -19 -88 -152 -126 -134 -185 87 134 9
7566IN6j48O2J26lj78j13J28j48J69k66K05J57OR7q6l4o0Q1M6J69k66J86j76N3
$$ 9 65 -83 -21 105 102 -76 -189 -61 -209 -40 -306 -101 56 62 159 73 39 -21 60 106 275 9 195 19 72
7591G2M7m82M47p3P0j04K7j15M46l74K31j13k87L70j63l8L0k6L32k99j53j25J66
$$ 72 119 -363 84 11 81 -23 4 -111 335 -39 192 79 -208 162 -1 -39 -9 -35 297 -2 -155 -280 -114
7614a14j12K86k05J02mj97M00l31L78k70Q6j96K94k00P6j73K11rq9q2J74j48J83
$$ -114 -226 60 -145 -43 -47 -244 156 -175 203 -67 19 -177 117 -83 -7 -180 31 22 -67 -149 25 -123 60
7637F0m41M15L5k50l5J38K2K85o3l52M33n09M93J9r32J187o56j24N06O5o97O51
$$ 60 -381 34 69 -181 -216 -78 -56 229 166 -186 247 -262 231 250 -682 505 -151 -275 231 296 -401 250
7659B50p84P66N49j176M22K71o56Q03n05r56J261q20j48J147p69K49m33O99R25
$$ 250 -534 232 781 -395 27 298 -358 445 -60 -1016 245 -575 -723 424 -345 -96 -529 170 1095
7678A095j587J326o15k76O15K8o10K24k33m15J165j71n04l42L42R4m36O40L27
$$ 1095 -492 834 219 -57 558 586 -24 200 -33 -448 717 546 42 -300 42 136 -300 340 667
7697F67o38J58p89P79M2l8L9J89n25n6J44M28k85K02K8j14J62n61m4J06N60o06
$$ 667 29 187 -602 177 219 181 220 409 -116 -172 -28 400 115 317 345 231 393 -168 -212 -106 454 -152
7719a52O69n11O59j67q84j44N03K60n52N70n72M38l70K58Q1l00L87K60k55lk56
$$ -152 517 6 665 498 -386 -530 -27 233 -319 251 -321 117 -253 5 86 -214 173 433 178 175 -81
7740h1M5L45j049J064p3n23p46J195O23q60l1k20K74P1L71r86J040m00P57j110
$$ -81 -36 309 -740 324 251 -272 -1018 177 800 -60 -91 -311 -37 34 405 -581 459 59 816 -294
7760b94L93K65p39M04r7j54k32L49n82k26O07K67j13l45K80M42J89k55j8q15L14
$$ -294 99 364 -375 29 -68 -222 -454 -105 -687 -913 -306 -39 -152 -497 -217 225 414 159 141 -674 -360
7781c60K92J46m04O62q54j27Q27k8R52j165m14J283q93j06N87n55K9n5m62J050
$$ -360 -68 78 -326 336 -518 -645 182 154 1106 -59 -473 810 -83 -189 398 -157 -128 -183 -645 405
7801D05k03P51q90l02rN55j106P93M11k69j66N91p11P5o2K05J23k07j293J269
$$ 405 202 953 63 -239 -248 307 -799 -6 405 136 -30 561 -150 -75 -137 68 191 -16 -1309 -40
7821d0k36L10l61L45m07M89j04K06k80M61M99j205q61Q06M96lo99O22O30p39Q25
$$ -40 -276 34 -327 18 -389 100 -4 202 -78 383 882 -323 -1184 -378 118 115 -584 38 668 -71 754
7842G54p69M79j41l52L67j126O00K83K44n52O92j146M35O56r65L06L91l36Q12
$$ 754 -15 464 323 -29 338 -788 -188 95 339 -213 479 -667 -232 424 -541 -235 156 -180 632
7861F32m92K81l68j94L30j164Q11j6K06K87k58m28R21j002J146K39n43j13n73
$$ 632 140 421 53 -141 189 -975 -164 -180 26 313 55 -373 548 -454 692 931 388 275 -298
7880b98J430j391l18R57l56l47P01M38l74K05k95P1J31j97p64K23K70p2J91L50
$$ -298 1132 -259 -577 380 24 -323 378 816 442 647 352 423 554 357 -407 -184 86 14 205 555
7900E55o89L12j99l46P47j296J628j041m27J189R1r61N38K6J08p02N02n51N30
$$ 555 -134 178 -21 -367 380 -916 712 -329 -756 433 524 -437 101 127 235 -467 35 -516 14
7919A4K70j022J90K19N03m2l01J49j44l33q4R42k73r4J98k33m01N22K13p21n4
$$ 14 284 -738 -548 -329 174 132 -169 -20 -164 -497 -581 361 88 -6 192 -41 -442 80 293 -428 -482
7940d82O08k58k40J21m7N40m86Q4K0P13j047P02pn69P34p37L76l33j81l37J539
$$ -482 126 -132 -372 -251 -298 242 -244 -160 -140 573 -474 228 221 -348 386 -351 25 -308 -489 -826 713
7961G13o85k97N48m89r4l54K55N3J53N73k14o58L23J50M76r8j80n23N00l88L87
$$ 713 28 -269 279 -210 -304 -658 -403 -350 -197 376 162 -496 -173 -23 453 355 175 -348 152 -236 151
7982A51l09O1J68n12L72M40j98J04Kl69k51K64j93n22R16r9n75M97l04R37m20
$$ 151 -158 -97 71 -441 -69 371 173 277 279 -90 -341 -77 -270 -792 124 25 -550 -53 -357 580 160
8003A60L54M5q0n28K3N52j026N59j4m98P0M89k09l3J23J16l98K98n75J96P22k62
$$ 160 514 559 479 -49 -26 526 -500 59 45 -453 -383 106 -103 -136 -13 103 -295 3 -572 -376 346 84
8025H4j67N6j09L32m76j27J86L98o02J05O76o96L34m53J35k1M05n68K14K47j28
$$ 84 -83 -27 -136 196 -280 -407 -221 177 -425 -320 356 -340 -6 -459 -324 -345 60 -508 -294 -47 -175
8046a75J93J29n01o6P61K2m85J44l99P22l69Q3J01l52N20m31J6J2j38RO7J24J0
$$ -175 18 147 -354 -420 341 363 -122 22 -377 345 -24 59 160 -192 328 -103 -87 -75 -213 -204 -137 -13 -3
8069cKK6J24K29m31m1L97pl66j79M94n06r63R99J24Q28j096m49J226J39k46p9
$$ -3 -1 25 149 378 -53 -94 303 296 -70 -249 245 -261 -1224 -225 -101 727 -369 -818 408 547 301 222
8091B22k43L27r5j70K1J18n30M29lL1L55m50l42K82N00N40o67p61K98k57k40Q59
$$ 222 -21 306 211 41 62 180 -350 79 76 107 462 12 -330 -48 452 992 325 -436 -138 -395 -635 224
8113B24n24J37N67q96K31M85l0k44j041J627L3q74O16l71j54N50k12K43l49l46
$$ 224 -300 -163 404 -492 -261 224 194 -50 -1091 536 569 -305 311 -60 -214 336 124 367 18 -328
8133c28k71M27K53p63K11P33r21K1O58j93L28m25L73J67m10l0k05n19J72J146
$$ -328 -599 -172 81 -682 -471 262 -659 -638 20 -173 155 -270 103 270 -140 -170 -375 -894 -722 424
8153D24K33n08J6l28J83N24j084N54O40l0p74J062o88j396J549m01j74m23O23
$$ 424 657 149 165 -163 20 544 -540 14 654 624 -150 912 224 -1172 377 -24 -198 -621 2
8172Bn87O18n53J13M35k44P81o55L71j89m73L24pJ63O9J81r33N72M39
$$ 2 -585 33 -520 -407 28 -216 565 -90 281 92 -381 -57 -64 99 168 349 -584 -12 427
8191D27
$$ Imaginary data points
##PAGE= N=2
##DATA TABLE= (X++(I..I)), XYDATA
0@%%%%%%%%%%%%%%%%%%%qJ6j6J6j6J6j9K7l2L2l6M4n1N7o5P3q1R2j01J11j26J42
$$ 0 0 0 0 0 0 0 0 0 0 0 0 0 0 0 0 0 0 0 0 -8 8 -8 8 -8 8 -11 16 -16 16 -20 24 -27 30 -35 38 -43 49 -52 59 -67 75
41G5j58J74j93K13k35K59k83L12l45L81m19M62n11N65o27O95p73Q68r80J114j279
$$ 75 -83 91 -102 111 -124 135 -148 164 -181 200 -219 243 -268 297 -330 365 -408 460 -520 594 -685
62f85J488j764K146k705L605n290R466l7384n8536R9198N0883l9924m9368K0663
$$ -685 803 -961 1185 -1520 2085 -3205 6261 -31123 -89659 9539 60422 20498 -28870 -8207
76h207N4761q186k4783O779j3115J8432K0378l0107j7500J3045K0809j1404n2098
$$ -8207 46554 38368 13585 20364 7249 25681 46059 15952 -1548 11497 32306 20902 -31196
89c1196J8564M6770l2813l7285Q193K7381J0962l6996j2193J8255J512J8370m833
$$ -31196 -12632 34138 1325 -35960 -27767 -386 10576 -26420 -38613 -20358 -18846 -476 -5309
102e309l5301J5206L0449P734j8270k4348K9633K5338j8033J128k243q06K0597
$$ -5309 -40610 -25404 5045 12779 -5491 -29839 -206 25132 7099 8227 5984 5178 25775
115B5775p581j0789J353K997J5602j8564j8351L0485N67k6518o363R337J9463
$$ 25775 18194 7405 8758 11755 27357 8793 -9558 20927 21494 -5024 -11387 -2050 17413
128A7413j6429k4441J7216O3m247J2242j8125j0280J4796J4833L193l1181K52
$$ 17413 984 -23457 -6241 -6178 -10425 1817 -16308 -26588 -11792 3041 6234 -24947 -24695
141b4695M0845q936k2640Q658J1167Q393j3610l084K1293j0467n762J0829q612
$$ -24695 16150 7214 -15426 -6768 4399 12792 -818 -3902 17391 6924 1162 11991 3379
154C379M071O326p599j654q395J0820J1462k8070l911J8718j790m791j0541L280
$$ 3379 7450 13776 6177 4523 -3872 6948 18410 -9660 -13571 5147 3357 -1434 -11975 -8695
168h695J2057j3443L282R021j3999O273P463l609K002p263O917Q171j4462P323
$$ -8695 3362 -10081 -6799 2222 -11777 -5504 1959 -1650 352 -6911 6 8177 -6285 1038
182A038P029q608N828l916l67Q569q668R60m84o211J5510n097j5436P448L333
$$ 1038 8067 -541 5287 1371 1004 9573 905 1865 1381 -4830 10680 5583 -9853 -2405 928
197I28M036o097j2853J5567L810j1478N482k901J751M687r338O015J177m047Q578
$$ 928 4964 -1133 -13986 1581 5391 -6087 -605 -3506 -1755 2932 -6406 -391 786 -3261 5317
212E317q767j632J3910p658l516J684R40J0540r546o869J2107m653k87K402p987
$$ 5317 -3450 -5082 8828 1170 -2346 -662 278 10818 1272 -5597 6510 1857 1570 3972 -4015
227d015O693j134l092O153r889P85R665r832J381K181k501N317q318K137R517
$$ -4015 2678 1544 -1548 4605 -5284 -4499 5166 -4666 -3285 -1104 -3605 1712 -6606 -4469 5048
242E048j0668K312M990n678P301k324k438N820n879N428L366j1123P210J984m199
$$ 5048 -5620 -3308 1682 -3996 3305 981 -1457 4363 -1516 3912 7278 -3845 3365 5349 1150
257A150M397p201K275M770r405N317O30p057P037l408j481L290o182N723L06p941
$$ 1150 5547 -1654 621 5391 -4014 1303 1933 -5124 1913 -1495 -2976 314 -5868 -145 161 -7780
273g780R469j551m769N966m215K979J923o549P471j701l692Q172o239p08N560
$$ -7780 1689 138 -4631 1335 -2880 99 2022 -4527 2944 1243 -2449 5723 -516 -1224 4336
288D336n321M087j519m548R020n173k812O138n685K566M67m870P289m864k806
$$ 4336 -985 3102 1583 -2965 6055 882 -1930 4208 -1477 1089 1556 -3314 3975 -889 -3695
303c695P830p622J098L951o031M611j806k038O556o874J276N550p086M971N01
$$ -3695 4135 -3487 -2389 1562 -4469 142 -1664 -3702 2854 -4020 -2744 2806 -4280 691 1192
318A192m103O524m050M63N221p343M351K105n797N307k672j226M808p293K984
$$ 1192 -2911 3613 -437 26 5247 -2096 2255 4360 -1437 3870 1198 -28 4780 -2513 471
333D71K592p239N195j109l763N429m751J204K644o445O141j47n185O977l693J55
$$ 471 3063 -4176 1019 -90 -3853 1576 -3175 -1971 673 -5772 369 222 -4963 2014 -1679 -1524
349a524M435o096M723Q25m728O656l562j949O023n419K139R41n195O545k700m175
$$ -1524 2911 -3185 1538 2363 -2365 4291 729 -1220 4803 -616 1523 2464 -2731 3814 1114 -3061
365c061O361m685J146K371o395N384j55l989N560m709K28N453p058K859J106l573
$$ -3061 3300 -1385 -239 2132 -4263 1121 966 -3023 2537 -2172 -1944 3509 -3549 -690 416 -3157
381c157O048m688j319O522n323J800J724m933O056j919l143N753m442J990K401
$$ -3157 2891 -1797 -3116 3406 -1917 -117 1607 -3326 2730 811 -2332 3421 -1021 969 3370
396C370o433N157Q8l731M922m364M20M447o825L266P24l960M958l127j843M361
$$ 3370 -3063 2094 2182 -1549 3373 -991 -571 3876 -2949 317 1041 -2919 2039 -1088 -2931 1430
412A430m664L026R49n606O290j146k659M691m264K130K741n047M654q97l253N591
$$ 1430 -3234 -208 741 -4865 1425 279 -2380 2311 -1953 177 2918 -2129 2525 1628 -1625 3966
428C966m271n0L942n708L919m72m624N911k993j953L511m193L030O90n575O254
$$ 3966 -305 -355 3587 -2121 1798 1326 -3298 2613 -380 -2333 1178 -3015 15 705 -4870 1384
444A384j883k191M754m445J764K944m866M557q29l120N230l441Q17K895n488L986
$$ 1384 -499 -2690 2064 -2381 -617 2327 -2539 2018 1189 -1931 3299 -142 675 3570 -1918 2068
460B068N55m538M954k914j196L904m674K174P50m839N043j723k194L482m234K415
$$ 2068 2623 -1915 3039 125 -1071 2833 -1841 333 1083 -3756 1287 -436 -2630 852 -3382 -967
476i67K108n720M864n33l256M576k757R45K094m404M887j03m263N940k486n60
$$ -967 1141 -4579 285 -248 -3504 1072 -1685 -740 1354 -3050 1837 1734 -2529 3411 925 365
492C65K869l856L868M63n600N237q51k037K207m492L121J704n765L826k126k726
$$ 365 3234 -622 3246 3709 -1891 3346 2495 458 2665 -1827 1294 2998 -2767 1059 -1067 -3793
508c793N569m006j194J747k869N198k287m719O240r41n41J499l509N252J125n343
$$ -3793 1776 -2230 -3424 -1677 -4546 652 -1635 -6354 -114 -1055 -1596 -97 -3606 1646 2771 -2572
524b572N163l18p36L120m266K412K027l890L606k933k435N733l708j486J123l735
$$ -2572 2591 2273 1537 4657 391 2803 4830 940 4546 1613 -822 4911 1203 -283 840 -2895
540b895N061j903n298M477j920k21J623m202L523L49l776N560k408j785M371k414
$$ -2895 2166 263 -5035 -558 -2478 -2699 -1076 -5278 -1755 -1406 -5182 378 -2030 -3815 556 -1858
556a858K562O97m142O001j008k738M386l192J630J753m276L957p56l337M576l553
$$ -1858 704 1401 -2741 3260 2252 -486 3900 708 2338 4091 -185 3772 3016 -321 4255 702
572G02q55L236l968K230j363l417N283k867k843K670k340K852m43m725N239j042
$$ 702 -153 3083 -885 1345 -18 -3435 1848 -1019 -3862 -1192 -3532 -680 -1123 -5848 -609 -1651
588a651j704L629k911J227K153k551L499j125k281N678k435p13K085k304L720
$$ -1651 -3355 274 -2637 -1410 743 -1808 1691 566 -1715 3963 1528 815 2900 596 4316
603D316j355m119N525k114j617J782l614K292N39m075K949k201j779M782l944
$$ 4316 2961 -1158 4367 2253 636 2418 -1196 1096 1635 -2440 509 -1692 -3471 1311 -2633
618b633k85J763k290M443k253l492N424j512k24J565k963M451k42l604M063j478
$$ -2633 -2918 -1155 -3445 998 -1255 -4747 677 -835 -1059 506 -2457 1994 1752 -1852 2211 733
634G33J15L102m852J705K217k693K465l463o07M785l883l48R83k633M314j758
$$ 733 848 3950 -902 803 3020 327 2792 -671 -1278 3507 -376 -724 259 -2374 1940 182
650A82l303L891k063L73J513l843L358j29k848M151k495L85K533m210K929J277
$$ 182 -3121 770 -1293 -920 593 -3250 108 -21 -2869 1282 -1213 -828 1705 -2505 424 1701
666A701l346L845k030j050L711l119J550O41l710M521q38k865L061l308J009K580
$$ 1701 -1645 2200 170 -880 2831 -288 1262 1903 -1807 2714 1876 -989 2072 -1236 -227 2353
682B353m306K400n61k168L875k975p12K260k654K779l35l442M201r17j202L146
$$ 2353 -1953 447 -114 -2282 1593 -1382 -2094 166 -2488 291 -44 -3486 715 -202 -1404 1742
698A742l199K135J005l215L619j063j022K816l566Q72K939l381J725j260j586
$$ 1742 -1457 678 1683 -1532 2087 1024 2 2818 -748 124 3063 -318 1407 147 -1439
713a439M255l262r82K375l043K666l59l279L570j713n33L247m120J765K063l588
$$ -1439 2816 -446 -1428 947 -2096 570 211 -3068 502 -1211 -1744 1503 -2617 -852 1211 -2377
729b377L404j455q03L618l697J099K203l453L271r59k228L570k027J73J870m177
$$ -2377 1027 -428 -1231 2387 -1310 -211 1992 -1461 1810 851 -1377 2193 166 339 2209 -1968
745a968L121P80k966K250j948K76L038m360J094J636k821K993k079j406L563k681
$$ -1968 1153 1933 -1033 1217 -731 -455 2583 -1777 -683 953 -1868 1125 -954 -2360 1203 -1478
761a478N83J089k608L213n53k544L701j739j2J708l140K706Q70k983L369k211
$$ -1478 -895 194 -2414 799 246 -2298 1403 -336 -348 1360 -1780 926 1796 -1187 2182 -29
777b9m24K975l246J339J298k845L169k232j478L378l387J423J229l443K854o19
$$ -29 -453 2522 -724 615 1913 -932 2237 5 -1473 1905 -1482 -59 1170 -2273 581 -38
793c8k299L519k464K13K530l774K462M01k644M066k899k3L354l334J346P33k584
$$ -38 -2337 1182 -1282 -1069 1461 -2313 149 550 -2094 1972 -927 -950 2404 -930 416 1149 -1435
810a435L424j428j313K987l313J211J459l256K493m66j646L152k853M00K326l733
$$ -1435 1989 561 -752 2235 -1078 133 1592 -1664 829 363 -1283 1869 -984 -584 1742 -1991
826a991K561J72k809L090k305k56K989l048J910L29k713L271j600j172K988k068
$$ -1991 570 742 -2067 1023 -1282 -1538 1451 -1597 313 642 -2071 1200 -400 -1572 1416 -652
842f52K00J962l089K572q97j662L459k507K61K132l043K101j33j681L006k607
$$ -652 -452 1510 -1579 993 96 -1566 1893 -614 -353 1779 -1264 837 704 -977 2029 -578
858e78p96K214k413J550P07k856L373j717l80K817l363K076M09l154L595r55j640
$$ -578 -1374 840 -1573 -23 684 -2172 1201 -516 -896 1921 -1442 634 1043 -2111 1484 529 -1111
875a111L284l081J231J680l420K576%k813L424j712r49K685l263J818K09k543
$$ -1111 2173 -908 323 2003 -1417 1159 1159 -1654 1770 58 -891 1794 -1469 349 558 -1985
891a985L308j658k36J892l151J686J137k389K443j002j450L568k943J83J507k580
$$ -1985 1323 -335 -571 1321 -1830 -144 993 -1396 1047 45 -1405 2163 -780 -597 910 -1670
907a670K835j210k012L753k244m37K370k509J761L79l030L197r26m06J743k524
$$ -1670 1165 -45 -2057 1696 -548 -985 1385 -1124 637 1016 -2014 1183 257 -149 1594 -930
923i30J074J492k525K462k120k3K568k725K56J679j949Q88L89k088L090j916j26
$$ -930 144 1636 -889 1573 -547 -570 1998 -727 -471 1208 -741 147 536 -1552 1538 -378 -504
940e04J798l818K991J25k350K861j229j61J815k910J438J486l084L028j865j113
$$ -504 1294 -2524 467 592 -1758 1103 -126 -287 1528 -1382 56 1542 -1542 1486 -379 -1492
956a492L318k861Q27R77k728K823q18q98J859j958J039J421l413J731M60j776
$$ -1492 1826 -1035 -208 769 -1959 864 46 -852 1007 -951 88 1509 -1904 -173 287 -1489
972a489L282k487O9K308k669J126N54k109L191j823o44J309j765J824L97k512
$$ -1489 1793 -694 -625 1683 -986 140 694 -1415 1776 -47 -691 618 -1147 677 1074 -1438
988a438J966p9q00J705k894O47K415l108J519N11j942K189q27p4J139k277J321
$$ -1438 528 449 -351 1354 -1540 -893 1522 -1586 -67 444 -1498 691 -136 -210 929 -1348 -27
1005b7Q41k795L088r72j044K166l315J840J545k847K016q30k59K329k225l91J838
$$ -27 814 -1981 1107 135 -909 1257 -2058 -218 1327 -1520 496 -334 -593 1736 -489 -880 958
1022I58k510K087M32k486K546n38j197K097k729J943P04k897K240p14q90J956
$$ 958 -1552 535 967 -1519 1027 489 -708 1389 -1340 603 1307 -1590 650 -64 -954 1002
1038A002k687J710J039k810K450r23p28J899j402P5J057k019K466m88j917K963
$$ 1002 -1685 25 1064 -1746 704 -219 -947 952 -450 -375 682 -1337 1129 641 -1276 1687
1054A687k234L00J814k993J981J55k111K607j205p28J968k748J941J081k873J905
$$ 1687 -547 -247 1567 -1426 555 710 -1401 1206 1 -727 1241 -1507 434 1515 -1358 547
1070E47j451o5K441k154K28J547k047K212o22j883J813j709N27K233l507K198
$$ 547 -904 -969 1472 -682 -454 1093 -954 1258 636 -1247 566 -1143 -616 1617 -1890 308
1086C08P35k248J810n28j035K469k849O66K446l297K121j008j206M159l119L28
$$ 308 1043 -1205 605 77 -958 1511 -1338 -672 1774 -1523 598 -410 -1616 2543 -576 -248
1102b48Q04j769K982o16k298K105j421M14J293l082K662m89j558K498j589r13
$$ -248 556 -1213 1769 1153 -1145 960 -461 -47 1246 -1836 826 337 -1221 1277 -312 -1225
1118a225K606j909M28M25j875K687j488n95K283k320O23J171k521K636k53j908
$$ -1225 1381 -528 -100 325 -1550 1137 -351 -946 1337 -983 -360 811 -1710 926 673 -1235
1134a235K231j499L99J566k771J561L81j313K115j723l25K374k380J191J38j837
$$ -1235 996 -503 -104 1462 -1309 252 633 -680 1435 -288 -613 1761 -619 572 710 -1127
1150a127K389j124j038K071k231R87J095k752K560n60j510J940j975Q69J632k530
$$ -1127 1262 138 -900 1171 -1060 -73 1022 -1730 830 270 -1240 700 -1275 -406 1226 -1304
1166a304J492m3j741K947j639n30J793j650J275O38k438K447r68o24J744j881
$$ -1304 188 145 -1596 1351 -288 -818 975 -675 600 1238 -1200 1247 279 -345 1399 -482
1182d82J145N94k406K226p08j143K129k195L74J582k564J945k01j956K610j555
$$ -482 663 1257 -1149 1077 369 -774 1355 -840 -466 1116 -1448 497 296 -1660 950 -605
1198f05m07J937k180J694j45j821K073q84n60J974k163J174Q70j999J995p53r83
$$ -605 -1012 925 -1255 439 294 -1527 546 -338 -898 1076 -1087 87 957 -1042 953 200 -783
1215g83K245j940N84J271k122J671k58j378K102j458l03J759k472J368K93j792
$$ -783 1462 -478 106 1377 -745 926 668 -710 1392 -66 -369 1390 -1082 286 579 -1213
1231a213J871j032o53J860k092J080O42k105K033n30q28J908j892N51J454k099
$$ -1213 658 -374 -1027 833 -1259 -179 463 -1642 391 -139 -967 941 -951 -400 1054 -1045
1247a045J593J59j366K043j551P2J170j910J346L36j660J926j161l73J490j941
$$ -1045 548 707 -659 1384 -167 -95 1075 -835 511 847 -813 1113 -48 -421 1069 -872
1263h72J214K06j547J900j152q66J864j625N54Q88k044J654J84j661K059j419
$$ -872 342 548 -999 901 -251 -1117 747 -878 -324 564 -1480 174 358 -1303 756 -663
1279f63K55J468k007J538k7j292K158j495m49J994k085Q27O98j564J804r91q40
$$ -663 -408 1060 -947 591 564 -728 1430 -65 -514 1480 -605 222 920 -644 1160 169 -671
1296f71J853j735N42R16k245J608l35r73J528r59j43J179j751J118J78j243J645
$$ -671 1182 -553 -11 905 -1340 268 -67 -1040 488 -471 -614 565 -1186 -68 110 -1133 512
1313E12r20J49J140j643J059M92j601J708q03k66J253j079K66N93j620J433m25
$$ 512 -408 -259 881 -762 297 789 -812 896 93 -173 1080 1 267 860 -760 673 248
1330B48j041J861j323R6Q66j691J216p0j600J809j181L8J475j855J149J09j364
$$ 248 -793 1068 -255 -159 707 -984 232 162 -1438 371 -810 -772 703 -1152 -3 106 -1258
1347a258K003r78m30J622j570Q49M34j498J782q21p26J765j340M74P67j832J392
$$ -1258 745 -233 -663 959 -611 238 672 -826 956 135 -591 1174 -166 308 1075 -757 635
1364F35p6j296J847j826L22J221j905J212M2j242J724j074m90J536j702Q94N02
$$ 635 559 -737 1110 -716 -394 827 -1078 134 176 -1066 658 -416 -906 630 -1072 -178 324
1381C24j526J957q52q17J987j846P70N48j466J655k04j345J862j362L30J004j605
$$ 324 -1202 755 -97 -914 1073 -773 -3 545 -921 734 530 -815 1047 -315 15 1019 -586
1398e86J154p4j070J482j053j40J241j636Q04L7j255J776o91r36J618j460M53
$$ -586 568 494 -576 906 -147 -287 954 -682 122 159 -1096 680 -11 -947 671 -789 -336
1415c36J015j536J069l95p38J416j099N61J097k388K159K0j045Q49o09n15J665
$$ -336 679 -857 212 -183 -921 495 -604 -43 1054 -1334 825 845 -200 649 40 -475 1190
1432A190k132J069P52j769J383p0r70J585k161J018O44j753J544l68q32J436j358
$$ 1190 -942 127 879 -890 493 423 -547 1038 -1123 -105 539 -1214 330 -38 -870 566 -792
1449g92N82R08j637J152N3r54J436j087J04J475j972J088K54j542J586o92k84
$$ -792 -210 698 -939 213 266 -688 748 -339 -235 1240 -732 356 610 -932 654 -38 -322
1466c22J473j901P94L43j274J333p03l89J394j745Q35N28j214J579p76q04J799
$$ -322 1151 -750 44 387 -887 446 -257 -646 748 -997 -162 366 -848 731 -45 -849 950
1483I50j775K46J149j044Q19M90j357R66q95q9J747k274J370L68k399K464n49
$$ 950 -825 -579 570 -474 345 835 -522 444 -451 -540 1207 -1067 303 671 -1728 736 187
1500A87j204J671j397J583j189n56M79L49n4J169j769O63J144k229J085O45j297
$$ 187 -1017 654 -743 840 -349 -905 -426 -77 -131 1038 -731 -68 1076 -1153 -68 577 -720
1517g20J405r06n43J585j301O55L09j291J460o08q34J699j402N62O29j497J306
$$ -720 685 -221 -764 821 -480 175 484 -807 653 45 -789 910 -492 70 699 -798 508
1534E08j69j061J495j295K25J046j555Q32M63j162J364j169J42J203j824Q98L31
$$ 508 339 -722 773 -522 -297 749 -806 26 489 -673 691 -478 -336 867 -957 -59 272
1551B72j051J498p40m70J299j203M99N10j388J076o3p57J216j111K96P91j266
$$ 272 -779 719 -21 -491 808 -395 104 614 -774 302 239 -518 698 -413 -117 674 -592
1568e92R97k92n60J289j249o9J065j312Q09M18j568J658o40p83J378r92N23N74
$$ -592 405 113 -447 842 -407 -476 589 -723 86 504 -1064 594 -46 -829 549 -443 80 654
1586F54j644J402k47o65J307j254L71P46j132Q17k62p22J262p34k7P38j185Q72
$$ 654 -990 412 165 -500 807 -447 -76 670 -462 355 93 -629 633 -101 -128 610 -575 297
1604B97j19j061J273o46l0Q63j243O96N88j517J055l53l70J079j022l3J122j017
$$ 297 178 -883 390 -256 -286 577 -666 30 618 -899 156 -197 -567 512 -510 -543 579 -438
1622d38O20j77q87J320m82l26J227j519Q44M31j101J180n32p10J357j297N68N93
$$ -438 182 5 -882 438 -44 -370 857 -662 182 613 -488 692 160 -550 807 -490 78 671
1640F71j249J232p01m14J494j529N0Q26j460J651m68r67J217p39QQ57j162P36
$$ 671 -578 654 -47 -461 1033 -496 -446 380 -1080 571 103 -864 353 -386 -378 479 -683 53
1658E3K42p83J239j078R3R70j134Q93j84q21R89m59k89J186r79J63K52p94Q92
$$ 53 295 -488 751 -327 -234 736 -398 495 311 -510 479 20 -269 917 -62 101 353 -441 451
1677D51M4j156J117q73K66O44j198P46R4r40J451j007j7J098j228N70K75q74J294
$$ 451 495 -661 456 -417 -151 493 -705 41 135 -805 646 -361 -378 720 -508 62 337 -537 757
1696G57p38k84Q73p28O11J63r11Q75k20r42J260r40M31O50j283O69m5p49J134
$$ 757 19 -265 608 -120 491 654 -257 618 398 -544 716 -224 207 857 -426 243 198 -551 583
1715E83p87n60J347j033O37Qj227J014l40m02J275j075M58P34j095J040m71n37
$$ 583 -204 -764 583 -450 187 195 -1032 -18 -358 -760 515 -560 -102 632 -463 577 106 -431
1733d31J041q02R3Q63j336J005q4m14O87p82K37N88j178P64K23j222J318p26m95
$$ -431 610 -192 -99 764 -572 433 349 -65 622 -160 77 665 -513 251 474 -748 570 -156 -651
1752f51R86j042N55M74r85P61m54k48J037p11J8M24p39R48j21q15J240q17j37
$$ -651 335 -707 -152 322 -663 98 -356 -604 433 -278 -260 164 -575 373 252 -563 677 -140 -277
1771b77J034r78O02J32j080J400p27j57P23j173O90K51q67O94m06k36Q18q95J56
$$ -277 757 -221 381 513 -567 833 106 -51 672 -501 189 440 -427 267 -139 -375 443 -452 -296
1790b96P14j002Q71l53n2N92q92J68O72j000N98jm41J119o24j13O00r98Q67J26
$$ -296 418 -584 287 -66 -118 474 -418 -250 422 -578 20 19 -422 697 73 -40 560 -438 429 555
1810E55q50O59m44k58J112j177M57K76p35P51k67o80J023q13N6R13j225O84M6
$$ 555 -295 364 -80 -338 774 -403 54 330 -405 346 79 -601 422 -391 -335 578 -647 37 83
1829H3n53Q04o38n9N95r54O27K22n52Q86p12q4R56j036L68M69o79P48m11n64J253
$$ 83 -470 334 -304 -363 232 -722 -95 127 -425 461 -251 -335 621 -415 -47 422 -257 491 80 -484 769
1850G69q79J60M70r04N96K3p99J177q48j53Q96j329J064J56j030Q51k06p56R52
$$ 769 -110 50 520 -384 212 235 -564 613 -235 -388 508 -821 243 399 -631 220 14 -742 210
1869B10q60P09L35r83J099p02j52P99r94O28K63r05J026j49n19P18o86M3P30p30
$$ 210 -650 59 394 -589 510 -192 -344 455 -539 89 352 -553 473 324 -195 523 -163 -120 610 -120
1889a20L52J55j140J212p67P7P22r57N59L22r85R59m35n46R12q73M17L26r25J049
$$ -120 232 387 -753 459 -308 -231 491 -466 93 415 -570 389 -46 -592 320 -553 -136 190 -735 314
1909C14L2o42P89p36P1P35j259Q68K52q41J175o57l76J135j214R3N48o20Q81m93
$$ 314 346 -296 493 -243 -172 563 -696 172 424 -417 758 101 -275 860 -354 -261 287 -333 548 55
1929E5n46J196r31l2N59r65Q41l1p35J019p25J41M03q24Q41m1q00J004o68K37
$$ 55 -491 705 -226 -258 301 -664 177 146 -589 430 -295 -154 249 -575 266 225 -575 429 -239 -2
1949bM78j040Q62R7q86J054n72k63P99q95O81K12j007Q05N5o45P92p04k08N88
$$ -2 476 -564 298 395 -491 563 -9 -272 527 -368 313 525 -482 323 378 -267 525 -179 -387 201
1969B01o86N58j9o57Q93n41j96R30r51M86J30p78J101l30l08Q32q62n7P20q62
$$ 201 -485 73 54 -603 290 -251 -447 483 -468 18 148 -630 471 141 -167 665 -197 -254 466 -396
1989c96O86R9m22N43q07L28M74r81N56J69o13R18o90m15R41j022Q62j05p20J021
$$ -396 290 389 -33 510 -297 31 505 -476 80 249 -364 554 -136 -551 390 -632 230 125 -595 426
2009D26n68l13J084j322P47M07j192J070j74m00O21m13j89R76j298Q53j5l58K15
$$ 426 -142 -455 629 -693 54 461 -731 339 165 -235 386 -27 -216 760 -538 315 300 -58 157
2028A57l99mM43o08L70N53q38Q89p76%N87q29K86L84l46K23j72k74J062j038j20
$$ 157 -242 -246 197 -411 -41 512 -326 563 -213 -213 374 -455 -169 215 -131 92 -80 -354 708 -330 -450
2049d50O44o08P14k17k26O95p08K76J64p20P88l61m23N89J45n11Q51j011R25l80
$$ -450 194 -414 300 83 -143 552 -156 120 284 -436 352 -9 -432 157 302 -209 642 -369 556 176
2069A76q28J117k30m07O41p51lM89n23N93n30p46J711j228N69M82j162Q36j92
$$ 176 -652 465 235 -172 469 -282 -285 204 -319 274 -256 -1002 709 -519 50 532 -630 206 14
2088A4m26J150l10k90k85k36J04K01l91L72o42J039O66j963O26M51n48M08r4m97
$$ 14 -412 738 428 138 -147 -383 -279 -78 -469 -97 -739 300 966 -997 -371 80 -468 -60 -154 -651
2108f51N05m35O03o7l22O46j22j165J129m29M8Q02j197P93K08p86R58n52l36R88
$$ -651 -146 -581 22 -45 -367 279 157 -1008 121 -308 -260 542 -655 138 346 -440 518 -34 -370 618
2128F18j028P07N6p30P82k89p79R46l91j46N43m58M38R8r42J120r39K62O26r10
$$ 618 -410 297 353 -377 405 116 -663 283 -108 -254 289 -169 269 367 -575 545 -394 -132 494 -416
2148d16M11J94p10Q27m94M8P03r25N97Ro52P07j10n77R81q47L3M85n76L63K60
$$ -416 -5 189 -521 306 -188 -140 563 -362 235 244 -408 299 189 -388 593 -254 -221 264 -312 51 311
2169C11q45J221q08k44P67r33N34j31o41J094n37Q4N13q28O73o5p80O03O4l23
$$ 311 -534 687 -121 -365 402 -531 3 -128 -769 325 -212 -128 385 -443 230 165 -615 -12 52 -271
2189b71O45n05L39K39r46R50m99k73R92p32k57P24q01P22l96m12Q09l60K04k53
$$ -271 374 -131 208 447 -499 451 -48 -321 671 -61 -318 406 -395 327 -69 -481 328 -32 172 -81
2209h1j14k91O7O13k55J04Q5n88M30j71J57N26j57J77q21M53r37O64M91p17L68
$$ -81 -195 -486 -419 194 -61 43 128 -460 -30 -201 -44 482 325 502 -319 134 -803 -139 352 -365 3
2230CJ00j061M99N31n0Q59j720J81M31n03L75K31n97J467r83M53j75j068J105
$$ 3 103 -958 -459 72 22 881 -839 -658 -227 -730 -355 -124 -721 746 -237 216 41 -1027 78
2249G8l3j301J442o59K53L78m44Q51o02k69K74j47K37L42q60M15N51j084N96J4
$$ 78 45 -1256 186 -473 -220 158 -286 565 -37 -306 -32 -179 58 400 -460 -45 506 -578 18 32
2269C2k69P76p45RP36r76O58l03l10Q32o80K68M21q64J94K89m94P28o25o5Q47
$$ 32 -237 539 -206 -197 539 -437 221 -82 -392 440 -240 28 449 -415 -221 68 -426 302 -323 -388 459
2290D59r45O78j20l62O08m20j85O60m56k03M55o82P36k09k85P15n85J74J30m08
$$ 459 -486 192 72 -290 318 -102 -287 373 -83 -286 169 -513 223 14 -271 444 -141 33 163 -245
2310b45K97J4n07R96p32j45Q30j091P13k3m56P25n38o7Q05r24K72R5m52R43q09
$$ -245 52 66 -441 555 -177 -322 508 -583 130 107 -349 376 -162 -229 576 -348 -76 19 -433 510 -299
2331b99o5Q95n50P4jm10O66j24m29L05J12m18N89o95O81k67o45J060r17K53N87
$$ -299 -364 531 -19 55 54 -356 310 186 -243 62 174 -244 345 -350 331 64 -581 479 -438 -185 402
2352D02r57M67M12j036P23J21o16J052p78L80L7n73N91k59l52P92n52J4M74p11
$$ 402 -555 -88 324 -712 11 132 -484 568 -210 170 207 -366 225 -34 -386 406 -146 -132 342 -369
2372c69N74p0o20R83o55k27N61o80O23P2p90R95p51QR12q59M25J15o33P29m80
$$ -369 205 135 -485 498 -157 -384 177 -503 120 192 -598 397 -354 -346 566 -293 132 247 -386 343 -137
2393a37r5O20o29K43L41q87P76p5m22O75l62k23N21o84L53On11Q20m21j13O69
$$ -137 -232 388 -241 2 343 -544 232 157 -265 410 48 -175 346 -338 15 21 -490 330 -91 -204 465
2414D65p41L65J11n99O16q5l18P03q39J78N00o01J13j3k28N41m37J72M98n35M16
$$ 465 -276 89 200 -399 217 132 -186 517 -322 -144 356 -245 -132 -145 -373 168 -269 -97 401 -134 282
2435B82j92n43P50k13l75O90q77N42J37m01P15l43m20M69n05J63O80q50L58j26
$$ 282 90 -453 297 84 -291 399 -478 64 201 -200 515 172 -248 221 -284 -121 559 -291 67 -59
2455e9k83P36o29Q8M26p08N63J26q09O71j58j55N33r35O03J65q76Q42j36k37P56
$$ -59 -342 394 -235 -147 279 -429 134 260 -549 122 -36 -191 342 -593 10 175 -701 141 5 -232 524
2476E24p43L04L41p69M13L4l86R73r11J5N03m35L7Nl06P69l26m49M55k75M79m93
$$ 524 -219 85 426 -343 70 104 -282 691 -220 -205 298 -137 -100 -95 -401 368 42 -407 48 -227 252 -241
2498b41j24O50k98l32K62r9K47L04q13O01J60l73L91l87j87N80n64N03q4n74O70
$$ -241 -365 285 -13 -345 -83 -182 65 369 -444 157 317 -56 335 -52 -239 341 -223 280 196 -378 292
2519B92n04J04O09r57N87P9o33P42j73m10N66n24P1L65n22P77l30m89R59q65K22
$$ 292 -212 -108 501 -456 131 210 -423 319 146 -264 302 -222 -151 214 -308 469 139 -350 609 -256 -34
2540c4K82m95K89j8m34M61k38j29N44m85K68O1l92M84k80m7M43m16p5J81k46O59
$$ -34 248 -247 42 24 -410 51 -187 -316 228 -257 11 72 -320 164 -116 -163 280 -136 -211 -30 -276 383
2562C83j31m66N03l65r9L51q98J021Q3r23J650j045n3O8p25N31P20o56J58l75
$$ 383 252 -214 289 -76 -175 176 -722 299 382 -541 1109 64 11 79 -646 -115 605 -51 107 -268
2582b68KM35l36M68l79p16J75K25l30J097j111P79P1m82R21n78k38N63m40Q6L19
$$ -268 -266 169 -167 301 -78 -794 -619 -394 -724 373 -738 41 112 -370 551 -27 -265 298 -142 -56 263
2603B63n17J06K64l44L81n01N18Pn29R4M64n92N35j8j61M05p09J14L42k81J87
$$ 263 -254 -148 116 -228 153 -348 170 177 -352 -258 206 -386 149 131 -30 375 -334 -220 122 -159 28
2624B8J91j25N37j337M16M10l94M89p39M05O16r79k13P30r2l49O81j03o12L34
$$ 28 219 94 631 -706 -290 120 -274 215 -524 -119 497 -482 -695 35 -57 -406 275 172 -440 -106
2644a06O2L30m57j60l58K40R41j098Q21M87j581K91Q66n57Q60o43j51r4N03m42
$$ -106 -44 286 -171 -331 -689 -449 492 -606 215 702 -879 -588 278 -279 581 -62 -213 -307 196 -246
2664b46P86j195N07N58r79P93l34j00M73k00J96k8o44O20k51m97Q91n80J52L18
$$ -246 540 -655 -148 410 -569 224 -110 -210 263 63 259 231 -413 207 -44 -541 350 -230 -78 240
2684B40q01M80K12l17N53m90l8N18q88K80N14n13M70l56N0L28p05O18J62m21K50
$$ 240 -561 -81 131 -186 367 -123 -161 357 -531 -251 263 -250 220 -136 -86 242 -463 155 317 -104 146
2705A46j8m23Q03l95k87P44j185P72l13J78N13k82o58N39J1P4j32l53O69r16m44
$$ 146 128 -295 508 113 -174 570 -615 157 -156 22 535 253 -405 134 145 219 87 -266 403 -513 -957
2726i57N62J62J81k24k25J395j396O07m0l13L24J12l19L10J00k50N69m86r0L5
$$ -957 -395 -233 -52 -276 -501 894 -502 105 65 -248 76 188 -131 179 279 29 598 112 22 57
2746E7k22K05l68j9O10m07J66l3k82N20j87k64L79m63J16M97l08j89L55m77N41
$$ 57 -165 40 -328 -347 263 -144 22 -11 -293 227 40 -224 155 -308 -192 305 -3 -192 163 -314 227
2767B27l46l07R36q21L09K14l63K81r5k38O43n57L81J3m24L58j85j31M67m45M7
$$ 227 -119 -426 510 -311 -2 212 -151 130 35 -203 440 -117 264 277 -147 211 26 -105 362 -83 -36
2788c6K18l85L03j38q8L49k70j81N33m44K04l3l34L40M0j77M59l62L6L10o36M30
$$ -36 182 -203 100 -38 -126 223 -47 -228 305 -139 65 32 -302 38 78 -99 360 -2 34 344 -292 138
2810A38k3o19Q32m19l9L79p54N21L40n59M65k84m08Q44p80J47M64m65M68l66m17
$$ 138 115 -504 328 -91 -130 249 -505 16 356 -203 262 -22 -430 414 -366 -219 245 -220 248 -118 -535
2831e35N37J64q8J48l49nQ5l44N35N8k50L01m74L20kk96K78l47l9N61o48N59J76
$$ -535 2 166 78 226 -123 -128 -43 -387 148 206 -44 257 -217 103 101 -195 83 -264 -303 258 -390 169 345
2854C45n44K24p0r2L34n08L01K37n16N48j85j97L05n08K25M24l97J11J72o04O70
$$ 345 -199 25 -45 -137 197 -311 -10 227 -289 259 74 -123 182 -326 -101 323 -74 37 209 -395 275
2875B75k98r8K83m15K17L19n21M58k68j43O06n77L9L13l46Q6R3l44P91m20KQ5
$$ 275 -23 -121 162 -253 -36 283 -238 220 -48 -191 415 -162 -123 190 -156 -70 23 -321 470 50 52 137
2897A37l78L40pm10M21k59JL11m79K84R6j28M03l69K10Q0m23o5K75k51M04j47
$$ 137 -241 99 92 -318 103 -156 -155 156 -323 -39 57 -71 332 -37 173 253 -170 -235 40 -211 193 46
2919D6j33L33m92K90K16o38L36m6j13L82k49j86K40k16J56L82m94K26j33l17N20
$$ 46 -87 246 -246 44 260 -378 -42 -88 -201 181 -68 -254 -14 -230 -74 308 -186 40 -93 -410 110
2940A10n13L02K92n90N45n1k24N32k63k48M02m69P0K1j02M43m46N8K53l26L52
$$ 110 -403 -101 191 -399 146 95 -129 403 140 -108 294 -175 -105 -84 -186 257 -189 -131 122 -204 148
2961A48L94p93K89j37k47M72n30O35q9k07P0Q5j86K84l77J06L57n66M51J47k73
$$ 148 542 -251 38 -99 -346 126 -404 231 142 -65 5 90 -96 188 -189 -83 274 -292 159 306 33
2982C3L36l00j40L25n63N32l16r8L48k8l93M94n84K25N43p38N74k69m85P97p68
$$ 33 369 69 -71 254 -309 223 -93 -191 157 129 -264 230 -354 -129 414 -324 250 -19 -504 293 -475
3003d75N25J85l74L75l3l68L97m09K6K64p3J98m3l91K50k48K51P3k83K4K47m04
$$ -475 50 235 -139 236 203 -165 232 -177 -151 113 40 238 195 -196 54 -194 57 130 -153 -129 118 -286
3025b86O08m51j02M45m82L77j61l16L75M0k51L51n31L33N5k49J59N01o13M68l67
$$ -286 322 -129 -231 214 -268 109 -52 -368 7 47 -204 147 -384 -51 4 -245 -86 415 -198 270 -97
3046i7j20O12l12O7N7j12J61k19l2k1j00r4K86k10K55j26k69N94o73K25K55k55
$$ -97 -217 395 83 150 207 95 256 37 5 -16 -116 -210 76 -134 121 -5 -274 320 -353 -128 127 -128
3068a28J94p2k70L65q7j67K72k70J23K02n48P47m16j86M43k11L05O4q86P33m81
$$ -128 66 -6 -276 89 2 -165 107 -163 -40 162 -386 361 -55 -241 202 -9 296 360 -526 207 -274
3089b74L3M97k51k45L12m92O96j88q3K07l20m0L64l96J43J03n34Q67m28k16M77
$$ -274 -241 256 5 -240 72 -420 276 88 5 212 -108 -148 216 -180 -37 66 -468 399 -29 -245 232
3110B32k88L13O3o90K92M06n72N80l68J52%n19N02j0k46K95k33k52M87k42K13
$$ 232 -56 257 320 -370 -78 328 -244 336 -32 120 120 -399 103 93 -153 142 -91 -343 144 -98 115
3131A15l1k69J88j21K2LN6J8Q7k12J84l05K11M07o58J26K75l54M87l46k9L53l55
$$ 115 84 -185 3 -118 -96 -93 -37 -19 68 -144 40 -265 -54 353 -305 -179 96 -258 229 -117 -146 207 -148
3154a48PL95k95L9J45m25N69k21k16L58l10PJ22j49Q1m6K18j25j70q0J87r3J56
$$ -148 -141 254 -41 -2 143 -282 287 66 -150 208 -102 -95 27 -122 -41 -87 131 6 -164 -244 -57 -150 6
3177F%k54O13m19K47M8n95N04p9j52K62j59k92M87m88N21M2m03M45k84j48M18
$$ 6 6 -248 365 -54 193 241 -354 150 71 -81 181 22 -270 217 -271 250 292 -111 334 50 -98 320
3199C20o78M15o0l12L74N0l32L28l53L4L07n50N67k4m66M10J51l27M68j80J37
$$ 320 -358 57 -3 -315 59 109 -223 105 -248 -214 93 -457 110 86 -380 30 181 -146 322 142 279
3220B79J1m28K89l48K18M9J24l01K7M6J84j85j18L58m48K56J25l76K22M28p45
$$ 279 290 -138 151 -197 21 70 194 -107 -80 -34 150 -35 -153 205 -243 13 138 -238 -16 412 -333
3241c33O27m45J41K30m23K63J53m35M90M1k74K78n01nL34m78L65J79k43L17n68
$$ -333 294 -151 -10 220 -203 60 213 -222 268 309 35 313 -188 -193 141 -337 28 207 -36 281 -287
3262b87K62J39k10K11L4l09K36k58J1M65n32K92J55k29J4MnK34l60K41j13j92
$$ -287 -25 114 -96 115 149 -160 76 -182 -171 294 -238 54 209 -20 -6 -2 -7 227 -133 108 -5 -197
3284a97L58j98O9K42k71j88M23n38M46n9k09L33m72N0K99l70J70J31j57K84l79
$$ -197 161 -37 32 274 3 -185 238 -300 146 87 -122 211 -261 -211 88 -282 -112 19 -138 146 -233
3305b33K1N35m73K22r0k86N90n21J01M97n35K46J62n91M39k60j02N05m51J26O8
$$ -233 -212 323 -150 72 -18 -304 286 -235 -134 363 -172 74 236 -355 84 -176 -278 227 -224 -98 -30
3326c0L3J41j58q7L38l19q9N03n94J9K10k47L50o2j2L04j99J42k06j71K76m64
$$ -30 3 144 -14 -101 237 -82 -171 332 -262 -243 -33 -280 70 8 -4 300 101 243 37 -134 142 -322
3348c22K31J63r1j04R6j67K98j08j22M04n16K40L13m44M8R3j34N16l61r8K04l86
$$ -322 -91 72 -19 -123 -27 -194 104 -4 -126 278 -238 2 315 -129 -81 12 -122 394 33 -65 139 -247
3370b47L35k8k16L32P6m96N52l32J05p4j43J35M1qM42n37J92o4k29J81o7r3M65
$$ -247 88 60 -156 176 252 -244 308 -24 81 7 -136 -1 40 32 474 -63 129 65 -164 17 -50 -143 322
3393C22l93oN45n73j0L61m17J08J70m25O03l74k41O22l22k21K82j02K66k96K8
$$ 322 -71 -77 468 -105 -115 246 -171 -63 107 -318 285 -89 -330 292 -30 -251 31 -71 195 -101 -73
3414g3K83m77K50P2n75Q30m24K05Q7k55K28o8l67L58k85j40O63j59k51J33j39
$$ -73 210 -267 -17 55 -520 310 -114 91 178 -77 151 83 -284 74 -211 -351 312 153 -98 35 -104
3435a04R9j1l11O57k68q2L26n84J66K39j79J74L4rJ30m28O4N4l64M49r3j41K42
$$ -104 -5 -16 -327 330 62 -20 306 -278 -112 127 -52 122 156 147 277 -151 -87 -33 -397 52 -41 -182 60
3458F0J0k97L45m54M58l9l25L29m15L63J07j0j29L7k27N42l78j37J71k14L59k21
$$ 60 70 -227 118 -336 122 83 -242 87 -328 35 142 132 3 40 -187 355 -23 -160 11 -203 156 -65
3480f5j09K73N2l6o3k17J70O2l62K66j10J75q5J30k3j41O1J22Jn97O33o5Jo3j93
$$ -65 -174 99 151 115 52 -165 5 67 -295 -29 -139 36 -49 81 58 -83 -22 100 101 -496 137 72 73 10 -183
3505a83M89m17o4M11k53k02P3j28L70k8m87P51n14K67Q2l12K87K9n73M81k91j23
$$ -183 306 -111 -175 236 -17 -219 -146 -274 96 68 -419 332 -182 85 167 -145 142 171 -402 79 -212 -335
3527c35O81o73K99J38l94O77l71NP6l7j60J99k64L03J76o32M05P2k97K91m13L13
$$ -335 346 -327 -28 110 -284 393 22 27 103 66 -94 105 -159 144 320 -312 93 165 -132 159 -254 59
3549E9K38k70J29j58l21M75l49M8L86n06K89k26O1K80j43j54L24l85K03n5r3M14
$$ 59 297 27 156 -2 -323 152 -197 -149 237 -269 20 -206 -145 135 -8 -162 162 -223 -20 -75 -168 246
3571B46m91K15J33l47J69J51k94L05N2k04K43k13K46j18k14N1j3q2K58J21k27
$$ 246 -245 -30 103 -244 -75 76 -218 87 139 -65 178 -35 211 93 -121 -70 -83 -165 93 214 -13
3592a3M8l08K62K88n23K61j62l3K86j44J10K21o39N00j35j00K40k15m9L42k07
$$ -13 35 -273 -11 277 -246 15 -147 -180 106 -38 72 293 -346 154 19 -81 159 -56 -105 237 30
3613C0J0k14J3J08P2N6R7l57K31J88m60K96k97J81L17k05Q7j85j48M33m67Q1R5
$$ 30 40 -174 -161 -53 19 75 172 -185 46 234 -226 70 -227 -46 271 66 153 -32 -180 253 -214 -133 -38
3636c8j70K84J96n21M77k13k42M96l88K6L6OR5J11m82N52l34J1N75p39L28pp6
$$ -38 -208 76 272 -249 228 15 -227 269 -119 -93 -57 -51 44 155 -327 225 -109 -98 477 -262 66 59 -17
3659a7K29l54J6M61m35J91K11m12K67k85j45R6K14j91J76j21K71M3j87j6j70O6
$$ -17 212 -142 -126 335 -100 91 302 -110 157 -128 -273 -177 37 -154 22 -99 172 215 28 12 -158 -92
3681i2M79o00K62K90o02M99j67l34M59j73K0K60o00M42k85o1K74j41p7K32l92
$$ -92 387 -213 49 339 -263 236 69 -265 194 21 41 301 -299 143 -142 -203 71 -70 -147 85 -307
3702c07L04J2j27K15M07p63L96p0j79J91k90M79m47L0K49j69K76J11k67j08K71
$$ -307 -3 9 -118 97 504 -259 137 67 -112 79 -211 268 -179 -149 100 -69 207 318 51 -57 214
3723B14k70Q2j3j21R3n4O0K35l83M81k48j57J36PO4j62n8J71n5l41K71j31M36
$$ 214 -56 26 13 -108 -15 -69 -9 226 -157 324 76 -81 55 62 126 -36 -94 77 22 -319 -48 -179 257
3746B57j47l47O27p49L78R5j35j40M27p37M49J48k55J40k78K95J78l22J68j6j56
$$ 257 110 -237 390 -359 19 114 -21 -161 266 -471 -22 126 -129 11 -267 28 206 -116 52 36 -120
3767a20K62l79K41Q1m46L92K11p00Q85j86k84K4RO8J58l60M59n02K62J51k73K8
$$ -120 142 -237 4 85 -361 31 242 -458 427 241 -43 -19 -10 58 216 -144 315 -187 75 226 -47 -19
3789a9J94m57K58J67k23R3q0O5J39m85K22K61k33K97k39j02L05l23J8J76L3q4
$$ -19 175 -282 -24 143 -80 13 -67 -2 137 -348 -126 135 -98 199 -40 -142 163 -160 -142 34 67 -17
3811a7j06J35p2k14N30j17k54K50k11J8Mj33J94J58m78K82r5K03j46LN4J18j97
$$ -17 -123 12 -60 -274 256 139 -115 135 -76 -58 -54 -187 7 165 -313 -31 -126 77 -69 -66 -12 106 -91
3834i1K72j90R7P2J50o6j57j92P5J00q6P4p7l78M89M0l68L94m67O58k84l09L34
$$ -91 181 -9 88 160 310 244 87 -105 -30 70 -16 58 -19 -397 92 132 -236 158 -309 349 65 -244 90
3857I0J00m78M63l24K38l0k12K51j49k12K90Pj48J76PJ08j11j00p8M6J43ln15
$$ 90 190 -288 175 -149 89 59 -153 98 -51 -263 27 34 -114 62 69 177 66 -34 -112 -66 77 74 -441
3880d41M80jk4K05l53J74J69o11N63j1l39L57N5k59N6Pk6L05o60N21j22j09L22
$$ -441 39 38 14 219 -134 40 209 -402 161 150 -189 168 223 -36 20 27 1 306 -354 167 45 -64 258
3903B58m99J92K63j97J82N7n23K70j5J9j93K8J30K06l80L27k07J36J04l61K23
$$ 258 -241 -49 214 17 199 256 -267 3 -12 7 -186 -158 -28 178 -202 125 -82 54 158 -203 20
3924B0Q9l47L91j40k62K97l26J28K27j13J18R2m04L07k88K49j72L21l01L30n47
$$ 20 109 -238 153 13 -249 48 -278 -150 77 -36 82 174 -230 77 -211 38 -134 187 -114 216 -331
3945c31L37m7j0J46P0M5m73N5L83j80k89Q01m77K5Lq6nQ0m27L53j73P6N69o58
$$ -331 6 -41 -51 95 165 210 -263 -208 175 -5 -294 507 30 55 58 -28 -33 47 -380 -27 -200 -124 445 -213
3969b13L98k71m3L11j12n0K48l56PJ17MK88j09m72N29l25q5R0j56KL32k82J84
$$ -213 185 -86 -129 182 70 20 268 -88 -81 36 40 328 219 -253 276 -49 -134 -44 -200 -198 134 -148 36
3992C6j36n5M35l22L56k86k63K22Lk10M30l92J73L91l54M7j64o2J65j24K05j24
$$ 36 -100 -155 280 -42 314 28 -235 -13 -10 -220 210 -182 -9 382 28 75 -89 -151 14 -110 95 -29
4014b9j62L42J37m15J94k20J74K30k39J08k58K16l9k04K55N4k21M7L69m34J35
$$ -29 -191 151 288 -127 67 -153 21 251 12 120 -138 78 39 -165 90 144 -77 -30 339 -95 40
4035D0q6j85L18k36J12J90l02J15k9N7K53l49L7J56j32J27J30m16K82j04k5L19
$$ 40 -46 -231 87 -149 -37 153 -149 -34 -63 -6 247 -102 -65 91 -41 86 216 -200 82 -22 -47 272
4057B72k68l2K33j54J29k85P5J76j96M5L0p8O2L9m25K55l7J05J62k33M5J19k58
$$ 272 4 -28 205 51 180 -105 -30 146 -50 -5 25 -53 9 48 -377 -122 -159 -54 108 -125 -80 39 -219
4080b19M12l77J99J51k79J74j43o8L36k16l0L38n03K51O5l27L39N4j06O5l7M7
$$ -219 193 -184 15 166 -113 61 -82 -150 186 -30 -60 278 -225 26 91 -236 103 157 51 116 79 126
4102A26p0J3j99o2j57M56n5j56K25p6m9L1j14R6j45O2K14m9j15L61k15o16L53
$$ 126 56 69 -130 -192 -349 107 52 -104 121 45 -4 27 -87 9 -136 -74 140 91 -24 337 122 -494 -141
4125a41L65j66o5P95j354N28p76R91l99K02L6j95L05J06k30M1k28O04l25k0J8
$$ -141 224 58 -7 788 -566 -38 -814 177 -222 -20 16 -179 126 232 2 43 -185 419 94 74 92
4146I2l63L09J51k65L63j20m41M76l97J69J14j67L74l17j10Q6K69j08N07k18j65
$$ 92 -271 38 189 -76 287 167 -274 202 -195 -26 88 -79 295 -22 -132 -46 223 115 622 404 239
4167B39K62m22K79l29m4J07k40J78kN8M0k33J3K08k19K10j1l76K87L49m85J45
$$ 239 501 79 358 29 -15 92 -148 30 28 86 126 -107 -94 114 -105 105 94 -282 5 354 -131 14
4189A4L1M4j03l13L58J78n60J84J96n9o7M1RM7o9j43K37O0L3k33L43j7j71O2k63
$$ 14 45 89 -14 -327 31 209 -351 -167 29 -30 -97 -56 -47 0 -69 -212 25 85 118 -115 228 211 40 102 -161
4214a61J78L1n8k2J53k59J66N8r5O7o2p1K75j86N2J13m45M23k37J96o2j61J24
$$ -161 17 48 -10 -32 121 -138 28 86 -9 58 -4 -75 200 14 66 179 -266 157 -80 116 54 -107 17
4237A7K54l06L9J14j06n9k94O49j58k77K45l53M2L41m87Q23l85n60M66j88l32
$$ 17 271 -35 4 118 12 -47 -341 308 150 -127 118 -235 -193 148 -339 484 99 -461 5 -183 -515
4258e15P09j46J65k38m90Q36L22j477J096M44q51M88j38o7Nj19K22k44K62K75
$$ -515 194 48 213 -25 -515 321 643 -834 262 706 -145 343 205 138 143 24 246 2 264 539
4278E39o89j055R77R9PM0k23rL14j57j42m9O17o76k05O09r3K33j76o09R00Q6n71
$$ 539 -150 -1205 -228 -129 -122 -82 -305 -314 0 -157 -299 -348 269 -407 -612 -3 -96 137 -39 -648 252 338 -233
4301b33P20p23O1L23k34j35L47k61L87m8k90K89j28j24L01m42j66L19k50M31k76
$$ -233 487 -236 -175 148 -86 -221 126 -135 252 204 -86 203 75 -49 252 -190 -356 -37 -287 144 -132
4322a32l4J66Q2K2K06n78L49p8k10M09j72j31R2j27K75o5j59J33j89L19j30nj41
$$ -132 -166 0 82 104 310 -268 81 3 -207 202 30 -101 -9 -136 139 74 -85 48 -141 178 48 43 -98
4345i8J47p4J05J5m0k63k28N66R6m43N95J5m03K13Q4k60k28K81J09j39m6K72m77
$$ -98 49 -25 80 95 55 -208 -436 130 226 -217 378 393 -10 203 287 27 -201 80 189 50 4 276 -201
4368b01j56O94k16n9J97l41J34j35mK82J7o21M64j66KJ64j64L50k89L18k32l89
$$ -201 -357 337 121 62 259 -82 52 -83 -87 195 212 -409 55 -111 -109 55 -109 241 -48 270 38 -351
4390c51M04K2k16M02j72N0k0j00%O6j5J96r8k6n6k26J23K1k89M16j44o9K29m80
$$ -351 53 75 -141 261 89 139 119 19 19 85 70 266 168 142 86 -140 -17 4 -285 131 -13 -82 147 -333
4414c33N58J56l64j23K86j49j5j6J62j57J51j85J78m09L60q8k55M39m18R8L01
$$ -333 225 381 17 -106 180 31 16 0 162 5 156 -29 149 -260 100 12 -243 196 -222 -124 177
4435A77j14m2l41q9N99m61J29K8R4O7q6j06M65m14O3K20l49R9J11LL64p43M39
$$ 177 63 21 -320 -409 190 -271 -142 -114 -20 47 -39 -145 320 -94 -31 189 -160 -61 50 53 417 -326 113
4458A13j02N3J13j61j7O3J17l82M44k44J00j06k80L74j06l21O04m70l8K68K2j01
$$ 113 11 64 177 16 -1 62 179 -203 241 -3 97 -9 -289 85 -21 -342 262 -208 -246 22 44 -57
4480e7J01p7K71m40K65mn01N42k43J12M39n61p3M56m34L53j35o9L19m62K11j14
$$ -57 44 -33 238 -202 63 59 -442 100 -143 -31 408 -153 -226 230 -204 149 14 -55 264 -198 13 -101
4502a01k90O43j77k77L44K42j007l27P91k00N00l58N04N69j393J002n20j78Q94
$$ -101 -391 252 75 -202 142 384 -623 -950 -159 -359 141 -217 287 856 -537 465 -55 -233 661
4521F61m46O3n25R9J59j62l5L20k5K17m02j5K17j53n1J49k62J65J26k60L31l35
$$ 661 215 278 -247 -148 11 -151 -186 134 109 326 -76 -91 126 -27 -78 71 -191 -26 100 -160 171 -164
4543a64PL07n6j26J66m82M81m9k45M67m97L21k46k5J84K5q4K13j35k8qo7j4M51
$$ -164 -157 150 94 -32 134 -348 133 84 -161 306 -191 130 -116 -141 43 68 -16 197 62 34 26 -41 -55 396
4567C96l52J03j04k28L45m33K86J1k4q9M08n26L56k61L06o2l40K34j03j46L35
$$ 396 44 147 43 -185 160 -273 13 24 0 -89 319 -207 149 -112 194 132 -208 26 -77 -223 112
4588A12l69L60j63m7J53q2j84M30l50J15L15k75J3J14m04K04j03J25N9J56k47
$$ 112 -257 103 -60 -107 46 -36 -220 210 -140 -25 290 15 28 142 -262 -58 -161 -36 23 179 -68
4609f8K12l41J85R2j76Q7j50P1K00j90k44K97k53M98k29k0J24k46j4K25j80O3
$$ -68 144 -197 -12 80 -96 -9 -159 -88 112 -78 -322 -25 -278 220 -9 -29 95 -151 -165 60 -120 -57
4631e7J99P8l5l77J55J99j23k6J99m35L31n8r6J44j23Q3J01k84P8K21l85L71k63
$$ -57 142 220 185 -192 -37 162 39 13 212 -223 108 50 -46 98 -25 58 159 -125 -47 174 -211 160 -103
4654a03q1J66j28K37J57q5N0l64k7K45j91O2J58k15J34k5j68L15l14j7J56j88
$$ -103 -184 -18 -146 91 248 163 213 -151 -178 67 -124 -62 96 -119 15 -10 -178 137 -177 -194 -38 -226
4676b26L09l43L3M47m29K46K5oP6k32j94M83j80O4L91n10k7Q9j58K54j57M6Mk8
$$ -226 83 -260 -227 220 -209 37 62 56 132 -100 -294 189 9 73 464 -46 -73 16 -142 112 -45 1 5 -23
4700b3J08L02l90P0J05k4jn7R6l88k09O21j42N0J16k98K30j49j08kK2m5K76j27
$$ -23 85 387 -3 67 172 148 147 90 186 -202 -411 210 68 118 234 -64 166 17 -91 -93 -71 -116 160 33
4724C3j21K79l40J81P6l56K87J33m28N70m93K91j33O4j05O0k73L75p6L7J41k59
$$ 33 -88 191 -149 32 108 -248 39 172 -256 314 -179 112 -21 43 -62 -2 -275 100 24 61 202 -57
4746e7K86o0k53K11j08J22Lm2L8n1k31L31k63J46p5o7j5J41j35Q7k54L96Q4k93
$$ -57 229 169 -84 127 19 141 144 102 140 89 -142 189 -74 72 -3 -70 -85 56 -79 8 -246 150 234 -59
4770e9j25M16l24J20o8p8N1J9k26N8L50j10kk6l1j66M40j43k03J26Q7o63Q59j99
$$ -59 -184 232 -92 28 -40 -118 -67 -48 -274 -216 134 24 22 -4 -35 -201 239 96 -107 19 106 -557 302 103
4794A03k54J00j94N2J93J6%j2k32K43j92L33or8l0K05j54K5j33J68lk53L21j02
$$ 103 -151 -51 -245 -193 0 16 16 4 -228 15 -177 156 150 52 22 227 73 98 -35 133 130 -123 198 96
4818I6k10K02j56R5K1j91K55l6j93L5K04j90J08k19L5L27m95M38k9j61j42K54
$$ 96 -114 88 -68 27 48 -143 112 76 -117 -82 122 -68 40 -179 -144 183 -312 126 97 -64 -206 48
4840D8n2M7j10J98k9l79L41J25k69R1J2K5M1k56J65Q6J61o7J3l97L94J18j93J61
$$ 48 -4 43 -67 131 102 -277 64 189 -80 11 23 48 89 -167 -2 84 245 178 191 -206 188 306 113 274
4864B74m86K19r2j7J98j94J48j48m3J96p1p3J75L0N1J90o12L54k78J34K32m45
$$ 274 -212 7 -85 -102 96 -98 50 -98 -141 55 -16 -89 86 116 167 357 -255 99 -179 -45 187 -258
4886b58L71j66K08k4j22k38K72j29K8L21k90j35Q4k10K00J4K06n7k00K5K00l05
$$ -258 113 -53 155 131 9 -229 43 -86 -58 263 -27 -162 -78 -288 -88 -74 132 75 -125 -100 100 -205
4908b05N12l26m2J3n7M9J68j81OK3k06L22J2J03J65k87K10k46k76M00m96L03J33
$$ -205 307 -19 -61 -48 -105 -56 112 -69 -63 -40 -246 76 88 191 356 69 279 33 -243 157 -339 -36 97
4931I7l5N1m4k03K37j78lJ56nR8j92J77jj56J96j29j41k65O74m45R7j3j51L31
$$ 97 62 113 69 -134 103 -75 -78 78 73 171 -21 156 155 -1 195 66 -75 -340 334 -111 -14 -27 -178 153
4955A53j13j51M72m35J21n4L4nr0l67N93j94j08M78n99M33k35j34L40q0j64J34
$$ 153 40 -111 361 -74 47 -7 27 22 -68 -435 158 -36 -144 334 -265 168 -67 -201 139 59 -105 29
4977B9J04j70J74l46K89k41J08J79k43J57j68J16J75l0k87L95l31j29M02l85J67
$$ 29 133 -37 137 -209 80 -161 -53 126 -117 40 -128 -12 163 133 -154 241 -90 -219 183 -202 -35
4998c5L18l79J55k07J81k4j57J46J84k35j9K12l9k58J28J55J11m30L16k96J24
$$ -35 283 -96 59 -148 33 9 -148 -2 182 -53 -72 140 101 -157 -29 126 237 -193 123 -173 -49
5019d9Q1j62Q2J87k45J49r3mL10k01k74J47P9n6Q8J92n4l10P6o4N0j39Q1m0L64
$$ -49 32 -130 -48 139 -106 43 -50 -54 256 55 -219 -72 7 -49 39 231 177 -133 -57 -121 -71 -210 -129 -169 195
5044A95l2l12K08j46j72K26qr1L00j44P7j52O8J28j34k3J35j33N3j8j85l2k7L70
$$ 195 163 -149 59 -87 -259 -33 -41 -132 168 24 101 -51 17 145 11 -12 123 -10 43 25 -160 -192 -219 151
5068A51Kj14Pl05J35K47l6r7mp8J48o2J52m2N1k67K31j24j60q8J25J78r7K68k7
$$ 151 153 39 46 -259 -124 123 87 -10 -14 -92 56 -6 146 104 155 -112 119 -5 -165 -253 -128 50 -47 221 194
5093A94K2j09R2k87K4J12j74J35k42R8K91k09K18k04K10n2j31n3q8J39k1j56o4
$$ 194 216 107 199 -88 -64 48 -126 9 -233 -135 156 -53 165 -39 171 119 -12 -65 -153 -14 -35 -191 -255
5116b55R7n3J59J3JJ86j85J18j85J45J8k80O4J38%j83M52m91J40L60l38J97Kl98
$$ -255 -158 -211 -52 -39 -38 148 -37 81 -104 41 59 -221 -157 -19 -19 -202 250 -241 -101 259 -79 118 120 -278
5140b78j1L17k30L35j73j26L94l47K08j34n2K17j10j10J64j16J18j6j90N47l32
$$ -278 -289 28 -202 133 -40 -166 228 -119 89 -45 -97 120 10 -100 64 -52 66 50 -140 407 75
5161G5l43N75j27P8l51J03L7r6M0r8r6J98J3j65J34P0L0P7j28j00N5KL06l10o0
$$ 75 -268 307 180 258 -93 10 47 -49 -9 -107 -203 -5 8 -157 -23 47 77 154 26 -74 -19 -17 289 -21 -81
5186h1K71n5J01k45k4R3K81j98o7o4J09q2k10K73k38N8K12K28l43J49k88L8M0
$$ -81 190 135 236 -9 -33 60 341 143 76 12 121 39 -171 102 -136 -78 134 362 19 168 -120 -82 -42
5209d2j21J36L72n24J78J35k42J42l11J61q2K63j01N2J7l7q1K0K66k47L2J78k66
$$ -42 -163 -27 345 -179 -1 134 -108 34 -277 -116 -198 65 -36 16 33 -4 -85 -65 201 -46 -14 164 -102
5232a02O8k35J78K71p0Ok86P9j5k19J42K74L2O7p6k72K50O0j41R0k11K31K1P6
$$ -102 -34 -269 -91 180 110 116 -170 -91 -106 -325 -183 91 123 190 114 -158 92 152 11 101 -110 121 142 218
5256B18j51M3J37l81j71M65N0l92MM23l30J74n4N8n3p5J24N4l29L01k4j33J61
$$ 218 67 110 247 -134 -305 160 210 -182 -178 245 -85 89 35 93 40 -35 89 143 -186 115 91 -42 119
5279A19k32L40j91j18J41J0k95L13k48L97l1l83K29k26J69l4L1j84J78M5j00O3
$$ 119 -113 227 36 -82 59 69 -226 87 -161 236 205 -178 51 -175 -6 -40 -9 -193 -15 30 -70 -7
5301gp5j8L54k21J68k25j02L13k39K81j72k43J38k5K76j25r9j63J58r9J39j90
$$ -7 -82 -100 254 33 201 -24 -126 187 -52 229 57 -186 -48 -73 203 78 -21 -184 -26 -125 14 -176
5323a76K96q9j41J25J35k76L40k47J44k13j92N01l53P8J30K0L0J38m10P8K34l85
$$ -176 120 31 -110 15 150 -126 214 -33 111 -102 -294 207 -146 -68 62 82 112 250 -160 -82 152 -233
5345b33K18j6l00M14K73m94j08K35M10n70kL46r3m8J83j77K63m25m7J63o4l1L44
$$ -233 -15 -31 -331 83 356 -138 -246 -11 399 -171 -173 173 80 32 215 38 301 -124 -171 -8 -72 -103 241
5368B41o07M83m8j05K10k28J03Lk18K60l8k72L15p7l97M73j45P9K15n40M20j68
$$ 241 -366 117 69 -36 174 -54 49 52 -166 94 56 -216 99 22 -375 98 -47 32 247 -293 127 -41
5390d1Q1J59K4l69K80m05P4K25K8N7N3j92PJ96n2J59m47Q7J47l9k0q5m5l3L10
$$ -41 40 199 223 -146 134 -271 -197 28 56 113 166 -26 -19 177 125 284 -163 -76 71 32 12 -73 -118 -151 159
5415A59n3j4j84K51j08L4j36l3K25j70k22L78m6l2K11l73K01k16J32N8k78J68
$$ 159 106 92 -92 159 51 85 -51 -84 141 -29 -251 127 81 49 260 -113 88 -128 4 62 -216 -48
5437d8L01l97P4K49k03j30J76j65K00k45K30P3j70K47j59Q3Lk40L42r5k41J56
$$ -48 253 -144 -70 179 -24 -154 22 -143 57 -188 42 115 -55 192 33 116 119 -121 221 126 -115 41
5459D1Q5p0j0P7l62L79l05J83J30j92r1M4o9M5K13k31J11J06m0o9Q4mq1j28L70
$$ 41 126 56 46 123 -239 140 -165 18 148 -44 -135 -91 -160 -115 98 -133 -22 84 44 -25 59 55 -26 -154 216
5484B16l24o7O50o68K48r6qn3r7Q5J55j28K21k51J04J18k24K94j4k93J27J68k32
$$ 216 -108 -175 475 -193 55 -41 -49 -102 -199 -114 41 -87 134 -117 -13 105 -119 175 161 -132 -5 163 -69
5507f9L62l06R4j53pJ04P5k26J41K22o58O45j80J52k57J7MP2j33K38j05j60K3
$$ -69 293 -13 81 -72 -79 25 100 -126 15 237 -421 224 44 196 -61 -44 -40 32 -101 137 32 -128 -105
5530a05o3K66j31r6J16k97K79K25l38M01p2j64J96k16q3L29j87oj72r7L73j01
$$ -105 -168 98 -33 -129 -13 -310 -31 194 -144 257 185 21 217 1 -82 247 60 54 -118 -215 158 57
5552E7J17O9m32K06p1P2J2K2l35J88L33l60L14m32J91K53m7R7j90j35J98m8j16
$$ 57 174 243 -189 17 -54 18 30 52 -283 -95 238 -122 192 -240 -49 204 157 254 64 -71 127 79 -37
5575c7L40j26k16oL13m9l08j40L59l67K38p6J45P1j55Pj6O7J30k46R7M8r3r1K76
$$ -37 303 177 -39 -45 268 219 -89 -229 130 -237 1 -75 70 141 -14 -7 -23 44 174 -72 25 73 -20 -111 165
5600A65n13L75N4k49M86k12j42K01l70M87j49j73R1q8J19Oj69R5k26K19k54K02
$$ 165 -348 27 81 -168 318 106 -36 165 -205 282 133 -40 51 -37 82 88 -81 14 -212 7 -247 -45
5622d5j44L98n11J12J62j31J87K29k43l17L34j09L80m86P8k2m2K64l79J94J73
$$ -45 -189 209 -302 -190 -28 -159 28 257 14 -303 31 -78 302 -184 -106 -128 -170 94 -285 -91 82
5643H2J18k00o3k4K0J68k98K57K9k09J13j11j20N02k64K29k24j82L60l57K43j36
$$ 82 200 0 -63 -87 -67 101 -197 60 89 -120 -7 -118 -238 264 0 229 5 -177 183 -174 69 -67
5665f7n9K11k21R5K73n02L35m7j99J75J26k13J81j35j12L08k36L36m6m01M24k54
$$ -67 -126 85 -136 -41 232 -270 65 18 -181 -6 120 -93 88 -47 -159 149 -87 249 203 -198 226 -28
5687b8J16M25o45K18j01L8P9J94k89J91j88P7o8j25K75o0k95L02J66k60K82m56
$$ -28 88 513 -132 86 -15 23 102 296 7 198 10 87 19 -106 169 109 -186 116 282 22 304 -152
5709a52K95j19l6K04r8l16J22o6K80K6l60K58P5j97R4k83k3L00Oj4n8jP1J48l24
$$ -152 143 24 -12 192 94 -222 -100 -166 114 140 -220 38 113 -84 10 -273 -296 4 10 -4 -62 -63 8 156 -168
5734a68K70j39q4Q1r9L65j37j01J4k37L06K45l74o3Q9J9R9N7p1K97o99P5K12j20
$$ -168 102 -37 -121 -40 -139 226 89 -12 2 -235 71 316 -58 -121 -32 -13 86 143 72 369 -330 -255 -43 -163
$$ [...]
8191b56
##END NTUPLES=NMR FID
##END=
