##TITLE=1H_Pr PEtR
 200.13MHz,CDCl3+CCl4,
 8 sc
 
 27.6.2025
##JCAMPDX= 6.0         $$ Bruker NMR JCAMP-DX V2.0
##DATA TYPE= NMR FID
##DATA CLASS= NTUPLES
##ORIGIN= UXNMR, Bruker Analytische Messtechnik GmbH
##OWNER= pz
$$ XWIN-NMR		Version 3.5
$$ Fri Jun 27 14:01:03 2025 Russian Standard Time (UT+4h)  she@DPX200
##.OBSERVE FREQUENCY= 200.1308
##.OBSERVE NUCLEUS= ^1H
##.DELAY= (6, 6)
##.ACQUISITION MODE= SIMULTANEOUS
##.ACQUISITION SCHEME= undefined
##.AVERAGES= 8
##.DIGITISER RES= 18
##SPECTROMETER/DATA SYSTEM= spect
##.PULSE SEQUENCE= zg30
##.SOLVENT NAME= CDCl3
##.SHIFT REFERENCE= (INTERNAL, CDCl3, 0, 14.3821)
##AUDIT TRAIL= $$ (NUMBER, WHEN, WHO, WHERE, WHAT)
$$ ##TITLE= Audit trail, XWIN-NMR		Version 3.5
$$ ##JCAMPDX= 5.01
$$ ##ORIGIN= Bruker BioSpin GmbH
$$ ##OWNER= she
$$ F:/spectra/data/she/nmr/H-C/1/audita.txt
$$ ##AUDIT TRAIL=  $$ (NUMBER, WHEN, WHO, WHERE, WHAT)
(   1,<2025-06-27 13:59:35.53 +0400>,<she>,<DPX200>,
      <created by zg, POWCHK disabled, PULCHK disabled
       configuration hash MD5:
       00 E9 B6 7A A2 85 ED C7 34 08 36 98 17 FE 4E 26
       data hash MD5: 16K
       20 EF FD 28 D1 88 C7 23 3C BC 22 F6 A4 B7 51 CF>)
$$ ##END=
$$ 
$$ hash MD5
$$ 1C E1 F7 1A E2 8C E3 71 95 78 22 1B 59 65 0E 37
##$RELAX= 
##$RELAX= 
##$RELAX= 
##$RELAX= 
##$RELAX= 
##$RELAX= 
$$ Bruker specific parameters
$$ --------------------------
##$DU= <F:/spectra>
##$EXPNO= 1
##$NAME= <H-C>
##$PROCNO= 1
##$TYPE= <nmr>
##$USER= <she>
##$AMP= (0..31)
100 100 100 100 100 100 100 100 100 100 100 100 100 100 100 100 100 100 
100 100 100 100 100 100 100 100 100 100 100 100 100 100 
##$AQSEQ= 0
##$AQ_mod= 1
##$AUNM= <au_zg>
##$AUTOPOS= <>
##$BF1= 200.13
##$BF2= 200.13
##$BF3= 200.13
##$BF4= 200.13
##$BF5= 200.13
##$BF6= 200.13
##$BF7= 200.13
##$BF8= 200.13
##$BYTORDA= 1
##$CFDGTYP= 0
##$CFRGTYP= 5
##$CHEMSTR= <none>
##$CNST= (0..31)
1 1 145 1 1 1 1 1 1 1 1 1 1 1 1 1 1 1 1 1 1 1 1 1 1 1 1 1 1 1 1 1 
##$CPDPRG= <>
##$CPDPRG1= <>
##$CPDPRG2= <>
##$CPDPRG3= <>
##$CPDPRG4= <mlev>
##$CPDPRG5= <mlev>
##$CPDPRG6= <mlev>
##$CPDPRG7= <mlev>
##$CPDPRG8= <mlev>
##$CPDPRGB= <>
##$CPDPRGT= <>
##$D= (0..31)
0 0.7 0 0 0 0 0 0 0 0 0 0.03 0 0 0 0 0 0 0 0 0 0 0 0 0 0 0 0 0 0 0 0 
##$DATE= 1751018374
##$DBL= (0..7)
120 120 120 120 120 120 120 120 
##$DBP= (0..7)
150 150 150 150 150 150 150 150 
##$DBP07= 0
##$DBPNAM0= <>
##$DBPNAM1= <>
##$DBPNAM2= <>
##$DBPNAM3= <>
##$DBPNAM4= <>
##$DBPNAM5= <>
##$DBPNAM6= <>
##$DBPNAM7= <>
##$DBPOAL= (0..7)
0.5 0.5 0.5 0.5 0.5 0.5 0.5 0.5 
##$DBPOFFS= (0..7)
0 0 0 0 0 0 0 0 
##$DE= 6
##$DECBNUC= <off>
##$DECIM= 32
##$DECNUC= <off>
##$DECSTAT= 4
##$DIGMOD= 1
##$DIGTYP= 9
##$DL= (0..7)
0 120 120 120 120 120 120 120 
##$DP= (0..7)
150 150 150 150 150 150 150 150 
##$DP07= 0
##$DPNAME0= <>
##$DPNAME1= <>
##$DPNAME2= <>
##$DPNAME3= <>
##$DPNAME4= <>
##$DPNAME5= <>
##$DPNAME6= <>
##$DPNAME7= <>
##$DPOAL= (0..7)
0.5 0.5 0.5 0.5 0.5 0.5 0.5 0.5 
##$DPOFFS= (0..7)
0 0 0 0 0 0 0 0 
##$DQDMODE= 0
##$DR= 18
##$DS= 0
##$DSLIST= <SSSSSSSSSSSSSSS>
$$ [...]
##$SUBNAM0= <"">
##$SUBNAM1= <"">
##$SUBNAM2= <"">
##$SUBNAM3= <"">
##$SUBNAM4= <"">
##$SUBNAM5= <"">
##$SUBNAM6= <"">
##$SUBNAM7= <"">
##$SUBNAM8= <"">
##$SUBNAM9= <"">
##$SW= 18.0517779522481
##$SWIBOX= (0..15)
0 0 2 0 0 0 0 0 0 0 0 0 0 0 0 0 
##$SW_h= 3612.71676300578
##$TD= 16384
##$TD0= 1
##$TE= 0
##$TE2= 300
##$TE3= 300
##$TEG= 300
##$TL= (0..7)
0 120 120 120 120 120 120 120 
##$TP= (0..7)
150 150 150 150 150 150 150 150 
##$TP07= 0
##$TPNAME0= <>
##$TPNAME1= <>
##$TPNAME2= <>
##$TPNAME3= <>
##$TPNAME4= <>
##$TPNAME5= <>
##$TPNAME6= <>
##$TPNAME7= <>
##$TPOAL= (0..7)
0.5 0.5 0.5 0.5 0.5 0.5 0.5 0.5 
##$TPOFFS= (0..7)
0 0 0 0 0 0 0 0 
##$TUNHIN= 0
##$TUNHOUT= 0
##$TUNXOUT= 0
##$USERA1= <user>
##$USERA2= <user>
##$USERA3= <user>
##$USERA4= <user>
##$USERA5= <user>
##$V9= 5
##$VALIST= <valist>
##$VCLIST= <CCCCCCCCCCCCCCC>
##$VD= 0
##$VDLIST= <DDDDDDDDDDDDDDD>
##$VPLIST= <PPPPPPPPPPPPPPP>
##$VTLIST= <TTTTTTTTTTTTTTT>
##$WBST= 1024
##$WBSW= 4
##$XGAIN= (0..3)
0 0 0 0 
##$XL= 0
##$YL= 0
##$YMAX_a= 704067
##$YMIN_a= -774321
##$ZGOPTNS= <>
##$ZL1= 120
##$ZL2= 120
##$ZL3= 120
##$ZL4= 120
##$ABSF1= 10
##$ABSF2= 0
##$ABSG= 5
##$ABSL= 3
##$ALPHA= 0
##$AQORDER= 0
##$ASSFAC= 0
##$ASSFACI= 0
##$ASSFACX= 0
##$ASSWID= 0
##$AUNMP= <proc_1d>
##$AZFE= 0.1
##$AZFW= 0.1
##$BCFW= 1
##$BC_mod= 2
##$BYTORDP= 1
##$COROFFS= 0
##$CY= -3
##$DATMOD= 1
##$DC= 2
##$DFILT= <>
##$DTYPP= 0
##$F1P= 0
##$F2P= 0
##$FCOR= 0.5
##$FTSIZE= 0
##$FT_mod= 4
##$GAMMA= 1
##$GB= 0.15
##$INTBC= 1
##$INTSCL= 1
##$ISEN= 128
##$LB= 0.25
##$LEV0= 0
##$LPBIN= 0
##$MAXI= 10000
##$MC2= 0
##$MEAN= 0
##$ME_mod= 0
##$MI= 1.114404
##$NCOEF= 0
##$NC_proc= 0
##$NLEV= 6
##$NOISF1= 3.799351
##$NOISF2= 2.8
##$NSP= 1
##$NTH_PI= 0
##$NZP= 0
##$OFFSET= 14.38212
##$PC= 1
##$PHC0= -1203.345
##$PHC1= 17.59222
##$PH_mod= 1
##$PKNL= yes
##$PPARMOD= 0
##$PSCAL= 0
##$PSIGN= 0
##$REVERSE= no
##$SF= 200.129724274929
##$SI= 16384
##$SIGF1= 3
##$SIGF2= 2
##$SINO= 400
##$SIOLD= 16384
##$SREGLST= <1H.CDCl3>
##$SSB= 0
##$STSI= 0
##$STSR= 0
##$SW_p= 3205.1282051282
##$SYMM= 0
##$S_DEV= 0
##$TDeff= 0
##$TDoff= 0
##$TI= <>
##$TILT= no
##$TM1= 0
##$TM2= 0
##$TOPLEV= 0
##$USERP1= <user>
##$USERP2= <user>
##$USERP3= <user>
##$USERP4= <user>
##$USERP5= <user>
##$WDW= 1
##$XDIM= 8192
##$YMAX_p= 0
##$YMIN_p= 0
$$ End of Bruker specific parameters
$$ ---------------------------------
##NTUPLES= NMR FID
##VAR_NAME=  TIME,          FID/REAL,        FID/IMAG
##SYMBOL=    X,             R,               I
##VAR_TYPE=  INDEPENDENT,   DEPENDENT,       DEPENDENT
##VAR_FORM=  AFFN,          ASDF,            ASDF
##VAR_DIM=   8192,          8192,            8192
##UNITS=     SECONDS,       ARBITRARY UNITS, ARBITRARY UNITS
##FACTOR=    0.0002768,     1,               1
##FIRST=     0,             0,               0
##LAST=      2.2672688,     0,               0
##MIN=       0,             -774321,         0
##MAX=       2.2672688,     704067,          0
$$ Real data points
##PAGE= N=1
##DATA TABLE= (X++(R..R)), XYDATA
$$ [...]
1962g31O27K09p07Q51m3j72L17q4m89L88l25l17M37l26J4O07K45m40M74m46J59
1983B48K05r49K13O09j203N10L08K15j06N32k18l1l13k70J13l32j83P66k70k46
2003d02P87J62p69R86k89r18Q76n02o86N23P7k42J10m7P39J83o60O87j51j256
2023g92Q70K85j030%Q32p66L64R45k95O2J92q29L05l97m72P92m25k12R56k95j94
2044a04J099n56n90O83l83p08N62m87l16N89j68O28L14l65N91l06o15K21j65n78
2064f54J4J77r0N63M01m39Q65Kq46K66k68p09K79m0j79M66N5K42N90j63K2N49
2086A103j659K47J032j713K6J177n52n9J156o22K20L33o86K64m57k69j66K7K1
2105e77J174m68l96J415l60j226J261m81j218R62k56n14J79O99q3J36k43Q88k87
$$ y = [-731, -104, 105, -602, 249, 206, 34, 351, 267, -222, 166, -159, -476, -39, -365, -351, 256, 501, 61, 535, 89, 248, 453, -496, -283, 326, -877, -367, -59, 156, 50, 582, 364, 333, 20, -250, -137, -469, -652, 114, -156, -402, 385, 547, -222, 764, 475, -443, 433, -69, -755, -232, -155, -397, -287, -334, 405, 588, -72, 615, 464, -792, 78, 363, -667, -667, 165, -601, -237, 708, 413, 475, 667, -162, 143, -254, -726, 66, -359, -571, 385, 90, -104, 995, 439, -151, 532, 149, -559, 3, -484, -800, -211, -379, 249, 563, 198, 789, 483, -132, 89, -76, -654, -640, -463, -553, 10, 411, -28, 837, 839, -7, 259, -9, -718, -439, -479, -658, -192, -137, 105, 695, 532, 554, 1103, -556, -309, 723, -990, -964, 213, -339, -398, 758, 136, 356, 689, 3, 267, -190, -459, -625, -598, -577, 597, 129, -267, 1148, 788, -438, 823, 342, -876, 86, -170, -684, -505, 194, 111, 247, 4, 892, 605]
2124F05j078P07K33j782O98J258j455M02J469j111J3J022m27n98K97o86J99m94
2142g28J48L41j49L92J142r37o88J693r42r84J154p68n91O67J63n81R87k88O03
2161F34l30m32P10m4j643J234j34j106Q52Q42j017P93N99q26O4N06j154K39j73
2180c86k8O8k96O35Q88r88L51R61j631L5J066r42j71J07J0j18P34k34K26M21q33
2201a25M28J82q61L55k11m35M74n3J21Q51m09n55J337j118n43P27l56q24R94k58
2221b79j78R09k00k58K92RJ28j19o32M01r4q84J151n7j029J304L62j319P97N01
2241H05j095O2M61l90o18K72P71R3r24R16O33j493N31J041j712J08J178j116m70
2260i47J325l07n93Q71K93n89O3K08j80p98L20Q45j141m56J818k51j510K052j85
$$ y = [605, -473, 234, 467, -1315, -617, 641, -814, -412, 1057, -54, -41, 981, 554, -44, 253, -433, -234, -728, -580, -239, -388, 4, 1146, 209, -479, 1214, 272, -712, 442, -326, -917, -250, -87, -668, 319, 31, 634, 304, -128, 582, 538, -1105, 129, -5, -1111, -259, 583, -434, 359, 958, 132, 196, 702, -452, -213, -386, -414, -346, -642, -7, 881, -107, 244, 1205, -426, -391, 675, -267, -438, -331, -321, -439, 295, 61, 287, 708, -125, 303, 485, -376, -21, -232, -667, -193, -246, -125, 726, 317, -238, 1099, -19, -562, 165, -191, -1015, -21, -279, -457, 452, 252, -6, 286, 295, 423, 304, -328, 73, -21, -905, 246, 189, -840, 464, 826, -493, 304, 805, -290, -228, 233, -157, -775, -503, 268, 361, -563, 353, 986, -507, 24, 1065, -647, -539, 639, -477, -947, 378, 71, -522, 349, 642, 53, 116, 324, 144, -654, -334, 511, -630, -1086, 732, 481, -1029, 1023, 838]
2279H38j671J144L04j062j66P76j18o06n0J425o06j135K037o85j476J073P11j751
2297a018M39J158j031k38J445l94n62N90L78p09p41Q38n6j144O86J202j433J15
2315d75J437q51p72J503l12j188L54M09p47K51M31K31n79K81J016q01l49Q07l79
2334B67j418J252r0r54R99M29j017P31O14q23p9K29j54k02l65L22L80r00P45K40
2354B06k50L57M47r96n9M56m40j55M46n75M33K54J86k14J48J22j0l84k01L35m35
2375c29o8P42k19l71Q14m48n16Q43j51n08L61m01j80k4M08K3K84q1J56k3l54M57
2397D15j63n55J91L79r72O48M48q68L43P13k45p7n5j71n28P6K74L70q07M50M05
2418B71n31L37O04n74l64P51p00l93P07rq23P13M57l29k30M98j39k83r3O97q63
$$ y = [838, -833, 311, 615, -447, -613, 163, 45, -561, -611, 814, 208, -927, 1110, 425, -1051, 22, 733, -1018, -579, 579, -452, -690, 755, 361, -201, 389, 767, 58, -683, 155, 99, -1045, -359, 843, -590, -475, 962, 111, -661, 842, 530, -658, -304, 105, -642, -391, 40, 271, -308, -27, 989, 188, -161, 646, 267, -1151, 101, 11, -943, 56, 485, -532, 199, 813, -10, -89, 140, -14, -216, -581, -259, 121, -779, -34, 206, -44, 313, 760, -236, -295, 161, -279, -434, 12, -563, -130, 124, 310, 96, 244, 366, 356, -28, -229, 106, -329, -397, 345, 126, -245, 569, 121, -395, 448, 297, -211, 150, -251, -431, -455, -47, -24, 260, 179, 335, 312, -42, 415, 252, -303, -112, 267, -705, -57, 391, -477, -134, 579, 334, 257, 202, 31, -497, -421, -147, 223, -584, -134, 271, -260, 77, 681, 107, -257, 494, -206, -599, 108, 99, -724, -11, 446, 117, -113, 385, 246, -37, -130, 567, -296]
2439b96o29J342k97p83J160K60r83L99K82p41m2L96l16k19j17Q99m55k01P36K00
2459E95p56N92L00j050lP64o90m99J054l58l05P74K87m14o33P20j57n22j22P45
2479C22p41RP94j35q00J045L84r87N10O0r07K36K62l85p2K35M90j60l58N95K3
2500D20o58M44L1p84L85J2k73L8R29k04m07L60J95l64j72k49M23l68j05M19n16
2521d44K85N38o16M71N84p36j40M34o78m24N81j54j44M14J69J41j89r4L19r4m90
2542b67L84m53P3J93N5L3K50j9j03M40j76k38p3k93O9K88n13J81K66k26M55j92
2564A34p6K27j27l15j32K78l99J42J96N7O7K12Q6J70l84K63j97l69k18R2O4J87
2586d2J10j28K60P3J25j86M27m04m54N5k67L6J44L19K06j79M36j37k30j90n7k86
$$ y = [-296, -925, 417, 120, -663, 497, 757, -226, 173, 455, -286, -328, 68, -248, -467, -584, 315, -140, -341, 395, 595, -161, 431, 731, -319, -322, 442, -248, -747, 307, -51, -356, 418, 705, 291, -342, 378, 221, -301, -423, 322, -419, -410, 384, 249, -551, 494, 878, -109, 401, 461, -446, -210, 52, -333, -405, -170, 320, 160, -198, 397, 420, -238, 206, 237, -547, -162, -150, -423, -385, 544, 340, -67, 293, 488, 124, -48, -297, 126, -242, -347, 72, -444, -159, 379, -237, 234, 818, 82, -58, 376, -302, -726, -145, -299, -443, -29, 140, 281, 92, -2, 317, 223, -267, 117, -336, -263, -70, -15, 18, 268, 249, 146, 586, 410, 172, 99, -194, -125, 163, -350, -169, 97, -129, 326, 134, 58, 285, 158, -157, -289, -11, -410, -268, -72, -15, 52, 264, 350, 520, 136, 399, 202, -167, -385, -293, -229, -42, 68, -60, 200, 273, 398, 212, 639, 235, -219, -164, -431, -395, -251, 68, 274, 95, 531, 394, 164, -26, -83, -369]
2608c69o8O3M6RlJ00L86K65J5k24lk17k31j79K7L88k29J17P4M41K8p4j21m68R2
2633a35L26k98j69N3r8L84j21K01J90j7k0j38j52n2l62J40J64p6K88J16J14j8
2655C20k55K60q3k66j98j87k22J80K52K5J06K45J69q5k74N1k9j91K6Q1j83j6L24
2678E0p9L24J71l18L3K9l62k01m5k56M29J63J85J21K5K25k3l13k08J43l82j48
2700d37K74j33K63J30J60J46M7l53L87l18n26K02k85k8O0N37P2l09N29l00J6j02
2722C2J45j59k78ln1K26j63L85n7Q0Q5j7o2n5j47r2j06q5O1M62kP8J65n3j04l5
2748B50k26k62L8j83J46J02k5K36L52jm2j58l72K59m98K35q6n6K51K3k3J23L0
2771A13J22l5j71l2j32q3q6N0N3M15j32K1JL97n82J46j65K59j68j62RR0J82Q6
$$ y = [-369, -437, -374, -328, -319, -322, -222, 164, 429, 444, 220, 217, 0, -231, -410, -383, 5, -224, -107, -33, 408, 436, 362, 241, -227, -135, 191, -107, -276, -223, -321, 63, -58, 143, 333, 316, 296, 158, 6, -46, -408, -268, -104, -180, 108, 224, 338, 320, 65, 325, 242, -24, -222, -409, -631, -451, -199, -174, -68, 177, 346, 261, -13, 38, 9, -182, -156, -75, -258, -274, 50, -29, 295, 466, 148, 181, 210, -152, -353, -398, -654, -225, -62, 123, 244, 269, 494, 471, 158, -50, 93, -289, -437, -163, -296, -33, 97, 257, 403, 450, 97, 484, 166, -360, -158, -443, -471, -411, 126, 198, -111, 418, 118, 134, 32, 177, 18, -260, -263, -314, -88, -251, 134, 77, 157, 242, 225, 163, 108, -39, -131, -237, -322, -261, 201, 199, 277, 442, 389, 285, 250, 24, -238, -200, -383, -237, -135, -160, 76, 428, 427, 385, 227, -145, 114, -384, -149, -235, -291, -40, -17, -40, 83, 113, 235, 200, 29, -3, -135, -218, -304, -254, -201, 214, 82, 103, 104, 501, -81, 65, -100, 159, -9, -171, -162, -72, 110, 196]
2795A96j3l8j26J96k63L94n13k52M88o33L05R5M29j26J59M8k25P3k06K34n11N5
2817b34J00j56J74K44j66J49K01k24j20j62L7P7r5L4M5M2j2J89K8O1j33Q6q1l08
2841b24J7M5Q8j27L17J25M4j5l47L20M3k47o0j9P5j28M72m97j09K68K84j13j50
2864F2J41m45J86lk85m0J71k7L34K82q7k89k9K14l1m43nJ95l2m7J49l1L39p3M9
2889B55Rk37p9n1J03k98Q9K65j8l19O03k03J10k38j06J74k26Q6J45l5r8K6j32
2912a75K58M7m05M26n2Jj42k8k9o9J7J09K18j52k9K88l02J34l3j77M5L9j97J15
2936i3N3J0n3J24L05j19j02l42O9J80j92K20j34J63Q7k56o6Q9L86n08J65P4j46
2959h6l04J57P2K35nJ10n7p3J26J68o02L05k77J54N7o6J45JJ72J2jj06j72LM3
$$ y = [196, 183, 145, 19, 215, -48, 346, -167, -419, 69, -564, -259, -164, 265, 139, 298, 346, 121, 194, -12, 222, -289, -234, -134, -290, -116, 128, -38, 111, 312, 88, -32, -194, -157, -80, -175, -141, -96, -54, -66, 123, 151, 212, 79, 165, 84, -224, -207, -162, -74, -201, 116, 241, 285, 270, -77, 243, 286, 39, -21, -40, 35, -93, 379, -118, -227, 41, 325, 212, 62, 203, -242, -56, -59, -344, -384, -213, -240, 94, 376, 289, 0, -29, 185, 154, -289, -294, -99, -131, -178, -29, -60, 279, 206, 255, 264, 27, -52, -103, 0, -298, -209, 56, 38, -281, 322, 119, 229, -9, -115, 59, -167, -81, 64, 29, -69, -43, -175, 83, 130, -275, 151, 99, 100, -42, -70, -99, -168, -151, -42, 176, 24, -5, 283, -19, 115, 82, -95, -50, -11, -208, -93, -40, -30, -83, 41, 346, 227, 125, -217, -148, 32, -160, 60, -74, 89, 176, -80, -146, -57, 329, -179, -14, 60, -86, -390, -233, -161, 74, 69, 179, 122, 49, 175, 343, -259, 46, -231, -77, -20, -86, 59, 60, 232, 244, 243, 137, -35, -32, 11]
2984A1j94J12K24m55M04J91o04K46P9L67j92j54N6l7m66K45P6n0l0K25J81m96
3006b61L17j91K00O1k75R7j74O6l1K33J09R0k61pL51k89Q4m58J14J99j96J6K90
3029H4P4l3J41J58o37j5J49O7j90J7K36ML9k98N71k25l66N48j56k94J77K69o78
3052c58L09Q3p3L99l30K0Q3o4l0M13q25K37R6k58N7M60j48K78n4m73K05J6k54
3075b11J70J42N8l08K7L2K04j55L61L6k47kJ90m24k56K17J89k77K38J02N9K9J24
3098B98l41J50j3l68J95j91O2J22j21M29j75K3M28l69k75M73k96l67L46j93n8
3119b41Q3J99O6k16L34q5j70J17k50L41o34M19J78o30O03M61m96j8J28k09j8q3
3141a21J92o4m48K92N6R6L13K32n24l43R04o92j45L20j45j88Q7p6O9Q4L77K9k71
$$ y = [11, -183, -71, 153, -302, 102, 293, -311, -65, 14, 381, 189, 35, 91, 54, -412, -167, -91, -141, -171, 54, 235, -261, 56, -135, 65, 126, -149, -52, -226, -160, -191, 42, 151, 241, -20, -27, 324, 35, 119, -339, -225, -26, -222, -206, 84, 158, 125, 266, 424, -213, -228, -79, -12, -202, -185, 51, 55, 94, -204, 367, 142, -224, 324, 168, -126, 51, 320, -358, -49, 34, -39, 360, 30, 50, 133, 69, 39, 452, -373, -136, -40, -298, -241, 219, 71, 349, 295, -178, 27, 43, -211, -41, 101, 159, -149, -122, -90, 114, -41, 320, 356, 109, 107, 297, -127, -383, -166, 23, -254, -16, 86, 145, 174, 298, -43, 107, 94, -274, -79, -270, -208, -86, -207, 222, 47, 70, 498, 129, -146, 327, 31, -336, 10, -183, -241, -158, 41, 107, -109, 225, 140, -30, 87, -163, 178, -456, -37, 141, -489, 114, 575, 79, 61, 189, -20, -38, -121, 71, 7, -441, -149, -93, 3, 316, 548, 24, -319, 585, -107, -252, 68, -77, -265, -178, -254, -185, -101, 276, 305, 34]
3164C4J02R0n00j96N39j45m9K66K05q19N37J80l99J09M07l23j46m0P3o7NK78p6
3187F5k97N38J83o25L17j19k38k63N58m49L03J70j7l03J62K09r6p6n5L20n20Q6
3209a47K27m45K71L36l25n6K08k5k49L92o8m97L45J90k05k0l01M81L1J7k1o6l5
3232C8L78m56O6l38O63n46J29L99k44J31k13o1J34o3j60K16k74J85J47m42L27
3253A6L06l06p5L51k45r5l4M4k2R2j66L3K02j24J36k77K19K28l84k54N87l73J12
3276b9J57Q2m46K45K84m80K84n2j58J95j99K54j21j19K20j32k62P15m2p99J73
3297b30N85m12m02P54l22k69N13j64j57R4K26k34j21J2M62o56K4O34m62l40Q21
3318C56j47n10O33j17l75J94Ok7j42l8L79j57j0l0L82m46J31J7n61O14K39m94
$$ y = [34, 136, 226, -274, -470, 69, -76, -125, 141, 346, -473, 64, 244, -155, -46, 361, 38, -108, -148, -75, -142, -137, 141, 65, -232, 306, 489, -136, 181, 62, -176, -439, 119, -330, -27, 143, 126, -177, -15, 194, 98, 22, -33, 287, -233, -147, 80, -365, -94, 242, -83, -139, 69, 44, -205, 187, 119, -378, -33, 157, -48, -68, -369, 112, 143, 160, 139, 73, 38, 416, -40, 26, -312, 351, -195, -66, 333, 89, 220, 7, -54, 80, 17, -143, 73, -201, -16, 131, -311, 16, 322, 16, -59, 292, 47, -48, -82, -38, -60, 32, -134, -101, 101, -23, 113, -164, 55, 283, -101, -355, 232, -141, -29, 128, 210, -236, 9, 293, -187, 97, 45, -113, 82, -117, 137, 16, -103, 117, -15, -277, 438, 396, -403, -230, 355, -57, -459, 295, -27, -296, 217, 53, -104, -10, 216, -18, -139, -127, 335, -321, -297, 337, -125, -465, 356, 209, -301, 332, 215, -160, 34, 40, 13, -129, -167, 212, 55, 45, 15, 397, -49, 82, 99, -462, 152, 391, -103]
3340a03j36O54n52k14N50R8l86Q2J27j32j27K00L88o34k52O59m68p3O74n33J44
3361c4L59j35l86K35j07j41L48k09M04j88n71P18k58m17M06J55o92M85M34r64
3381e58O56L19m09N8j88K31p6M5J17P1k84m7L06k27K11j56k19L47J87n49j94N50
3403A91l77m8L70q8l73K28l5L34j65O2l0nj89N80p52K06K25j45k75N86l60m57
3425e17R15l15n12O15k12L2k27qL20j48J12K90k37p28J086r8p32J60L97q94N03
3446a98L12l50M56J16l40k27K55l6P5n76O24K48p53K44P15o11o4P04m85m89P48
3467C68m7j017O24J43l85J36M60L44p46jL81n93l41R82l07q04J169k06m72N84
3487B72J82p47K67N02n50P2j05L53o04j18R68l30q61Q90L80r80M72N24r09j04
$$ y = [-103, -239, 415, -137, -351, 199, 297, -89, -7, 120, -12, -139, 61, 449, -185, -437, 222, -246, -319, 355, -178, -34, 325, 190, -196, 39, -68, -209, 139, -70, 334, 146, -425, 293, 35, -382, 24, 179, -513, -28, 406, -558, 98, 417, 8, 66, -122, 109, 33, 78, 195, 266, -18, -65, 241, 14, 225, 69, -150, 197, 384, -165, -359, 191, -186, -234, 136, 48, -325, -97, -132, 202, 37, 99, 69, 64, -125, 455, -297, -91, 134, -11, -286, 300, -60, -517, 398, 83, -429, 186, -26, 6, -221, -229, 91, -57, 55, 345, 108, -620, 466, 368, -364, -204, 193, -701, -198, 114, -236, 220, 336, -4, -231, 24, -12, 63, -513, 111, 359, -394, -150, 565, -46, -110, 594, 109, -380, 368, 321, -696, -72, 71, -314, -178, 282, 626, -120, -121, 260, -333, -674, 308, 1, -803, 366, 160, -312, 272, 454, -293, -26, 476, -74, -2, -107, 246, -358, -476, 492, 162, -699, 191, 571, -409, 63, 587, -322, -426]
3507d26O83l32k31K50K7k04L57K3J1m33nP71q98K4O96l23m81J096k47o51M03M23
3529E33l17k33K52k47l07L9L90N3n01O30M2o83P71L0j001P04j05o95N63J6p0K90
3551A54M0k04q4L78l61J48m71K61K48p14J31Q18o93M61R4Jl02K27k59j12M28o84
3573d95J87L12m23O21k69n2M61k3j93N3l25O5L36n95j52Q14n19K2N98j94m22L23
3595A30j11l35Q9K04j16L59n91J99M54o95P72j29l43L23M8j115R63m7p90N50N57
3616C76m21O5J08J89l09j89J42J64p64K54O97p81R9R28o19j23R67p78o1J63j23
3637a6j61j57K29Q2k09L59K83l93j12M87k23o21O64j04o00N48O0n47P57l6l64
3658g4M92l79qj44kJ46j00j90K05K83p48O44K94n74M71n8p86L14M32p57k7N41
$$ y = [-426, 257, -75, -306, -56, -29, -233, 124, 147, 158, -275, -280, 491, -407, -383, 313, -10, -491, 605, 358, -293, 110, 533, 216, -17, 235, -12, -319, -280, 110, 163, -338, 292, 334, -349, 422, 452, -549, 155, 50, -645, -82, -66, -136, 154, 194, -10, -94, 284, -77, 71, -400, -139, 109, -605, -474, 344, -349, 112, 206, 207, -95, 132, -127, -239, 189, -495, -308, 4, -419, 202, -67, -119, 342, 319, 126, 179, -146, -81, 255, -340, -492, 322, -197, -175, 423, 229, -193, 130, 19, -316, -227, -23, -139, 220, -371, -172, 282, -413, 359, 230, -113, 210, 258, -857, 106, 59, -731, -181, 376, -45, 20, 128, 317, 8, -181, -39, 125, -639, -385, 312, -469, -370, 558, -61, -184, 783, 5, -56, 107, -16, -177, -334, -105, -23, -232, 127, 410, 17, -95, 392, 169, -452, 212, 108, -492, 56, 116, -431, 326, 290, -74, 418, 39, 31, -113, -115, 31, -69, -259, -54, 229, -519, 125, 419, -155, 316, 258, -528, -214, 218, -539, -566, -25]
3680b5k80L16L43k87L01m90N3K17k78K3L40n36N6N94n92K87K24j79j70N20l77
3701F0l76P9k7n8J59J19J48k82L38L38n95k4L80n07k15M70P0n49O57L0m50L29
3723I4J89j64l01J20qp2m96N35K3k89N19O3n63N79J55l10j77P67j108K47L47j89
3745c9rQ9K25m4l38Q3M96o03j48P79r57O0O30m02N6L92j35k14J67J9j27q3k48
3768c51LP6J23J11r2K94K26j97l93M58k66l85J20K87j57L0K75j23j32L34Nl91
3790a45j02L72j44j50K19j81NM75j53k71R6N55m85l40K86Jj37K13j71j54P9K44
3812A12p3j08J03K4l03K79J48n45K46K49j49p0J52J7P7j18K27l99L34K2n52K77
3834e0j90L84K4m58N60k70k91L48J10p54N83K1m49K42L64k93K7K21q8J5P9j20
$$ y = [-25, -305, 11, 354, 67, 368, -122, -69, 148, -130, -107, 233, -303, -247, 347, -245, 42, 266, 87, -83, 437, 60, -316, -237, -264, -322, -163, -44, 104, -178, 160, 498, -97, -121, 259, -248, -463, 7, 77, -472, 185, 215, -235, 94, 283, 119, -182, -62, -70, -142, -638, -103, -80, -369, 150, 213, -350, 229, 384, 74, -103, 664, -444, -197, 150, -39, -48, 41, 266, 222, -116, -33, 463, -140, -288, 491, -466, -406, 224, -178, -122, 270, 135, -79, 88, 107, -20, -103, -351, -348, -272, -149, -38, -130, 164, 390, 193, -200, 258, -8, -393, -273, 14, -143, -113, 162, 39, -93, 241, 246, -145, -247, 125, -19, -169, 50, -131, -126, 349, 196, -75, 21, 576, 91, -249, 37, 38, -99, 114, -57, -211, -132, 112, 39, -69, 34, 58, -245, 34, 182, -363, -117, 132, -17, -87, 65, 82, 159, 41, 268, -131, 203, 225, -327, -50, -240, 144, 168, -290, 270, 0, -291, 57, 167, -587, -4, 17, -432, -190, 174, -119, -92, 129, 41, 56, 135, 15]
3856A5R2n73N87n4o44O02L12n05j8N42m54lL55k86k98K19J72j9k64Q7M74p12M0
3879c33R50o19k48N84n2r43N86J37j44K9N17n29K27o0K56j38r1L16n25n50Q07
3900A77J00m93K77M56n13K83M2n35j9K80k40m17M71J15j26J77l5L04o60M95M91
3921F30q24m1M91o16l12R68m17r6K79L12l79J09R2l0Pj19l1m64M3N54K09n19N76
3944D22k9m60J30ql46K55J53k78q4P7L42M1n1M1R3l60L90l70m37K94j8k65N16
3967D8K66k55P5K23m04J6K80k76j41k2k16K45J22r5J66j43K89j01q5k64N85o50
3989c37j38O56j88m68N71N0j99L36q3J5m01K24J8m40q5P94l78j08N15Q0m03L90
4011D21j45l43k71O21n03j28M23R6l60L18L25l03L1Q4j59m18L59P2l20N9K93j70
$$ y = [15, 107, -466, 121, 67, -577, 25, 337, -168, -186, 356, -98, -101, 254, -32, -330, -111, 61, 42, -222, -135, 339, -373, -333, 617, -2, -250, 334, 282, -661, -75, 62, -82, -53, 464, -65, 162, 102, 358, 220, 129, 445, -80, -630, 177, 277, -216, 61, 517, 4, 287, 329, -206, -225, 55, -185, -602, -131, -16, -142, 35, 0, 304, -356, 139, 630, -194, -235, 256, -360, -672, 296, -121, -217, 62, 374, -5, 104, 196, 166, 173, 54, 23, -441, -398, 156, 365, -154, 422, 393, -67, 63, 55, -291, -36, 117, -161, -245, -168, 174, 215, 164, 205, 298, -62, 328, -42, -479, -185, -203, -468, 48, 314, 59, 134, 357, -47, -31, 249, -27, -168, -190, -406, -161, -39, -134, 32, -111, 178, 77, -8, -272, 313, -337, -475, 181, -7, -475, 96, 146, -53, 283, 200, 215, -186, 38, 56, -384, -469, 325, -53, -161, 354, 434, 31, 421, 276, -67, -338, 283, -220, -348, 75, 171, -189, 129, 454, 151, 182, 266, 107, -311, 48, 120, -200, -141, 152, -18]
4033a8k32O94k55l15K36p2j39m80L41K74l49J37O96o26J84M41m00l03L89k96k63
4054c56K06J19J98l13K27l1R5O7Q3k06m39L77O8r03R24J9m69J76K80L2J64J91
4076E09j66l42J5J24m23O8K19J67k01p4K1N8K96n6l79K8J93j03m7k8j15K35K7
4099B6K46K04l71r5K12l03m15O03l77MJ86r3J0J08L94j16j92k11J82l15J88J5
4121a10m7j9J70L18k86Q6N5J18o2k79m7j00K87l27P4J97q9PL86j71K30o1j75j99
4145d4l54J07J36j34L30J17J79p8K09l62j01J33j71j72r6q7J75L72j13K2n6p1
4167e9N67o59j07M11k09j95j22M14l97M19P4l5N8P7j55k99J94j61Jl75L54J25
4189g9K1L01l2J55mk58R1j75j87j17R5j90M11J11k0K93j90k76K06k82K8j48J09
$$ y = [-18, -250, 444, 189, -126, 110, 38, -101, -581, -240, 34, -315, -178, 518, -108, 76, 517, 117, -186, 203, -93, -356, -150, -31, 167, -146, 81, 50, 145, 212, 295, 89, -350, 27, 95, -808, 116, 135, -334, -158, 122, 154, 318, 509, 343, 1, 16, 140, -283, -215, 4, 171, -30, -104, -83, -25, 271, 215, -164, -136, 57, -46, -93, -121, -236, -1, 26, 272, 476, 105, 10, 222, -81, -496, 107, -270, -266, -80, -173, -163, -55, 339, 223, 31, -180, 2, -313, -125, -110, -157, -176, -6, 312, 26, 112, 167, 285, 223, -56, -103, -203, 84, -243, -169, 28, -61, -54, 332, 161, 391, 330, 155, -44, -398, -291, -155, -289, 41, 158, 337, 259, 468, 106, 5, 138, -33, -205, -301, -388, -213, 159, 46, 68, 12, -59, 508, -151, -258, 153, -56, -251, -373, 41, -356, 63, 137, 102, 160, 237, 82, -217, -23, -184, -183, -558, -204, -79, -58, 243, 211, 366, 362, 104, 195, 20, -167, -284, -189, -379, 32, 143, 123, 416, 226, -50, 156, -126, -98, -246, -137]
4212a37J36j1K9j77K32J35K02m76K76J23o51K83j27k7j12K42R1K7J82k34J65r8
4234G3l54M99m83Q9Q5k32L85m7R7L75k86j06k15N6o1K13k90P8r9M41K31l39N8
4257A68l7P9k16J78k31k13P1o4p7L27n6M17j50K1K24j86l59R3j54p6P0J71qJ31
4281A23j62L81j95R3l52M2J97k39J3J04k63J20K32j58K30k58K46j63p1K03k83
4302a60L3O2j9j3j15K86O3l6L7K61k65K0j84Ol61K37P1P3N8O4J13R1k78q8l3k6
4328a03j27L5N9J15j04K23m0J65j50O9kk93M1j88Q7j53K25p0L91M0J95k54p4j05
4352a8M8j27Q6rl50R8L54j3j38N39l64J0r9k42j14Q6K23k7j61J29k8K07P1J55
4376C16j85o4m20K4j3J99o0K5L66kJ50k20j05J00k06J47k18j9p9K04k31L46P8
$$ y = [-137, -1, -12, 17, -160, 72, 207, 409, -67, 209, 332, -319, -36, -163, -190, -302, -60, 31, 58, 240, 6, 171, 73, -281, 218, -265, -176, -91, -323, 62, 15, 112, 487, 201, 95, -120, -64, -125, 88, -202, -124, -223, 218, 449, 110, 168, 131, 210, -6, 172, -59, -272, -201, -265, -342, -15, -71, 346, 196, 217, 441, 255, -104, -11, -165, -241, -171, 0, -8, 123, -39, 342, 147, 240, -112, -70, 127, -112, -99, 5, -258, -138, 94, -64, 166, -92, 154, -9, -80, 123, -160, -127, -65, -84, -97, -212, 74, 137, 101, 138, 399, 134, 154, -30, -24, -385, -148, -77, -4, 54, 118, 231, 322, 44, -44, -77, -103, -230, -195, -136, -21, -125, 98, 58, 223, 73, 142, 140, -153, -112, -300, -213, -366, -141, -211, 180, 220, 415, 161, 87, -18, 30, -97, -11, -20, -370, -272, 82, 69, -69, 470, 106, 116, 17, -225, -339, -253, -30, -57, -218, -89, -117, 90, 161, 316, 131, 67, -353, -329, -342, -143, -203, -178, 188, 186, 336, 116, 11, 111, -95, 52, -166, -185, -264, -60, -291, 55, 133]
4399A33J44N7K1k97j32K30l08j5j95K12L87j24q1jJ65m2Qj1k89j80o1P0J93K82
4423A66j97N2J56O1k31k53qK87m35J24L15l27L25J45k09P9K12p9J36m55K5r4j27
4446c32K30M3J14J9J56J11j72L5j0m02L40l22J8O9rP7K32L6k5K24l25k43K34J90
4470B88o49J89J17lj5P6K6J52j94L20l7l98K56j97k62K67J45J34k14J65L1J51
4492C48k33O2J34k62j07L28k10k51K59k46J45N74l11n8n3m9k88j0M9j36J91k08
4514c32L54r9M5L38o1j16L03m70l09K47K35j52J16N2J27J33l78j6l9K41m8k39
4536f8j45M22r4m29N28j95j10L5K92j17j3K13l69j1q9j59K68J57j76L09m8k15
4558a4J94Q4k47J30l52m3R2R9J41j33L8J22J11mk76j8j13K6K41j93k37K54K14
$$ y = [133, 277, 334, 355, 58, -74, 156, -152, -167, -362, -150, 237, 113, 32, 31, 196, 154, 162, 151, -138, -318, -379, -309, -116, 166, -31, 21, 177, 238, 7, -246, -254, 33, -402, -278, 37, -290, 35, 180, -29, 50, 262, 183, 319, -136, -111, -205, -332, -102, -59, 55, 74, 230, 341, 169, 204, 194, -208, 132, -190, -172, -103, -112, -35, 197, 233, 208, 432, 107, -136, 98, 288, -361, -172, -55, -58, -73, 3, 29, 181, -13, 307, 270, -128, 128, -69, -331, -64, 81, 215, 1, 166, 197, 348, 115, 177, 311, 49, -58, 270, 60, -191, 68, -178, -33, 541, 230, 172, 119, 70, -218, -228, -179, -315, -124, -332, 22, -77, -32, 306, 245, 129, 432, -38, -347, -100, 135, -17, 99, 151, 278, 411, 33, 17, -22, 219, 171, -68, -213, 209, 115, -314, 214, 19, -91, -56, 236, 119, 106, 319, -50, -61, -150, -309, -41, 116, -60, 249, 201, -14, 180, 264, 17, 147, -205, -248, -156, -57, 84, -49, -11, 111, 222, 218, -58, -76, -189, -163, 78, -115, -352, -98, 116]
4581A16j59L09n7j69K67m59K39j10l17M24j49K04j5l1K14k04M8P3m12J33l6Q8
4603cj44J42K02L6k04K13n3j85nr5l6L1n4K71j64MK48j96J40k90K87j70ml20K90
4628e9o1l9J5N53k86k0P3j86L7J30j82r4j42J62J91m9j85L91j99R1k27kk8K07
4652I1J10l54J32r7J56o6J03Pj2nj72o2L9O3J66k02j85K84j07K08Nj14K73k01
4676F0k90J41J28j22J64j35J2K42j35K58k47k0Q8k32J44k69J94J67m10P6L73p8
4698A09K53j04m16K14K5j79J41q7K09k90q7L38j36K57r0j54J55j40Lj59L12k44
4720g0J42j70L47j46J19R1l28qk87j74P28m71J71K11j73o7L05l0k0j77p3P3k00
4743b07K67j04Q7J5J01M0j81Q0r3l30M89k13J71j27L4k93J76J35k3k61M54k48
$$ y = [116, -43, 266, 209, 40, 307, -152, 87, -23, -340, 84, -65, 139, 124, 93, 307, 103, 151, 224, -188, -55, -91, -3, -147, -5, 197, 233, 29, 242, 189, 4, -1, -96, -132, -101, -155, 116, -48, -44, 204, 8, 148, -142, 145, -25, -29, -349, -59, -120, -159, -144, 409, 123, 103, 176, -10, 27, 157, -25, -119, -261, -99, 92, 43, -142, 249, 50, 141, -86, -88, -116, 91, 201, -153, -21, -118, 38, -28, 75, 82, 70, 65, -107, -169, -130, -67, 99, -103, -288, -4, -111, 97, 102, -12, 261, 60, -230, -89, 39, -83, 81, -54, -42, 200, 65, 323, 76, 56, 144, -88, 56, -213, -19, 148, -262, -186, 187, 109, 362, 258, -158, 56, 81, -98, 43, -44, 165, -125, -212, 126, -10, 247, 157, 3, 158, 18, 21, -138, 174, -70, 72, -98, 249, 103, 222, 313, -15, -23, -310, -484, 244, -227, -56, 155, -18, -85, 220, 190, 170, -7, -80, -7, -207, 60, -44, 43, 58, 159, 199, 18, 98, 5, -325, 164, -49, 122, -5, 29, -264, -88, 47, 24, -237, 217, -31]
4765c1R7J1p3j47k6L70%j22m95O96l60K4K86k99n8P8K81m14J49K03k63M11k34
4788H4Q1k1P4o1k4k01J51j75l7K21o2j54L54M7k28k4j27J69O8j35N1l8k16OL42
4813A45m36N01J3l13j83L48P2l48K46k83K08J14Mk0l8K57k21j56n4J33j87R7L42
4836B41k77n0Q0Q9m6M8l5J2j54l0J19n0j75J21R1j91M09k89J58j39J25j35L5j17
4860a60J66L26l66KJ52Pk3p8J4o1q0L87l31m7J93r1J52k65K78M8l48J36L14m10
4884h5J28j65K81k23J23k76K32J9j45J37k16J54q0p7J69J49k78J89J29l25L02
4905A42M3l93O8L51l78J64k35K37K36l27q0M34n21J80K72p6m70K20K34j97R8J15
4927A17k99J61O0J91J04m73P5J16j00j37M31o39K39K28l3j44Q8o2Q7L15k30k24
$$ y = [-31, 66, 77, 4, -143, -169, 201, 201, 79, -416, 280, -80, -56, 230, -69, -127, -49, 232, -182, -33, 170, -93, 318, 84, 165, 144, 218, 157, 133, -68, 83, -92, -129, 92, 30, -124, 230, 277, 49, 25, -102, 67, 135, 0, 51, 13, -203, -197, 145, -291, 210, 223, -90, -273, 75, 147, -201, 45, -238, -30, 84, 88, 68, 30, 287, 66, -90, -144, -11, -198, -101, 241, -36, -86, -6, 83, 37, 85, 50, 62, -92, -122, -3, -53, -228, -107, -16, -207, 202, -87, 71, -68, 57, -78, -43, -160, 6, 332, -34, -32, 120, 127, 104, 26, 40, -21, -101, 286, -45, -92, 101, 10, 162, -103, 175, 223, -125, 11, 325, -85, 43, -122, 159, -64, 59, -217, 15, 34, -111, 26, -190, -36, -116, -193, -24, 125, -153, 36, 165, -160, 142, 185, -208, -140, 211, -167, -3, -238, -1, 235, -92, -172, 262, -259, -79, 193, 117, -353, -133, 101, -96, 2, 117, -182, -21, 39, 230, 334, -139, -64, 52, -48, -185, 246, -393, -154, 74, 41, -103, -15, -77, 10, 325, 95, -129]
4949a29M6n6J36J15j3j15K07p4K1j23L5n1R0k96L52m87J12M18j23J02j25J7j70
4972a11K83j75L1n1j3P0p7l04N78n9J16j89k83K00j4K05n8j81j25J87J6j67K95
4995A74r4J0O0n9k5N1k42J3r4L07p2Q2m3j03p2J20K13l35K88j01jp2Q5m33L98
5020E5J6l4o7M9R1l39Q2K22P7l40q5K25n0K97k95M07k28J83l85K22l87L85j74
5043g3m12M91J3k46K78L67m51R2J74l24k1L1p3J57j01J60j11K32j04K1k42L7P6
5066b9O8k4p2J00r7K57l6k93J58m0j56K45j9L3k48L04j28q3J09j45j72L8N91o63
5090c02K24R0k02K6j09J73J52K05j83Q9L4k14j19J56l3J81j08j47J37m4J83k04
5112a5Q8j20Rn0K2L3m0j4n3l6J50k9K98l73P4L7m5K1K2j25K17Jk42J01K04rj0
$$ y = [-129, -83, -139, -3, 112, 99, -16, 191, 117, 138, 15, 50, -1, 89, -207, 145, -342, -230, 188, 65, 167, 42, 59, -111, 172, -3, 28, -23, -36, 34, -43, -347, 231, 172, 288, 99, -184, 16, 2, 207, 149, -32, -157, 30, 46, -121, 174, 80, 90, 150, 91, 66, 117, -125, -112, -206, 101, 29, 111, 68, -35, -107, 13, 226, -109, 179, 78, 77, 5, 90, -343, 55, 71, 37, -30, 19, 110, -229, -147, 75, 152, -188, -273, -48, -98, 199, -96, 311, 83, 266, -119, 103, -284, 101, -73, -485, 6, 19, -227, 51, 418, -33, 59, 233, -91, -112, -81, -154, 3, -98, 62, -49, 183, 79, 100, -142, -105, -29, 39, 15, -57, 43, -54, 203, 167, -126, 32, -8, -164, 81, 62, 95, -153, 151, 23, -60, 49, -96, -268, -230, 361, -302, -78, 12, -190, -164, -273, -100, 52, 257, 74, 163, 197, -17, -136, 20, -13, 168, 60, -87, 50, 6, 189, -15, 73, -47, -38, -88, -66, -33, -73, -87, -140, -176, -26, -55, 243, -130, -56, -19, -64, -43, -21, -146, 71, 72, -170, -69, 135, 126, 116]
5139A16j36L8K67l96J30j83LJ86l33K49M2QJ58m8j64k4K34j49J17j3q1R4j12K7
5163C0K25k01j43JK17J36J85p48K28j6J81p4j53m5j3J36J31R0q6J25l57j57o2
5186c70JM00q0j4J90k27N9J48k13L70k15n9J3Q4j25QK76n80L89L7J44l15J10J45
5210A76l87K61j57r3L19j3M3j58K84k49r0J25J4j57Q8J63j0l35K20r3K50k37J86
5233A50r0j71P3k00L46k53K03l4J94m82L28O0j35K39l59J46k13K46k91L85j82
5254d0l75J96M52j87j0P3j62K52k35Lp8l6K34k10J24j18K28j03k1M3n5J06P6l82
5278b25J84K32k39J03N5j27J41j58j05K90n2j36N0O1P8M5%l76R6K4O7k32Q0L18
5302A74j29J9q1K0J06l8N0J11j26J25k06K68r5l61M80k74M7l58J81J93l5l5J72
$$ y = [116, -20, 18, 285, -111, 19, -164, -161, 25, -308, -59, -17, -9, 149, 101, -63, -87, 147, -2, 115, 102, 21, 115, 3, 30, 255, 54, -89, -88, 129, 265, 450, -298, -70, -86, 95, 21, -132, -177, -190, -54, 77, 167, 81, 206, -151, -308, -370, -369, 31, -49, -63, 127, -100, -41, 107, -106, 264, 49, -10, 3, 87, -38, -30, 246, -334, 55, 92, 236, -79, 31, 176, -211, 50, -107, -200, 119, 106, 149, -9, 275, 26, -64, 61, 75, -82, 6, 169, 159, -176, 44, -49, 201, -36, 150, 60, -111, -38, -238, 108, -145, 58, 24, 218, -264, 64, 124, -11, 228, -131, 15, -198, 48, -243, 142, -40, -415, -219, 233, 46, 36, 109, -53, 199, -36, -33, -111, -147, 87, -123, 1, -117, 111, 8, -13, 30, -25, 81, 157, -225, -41, 191, -48, 55, 110, -17, 124, -34, -139, 151, 99, -37, 13, 74, 152, 197, 197, -179, -83, -59, 8, -224, -144, 174, 45, 64, -17, 3, 109, 71, 121, 232, 106, 231, 25, 293, 198, -163, 317, 43, 90, -268, -87, 106, 71, 36, 208]
5325B08k27j31L38l17o4M88j93p7J03O3m56K50j50J47J63R8j61j55j28K83k51
5346a69K95j87J20N2l17K00m5P5m7j21J40r8L4j72L59N5q0N3l11J74j63j82J73
5369a62J0J93m4R9M9l19N2L95l91K83k76R8J98j81J07j33j25L19j00q0K24j98
5391A8L2p5K36k14L6J07j11Pk5K23p9j29N3j6Qj80J20K58j80J91j84j17Q5O4k88
5416a60L29K2j48Nq3l1j59J53j2j77L34p3J00j64k4J83j02J68j03J58l85J46l6
5439e9j19J82K58l33K23k70J58k90Q7L19r7j4J02k63r5l0M42k31J01j36o1K71
5461A45k63L11k07J03J21m7j60R4n9J14l6J09k78K77n1k8j47K0q3J24Kj41J15
5484C5l20J00J85k59K98Q3l01J07j33J23K75R0j39o7k97M54l72K31j43rM3r5L16
$$ y = [208, -19, -150, 188, -129, -193, 295, 102, 25, 128, 191, -265, -15, -165, -18, 145, 243, 82, -73, -201, 82, -169, 126, -61, 59, 111, -206, -6, -51, 24, -23, -144, -4, -102, -68, -240, 119, 174, 94, 147, -164, 10, -153, -335, -162, -152, 41, -3, 96, 145, -174, -122, 273, -118, 165, -111, -13, 185, 4, 111, -22, -147, 172, 72, -8, 216, 18, 50, -25, 211, -3, 33, 140, 29, 36, 11, 234, 155, 26, 79, 63, 71, -109, 11, 269, 89, 280, 96, -21, 64, 128, -160, 169, 191, 43, 48, -35, -66, -225, -72, -84, -261, 73, 0, 100, -64, -88, 95, -7, 161, 58, 216, -169, -23, -59, -178, 4, 262, -71, 152, -118, 40, -250, -163, 156, 59, 45, 147, -116, -211, -241, 201, -30, 71, -65, -126, 145, -118, 193, -14, 89, 210, 163, 3, 97, 38, 152, 116, 225, -53, 224, 173, 145, -2, 18, -65, 59, 61, -80, 35, -285, -185, 0, -259, 39, 122, -179, -72, -205, -82, 193, 283, 144, 77, -220, 234, -138, 93, -50, -59, -16, -111, 205]
5507B05m59M54n66K61n5l2L38Q9j28n0R2j8j98K0K48q9l21Q5L23j30J56k61j27
5530a63J55M1q8J78J31n5j86J83j43L3QL7j66j09K47j58J67p8N2r7r4J51l30L58
5554G4r1r5J67K33j60p2j28K75j00k88K24N5m91K75r3K98J47P0j69j61J22j24
5576c2k41J26J79j12n7K07N5l87L60K7j48q8J51k97M44k97l1J66M8J9K3j5J19
5599B19j89M0M5j58O2N7O8n9k19J42J82j91K09k33OQ8j98Q2K7k07K17L28l15R0
5623I3J04k84L05l42J43j47J2J4K95k7k68j13L89l12J38K28j54k60J64M0n2j26
5645a60J38J27k74K18K60m25K07l8l55L51J83k01k60M35l66l4L30k60J84k31J90
5666A9j66L8J64J42n54K89j6J75j58L8K54k57o4P1l2J77j98K33l6J43j92%k70
$$ y = [205, -254, 200, -366, -105, -160, -192, 146, 235, 107, 57, 149, 131, -67, -47, 201, 112, -209, -124, 199, 69, 225, -36, -163, -8, 33, -55, 123, 254, 199, 13, 196, 53, 86, 94, 131, -35, -144, 103, -55, 112, 34, 86, -11, -105, 46, -284, 74, -17, -112, 55, 288, 128, 56, -72, 203, 103, -185, 39, 94, -397, -122, -215, 83, 230, 300, 131, -30, 92, -32, -273, -147, 32, -80, -137, 70, 125, -262, 98, 125, -23, -111, 40, -257, 187, -110, -141, 25, 73, 92, 115, 100, 219, 30, 70, 115, -43, 19, 76, 144, 85, -134, 8, 190, -1, 208, -25, -19, 69, -129, -47, -20, -227, -10, 318, 3, 93, 197, -87, 218, -124, 19, -128, -116, -102, 193, 166, -102, -215, 174, -138, 0, 228, 74, -186, -22, 18, -34, -160, -22, 105, -169, 49, 309, -116, 91, 53, -302, 49, 232, 31, -229, 206, -160, -194, 136, -124, 60, -171, 19, -147, -109, 55, 197, -357, -68, -84, 91, -67, -29, 225, -32, -96, -25, -57, 120, -78, 155, 119, 262, 70, 70, -200]
5689b00o1N77m11k22M15k12J00N8j88j5N88j52j18j06j30Lj13j88O59m81K01P2
5711G6j11J17j18J24j54J9q5K36j34J11k32jJ71J68l35K22J89K9l41J12O0j8o
5734I9j86J86l10K01r4K9j36M96j22k33O8Q6J6j25n2K9O2oj9K00k92J49j70L28
5758B04k36k8J15m96M95j66j0K47J16p3L3j36oj87N6q5K58k8R3J6k55o6L76q8
5782A49j78j77l1K4L26j57R9J50q7L5j57j21J54j78J11o8K26j65K18j72Q3k07
5804a23J13K1k0J63j39J76k60J7j44q0L39k9N8j18J05m9P4J4j11n0J1pJ46l39
5828b32J59L14m08K87j23k54J46J34j10j48J78k5L9L66j1l94J11oJ85k82j52L77
5850A51l43J29O3j13J68P6j29J40k25J8r0K11lj77P3k2MJ05P2L3O5n1J15k00o8
$$ y = [-200, -261, 316, -95, -317, 98, -114, -14, 44, -144, -159, 429, 277, 159, 53, -77, -74, -187, -375, 284, -197, 4, 76, -35, 82, -36, 88, -66, -47, -132, 104, -30, 81, -151, -152, 19, 187, -148, 74, 263, 292, -49, 63, 123, 105, 99, -87, 99, -211, -10, -104, -75, -211, 285, 163, -70, -2, 84, 100, -25, -77, -48, 14, 8, -11, 189, -103, 46, -124, 204, -32, -60, 55, -441, 54, -112, -122, 125, 241, 168, 201, 65, 59, -128, -72, -157, 101, 73, 166, 182, -73, -139, 237, 149, -29, -206, -237, -213, 113, -44, 55, 205, 118, 153, -4, -125, 29, -149, -38, -106, 120, -45, 173, 1, 84, -123, -10, 11, -9, 154, 15, 191, -69, -52, -196, -276, 63, 34, 92, -26, 79, 30, 104, 118, 7, -43, -32, -39, 107, -232, -73, 241, -167, 120, -3, -257, -111, 23, -87, -235, -57, -82, -43, 323, 312, -82, 29, 23, 208, -74, -226, 151, -192, -63, 0, -113, 55, 131, 2, 142, -83, -65, -155, 56, 53, -124, -51, -73, -69, 36, 108, 141, 206, 155, 270, 70, 2]
5875Bj09L37m68J19lM2J66J5J5j57J11k81P6L00k21J45l68J83L03l76K61l8j7
5898C7Rk8l04L20o4k91K60o2K3N9L37l02K84l43J23jk80J49J26j01j56L53oK09
5922C51m43M2K03kJ60m41J51k60J15K68j67m8K13l11K08J16j59q9K03J26k40K2
5944A8j9J27j62M45n87M81j88k66J97j50J66r1k91K17K16q1Q0k44K48j98k2J83
5966G9j41o1J6j45O2L29l1r9J63o8nK3j30j51k03M09k86M8K21N0k03O3M55l78
5990A7j9j33N2Q1nj17J61k32R5L03k86N9K86j95K8j50j69L2n7J85P3m0J91j43
6014A7L22o6m61J46O0J17l42J87K96l24J92r3Q0n3l9j42p0K89r1p7P6j34K17p6
6038C1k6J25j85J70l4J4k3l00L41p2O3r4n6rJ25K54p5l8k10l61Q7M20k03K3q7
$$ y = [2, -107, 230, -238, -119, -122, -80, 86, 101, 116, -41, 70, -211, -135, 165, -56, 89, -279, -96, 207, -169, 92, 54, 37, 46, 18, -286, 34, -30, -321, -61, -123, -100, -41, 296, -6, 278, -65, 58, 57, -223, -74, 52, -49, -205, 148, 142, 351, -92, -50, 153, 151, 311, -130, 21, -239, -124, 144, -23, -71, 142, -169, 39, 155, -4, -93, 110, 236, -4, 18, -1, 126, -36, 409, -178, 303, 115, -151, 46, -104, 62, -29, -320, -103, 113, 32, 112, -132, 116, -82, -104, 79, -62, -123, -107, -252, -190, 139, 108, 9, 172, 104, 99, 122, -8, -159, -362, 47, -239, -191, 30, 80, -123, -60, 395, 17, -2, -135, -83, -2, -7, -124, 37, -195, -100, 203, -83, -24, 262, 67, 95, -55, -224, -192, -249, -64, 9, -31, 160, 17, 339, 273, -188, -42, 18, 135, -207, -20, 276, -48, 144, 51, 131, 78, 39, -103, -173, 116, 25, -52, 24, -110, 107, 31, 5, 130, -55, 115, 81, 95, 72, -228, 113, 41, 104, 10, -46, -55, 70, 324, 249, 211, 1, -360, -273, 147, -56, -33, -120]
6063a20K04O7o1N4k66J50j41pj92J96p6L6J77m9R9j09o5j5K03o1j4n9L14k64n5
6088e4j46K47j96K22j0k3K2J9l1k9j19j03J02j85J57Q6O2j23K72l0j67J51l98
6111b74plJ93n5J93l2J86l4P3J9k59J41j22P1m50L62n8L18j30j93J44N3p1j83
6135a18J55j41p%m2O6J50j32P0J45l65L81k29P8p2n6p9k19K82L3L87m07L34k68
6159e4n6j5l8J61l0P1j96K71K3m59K47L68k07O7pJ24m22K20k87k0K78N7n6L6k67
6184a91M55Oj82J74k7l70j13J17J68K97l40J64M2K05l09k31M10k80j87j24K40
6205g6J4j54K30m5J50j6K7j47J16o3k27J84j68L3L03k3m2j69R9Kj06K73k26j13
6229a44K62k23j7lL8L36l43J55M6j31Q9j64q1J21P2j33j17P8O6J90L9m8Q4qk32
$$ y = [-120, 84, 151, 90, 144, -122, 28, -113, -120, -312, -116, -192, -156, 21, -28, 71, -38, -103, -118, 85, 24, 10, -49, 265, 1, -54, -200, 47, -149, 73, 63, 40, 62, 81, 50, 21, -98, -201, -99, -284, -127, -41, 21, -102, 170, 140, -27, 124, -274, -281, -284, -91, -146, 47, 15, 201, 167, 240, 259, 0, 141, 19, 90, -360, 2, -56, 262, 132, -61, 83, 136, 65, -118, 37, -104, -111, -111, -153, -87, 63, -69, 1, 146, -219, 162, -67, 11, -61, -117, -196, -415, -133, -100, 287, -120, 214, -54, -110, -125, -163, -2, -32, 39, -157, 114, 137, -322, -75, 293, 86, 153, 146, 270, -152, 68, -219, -239, 39, 96, 40, 76, -191, 264, 270, 88, 262, 235, -135, -248, -131, 37, 334, -6, 158, 200, 405, 96, -135, 275, -5, -192, -316, -76, -62, -216, 14, -31, 119, 103, 130, -17, 99, 36, -191, -7, -175, -142, 161, 138, 96, -73, 26, 28, -78, 195, -31, -144, 118, -105, -122, -125, -87, 249, -94, 61, 107, -24, 65, -99, -180, -59, 13, -120, -237, -159, -93, 97, 136, 88, 172, 164, -68]
6254f8J32J12k65K12j79J05M1J88k39Mj4J9k50R2j2k42K50N4J11k1j38J13M17
6277D22k67j81k06K13k44P3J83q0K37n7J17k14K56k46J3j0j34J44L8j37Jr5O28
6300D54j45j74l13K60l34J33K19k23J7l1L40l38L16K0Mk67N8J5j06K19k89K38
6322G3r2K3MJ79j14j03L2j08N2J8k04L23k39J03k63J33L13P9Jj38Q9j88J89j70
6346hK8j95Q7L13n5q1L8j18O0J48j86r0q0N1m8J54L0j18n6K43l9m4J21l05j04
6371b54K83k53J34%p1L0J67j14K41l31K89k42J18J11k56k27L35p3K72Oq4m18O23
6394B86l33J46j02n2n0l1J90j55K01k42L75J92k96K1l58J14K98k01l8k02K78j42
6416a01M35q2j84Rj43J26mj6j25Qm8J97R5j50R4J00l08K21j77k87K74j11m2K52
$$ y = [-68, 64, 176, -89, 123, -56, 49, 90, 278, 39, 43, 29, 48, -202, -110, -122, -364, -114, -60, 51, 30, -108, 5, 422, 155, -26, -232, -19, -263, -190, -7, -87, 150, 93, 210, -4, 252, 6, 19, 9, -125, 19, 57, -80, -79, -174, 454, 309, 135, -178, 82, -252, -119, 100, -123, -106, -137, 203, -135, 181, 201, 205, -62, -4, 11, -95, 124, -165, 73, -19, 4, 8, 187, 73, -30, 2, -106, -54, -36, -240, 83, -156, -53, -316, -183, 130, 209, 210, 72, 161, -27, 162, -8, 20, -175, -88, 225, 170, 89, 127, 9, 69, 217, 31, -59, -139, -88, -136, 18, 48, -70, -126, 117, 78, 34, 155, -150, -254, 29, -224, -90, -90, -161, -131, 36, -78, 163, -168, 121, -121, -3, 108, -148, -375, -40, -113, 159, 165, 81, -337, 286, -47, 99, -3, -55, -105, -136, 54, -101, 100, -142, 233, 425, 129, 150, -208, -94, 204, 3, -35, -237, 41, -101, 334, 252, 68, 77, -66, 60, 56, 40, -85, -77, -125, 72, 167, 17, 111, 211, -97, 124, -53, -340, -66, -177, -219, 33]
6440C3j03R2J87m6j93J64j45N8k34M23p7l13J08K50k88J69qn6o9LJ06j38J4k09
6464b72K8J39L6J13J17j88K47j36j37K27k13N2j4J46j52l23J10K91J03j96J31
6485A09k09n9p3L06n00M17o2R1Q9j36K79n65K16Q5L1P7j14L2j39m9L91k04J25
6508A38Q5j6j37L2j42n2L5P2j20L7k34M23J94j07j28J22j79Q7k38j04l8L73q0
6531B3l01M34K9M6k30OJ74k35J83k61K34j58n4J66j63K78j65M4KK23l88K5J30
6554D2j28o7p6L36P1l2j69N7L2j37M59n09p2L90m80L28j96K33K14k54j0j07J88
6577A13p6o5L4j57%O6J98p5q2J5p6K04o2l05M79k73K6k41O5Q1J94j62J19p7J06
6602D9k4K8q1o3N6J38m8o1K4L2K01K64m03j1J27j0j83nJ12k32k4J52j50K3J96
$$ y = [33, -70, 22, 209, 163, -30, 134, -11, 47, -187, 236, 159, -154, -46, 204, -84, 85, 77, 21, -48, -45, 61, -77, -63, -272, -244, -105, -69, 44, 161, -27, 220, 84, -53, 174, -39, 13, -1, 145, -7, -330, -220, 71, 174, -22, 109, -100, -159, -232, 74, -426, -9, -71, 20, 109, -27, 252, -313, -97, -12, 19, 96, -18, 14, -125, -174, 217, 13, 138, 223, 207, 70, 102, -40, -92, -57, 15, -105, -68, -302, 121, 315, 208, 80, 202, 23, 110, -128, -232, -270, 103, 23, -278, 156, 185, 231, 1, 7, 181, -54, 129, -132, 102, -56, -110, 56, -107, 171, 6, 50, 52, 275, -113, -88, 42, -86, -153, -229, 107, 178, 146, -23, 34, 66, -71, 388, -121, -193, 197, -283, 45, -151, 82, 296, 42, 32, -75, 113, 37, -28, 6, -151, -151, -85, 113, 38, -44, -29, -105, 99, 37, -268, 211, -62, -36, -277, -212, -131, 63, -99, 20, -57, 49, 25, 53, -28, -91, -35, 103, 55, -6, 18, 50, 251, 515, 112, 101, 228, 218, 35, 30, 142, -90, -114, 38, -112, -89, 107]
6627A07j87L13k79NP3J0j32R3j9j59k5L22J97l47K4L4k61K05p3l2j68Q0J52J78
6651A11J36L8m11J6j1O8p1m6K39M1K00l03k89J26L43k57L56k29R5k55o5j6J6M17
6675B49j55k90L61m16K28L65m62K8j73R4J73k01K59L56l68r1k7J04J09j83K07
6696A67l86J08L6O7J33n1j64J68J53j68M9m19K94m3o5k46R3K85K12j53K1J90k70
6719A1j19K96l35J47K05k60o6K82k48J6J39j42rJ9K67l87K57M9j39j43J08O6K1
6742C5lj28N44m06NN7k28J8k43M22P1j10J72j14L2k38L35j29l41Q5J32mj19R9
6766e6J22j47O8J40o8j29L35k74j85L37j37lO6Pj62L76j35k26l8J41K18l12o7
6789a29K32j53j42J24N8J41j81M8j0m8J4Q4N4j06o0J40j14n2m4K63p7p5nk8J72
$$ y = [107, -80, 233, -46, -41, 32, 42, -90, 3, -16, -175, -200, 122, 319, -28, -4, 30, -231, -26, -99, -131, -299, -219, -67, 111, 247, 285, -126, -110, -121, -53, -124, -170, 69, 110, 310, 7, -282, -156, 187, -70, 286, 57, 152, -103, -168, -184, -168, 249, 94, -196, 165, -251, -23, 342, -120, -92, -265, -171, 2, -199, 60, 416, 48, -43, -70, 34, 143, -40, 167, -219, -111, -75, -8, 125, 74, -90, 78, 231, 63, 112, -307, -13, -56, -121, -367, -274, 11, 223, 70, 91, 281, 11, -108, 188, -147, 0, 205, -55, -121, 161, -87, -71, 68, -74, -83, -64, 203, -184, 73, 122, -17, -160, -52, 14, 35, 32, -96, 448, 42, 47, 104, -124, -106, -349, 73, 144, 34, 206, 92, 124, -114, 221, 92, -249, -164, -32, -36, -155, -56, 66, -81, -13, 127, 59, -70, 265, -9, -194, 143, 6, 3, 69, 76, -86, 290, 155, -71, -109, 32, 250, -62, -129, 103, -50, -192, -68, -10, 131, -50, -2, -12, -60, -46, 38, 92, -14, -74, 66, -48, -100, -144, 119, 42, -33, -38, -66, 106]
6814A06m77L06J82j09j49J47Q8l28K20R4k45Q4j57J40J47R4j34j45K65Jr3j1m1
6837a5P2q2L37j95o3j82Q7L3P6J07j41P9k20K12o1J12k51k72K37J70K4K92l62
6860fJ96j26mJ86l03j21J5J54Q0N7j38j43O4J32j55Q0o1j54K21K36k22R6n4J1
6884D1L7k7j59O8J79J34k74k05K40k09J14o7J41r8J37N52q20K47j42n1M97k90
6906D5m8Q3j55j66J14l0J06J34r4K5j13J43k83n2J37K25O5j90L06l10K41l47K1
6929a43n1J81M6k32K31r8m2J41L12l94L8L7j65J04m4N0J10j00J41J62k38j18N0
6952b2l8O0mm1k60M75m14L75qj96k78M95k2J16l73K49k6m7j35K77j82n2P1J13
6976A33j67p8l0L25M0K2k35o4O6m01J18L44j48l2O8L3J15j44l8m1r0R1j49K32
$$ y = [106, -371, -65, 117, 8, -141, 6, 94, -234, -14, 80, -165, -81, -238, -98, 49, 143, 9, -136, 129, 130, 37, 26, -15, 57, -25, 312, 117, 54, -128, -41, -8, 68, 175, 34, 113, -107, 105, 44, 156, -95, -367, -130, 40, 64, 356, -6, 190, 64, 60, 246, -57, -178, -163, -9, 71, 128, -10, -153, -89, 43, -112, -32, -93, -247, -26, 210, -12, 84, 30, 41, 78, 51, -108, -40, 139, 273, -1, -206, 34, -175, -61, -128, 13, -85, 52, 604, -216, 31, -111, -162, 335, 45, -3, 80, -75, -241, -127, -157, -51, 83, -11, 14, -99, 44, -239, -291, -154, 71, 136, -54, 252, -58, 183, -164, -143, -194, -13, 33, -199, 32, -66, -108, 33, 345, -49, -11, 26, -139, -35, -79, -29, 81, -19, 122, 284, 46, -72, -22, -60, 0, -4, -45, -305, 170, -244, 131, 123, -73, -351, 144, 122, 238, -135, 114, 88, 41, -94, 183, 1, -51, 20, 133, -34, -112, -142, 183, 223, 245, 10, -54, 12, -389, -271, 73, -75, -107, -39, -6, 109, -35, -73, -114, -204, -113, -262, -30]
7000c0J35n7%j09j2K5K23j20P9j70k19L09j11j35K38j7k12J51P5m06L88J81j52
7023E4Oo8k34L78j56QL64m96Q5R9j42M4k9J21J61j45m4j12J24q8N5J31N8l01J15
7048a2j72K65j01Q9j17K66j42l0j30K07rl04j19M02r9qj16j15N03N9j09k54j7
7071f3q0J01j15L30K5j41j89J36n1J86m0j08J52m2j91N1J09j58j65J37Q8J83m32
7094b77J99Q2j22Q9J54j64j41J17P0j36J57J35j79k3L91k38p5M9j14J6j67K09
7116C2M7K3k73J33O0K9J28j63j26J79m11L72q0J24k47N55l42K19k37J85q5l58
7138b36N12n09k00N38k02J68p0J35j7J28l88K24l1K45l54j1j84M02l23Q6J31J4
7160E8m7k57K34L0Q5m07L80k9k28M44p6j73J87J12K28o86J17j14K07k21J93J31
$$ y = [-30, 105, 48, 48, -61, -73, -48, 175, 55, 134, -36, -255, 54, -57, -192, 46, 29, -183, -32, 43, -363, 25, 206, 54, 60, -8, -242, 136, -20, -12, 352, -144, -59, 40, -102, -58, -87, 34, 195, 50, 6, -106, 18, -70, -15, 116, 174, -127, -12, -184, 81, -20, 69, -48, 218, 76, 46, -84, 123, 114, -190, -309, 93, -6, -14, -130, -245, 258, 317, 208, -46, -63, -143, -42, -157, 173, 198, 57, -132, 4, -47, 139, 99, -9, 143, 101, -90, -39, 70, -88, -253, -116, -28, 155, -277, -78, 4, -118, -29, 125, -39, -180, -63, 7, -129, 28, 163, -16, -39, 352, 114, 39, 88, -26, -10, -177, 32, 79, 102, -171, -38, 22, 51, 179, 16, -110, 69, -342, 30, -50, 74, -173, 382, 40, 259, 22, 207, 122, -236, 276, -233, -433, 105, -97, 71, 1, 136, 119, 247, -141, 83, 52, 297, -57, -68, -252, 150, -173, -87, 44, 58, 11, -246, -12, 18, 103, -304, 76, 47, -181, 263, 187, 14, 201, 313, 541, -145, -28, -142, 65, -156, 37, 168]
7182A68j10K3k42K09J18k1j12J06j57q0M08l43J36pO7j04j05J31K5j71p6J79K54
7205B96l10K40o1R2k29n7r8K37k57r6J51L8P1J04k06J75o3k04j37L72nk08j92
7228c47r8K18j3J41q7K27j3R8k20l3K07k1l07l1M66l62K5J96k7PJ3k36N9L09k03
7253c2Q0q5mj46qM42l67K14k27p5M83j59k04l8J29J54l98L18k07J18j44O8mK01
7277A09j65K32J32k74j93qr5L82O6l98J90k20J16J23j40K70k37J64J14k74p4K97
7299A17j71K85k58o6J61o3NK12k94pRn6M38l48j0j1jN2J44k64K45k53K66k54n2
7324a74M6J57r0R1j10J30j00j24K01r8M5K82l36J96j48j22k3J14R9j90K74k54
7346a34n3K17j35K88q9k72J51j48K00j34J32J65j34K5k42Ol8J58l5N7l5R8K8j82
$$ y = [168, 58, 81, -161, 48, 166, 145, 33, 139, -18, -98, 310, -33, 103, 96, 163, 59, -46, 85, 110, -61, -137, 42, 296, -14, 226, 165, 257, 28, -29, -127, 110, -147, -243, -92, -54, 17, 121, -85, 90, 27, -177, -314, 58, 53, -155, -347, -445, -227, -240, -99, -186, 41, 28, 126, -94, -127, 80, 59, -248, -279, 187, -175, -150, 46, 19, 26, 39, -197, -138, 171, -32, 48, -37, -41, -187, -195, 247, -120, 94, -133, -208, 275, 116, -88, -126, 3, 157, -241, 77, -130, -12, -156, -88, -92, 109, -56, 176, 308, 34, -159, -167, -262, 120, 186, -212, -22, -242, -126, -3, -143, 127, -110, 54, 168, -106, -180, 117, -54, 231, -27, -93, 68, 5, 10, 222, -72, -79, -70, -126, 312, -36, -46, -57, -58, -6, 138, -126, 119, -134, 132, -122, -174, -128, 29, -61, 30, -80, 50, -50, -174, 27, -71, -26, 256, -80, 116, -32, -154, -177, -63, 36, -154, 120, -134, -187, 30, -105, 183, 94, -178, -27, -175, 25, -109, 23, 188, 54, 79, -163, -157, -195, -37, -72, -15, -50, 48, 76, -106]
7370a06L9K9j63M03j42j88k08K33L00j78j04K84l2l50K00k29K53M7mj78j2K35
7392A29k13J37Rj32Q5K34m89K5K08o6Om2K9o9P6r1K15K55l00k83K25N2j25J06
7416a9K57k54J72q3q6K03R6m07N5k45N87j05N6J37m43K0M24l76l12K60l2K71j46
7439C0Q7k46L68l97K07j10n0N12k63j32k43L24j13J63j94J97J40k97J37J86k08
7460I8J4j00j28J21M1Q2j80J57J72k22j32j6R0R7J80j69k86m7L54j57J03k2K3
7483G3k44L03j82K1j42K57k05RL0M5J0K27j29j88Q0OL4mj51J13k11J83J4q6M50
7508C13m98N00m08M8p6R2j00o1J84M9j36K46l85N04M8l28j44N1J71L6j71J30k37
7531a72K16j67J98K21J4k46j35J61Q6j41qj51L65l90K40k9k38P3K35j95P2J17
$$ y = [-106, -67, -38, -201, 202, 60, -128, -336, -103, 197, 19, -85, 199, 167, -183, 17, -212, 41, 88, 84, -94, -106, 129, -84, 53, 62, -70, 15, 249, -240, -215, -7, -73, -67, -109, -80, -149, -73, -164, 51, 306, 6, -277, -52, 0, -125, -19, 238, -16, 156, 73, -13, 190, 286, -121, -66, -311, 276, 171, 227, 364, -79, -59, 365, -11, -323, -63, -95, 176, 30, 117, -129, 239, -158, 49, -61, -111, 401, 138, 6, -237, 87, -26, 137, -57, 140, 280, -17, 120, 306, 98, 112, 12, -116, 5, 46, 128, -52, 105, 277, 55, -77, -93, -3, 94, 274, 105, -181, -228, 126, -31, 72, 50, 73, -171, 132, -50, -29, -171, 86, -119, -110, -80, -35, -25, 202, 73, -115, -35, -29, 5, 1, -150, -37, -248, -65, -51, -137, 313, -185, 315, -93, -45, -121, -29, -129, -190, -6, 43, -93, 153, -232, 272, 320, -8, -152, -101, 70, 106, -65, 65, -172, 44, -123, 75, 296, 310, 64, -71, 90, 176, 35, 27, -124, 241, -149, 91, 62, -176, -103, 132, -63, 9, 126]
7553A26m1j60r9J96k00L00L2k58J84Q4m5l17L34j06j98J04J1j56M07k84J7L06
7575B37l30J07O4J22k54J61k86M26j22j58K05k63O1M8K0o3O5j80lJ83J31Q3j50
7598A04k37J36J2j68M15q8j19o6M1q6o1Q7j5L7R9P3j15j19K12p9q5p4MJ4K16J33
7624B71l24J47j6k2p2J51q9k49J09K4J20k04M1J27K33K5k19j47J8J07Q4m5j99
7647a29J02M24m69L39j90PL7N7O5k86K17k20Q9N7j74Q6pL18j74J4j83L40j15l38
7671a33J63K0r1o3L6j58M18k12L6K9J97j82l93M1O4O4K72Q6k45j19m7K80J94n91
7695c34N81m18K92P9j08L3k03K60l10J57r1n1K27j98Nm8j31M05pk66J82j78r5
7718b17M21j65M1L2r7J6Jj11o4J88j73K19j19j8j47K59j03J16N9l8j65J40l39
$$ y = [126, 85, -75, -174, 22, -178, 122, 154, -104, 80, 164, 119, -198, 136, 30, -168, -64, -53, -209, 198, -86, -69, 237, -93, 14, 78, 200, -54, 107, -179, 247, 125, -33, 172, -91, -30, 18, 38, -25, 40, -140, -143, 40, 171, 254, 104, -133, 3, 15, -153, 262, 174, 55, -11, 30, -56, -117, -30, -45, -8, 91, 164, 49, -70, 142, 63, -22, -96, -92, -78, 138, 271, -53, 94, 78, 56, -16, 135, 46, -203, -94, -70, 50, -154, -113, 14, 247, 272, 53, -94, -76, 31, 115, 70, -129, -27, 397, -72, 267, 77, 84, 121, 178, 243, -43, 174, -46, 43, 100, -74, 12, 5, 323, 149, 163, -20, 320, 205, -133, 30, 50, -41, -104, -68, -226, 192, -20, 16, 45, 242, 60, -333, -292, -228, -164, 108, 194, -51, -170, -217, 63, 257, -334, 247, -171, 121, 200, 92, 125, -78, 182, -128, 29, -62, -113, 114, -84, -79, -127, -258, 147, 140, -126, 56, -122, -217, 204, 39, 80, 112, 15, 31, 32, -79, -143, 45, -128, 91, -28, -46, -193, 66, -37, 79, 138, 100, -65, 75, -264]
7741b64K52J30j18L1P7p5Ml00j16K44J92j70Q3O6k03J92J04j60K34j31J27k82
7763h3j93M10J32k91J39l1l35K20J81l84M96k73k78M62k5j48K25J12n06K75j85
7784h0J53j2m5o3J21j21j5j76O7L29j07k73l8O6K19j9J80j65j34Q1j76K8K04M6
7808G0j41R9j46J7J34q9j53jM9L08k98K32l2nJ26q9k34L01k23J25J10L22p00J86
7832c2J21k65J80j07K27j69J45l57M10k61L8n1P3K5o9K81p7k31J53J84j02k13
7854i7J69j11N0J42k35J27N6J3k11O7L8n9k7J2O2n6j%m6QKJ63J93l25R1j33J34
7881B6j66K49j89L4J05j27L99l18o1Q1K0j50J41q9J06p3k8O4r1J5k0K67j16%k7
7906E2k78j14L91J80k03J94k33L58m75J62J34n4j77K3R6k10k3M01j38j51o3J14
$$ y = [-264, -12, 118, 0, 31, 108, 33, 37, -263, -379, -135, 57, -113, -30, 36, -167, 25, 129, -31, 203, 72, 199, -83, -276, 134, 266, -25, 114, 83, -252, -32, 149, -235, 261, -12, -290, 172, 147, -1, 224, 336, -170, 105, -80, 73, 61, 16, -47, 74, -47, -62, -238, -171, 158, 51, -222, -260, -194, 25, 6, 186, 21, -113, -32, -208, -180, 24, 70, -71, 28, -118, -101, 33, -56, -209, -210, -161, 147, -151, 81, 49, 44, 170, 81, -153, 148, -75, 50, 160, 482, -218, -32, 89, -176, 4, -103, 124, -45, 100, -257, 153, -108, -70, -121, -48, -23, -92, 189, 112, -119, 34, 218, 116, -97, 72, -39, 11, 153, -82, 45, 101, 114, -97, -30, 8, -51, -78, -66, -4, -60, -61, -61, -107, -99, -97, 66, 259, -66, 25, -108, 26, -140, 109, -80, -46, 59, -68, 331, 13, -48, 33, 53, -97, 44, -45, 61, -12, -40, 24, -67, -52, -72, 195, 79, 79, 52, -226, -340, 51, 231, 28, 222, -11, 347, -128, 34, 168, 114, -63, -40, 56, -154, -177, 224, 86, -65, -128, -14]
7928a4Mk37K00K6KJ12k77J30J35n1L8k40K76k12K21K9j92j59P3J06j53O47k09
7951B55ql86P2L09n26K09k4Q6K75l49q2J41j52J3K55J21j51N0n8j39Q8n4o6K09
7975H8k39J64q0J33j05j1J05r1J96l42L28j69k5J9K67k37o8M6J06j98K85l65l
7998a96R7k2M01k60J51j25Q4M5r0m34L51J72l9k14M5R2j21j72K43J02j24l0j23
8021a67L73l42j12K68L59n69K33j20K88P9j93j63J75r0J83k24P4r1P7R1k0k3k06
8044a20L8K60k80l4k33L94j58M7K48r2k68J86R7j9J12p4l45K60l29K47J12p1q
8067c0mR4j61K08q1P7l29K9L04j67k54K94j04J89J9q3J86k12J87j69j43M4M0k27
8091b93K74m0j35K04M3m2J42k04O6K44l12L0m6q1L09Om5j28o4J3L16l65J80M3
$$ y = [-14, -10, -247, -47, -21, -19, 93, -184, -54, 81, 30, 68, -172, 104, -108, 113, 142, -50, -209, -136, -30, -183, 464, 255, 247, -139, -67, 242, -284, -75, -99, -13, 262, -87, -169, -28, -180, -167, 88, 209, 58, 108, 50, -89, -1, -55, -121, 88, -151, 13, -67, 66, -39, -50, 55, -36, 160, -182, 146, -23, -48, -29, 238, 1, -67, -21, 85, -113, 172, -193, -196, -99, -121, 280, 20, 171, 46, 130, 175, 85, -349, 2, 174, 135, -79, -34, 58, -63, -235, 8, 110, -14, -44, -167, 206, -136, -248, 20, 379, -190, 43, -77, 211, 290, 97, -66, 109, 19, 202, -22, 52, -39, 38, 129, 109, 86, -120, -82, 178, -102, -136, -369, 25, -133, -86, 162, 70, -198, -12, 85, 66, 178, 104, -241, 19, -310, -63, 49, -22, -30, -34, 60, -101, 107, 26, 103, -226, -197, 107, -60, -314, -20, -124, 65, 84, 1, 187, -25, 162, -7, -150, -106, -66, -293, -19, -59, -194, 10, 53, 11, 153, -51, 15, 259, -53, -23, -69, -150, 159, 165, 120, -8, -72, -59, 257, -108, 72, 115]
8115A15l55J58J88j76j22K24j7K22j77k61K7k1J38M9J03l28K29L5J08j35R1k12
8137a17K48m0l92J90j18K79k76L45m83L27J21n2k6J78n9k39j30K86k81M64l95
8158a70L00j62N2J40j11o5j78K54j62N08l15k47J8K56J61l86L51j75M5j4L9m8
8180I1j84K06q1q9k11L07L8j23J0n2O2
$$ y = [115, -240, -82, 106, -70, -192, 32, 15, 237, 60, -201, -174, -195, -57, -8, 95, -233, -4, 31, 139, 4, 95, -117, 131, 91, -301, -111, -229, 50, -226, 119, -364, -37, 84, 32, 6, 184, 125, -114, -244, 42, -239, 225, -170, 130, -32, 20, 160, 49, -16, -194, 60, -102, 406, 91, -156, -138, 118, 279, -107, 244, 69, 114, 100, 139, 91, -93, 113, 32, -57, -268, 39, 77, -46, -36, -88, -26]
8191b6
$$ Imaginary data points
##PAGE= N=2
##DATA TABLE= (X++(I..I)), XYDATA
0@%%%%%%%qJ6j6J6k4L7m5N6p2Q9j07J31j61J93k32K75l23L78m43N20o04O96p99
30d27R19j051J197j357J533j730J946k185K446k731L041l383L761m169M612n097
46b675N631o214O846p542Q310r157J0091j1125J2279j3578J5048j6722J8654k0912
60a1066K3592k6835L0848l5964M2748n2226O6476r0544J41319m26252N94984M27656
72F84736j348973L92054R76250o48729o55652Q70609J37802p88540J55678O09939
82C85174m61412k58234N42055m7972m36394L74485J48469m40862J45995K98290
92B49594l85239l7739L57962k05369j99827L52332r610l11985K22483K16891l76250
103a26757l5453M21870k25901l84476M58795J63950n89290J69916N54103m51851
$$ y = [0, 0, 0, 0, 0, 0, 0, 0, -8, 8, -8, 8, -16, 21, -24, 32, -40, 49, -58, 73, -88, 105, -127, 148, -175, 203, -240, 280, -324, 372, -427, 492, -559, 638, -719, 814, -916, 1030, -1155, 1291, -1440, 1601, -1782, 1979, -2190, 2422, -2675, 2956, -3258, 3588, -3954, 4356, -4801, 5290, -5835, 6444, -7134, 7914, -8808, 9846, -11066, 12526, -14309, 16539, -19425, 23323, -28903, 37573, -52971, 88348, -337904, 257080, 684736, -664237, -272183, 704067, 55338, -600314, 270295, 408097, -380443, -224765, 385174, -76238, -334472, 207583, 159611, -276783, 97702, 246171, -194691, -48696, 249594, -135645, -173384, 184578, -20791, -220618, 131714, 122104, -189881, 32602, 249493, -126757, -162210, 259660, 33759, -350717, 108078, 272028, -317262, -147346, 406757, -45094]
113d5094k98956O10442j8599n86385K74920L99896m50289j90561M98603k5793
123A68184m44880K41268L28279l69410j11925L90320j23147k84915K52116O6122
133A12012k54654J16588J33259j82766M0305J57065j44809n4776J85006o3329
143D3901j85424J55073J17960k49370k148K96547j48834k31766L07109Q2924l63907
154a77935J10136K89528k71697j48192L16333j6189k77641J43727K05272k08173
164c4831r7181K47850j7751k40985J27691J55301k15915l1796K13280r0618j21734
175a06689J57480J3195j23787P0285M5055r1877J9551N6620o9147j6873Q9261
186D3074k7300q7583R5669O6923j52902Q006J74967j19475j35952J98231K4940
$$ y = [-45094, -344050, 266392, 247793, -338592, -63672, 336224, -114065, -304626, 193977, 168184, -276696, -35428, 292851, -76559, -188484, 201836, 78689, -206226, 45890, 112012, -142642, -26054, 107205, -75561, -35256, 121809, -23000, -77776, 107230, 43901, -141523, 13550, 131510, -117860, -120008, 176539, 27705, -204061, 103048, 185972, -177935, -67799, 221729, -49968, -198160, 118173, 101984, -175657, -31930, 173342, -34831, -132012, 115838, 98087, -142898, -15207, 140094, -75821, -107617, 105663, 15045, -106689, 50791, 63986, -59801, 10484, 55539, -36338, -16787, 39833, -29314, -46187, 43074, 15774, -71809, 23860, 90783, -62119, -54113, 120854, 1379, -134573, 63658, 88598]
197H8598k17162R2146J67235j59612p2926J83301m962j67365O3704J30772j21475
208a7746q6789J56132J0677j57032P7056J12634j24772k3624J21766n0218p0706
219e2622P2363M528n9938K7018K6726l2498L7L5201j3586k7301L9379Q660o2547
232c4580K9352N2487q1806r119R9404n4867o8877J05873J2611j06211M4987P7719
244F6973p7183m5121Q3925J1851r2281J9019R2698n8609o7409J00429J9873j06950
256e2785L9575P4497p6098k7562O9432j2149m6477K2432K9142j7865k0232K3475
268E385J8110l0698l312K7099j6645j1163J4635j1698N730J2814k7983J4069L3573
281B9916m0356r922N0064j9059m0167L0930K1255l3516j4623L5472J2810m4298
$$ y = [88598, -128564, -36418, 130817, -28795, -101721, 81580, 76618, -90747, -27043, 103729, -17746, -104535, 51597, 62274, -94758, -17702, 94932, -29840, -53464, 68302, 18084, -52622, 19741, 24269, -35669, -8651, 18075, -14423, -14386, 20815, 7229, -20072, 19307, 27967, -34580, -5228, 47259, -34547, -43666, 55738, 871, -68006, 37867, 50478, -55733, -10746, 66973, -10210, -55331, 28594, 40445, -51836, -32817, 59881, 1272, -66137, 34292, 54165, -52785, -13210, 61287, -14811, -42373, 27059, 14910, -31567, -9135, 20007, 2142, -18090, 5385, 23495, -7203, -10515, 16584, -61, -11224, 3411, -8287, -2557, 10257, -17726, -3657, 29916, -10440, -20362, 29702, 10643, -29524, 1406, 22661, -10855, -25478, 9994, 22804, -21494]
293b1494L764N4653l0514m1783N2735R904n6082J7873L3694k8038j2123K0398
305B987P908j0455j1557J6632J2057k7411j92K4928j5356j3050J5141M08k065
318b5k485m107J8208l619k5182K3686J2605l5283P026K6240k0156j1850J8878
331C936M466j1223o567J5778P735k5453L325K8141k3398j6086L1665n149k3393
344a6223J7570P612j1647o5L753M754l855j0605J1928M987j8632P043J2599j4060
358d841P89R137n888L095k030m765J1716n839j2544J6894J40j7090J1202P634
372G610j0590r2N032K461k168j0055R690Q299k0649K914K1311j6588r562K0400
386H013j651j2885N025O260o3r329j951J6002p026j7085J8312P658k1638O144
$$ y = [-21494, -17730, 36923, 6409, -35374, 17361, 27265, -28817, -10944, 22750, -5288, -17411, 2987, 10895, 440, -11117, 5515, 17572, -9839, -10031, 14897, -459, -13509, 1632, 2040, -25, -2510, -6617, 11591, 7972, -17210, 6476, 19081, -16202, -9176, 17064, -3092, -14942, 3936, 8402, -2821, -9388, 6390, 14125, -11328, -8003, 20138, -3260, -19346, 12319, 7170, -16223, 1347, 8959, -2688, -2753, 1000, 5754, 1899, -8706, 3222, 8209, -10423, -3380, 9219, -4841, -4052, 5085, -803, 2292, 262, -4503, 7213, 1374, -11170, 5724, 5864, -11226, -24, 7610, -2980, -3072, 1960, 4421, 2253, -7802, 1888, 10187, -10462, -7548, 13763, -2825, -12387, 8013, 6362, -6523, -1498, 4762, 4699, -4630, -6581, 9421, 2395, -14690, 3622, 11280, -10358, -4214]
400d214J4722j0430n090N687K990r72r978M567J2501j3802n334J8680m936j3134
414h743J1258K745o737m44o36N183k79j1158R264Q876j5259K070J3312r018n219
429d785O659j63j572m353L57J0294p485p802J6287q61j4943J0066N723j1151R20
444b809L714j211j37m393M892O255j0551J887J1739j0613l898J0914o075n007
458e293N932j372k68N15j405O831k288q206J0861O42j4895P810P487j2409N82
473e476Q485j676j702r86M218M238j0927L67J1412j0555o775J3656l795o951Q944
488B477K02k808L622l316J607J494p592L003L409p299L005L998m501M417J129
503B847m288O806l083q239R909k024j1194R659L132r410N125N397l376j096J35
$$ y = [-4214, 10508, 78, -5012, 675, 3665, 2693, -7285, -2718, 9783, -4019, -9353, 9327, 4391, -8743, 2515, 5260, -1477, -1921, -2557, 2626, 2347, -8811, 453, 9329, -5930, -3860, 9452, 434, -4785, 1874, 1711, 139, -4214, -3857, 6437, -1048, -8850, 7437, 6576, -8367, 1699, 7422, -3729, -2809, 905, -306, -443, -4836, 56, 6311, -4240, -2353, 9386, -1227, -5125, 5789, -286, -5293, 639, -733, -1001, -486, -1891, 4940, 2652, -5554, 5307, 5949, -8946, -1136, 6351, -6058, -5476, 3009, 1333, -369, -1355, 2863, 7101, -3826, -3459, 7953, -2602, -9377, 4279, 484, -6467, 2477, 2679, -129, 3493, 177, 1784, 3278, -4314, -1311, 2098, -5201, -2196, 1802, -2699, 1718, 2847, -1441, 5365, 2282, -5957, 3952, 1928, -9266, 393, 3525, -5885, -760, 4637, 1261, 165, 300]
518C00M095k291r928Q054O473j6427K916J7167j0832p673J4167J123q710j049
532b615L804L525q544n180J3675j209j3007J0402P348j0428J936M640m042J38
546D43k310o03M448n316l51P786n252q83P685o085q23O309p480o54O901p328r85
563d498Q269m209k152M958l57l23k529l92N864o669m554J1878n297q008J3327
578E308j912j0996J2058K783j4920O165R738j0547n850J0121N216j2898k801J9459
592A0924m352k1038J7072J2723k5811K391K1437j5084r937J7991n92j3971P017
605a230R401q453p106J1801K473j6220N879J5190j6976m774K1709r758j3847J9559
619G648l92j8057J1089R053j5171r43J3807l707j2552Q620J2362j5874o230K2359
$$ y = [300, 4395, 2104, -7824, 230, 6703, -9724, -6808, 10359, -473, -8146, 6021, 7144, -1566, -2615, 1189, 4714, -3830, -9010, 4665, 3456, -9551, 851, 8199, -2229, -293, 4347, 305, 443, -1867, -2470, 1978, -3338, -3689, 4097, -1155, -2038, 5647, -438, -1261, 5048, -2432, -3086, 3815, -3513, -4498, 3771, -438, -2590, 2368, 2011, 1688, -841, -1233, 4631, -2038, -6592, 5286, -11, -8019, 5308, 3396, -7600, 4458, 7241, -7679, -1514, 8224, -2323, -8173, 1948, 7164, -5734, -8535, 10924, 6572, -14466, 2606, 15329, -10482, -8091, 13346, -1738, -11675, 6316, 5724, -8247, -1230, 8171, -282, -7388, 4413, 6886, -9334, -3455, 11735, -5241, -10015, 11694, 1936, -11911, 7648, 7256, -10801, 288, 9341, -5830, -6773, 7034, 3327, -9225, -605, 11757, -4117, -10347, 12012]
633A2012o913k1489K0820Q894k7084Q054K1161j9002q651K1503j433j7768O816
646c080J3968j0937j1743J6037N025j9888O642J6500j6108m519J7818q506r609
659h400J3559j734j0581P832L510p683R25O185j712n770M168O042j0173q14J2265
674G619r020p750J5875l063j4005J3571N404j5156L934J1060q519o202P743L157
688D648q618j505J0743k926j0190J0778M232j3486N524R356j2764m44J0935p427
702a144m746Q050J68m945K155K930o82l439J812K987n043o4M514n266M79O553
718D319p154k01J0063o790o088J1535k152r964N661N243o820k523O144K638p069
733c158J00R999n314p953J0319L98j1647O847M882r389K473O231m565o22M269
$$ y = [12012, 5099, -16390, 4430, 13324, -13760, -5706, 15455, -3547, -12198, 9305, 7872, -9896, -3080, 10888, -49, -11792, 4245, 9270, -10618, -3976, 12524, -3584, -8103, 9715, 1209, -8400, 5159, 3425, -7156, 676, 4186, -3497, -2572, 3613, 1901, -3869, 299, 6341, -3832, -4646, 7619, -1401, -9151, 6724, 3661, -10344, 3227, 8631, -6525, -2591, 8469, -50, -6252, 1491, 4648, -3970, -5475, 5268, 2342, -7848, 2930, 7162, -6324, -800, 8556, -4208, -4652, 6283, -1144, -5890, 2160, 2328, -2617, -462, 2468, 1786, -1653, 159, 3146, -1897, -1961, 2553, -2713, -2234, 4319, -2835, -3036, 7027, 237, -5851, 5684, 3532, -6432, -771, 4472, -2348, -4871, 1273, 3911, -3158, -3058, 6941, 1627, -6326, 3993, 4391, -7256, -409, 4473, -4916, -2443, 3788, -777, -1399, 2870]
748B870j775j457J145r8j217j568K535l68m200N600K389q952N642P332j1773k5
764c920J1358q053p077J0019J709r340K432Q201k947p473O424O475j1196k007
778e395J2314o888r306J2124J281j0631O536O254p713p28N916k425m233J686L490
793B282l984l147P279m33o757O802L377r272M191N565r070l81P597n594l344O449
809A560M46m051J748L924j984m697M250K969q885J605Q738q526k941J1226k733
824B649q176Q507K621q624Q11N574l305m632L211M810n051k699R012j393q050
839d735P169K756r046K373M520o250M71M174k298K69K151j83m03l16Q19o17l270
856b416K392J286n732L679N200o951Q90P764o105l495O933j853n119K418K316
$$ y = [2870, 1095, -362, 783, 685, -532, -2100, 435, 67, -4133, 1467, 3856, -5096, 546, 7878, -3895, -3920, 7438, -615, -7692, 2327, 4036, -5304, -2872, 5329, 2382, -5091, 1333, 7808, -3388, -5395, 6919, 31, -9275, 2849, 4130, -6501, 35, 6289, -1424, -2152, 3764, 1339, -2894, -1208, 2282, -1702, -4849, 2430, 1997, -4760, 2042, 5419, -3853, 338, 5903, -3167, -3548, 4049, -1545, -4889, 1560, 2006, -2045, -297, 3627, 1643, -3054, 1196, 4165, -4720, -3115, 5623, -2903, -5844, 5382, 2649, -5527, 2980, 5601, -3023, -2212, 3362, 57, -4575, -1364, 3446, -1605, -4304, 4708, 3315, -4735, 2434, 5190, -3856, -1483, 3037, -3213, -2742, 1432, -866, -597, 1554, 1371, 968, 652, 1471, 854, -2416, -24, 1262, -4470, -791, 4409, -2542, -1652, 6112, 7, -3488, 3445, 1592, -3527, -1109, 1207]
871A207k179j936K989L423m002j422O636l684n081O350r25o030M400J505l840
886b589L050J182k034J958j09j475M83j048k58L92j464K102m6k916M930R36n897
903b803M279K366o881J680M245n009j069M184n33j714J053K226k70l301K082K192
919B727n530M85N269n020j122O570k840l175N406o35l859K174P97j960p40O20
935h33J783j898r68M211q59l347L950m42l942L521M8m402L169J647l976J977K361
952B000k450r7J738j47j836r92L199n09m829M294K893o515K127N616n448j843
968b799N762j833l566K562J376j937j470K057K022l291p1L954l056j864M190j564
984D72l183M343j021l094L690j95l051K340J003k188J38J189K44j546k05L386
$$ y = [1207, -972, -2908, 81, 3504, -498, -1920, 4716, 1032, -4049, 2301, 1376, -4654, -254, 1251, -2589, 461, 1643, -391, 1567, 1458, -17, 466, -582, -840, -448, -1912, 190, 144, -2772, 2158, 3094, -2803, 1476, 3842, -3039, -1359, 2886, -2123, -3192, 992, 459, -1255, -202, 2024, 1754, -1547, 535, 2727, -2803, -2318, 2951, -2069, -3191, 3379, 539, -2636, 2770, 2135, -1724, 450, 1247, -713, -1453, -833, 950, -948, -1916, 2295, 1436, -1911, 2039, 1597, -2345, 1176, 1224, -3178, -9, 1638, -2338, -361, 2000, -450, -547, 1191, 1044, -792, -1784, 1415, 906, -3923, 371, 3264, -3251, -1124, 4492, -956, -2799, 2963, 1130, -2436, 126, 1502, -435, -1905, 152, 2174, -1117, -1188, 2766, -290, -2154, 2036, 472, -2711, 1632, 611, -2483, 1207, 1012, -2039, 301, 1304, -884, -746, 443, 687, -859, -1064, 2322]
1000B322k027l468N327J64n915L376L721n943P12M552k692j696K471l7j415l64
1016i12J273L64k339J169K311l362N96L212k828o04L393k597j308L621k096k085
1032b192L203n68j999K020P27o95q27J101Q39l119J95L341l204j859N612j752
1048H23m520N641R84n994K772L516m445j308L610O1l326J205L712k208l237M900
1064B186R03o084K703L729o248M81N363m072j665M914j213k614K673J136l150
1079i58k87K927j075l981L375L086o054J003P286n635l863Q117j536p059M605
1094d9L431o109q7N598j878l881L222L842n152j896O973k958o370O530K167p890
1110d507L325N785n795o57N039k125l279K894J110l365n92M468j637m533M974
$$ y = [2322, 295, -3173, 2154, 2318, -3597, -221, 3500, -2443, -1731, 2821, 129, -1567, 904, 867, -548, -912, 361, 725, -1614, -445, 1866, -1496, -900, 2312, -516, -1120, 2273, -324, -1632, 1989, -107, -2192, 1011, 443, -1556, 464, 1191, 496, -331, 770, 1609, -1510, -1315, 2026, -1178, -3037, 2575, 823, -3697, 1944, 2928, -3066, -294, 3222, -1223, -2531, 1079, 1140, -2186, -981, 2731, 523, -2714, 2186, 3089, -2995, -292, 3437, -2811, -2330, 3033, -1039, -2704, 2210, 997, -1617, 1056, 2192, -958, -1245, 1682, 607, -3374, 1, 3087, -2967, -1964, 5322, -313, -4176, 3941, 2405, -4654, -49, 3382, -2727, -2814, 2784, 906, -2975, 247, 4089, -1063, -2959, 4014, 1056, -5314, 1216, 3383, -4507, -1182, 4603, -1192, -1849, 3190, 1065, -2214, 680, 1790, -1575, -2167, 2301, 664, -3869, 1105]
1125A105K807o883K034N746o142k198O999k731n116N498J636n008Q42M171j777
1140I83l037K670K591n294m36N266k937l678N818M37n574L793K491m659O76K890
1156B000k677r68J804L72j563j05K216l04k468K836P98m196K569J547m211J322
1172a028L098l573K0L555k332r24K788q65j556N39R09p73j466J516J921l636J221
1189e86L729l781j239M844k710l120L606K41l263J980J356j469M06L74P60r80
1205A48j36O97j127o60J929j469j435M004j034l396M505O85n345K367L313m928
1221a882m97M130j318k799J694L114k109k533M568K13n947L408L275o012J79N815
1237C299l898k392N433q40l765K923K093l764q47L106m98l757J927M024n021n25
$$ y = [1105, 3912, -2971, -937, 4809, -1333, -3531, 3468, 737, -4379, 1119, 2755, -2253, -1411, 2760, 983, -2054, 616, 3207, -2087, -2523, 2743, -194, -3872, 1946, 2383, -3191, 602, 3093, -1566, -890, 2000, -677, -1645, 159, 531, -1032, -1137, 1079, 775, -1693, 1143, 1941, -2255, 314, 1861, -2350, -1028, 2070, -1503, -1483, 2072, -260, -1184, 1604, 739, -817, -278, 631, -142, -1608, -92, 1829, -1807, -586, 3143, -638, -1877, 2967, 257, -2863, 743, 984, -2279, -299, 1057, -412, -6, 368, 1128, 148, 12, 709, -418, -1078, 851, -618, -2053, 1951, 917, -2479, 2026, 2711, -2634, -267, 3046, -1882, -2379, 1751, 433, -2366, -672, 2442, 333, -2200, 2368, 2581, -3366, 42, 3317, -2695, -2516, 3299, -599, -2991, 2442, 1602, -2163, 760, 2853, -911, -1758, 1348, 850, -2907, -980, 3044, -1977, -2502]
1253b502O422k791m620N955J79o247L215K669m318nL512r83k248K352J941k926
1269c95j178L884j595m544M969J106o139L305M337n597j46N796k784l566L869
1284A322O41l945O4L593j029l554L273K849n112P98N223m644k591N854k108l772
1300c138L748P07l528J781J969j185q74J031Q38k215k88K855k498j787L898m64
1316H50l652M171J061m539K450K530m007p8K201r22j259N90J302j78j803J909
1332F26J068k686R71J824k930J69K252k798M76K658k639O10K249k141j83J345
1348H71o84n60N72k25K22j164O63J475k014L6L137k809j129L486j735k127L010
1365A025q81j927K529J14j673O10Q18k54p31L03J151j610j042L086j247k833L943
$$ y = [-2502, 3920, 1129, -3491, 2464, 2643, -3604, -389, 2280, -2038, -2043, 1469, 486, -1762, 590, 2531, -395, -1573, 2311, 716, -3828, 1141, 2247, -3892, -587, 3750, -1847, -1993, 3803, 1019, -2547, 1322, 1963, -1982, -1918, 1675, 646, -2908, 365, 3214, -1898, -1100, 4123, -521, -3112, 2742, 634, -3138, 610, 1317, -2211, -430, 1539, 354, -520, 511, 1349, -866, -1154, 1701, -797, -2584, 1314, 850, -2802, 1369, 2430, -2109, 341, 2871, -1136, -1214, 987, 65, -1194, -604, 698, 520, -1283, 626, 1694, -992, -21, 1803, -1127, -958, 1294, -1504, -1028, 1630, -1009, -399, 1850, -291, -474, 871, 187, -373, 199, -26, 196, -968, -305, 1170, -844, -808, 2329, -480, -1609, 1877, 142, -1985, 1025, 144, -1783, 746, 860, -813, -203, 615, 361, -370, -67, 1084, -526, -1568, 1518, 271, -2562, 1381]
1382A381L14m100K986J303l500J511J480k018j74J539q14l57J13R80k30j677K214
1399I51N32l841K758K261m953Q16M518m099j156M374j315k739J887J451j920r15
1415a390J537J323k940J78L722k680j614L778r80k818K844l78k188J787L92j403
1431h30R77M92n84J63j84L55n47o57J741m59k472K740O87l111K109J565l003O23
1449c95J638j873J98O79p68N46n04L8J087q69r8J513j804J38J646k077J93J731
1467A019k010J42K230j807k68K032j556L19N03j249M18L29q59P48K18q15J503
1484H97n80n82J408j104j248K165j172j163K167p70j327K072j18j409J440l36
1500C40m67K31m45M12M9j240J532N42k069J625R74k399J304Q24j995P32N83j521
$$ y = [1381, 1695, -2405, 581, 1884, -1616, -105, 1375, -643, -817, 722, -92, -449, -336, 644, 414, -1263, 951, 1483, -2358, 400, 2661, -2292, -1476, 3042, -1057, -2213, 2161, 846, -1893, -6, 1445, -475, -1390, 147, 1470, -1470, -1292, 2430, -250, -1864, 1914, 934, -1884, 960, 582, -1606, 181, 573, -830, 147, 639, 55, 218, 34, 389, -158, -815, 926, 467, -2005, 735, 1422, -1689, 420, 1985, -1018, -395, 1243, -630, -432, 247, -521, 25, -479, -441, 646, -223, -321, 1192, -612, -474, 1172, -905, -712, 1019, -991, -849, 1381, -426, -694, 1338, -218, 101, 604, -645, -227, 102, -757, -9, 209, -606, 897, 317, -265, 1143, 39, -1209, 956, -216, -1379, 788, 18, -1309, 763, 645, -764, 676, 340, -127, 104, -341, 71, 120, -1120, 412, 954, -1115, 510, 1484, -915, 389, 1213, -782, -50, 533, -988]
1518i88O72R53j110M70N26l22N32j149K08J181j832Q4K121k241n24K751j368m27
1536d63J377n44m42M08j032R36j49j480J288Q90j782R01J265j191J73M09j083
1553e19Q98j038j9J449j142n87K016n44j140J584l77j015Q03m33l40K99o97O19
1571a83O35o73N37M61j167P34J06j325J030K81j977J672Q60k078P25J827j459
1588Fk15M61Nl93r76J032O77j761N18J872j514l50K234j358j204J680q98j089
1606a273J468l33p08P77K73K52n21k17J624j427j171K120q23k012K444P25k599
1623a401J410J119j114m70J378m25n88p11J134O6j866J136J437j926O43J990j935
1640a23n41J621j004r54R68j18j45K89m01J133n18m54J527r53j179J204K2j495
$$ y = [-988, -316, 637, -473, -3, 523, 201, 733, -416, -208, 973, -859, -775, 1346, -895, -1419, 1332, -36, -463, 914, 370, -72, 336, -696, 240, 91, -1389, -101, 789, -993, -92, 1173, -18, 155, 564, -519, 379, -659, -678, 771, -371, -958, 1058, 514, -626, 958, 581, -434, 369, -64, -404, -105, -802, -183, 452, -221, 316, 777, -390, 344, 450, -875, 155, 436, -1541, 131, 991, -1087, -362, 1465, 6, -209, 252, 257, -136, -1112, -80, 597, -1164, -646, 1226, -288, -638, 1596, 238, -966, 714, -184, -1273, 195, -138, -846, -69, 204, 456, -65, -282, 1342, -85, -1256, 864, 41, -1971, 473, 1198, -1401, 9, 1128, 14, -456, 922, 497, -91, -802, 332, 398, -1468, -332, 1105, -821, -178, 1812, -123, -664, 957, -47, -1001, -33, -151, -296, -7, -408, 725, 207, -247, 1280, 327, -852, 352, 374, -1121]
1658a121J231K08j336J134K64n86P37k18k39N17j210J84J056j423j53J623q62
1675a94k22J055j87m87N89o48K71m07p18Q92L45j210J559j09j186J421j36j390
1693g62J311J26j681P12Q34r49J15L27J80q7n57R96L80j766N04J508k492J39K076
1712I14j130q65J820l03p00P26j95k28m99K06N19q14J69J362j239o17K405r18
1730F13j621K078O9k394J183J187j891l03J350K68j116M81J146o10j548J705O53
1747A250k613R23J403j869n9K084j428j99J248l97o57J79M65k06p03L86N35r61
1765f19j17J708r73p89J849q03r80J366l56r27L96L28k60k42L47K52J44p65J267
1784H26r8j751J393J71j249N01L23o81N89L17o45Q67o55j57N22k55l88P53m31
$$ y = [-1121, 110, 318, -1018, 116, 380, -206, 531, 313, 74, 591, -619, -435, 621, -802, -955, 668, -194, -416, 639, 452, -35, 554, -94, 177, -230, -948, -56, 289, -921, 638, 529, -657, 764, 628, -762, 549, 675, -1006, -294, 540, -409, -294, 33, 213, 126, -431, 565, 945, -821, -317, 1191, -1301, -1162, 914, -216, -1081, 739, 436, -264, 462, 267, 39, -460, -254, 265, -549, -380, 982, -257, -874, 1531, 613, -1008, 1070, 1139, -1255, -72, 1115, -776, -1079, 271, 539, -577, -96, 1050, 440, -1108, 597, 1250, -1363, -440, 963, -906, -965, 1119, -309, -508, 740, 343, -314, -135, 330, 124, -579, -193, 342, -619, -736, 972, -1, -790, 1059, 256, -724, 642, 286, -641, -245, 83, -177, -419, -72, 180, 324, -441, 826, 728, -1023, 370, 541, -708, -207, 116, -565, 24, 341, -304, 563, -92, -249, 273, 18, -370, 383, -48]
1803d8m03P00l93j18P26o11J25O36p78J70K41o81K89N67j203O42O19j043P92O56
1823H85j363M04O45q31J55j38o1L98n42M72O56j017L0J219r81q13J376o34q78
1842a018J349j12o63M52L50n42R4J84K76l17p67Q76J61j436J217P97j798Q69J044
1861A016j247J5Q91q70k44M35j3j73j08K94Q76j408L25J357j539j91J291j036
1879c29p22J297k62o92J115M4l79K49k53K20j88q3o2k85m87J454l28j089J564
1898G84M15k087J326M54j153r5N94l67l04K27L82J05n18N09L87q57Q6Q22j372
1917f62J68R92j063N6J091o20j71N67k66K71K6o65J76m49m11R36J6q10J348K40
1937G70r66N72P9n20J51l26m37O40m50r6J170m95j5P77o44k48J78j80k21P5k54
$$ y = [-48, -451, 249, -144, -262, 464, -147, -22, 614, -164, 6, 247, -434, -145, 422, -781, -139, 480, -563, 229, 885, -478, -74, 571, -260, -105, -243, -304, 94, -448, 24, 680, -337, -307, 912, -69, -882, 494, -140, -1018, 331, 219, -444, 8, 358, -184, -90, 94, 370, 53, -714, 162, 323, -1113, 104, 901, -897, -28, 1016, -231, -216, 675, -195, -439, -4, -17, -190, -298, -4, 872, -536, -211, 1146, -393, -584, 707, -329, -1051, 246, -16, -708, 407, 451, 72, 321, 68, 288, 100, 17, -45, -330, -817, 637, 309, -780, 784, 1199, -888, 438, 892, -261, -356, 238, -129, -433, -206, 176, 281, -237, 272, 659, -198, -112, 710, -662, -494, 498, -565, -509, 582, -38, -209, 358, 92, 363, 389, -276, -100, -549, -960, -24, -8, -818, 530, 770, -196, 376, 455, -65, 86, -240, -677, -37, -487, -583, 587, 92, 77, 854, 210, -38, 140, -40, -261, -186, -440]
1958d40L8M95m74N00N18r10O07M25j030m8L24o67K25M02m78P09Q5k30N90o2o78
1979i9N68n24n39Q18r05r2R06l06j9R30n30k72N88l63l07Ll29J22k76R2P64J72
2001D02o50P94k3q64P16j62q59N49K8q73Q71L98l28N05k24K04q2m43Q0K73j363
2022a051N28N64o41J5J270l40n92J069m32n26K36k19k54n4l18O54Q0j01P54L0
2042F72p87Q03k96j078P46m4j025O84M06l50P22j81l7O00q45K56K26q85j17N88
2062E8n74QJ196o24M35K92o68K83J16j149K18K21p42O12N13n22O74K15k46J24
2082D40j71l20K42q66k33J055o52l73J781k33p40J000l76n93M18m75j48k52k19
2101g15N56J89k39P42l1l46Q52m11j771J253K35j593O45R76q51N62O75m11J9m7
$$ y = [-440, -402, 93, -381, 119, 637, -273, 334, 759, -271, -319, 5, -662, -437, -35, -513, 196, 281, 51, 641, 579, -99, 469, -55, -594, 224, -681, -773, 133, -173, -192, 738, 208, -64, 524, 161, -146, -143, -472, -350, -626, -534, 230, 402, -248, 546, 523, -341, 375, 213, -646, -97, -69, -942, -71, 327, -1, 504, 280, 484, 402, -41, 39, 312, -1051, -523, 41, -600, -585, 685, 345, -247, 822, 390, -136, 100, -119, -373, -427, -745, -91, -11, -112, 642, 672, -115, 688, 392, -686, 60, 16, -1009, -325, 81, -269, 453, 272, 235, 835, -10, 246, 472, -413, -530, 58, -516, -508, 688, 64, 499, 791, 123, 406, 522, -627, -409, -188, -930, -318, 195, -327, 347, 562, 316, 440, 269, -51, 191, -675, -908, 147, -505, -878, 903, 670, -70, 930, 554, -39, 379, -96, -244, -496, -715, -159, 30, -209, 533, 502, 156, 1008, 597, -1174, 79, 314, -1279, -634, 342, -509, 53, 728, 317, 336, 289]
2121B89J93k56j006L62P26j414L59J795j418N6J690j023n62P61l55r16K27j3K92
2140b13k09K46P99k61n32J226q00j265J492n62j452J285N00j095Q91N89l10M5
2158C74M45l72n37k75J20J41j082R74P76j159O63J165j217J84P18j044m41O26
2176E9n99k45M12J14M42j02K52M66n12m17R70r64j004J442p52n43J327n2k38M62
2196E18o4l23M57p84j13K17n33R7P16n07L06K06k55O09k47q42J135o30q59R76
2216H0Rp53O78L68o87O87K31l33p7k75j26J71n38L76M92r94J046M46j372J088
2236E17P91j662l4J144j331l3O59k28l96O06K83J31n57L92N02j361O0J393j570
2255f94m95J871q91o96J513l28o00R87j16p95j26N41r7r87J25J454o99p53J939
$$ y = [289, 482, 226, -780, -418, 308, -1106, -747, 1048, -370, -314, 1376, 353, -209, 552, 197, -719, -492, -505, -213, -422, -176, 623, 362, -170, 1056, 256, -1009, 483, -79, -1531, -246, 254, -841, 50, 639, 329, 374, 819, 447, -90, -365, -245, -104, -1186, -212, 564, -595, 68, 1233, 16, 200, 918, -126, -567, 59, -540, -785, -373, -259, 183, 81, 333, 799, 287, -130, 840, -124, -1128, 314, -438, -981, 346, 294, 56, 518, 454, 131, 588, -196, -309, -92, -625, -528, 188, -319, -13, 193, -62, 547, 300, -542, 593, -37, -896, 80, 89, -664, 14, 382, -305, 382, 613, 280, 203, -72, -198, -27, -565, -189, 303, -691, 355, 801, -571, 517, 1308, -354, -388, 756, -575, -608, 51, -177, -573, 33, 316, 447, -110, 282, 784, -577, -517, 876, -694, -1189, 682, -209, -905, 608, 280, -320, 667, 551, -244, -370, 171, 74, -913, -788, 666, -33, -786, 1153]
2274A153l21j794J600L04j975O96R67j254k69J018m8m05K97N00Jq23O99J59j535
2293a030M49J393j562k51K152j551J23J404n89j046O58J21n60n27R18J72j022
2310g48K88J471q74q08J672n91j599J702R4j544O98M27m12J5N26j22K88m23N05
2329E65l60p74P78m8j104R56N39q63K09J020p68o6M99p08m40O50J03o26LM56L56
2350C77r47Q35M50p39m7Q18j242j14N26n4l91Q45j55j97M11r3j85m6K04k60k64
2371b68J36j16J24l32P17J06q55J254k19p78O33j59o90J58J91r5J51Q9J87J8j86
2392F6K93l66k89N00K7p05L18N76o86L86L61o25J83O00m62o76L62l7n59J23L96
2413b14L65j12K19L48o68q6O22o63m54Q40m0r42Q50L03o93L60M89j93l66L3M03
$$ y = [1153, 832, -962, 638, 942, -1033, -337, 630, -624, -893, 125, 77, -328, -31, 469, 470, -353, 346, 505, -1030, -581, 812, -750, -1001, 1151, -400, -277, 1127, 538, -508, 150, 271, -289, -816, 102, 274, -748, -460, 1011, 137, -671, 1001, 410, -1189, 513, 607, -937, -239, 188, -224, -209, 317, 195, 483, 60, 565, 205, -569, 209, 161, -943, 13, 552, -311, -102, 918, 150, 84, 583, -125, -565, 85, 188, -438, -435, 21, 377, -570, 265, 715, -24, -71, 747, -495, -609, -83, -137, -528, 317, 162, -35, 376, 283, 98, 52, 256, -4, -268, -132, -248, -124, -456, 261, 367, -488, 766, 547, -231, 402, 243, -447, -289, -98, -193, -42, 47, 234, 252, 66, 359, -7, -296, 204, 231, -474, -156, 420, -266, 120, 481, -144, 39, 639, 177, -499, -137, -174, -733, -610, -214, 151, 39, 258, 606, -62, -148, 474, -189, -643, 197, 157, -785, 65, 368, -325, 35, 524, 331, -35, -2, 401]
2434D01p86j98R64n83n78J108J90r87O25R15j310k2P22p28k14L65R7m42L53O75
2454E67k93m95N52k3n08J5M01n60k28Q11l69l04J097j85n69N40K22r32j49N86
2474A76j13n67J98N39k27j93P09R7p98O68R7j020L64M86r37K77L78o5l18K79K99
2495C29Kj94j26K46m15L43k61k48P8L68l41J66M89j46k57K76k5m36r0j3P9q9K15
2518e0R5k02P9L94l4j91K75m86j87J3p4j04L66J44R5K01n4Rl72L79j64j83k60
2541c11J12m27PO41J69k65L95L06l16j62K38o67j34L62l70M00r9KO64n27O0M03
2563D81n31P4M3n46O7K41j18J34N66j62k65M15r1p1l02j01l27k07L48J57R2J66
2585F3J61K1k21M50o37j5K85m86p9j11M04K46k6M26r7k37P6m55K42k37j30K3l47
$$ y = [401, -385, -583, 381, -202, -780, 328, 518, -469, 156, 1071, -239, -261, 461, -267, -481, -116, -19, -461, -108, 567, 274, -221, 331, 308, -200, -185, 216, -344, -572, 239, -130, -434, 663, 478, -91, 449, 671, -261, -410, 176, 63, -504, -306, 233, 6, -187, 522, 619, -179, 489, 586, -434, -70, 416, -521, -244, 134, 69, -249, 30, 329, 331, 137, 11, 257, -158, 185, -76, -324, -246, 122, -219, -53, 436, 290, 33, 309, 284, -152, -242, -255, -176, -265, -50, 45, -157, -78, 316, 282, 91, 366, -120, -307, -294, -368, -472, -106, 38, 133, 334, 280, 289, -83, 296, 132, -51, -311, -199, -626, -619, 22, 191, -74, 321, 627, 311, 149, 387, -280, -414, -52, -422, -22, -121, -119, 545, 18, 78, 481, -50, 24, 67, -479, -412, -171, -289, -155, 411, 249, -16, 399, 308, 237, -65, -166, -493, -700, -352, -195, -103, 63, 224, 245, 24, 474, -163, -178, 107, -379, -458, -569, -165, 81, 55, 481, 384, 147, 223, -232, 10, -227, -357, -334, -681]
2608f81L57O15k13J83P9Nj10j61k66L1l1q1N2q6L58N7O3N0M4o4O4l94L5l69J61
2633c02k73K92N88j76J02K31j75j24o4j97j37j4k34M26k91K19K66J08J8koJ86
2655D41n93J2j94L1n2l24O39K23R2k05J24K6j74j53l6l80K04Q6n1k00O45P0J98
2678D29l22j7k01q6Q0k2r2j1j03M08Q3k14O31m44J32n8l11k08qP4J31Q1n4K32
2702A30J25J81j50q3k91j57M6m3K54np3L88o0l48L51kk32O3k28j60nk07K74k41
2726d73M16J96K5N9J8j18p0o9J99p07mL95K88n8M41r7j76J68n56J04k07n7r2M74
2750I9k37K57p5k1L13r4p8k02J6m30K53o5l1N7K23k00M99j0k07J46k7l99K07j59
2774a65k50L45j21J31k0L25o3J70k70j83j07L25k14j8NJ45j35N28l67R6j4RJ77
$$ y = [-681, -324, 291, 78, 261, 340, 345, 235, 74, -192, -161, -192, -273, -221, -307, 51, 108, 171, 221, 265, 201, 265, -129, -94, -463, -302, -575, -283, 305, 129, 231, 462, 287, 163, 99, -98, -235, -249, -483, -57, -348, -129, 137, 245, 263, 261, 255, 441, -152, -140, -334, -303, -355, -679, -40, 183, 275, 70, 194, 220, 46, -107, -143, -523, -319, -233, -284, -484, 161, 231, 429, 107, 90, -111, -197, -117, -139, -231, -242, -345, 63, 146, -68, 563, 119, 251, 193, -118, -326, -334, -260, -129, -48, -102, 130, 255, 436, 286, 203, -88, -245, -199, -242, 12, 7, -66, 322, 262, -86, 265, 263, 31, 94, -134, -294, -299, -506, -232, -473, -57, 139, 164, 223, 241, 123, 53, -16, 183, -524, -528, -133, 155, 97, 538, 441, 265, 433, -123, -19, -226, -283, -375, 99, -138, 119, 44, 23, 336, 242, 164, -38, -22, -452, -199, -264, -295, -238, -15, -215, 284, 274, 67, 213, 186, -213, -6, -165, -415, -70, -191, -60, -80, 245, 182, 352, 82, -101, -208, 117, -97, -115, -110, 35, -100, 428, 61, 157, 143, 152, 329]
2797C29o43L03j52k84L49K6K3K18j28P5J85j44j11j61r7k2m4J08K38r0m5l3K03
2820A03K28k54K50l07j30j4P8Q6k5q0L18l23M47N7k46m36L7R9r3L0k47M5N50K04
2844C77k23J56r9L1K3l54k5j4j54J22j69J45K48K26m6k88o2K47k13j85J1jJ50
2867i7j09J86K43j62K10r5j09J77l81j39K88j87r0K29o5L93l16L78k43l5J00k56
2889h0J6J02k93L30Q0l73J74J99k16K70j58O1n0j44k47o4L62j39j98P59k58j8
2911A15R2j73k33L79j13l57r8J38K61k30L14K49j51n7k77J21j00j01q6K48J2j49
2933a96L3QL55j78M6j11J39K4L3k87J81l37k5K36J42Q7j3J06k64o4J11r3o3J28
2957bp9l4j2O3J38j78J02K18n9l4l23r9K34O8L3J01k43J07P9O9k11J35Kj50j74
$$ y = [329, -314, -11, -163, -447, -98, -72, -49, 169, 41, 116, 301, 157, 46, -115, -212, -234, -278, -170, 68, -22, -67, -100, 103, 331, 77, 327, 20, -110, -124, -46, 40, 15, -65, 253, -70, 377, 434, 188, -248, -211, -112, -205, -175, -422, -377, 173, 377, 154, 310, 211, 242, 265, -89, -114, -128, -282, -160, -329, -184, 64, 290, 244, -44, -106, 141, -72, -257, -246, -247, -97, -206, -20, 223, 61, 271, 176, 67, 244, -137, -276, 12, -175, -265, -36, -101, 292, -24, 354, 111, 76, 176, -80, -64, 38, -255, 75, 155, -218, -44, 155, -61, 209, 51, 112, 62, -82, -329, -393, -31, -170, -368, 391, 133, 115, 207, 34, -199, 180, 67, -290, -388, -250, 11, -219, 95, 344, 193, 136, -141, -20, -120, -221, -307, -59, -47, -196, -163, -155, 200, 22, 68, -43, 96, 120, 153, -134, 47, -290, -315, -79, 63, 150, 137, 243, -21, -85, 26, -67, -130, -2, -81, -115, -127, -64, 74, -104, -2, 216, 157, 123, -200, -299, -65, 3, 36, 137, -106, 1, 80, 149, -62, 73, 75, -75, -249]
2982b49K49l79L94m6J20j18Q9K14j29l3k27K01j53q8J06J09j00J65k39K9J01l43
3004c27M17k31K95m04R9Q6O4P1R5j64l05O09m87J70J32j48q9j33K59j00m69N60
3026@l4N8J36N6n67N89k33k57J13j25K64j02K80r0M8r2K10q4l88M00J4o66M82
3049A2q0k37K47L44N5j95N6k96Po4Q7L0R9n4K72l63p5L29k17j21M92l10k00R5
3073h7j66K70k37K47R9l3k31L80j5j09k2J0k35M11m47o2M87o3l53M02Rl28J72
3096I9j45l9N5l04L60q7Q3Q0j18r8N75J04p96N69m2m05j26K66k68o0M84k27P6
3119C6K38j85L0o15M67K2n5j31J83k24K46J42J86l29M38k92l76O04n68Q8K0J48
3141G3l25L82r3L60n52l6N23m38o2L20K0o29N73Q6n43M65R4P9j18j78K72l56K4
$$ y = [-249, 0, -379, 15, -31, 89, -29, 60, 274, 145, 112, -115, 86, -67, -155, -49, 60, -40, 125, -114, -85, 16, -327, 90, -141, 154, -250, -151, -65, -1, 70, 165, 1, -304, 305, -182, -12, 120, -28, -117, -250, 9, -91, -560, 0, -34, 24, 160, 216, -351, 238, 5, -252, -139, -264, 0, -102, 178, 88, 136, 44, 254, 170, -218, 182, 196, -470, 12, -68, -305, -58, 286, 341, 146, 202, -94, -87, -151, -64, -34, 65, 11, 283, -80, -155, 174, -43, -164, 328, 18, -182, -87, -253, 17, -220, 27, 126, 93, -138, 242, 227, 118, 96, 106, -129, 282, -165, -227, 260, 197, -156, 246, 255, -73, 99, -46, -85, -30, -334, 26, -61, 22, 102, -16, -114, 461, 565, -231, 338, 296, -109, -235, 31, -237, -297, 187, -40, 36, 274, 89, 119, -496, -29, -7, -62, -193, -10, -234, 12, 154, 340, 11, 449, 157, -219, 385, -183, -95, -75, 73, -252, 130, 37, 397, -155, -191, 332, -106, -168, 152, 172, -457, 116, 202, -341, 124, 218, 297, 179, 1, 273, -83, -59]
3164e9J24m30k62R12P9o81O85ll28K67km03r0J54j68J30j34L63n11L56J94Mj1
3187A86l14N77p49j6L11k35j30P41m99m4L76j10k46R1K60o6l66o7L06l56J32J99
3209a9j1Q6L31J79p67K56M33o24P5P5k64j10N12j25L2O4r0p0K7Q5j74j7J77J20
3233A81m80JP27q08J26O06m38r3M00l38J32N7k67J71j91PM20r5k04J56j96k14
3255c40O29j84n42O78n5m33L60K13m16L94j66r1k88L72nP3o65M89K55n26M68j40
3277H0j12J2L96m93j45N67l16j93J75Q1m55K38P9L47o26J53O94o92m12Q15k12
3298a9r6M06l81p0K83j86j14J24m5RR6O3L4k92j30R64m01o55N07J20l14R9J08
3321A10k21r6M33j33l91M54J68k76p4K35q1m51K59L50p32K54O15m72j52M39j53
$$ y = [-59, 65, -365, -627, 285, 364, -317, 368, 365, 37, 304, 302, -101, -191, -37, -205, -75, -209, 154, -357, -1, 193, 197, 186, -128, 449, -300, -316, -5, -240, -370, 371, -128, -172, 204, 94, -152, -61, 199, 133, -233, -300, 6, -350, -218, -19, -30, 56, 387, 566, -201, 55, 488, -136, -61, 14, -250, -360, 152, 27, 59, 123, 33, -37, -10, 75, -99, -116, 61, 181, -299, -298, 429, -379, -253, 353, -85, -178, 222, -116, 16, 73, -194, -23, -214, -207, 213, 118, -86, 70, -126, -340, 289, 105, -437, 241, 186, -247, 113, 326, -90, 304, 138, 47, -241, 131, 126, 199, -466, 23, 278, -248, 220, 80, -32, -20, 376, -117, -262, 305, -11, -204, -29, 52, -403, -165, -86, 261, -365, -212, 482, -210, -622, 193, -19, -115, 291, -90, -160, 123, -63, -177, -53, -98, -89, 7, 70, 104, -188, -318, 646, 245, -410, 97, 217, -97, 2, 110, -111, -207, 226, 93, -298, 156, 324, 48, -26, 209, 128, -323, -64, 286, -446, -192, 423, -49, -201, 238, 85]
3342H5l00N47k80J43k09p4O7k96M12N07n70r5L66j21l80N07k61l89L39J18m99
3363c83M19j4K47m15M6J29R3j80K46j90l85O24m0m28l7O49l26Q7L21m15j18K47
3385A77l19l7K24k55R8R0p7K34j03k94O26k10m19P41n64l38J009p31j29K98L89
3406D10j06l29j32M38k49m27N03l7m26O01l25k20M28j1k37L47j13l79L93J17m37
3427a91OK55j58P1RJ17K01l77R6L98o96R9M58q86M20O75o04K62M19p68k56O02
3449A52j08L0q8J74k61j90K20K74k45j87Q80q96k80R06k81o58O75L03q78L83M54
3470C79m19Q7k6J80l80mM00k95m83N86L43j056Q83M10r25L89O14p31m23O66k66
3491g1j54LM27k62k00M91J06o47J02R82j082k16P53m75k81N11P8l82N43K7k63
$$ y = [85, -215, 332, 52, 195, -14, -88, -21, -317, 95, 602, 32, -63, 303, 182, -198, 309, 48, -341, -2, 116, -383, 36, 22, 269, -146, -100, 29, 122, -58, 188, -2, -387, 237, 197, -231, -268, 381, 55, 142, 463, 48, -70, 177, -142, -179, 45, -210, -112, -22, -99, 135, 32, -262, 364, 154, -265, 476, -88, -426, 583, -148, -277, 21, 410, 304, -25, -157, 281, 32, -395, 108, 71, -355, 246, -79, -299, 129, 118, -119, 228, 115, -264, 129, 246, -191, -185, 70, -88, -17, -8, 109, 310, -67, 29, 427, -269, -170, 288, -598, -178, 497, -107, 155, 574, -194, -450, 152, 44, 74, -14, 160, -101, -291, -71, 203, -42, -229, 651, -245, -525, 381, 100, -558, 117, 420, -458, -75, 379, -40, 47, 21, 201, -179, -183, 217, -78, -561, 25, 368, -688, 195, 605, -320, 69, 683, -48, -471, 195, -71, -225, -222, 205, -57, -257, 234, 340, -307, -205, 777, -305, -521, 232, -243, -524, -13, 65, -317, 226, 253, -10]
3512a0j65J45K89n97P7Q16o06m17R37m38p78J565l33p37L80J61n75L31mk72K48
3533A7n7M2K09l57M58J14o30K6N05r12L65J98q1j95L96L5Q2o6l00K83j28r0pj1
3557a04r3M11p00M16N62n94K33M22p19j7M22l96j8J53j59J28M17l18J75J42m33
3578g0J60R7k24q7j1j12J52M8k67P22j46q11R00l3p10M51l40m2K7K57j49L66k86
3601a08L65Ro31N77l9q48P45J28o28K34O39n50l0N32o53L10J71N3k18k62J6L27
3623A39l68K05K59l66j61P10m11k87N04j83p25O38J6k19j49L51K47j0j40M27l48
3644A29m89N28j35o23O08K5p00O22N97q29L05L13l14K13n45J33q2M2K63j64K3
3665h0J64J97l90L44L00m26k00K80m78l30R18m64j35N97j11j90L04l02q8J59q0
$$ y = [-10, -175, -30, 259, -338, -261, 555, -51, -468, 469, 31, -747, 818, 485, -252, 128, 289, -286, 45, 41, -231, 17, -40, 2, 211, -146, 312, 426, -204, -178, 327, -585, -220, -22, -103, -298, 98, 133, 215, 149, -151, 132, 4, -86, -93, -104, -197, 214, -486, -70, 492, -102, 131, 553, -166, -183, 239, -157, -175, -22, -181, -53, 364, 46, 221, 363, -70, 90, 187, -37, -124, -135, -247, -95, -47, -314, 408, 262, -549, 351, 318, -392, 59, -281, -323, -296, -39, -188, 178, -108, 257, 266, -365, 212, 173, -675, 70, 198, -430, -196, 443, -107, -137, 395, -258, 52, 223, 276, 58, -204, -188, 139, -229, -24, 235, -131, -292, 418, 7, -280, 224, 41, -684, -46, -30, -249, -398, -47, 200, 190, 50, 477, 129, -360, 168, 33, -590, 18, 43, -657, -35, 562, -267, 38, 351, 37, 250, -295, -162, -244, -202, 61, -103, -80, 84, 281, -109, 235, 535, 109, -91, 189, -289, -619, 299, -165, -300, 297, 186, -4, 300, -2, -90, 69, -11]
3686a1K70o21k81J214q27R0O85m58k76M18j0m96L82l42l38N61o7j70N09j74J71
3707B29l4l14K20j72j82J33P9o44O76J48n97N46M55o36K39J74n62K07k44M8K23
3728hj57K83K73p42M28N97q62o6M64p29L13M28o03k24Q23k93K41J99j20K30n86
3749a11J11J16k77k85P54m27j78R53m07o64P13k08l88M39k66m8qj0L41j67j57
3770a74L91j5k28M01j00p91M45L56o48K87K52l93R4M63k55J82j92nL5m66K45K23
3792A07n70L37N76m28J15N02o39j46N33m27l27N32O7p25O08j6q8J61Q7P7n24J22
3814f6P5k35k91O84l2o15Q46R1m81R5J77m45K84o5k21q2J30l7j6N6M09p9m82N10
3838B10k9m85J72M88q37M00L38n07Q0N89k66o4O9J03k33j55J79K36p98J34N58
$$ y = [-11, 259, -362, -643, 571, -256, -166, 519, 61, -215, 203, 193, -303, 79, -263, -601, -40, -107, -277, 232, 58, 229, 195, -119, 101, -71, -253, -120, -41, -685, -9, 139, -458, 88, 543, -93, 146, 320, -242, -35, -279, -231, -8, -165, 118, 391, -351, 77, 674, -188, -254, 210, -519, -206, 222, -381, -605, 218, -75, 166, 365, 245, 475, -111, 0, 116, -161, -446, 308, -119, -297, 656, 249, -415, 298, 90, -298, 141, -125, -173, -181, -191, 150, -17, -174, 217, 202, -26, 375, 275, -516, -71, 285, -363, -76, 176, -217, -123, 340, 85, 267, 75, 70, 105, -361, -116, 107, -463, -126, 450, 22, 137, 639, 0, -146, 387, -40, -367, 165, 232, -493, 115, 99, 11, 172, 259, 336, -188, -66, 9, -226, -517, 167, 135, -480, 366, 457, -24, 71, 248, -197, 87, 22, -199, -281, -151, -188, -204, -148, 261, 182, -300, 210, 181, -304, -132, 356, -481, -81, 257, -250, -170, 419, 153, 89, 158, 261, 28, -127, 52, 288, -510, -376, 182]
3859A82l49JO64m44l33O97n8q41M50P6m15M8L99j39J20p1N87n97k39O84m44k79
3881c01M05k79l53M41L61n47K50K87k24k34K17J43k71O5j03R8j78M74R8o86L40
3902CN71o61k2M15l55l22K82m3n6J57l8K40j80P6L57k87j77K85n80l9Q65n35m1
3925h5K61L37p62P98J67p40J70k96J05j06l36M78O9l87K09M59l96L36J46p66M04
3946F5J39n15j72O12p7J65p6K35j85j77J73m36p4J58J99l93J95K44j69k28Q64
3967E47n92k16N02m04k12J86J73j47J35K08k20M70n21M24L7m71M85o73r7M16p6
3988d6k60N47n9k59N61l32k36J71j4k58k54O4J23K40r3L45P1m36L85N10q79L23
4010B14j7m16J27J90j78m2K52K3p8Q1l3L04m63p9J97n39L16K56k40q7N50k32l66
$$ y = [182, -167, -166, 498, 54, -279, 418, 360, -481, -31, 45, -370, -322, 77, -62, 58, -13, 574, -23, -262, 422, -22, -301, 104, -175, -528, -87, 274, -273, -23, 264, 40, -194, 23, 166, -105, -40, -143, -45, -223, 251, 349, -337, 3, 574, -87, -109, 306, -49, -371, -89, -132, -188, -31, -69, 171, -9, 67, 424, 137, -40, 245, -335, -374, 491, -44, -85, 176, 513, -249, 549, 716, -24, 146, -150, -45, -151, -487, -9, 60, -327, -118, 341, -55, 281, 427, -339, 65, 204, -311, -483, 129, 52, 217, 141, 376, 191, 14, 187, -249, -323, -165, 34, -359, -164, 80, -89, -317, 547, -45, -261, 241, -163, -375, -189, -16, -163, -28, 180, -40, 430, -91, 333, 370, -101, 384, -289, -386, 30, -46, -306, 241, 182, -77, 484, 152, -84, 87, 73, -185, -439, -375, -252, -12, -105, 240, 311, -125, 260, 770, -109, 214, 197, -219, -92, 98, -80, -122, 130, 153, 75, 156, 123, 427, -36, -115, 82, -457, -141, 115, -125, -212, 338, 106, -260]
4033b60L44J56j47l29K80n38K12L31nj98j05O78j24j61J01l26j52N45j92n33L78
4054d5O2P4j6k2L37j86Q5J19m03r3p6K56l94K30N43l79m0L33l25k47M42j82m0
4077C3r3j73L10k16K43J20m01N47j05L3n49L03q2l94L94k9R6Rj55K40J64j78J47
4100B64j12m72M22k61j61J22J23j60M55J87j34O8q5K17n43J35n08O3J49K56l05
4121b80M16K8J09j13j10K72l90NM9j60n41P26p0o4OJ39J30J80r5P4k62l44J32
4144a63j03J54K11K56n12J36L61j03q1k5j39J04m67N2K66m0L23j30J40o4j04o8
4166DJ48m19k58M93l82M73l41M03ML81k16r6k65J62k02k07J26k11M76m24J28L74
4188A51l0J78j97r5j78K44j56k06K1OL56J6J33J03Jj97J4R5j74q9l72K78m7K19
$$ y = [-260, 84, 240, 93, -236, 44, -494, -282, 49, 44, -154, -259, 419, 295, 134, 235, -91, -243, 302, 110, -423, -45, 17, 91, 75, 53, 390, 204, 289, 408, 5, -88, -164, 92, -302, -72, 471, 92, 52, 385, 60, -187, 255, 73, 33, -60, -233, 77, -139, 104, 224, -177, 370, 265, 298, -251, 52, -30, -424, -30, -59, 37, 46, -109, 131, 295, 117, 264, 152, -320, 102, -159, -320, -198, -75, -235, 220, 407, 273, 341, 256, 473, -70, 65, -443, -380, -231, 25, -280, 136, 164, 273, 160, 50, 322, -68, -63, -14, -174, -715, 11, -59, -123, -117, 22, 152, 332, 237, 311, 49, -295, -163, -266, -112, 99, 355, -157, -21, 340, 237, 156, 131, -8, 96, -371, -319, -53, -93, 230, 100, 240, 176, 72, 4, 152, -267, -525, -32, -414, 59, -282, 121, 125, 506, 290, 194, -71, 91, -111, -318, -192, -403, 73, -351, -223, 151, 121, 299, 102, 7, -171, 73, -83, -289, -268, -262, 94, 110, 243, 346, 347, 150, 164, 259, 85, -4, -376, -98, -145, 74]
4212G4Jk0K50r1j82J84k09n7N6k34J14j6k31M17R2J08j5j96L6k52lj11j2J54K1
4237a22K06q7O2K51j64J01kj34j69n5n5Q6j64N2L06J86K3l15L63k48k38K61k17
4260g3j63J02j23K30K7J25j11J56q5K05l53j07K22j91J08o5J13mK22l11J39J24
4282A87j33J23j44k20k26K05J35Q3K99j0k02L0J51j37k85J33l57J15N7o7L91l4
4304I4J30K12l58R2j82l79N00m25P2R7o3p1L38j43J53L50j2j30l72N5n2J31m65
4327d28K15J83J62Rl70L23L81k40k41p4N7m31L79Q5j14o5L59J16k25K52k89J12
4349A56n5k31k85K8N22L2J03j76J7p2J98L6k66j46j34L49m54K31L63j03K7j4J13
4372B39J5J5j20j38m89L26J34j55K10J17q7kK06j40J9j41r3k45j22K30Q4J78J51
$$ y = [74, 75, 55, 305, 214, 32, 216, 7, -50, 6, -228, -114, -130, -361, 56, 148, 256, 241, 45, 81, -171, -174, -285, -297, -143, -122, 84, -3, 59, 310, 146, 247, 245, 111, -58, -113, -168, -82, -246, -194, 112, 298, 321, 6, 369, 121, -117, 144, -73, -236, -134, -257, -27, 0, 125, 14, 170, 85, 290, -63, -170, 52, -139, -31, -96, 17, 13, 235, -76, 63, 187, 54, 177, 33, -187, -413, -208, -73, 10, 309, 299, 97, 127, 278, 141, -144, -11, -368, -253, -196, -263, 128, 94, 224, 436, 78, 170, -12, -391, 109, -316, -244, -147, -210, -281, 57, -86, 67, 417, 405, 275, -97, -42, -94, 37, -428, -213, -30, 132, 141, -229, 94, 475, 235, -6, -80, -23, -454, -75, 10, -104, -169, 190, 306, 81, 333, 44, 156, 101, -130, -415, -387, 135, 167, 270, 94, 111, 39, 237, 273, 7, -139, -273, 76, -378, -147, 216, 113, 140, 126, 239, 254, 269, 149, 11, -478, -152, -18, -173, 37, 154, 67, 65, 271, 131, 150, 9, -84, -329, -451, -221, -137, 41, 192]
4395A92p3K20j61j5l1j25L5j09k96J39JL91n3j28L32m1j56J82m07j7l1j39K22
4418f8K89m28L26p1n9O7J21k55J39k23l1j81J19K44q1O1o6L08l8l30p1R2q2LK03
4443a2j19L6J41l1K12p5J46k44K14m3m77k3o7K44n1r6N86m25M03J0k11K55l90
4466a7l14J93k90J70K05j0M9p6J90J18r2k28Q2l0J15j40N4j86l5J10K1J79K41
4489C09j6m75J72k30J26P1k14K19j00K49O1Q7j60K36k87j08J33k33p1L33R8k61
4511f1J03K19l15J90K0j90O5k89K38l5j4L7q5L1p3L05l4j62J76l35j29L36j70
4534a72J13kL07l05J94PO3j59j3k2o0m5j54J47r5J29RJ56m0k70J85J73l98M0L34
4559A22j50j64K30l53M46O9l2K3j21j11J93j74k50L12k22J23j96K97l1J42j22
$$ y = [192, 119, 339, 178, 163, 132, 7, 42, -67, -363, -224, -223, 168, 115, -13, 319, 278, 122, 304, -103, -120, -151, -290, -68, 221, -207, 119, 48, -11, 56, 177, -78, 61, -162, -193, -374, -255, -11, -92, -31, -97, 211, 173, -157, -228, -136, -218, -215, -12, -131, -95, 46, 15, 227, 152, 298, 54, 268, 225, -252, -275, -342, -98, -149, -245, 341, -84, 319, 329, 118, 373, -17, -331, -138, -428, -258, -53, -63, -14, -90, 100, 218, 126, -102, -20, -50, 65, -75, -21, -207, -242, -132, -111, 68, 309, 293, -182, -10, -240, -114, -43, -257, -38, -138, 111, 172, 259, 99, 335, 48, -60, 73, -160, -231, 102, 200, -61, 42, 261, -54, 136, 156, -34, 31, -258, -20, -55, -69, -32, -117, -86, -159, 146, 112, -50, 126, -209, -338, -2, -172, -59, -61, 246, -59, 135, 142, 205, 46, 33, 11, -49, -94, -248, -101, -196, -67, -58, 98, 58, -212, -27, 146, -252, -212, 122, -28, -192, 38, -315, 131, 200, 168, 191, 70, -41, 152, -22, -272, 40, -182, -59, -255, 42, 11, 153, 31]
4580C1j31O8j21J74%l09J00k31M49L4l0l8j56J26K02j96L23m94k5K85K1K32m86
4603a72K76M5j62n2J21j43o8M73l95p9oJ86j10J89k0O2k61Q1J52j37j90M5J24
4626d1M6J12qj75j38L47j83MJ12j21j43J32L8j71K97k2J12l8O1j87l6o9J47l35
4650b59k05N70j54K41k10J17P8K06k43j67k5O1j18J14k98L93j80q6L02p5p9Q9
4672G2J04k90P6l7j52M32k21K0L3lk8K8l27O05j47k09J3J79ll80L52J84j95k1
4696H5j16K9L1k38L33l25j09L02J1J07J79j83j60J34r1l97N28j25j28K11j54j1
4718h7J54k5O8k97J04K10k64j97J81R9p2K58k11Q4r4N7J88m62L11j23l7L22k80
4741a13P3m7n0O5O2L66m71J30Q1Q5l61pJ62m2p8J11J0J25K81o19p7M71j24r4J08
$$ y = [31, -100, -32, -153, 21, 21, -288, -188, -419, 30, 64, 34, -4, -160, -34, 168, -28, 295, -199, -224, 61, 82, 314, -172, 104, 149, -13, -65, 56, -87, -155, 318, -77, -156, -162, 24, -86, 103, 83, 145, -116, -35, 117, -20, -210, -165, -41, 5, 117, 109, -66, -204, 143, -40, -36, 76, -45, -188, -56, -18, -189, 108, 86, 198, 160, 221, 34, -2, -71, 76, -259, -464, 106, -48, 193, -17, 100, 178, 384, 141, -26, -51, 10, -108, 6, -292, 101, -79, -165, 137, 62, -17, 72, 176, -114, -38, -75, -227, 205, -16, 4, 37, 34, 6, 34, -293, 312, 165, -44, -31, 148, 145, -235, 117, 301, 106, 85, -31, -2, 29, -209, 124, -201, -310, -8, 3, 110, 289, 106, -54, 80, -11, -408, 120, -5, -133, 78, -76, -87, 67, 42, 110, -187, -83, 127, -137, -334, -153, -54, -126, 132, -79, 5, -89, -32, 156, -306, 5, -118, -155, 167, -113, -40, -87, -137, -72, -10, 356, -115, 15, 96, 181, -180, -187, -25, -67, -145, -34, -24, 101, 382, -237, -314, 157, 33, -61, 47]
4766D7L9j73K06L6k68K05j95K08j20n0J6J16k58J93J77m92K36K86k04M5j71K73
4788A52k01j88J84J45k79M23l54J80J08j31j25J95P0J46m00J94k8q2OM6L3l10
4810b16K15K59l53j20K75l66M29j15j78N4K9R9k19M32o4j47o3m8M9L4l52L04k02
4833b64M58k88P2m7K01r8J20l15N4j92K77j2k18M03J20l0l51J80L0j31J0J72j58
4856gl60K74J70j95L4J43k34O4J62j12J40j95R2M9k86K19J88j79r3K95k12J55
4878A12K1m45R2J00Q9j82O0K15Q4j48J9J31j06Q3j31j20j0K02j57KL7J50l75N22
4902B45j94j26L67j06l01P8J30l12L91l99L40o1J26k05L43l80J33Qj98r3J67j93
4924b40K3L9K54j47P3j13kK13k45n5M7n5J35L2j43L69l39L37J47l35k84K44RJ80
$$ y = [47, 86, -87, 119, 155, -113, 92, -103, 105, -15, -65, -49, 67, -191, 2, 179, -313, -77, 209, 5, 50, -121, 152, -49, -237, -53, 92, -187, 236, -118, 62, 170, 39, -86, 109, 179, 325, -75, 119, 91, 9, 15, 61, 94, -216, -1, 258, -95, -215, 60, -306, 123, 8, -170, -116, -87, 12, -207, 225, 161, 14, -49, -97, -48, -14, -366, -62, -264, 194, -94, -22, -69, 132, 34, 154, -161, -107, -299, -22, -34, -252, 151, 271, 241, -110, 70, 100, -31, -21, 151, -7, -367, -93, 77, -118, -84, 59, -175, -111, 51, -61, 79, -116, -24, 25, -261, -42, 146, -33, -126, 169, -43, 112, 133, -312, -220, -120, -31, -213, -153, 62, 146, -2, 17, 148, 42, 125, -6, -126, -136, 66, -91, -89, -52, 98, -277, 245, 51, -75, 292, 186, -115, -37, 93, -219, 172, -227, 113, 52, 178, -27, 316, -64, 69, 77, -121, -214, -47, -240, -217, -178, 76, -71, 2, -111, -113, 100, -145, -200, -153, -208, -73, -41, -184, 185, -154, 183, 330, -5, -289, -45, -36, 144]
4948A44k78K64l40M50j26j11n8lj5K30k80K23Ll64n1L16ok15M21m1O8n2j52j06
4972g9J19m4j03J13Jr1j42L22r7J0L2pq7j82K82m00M4P42m47L2k9L4J87k62j47
4997a99J13K69j80o3L21k29qPj20J5j61L05j33K50p3j40P9l42M38j44L5J09m58
5020c09K14M45k00l34J57j30O0L7oL7l5K93j76Q9p0l11J69j6L2J11l6K92l40J93
5044A66j02l2j25L6Q5j92J71J67j31j60L96l56K74l9k22R4Q3j70MK57m55K18r3
5067a26J21J20k06K35m9q9J3k3J69m71K87l1J72j34k59M22k28J71p3J01mj10K8
5090C6o7k49O8j33K09J47K2j16J70J09j97J27l11J16k13J12J08J17k34M38m69
5111b10M97N1n09J91j66q8K13m3qR5k32M7J46r6p7K35J37k4j75j56M71m62J93
$$ y = [144, -134, 130, -210, 240, 114, 3, -55, -58, -73, 157, -123, 100, 103, -261, -312, 4, -2, -217, 204, 163, 231, 179, 27, -79, 40, -4, -107, 6, 7, -84, -226, 96, -1, 9, 41, 34, -53, -235, 47, -353, -309, 433, -14, 18, -11, 23, 210, -52, -199, -86, 183, 3, -60, 261, 32, 24, 31, -89, -74, -235, 70, -63, 187, 114, -26, 53, -289, 149, 5, 40, 149, -309, -95, 350, 150, -184, -27, -157, -97, -60, -66, -29, -64, 229, 53, 142, 72, -239, -70, -86, -54, 57, 21, 313, -27, 166, 64, 32, -93, -57, 28, -164, 7, 174, 43, -117, 279, -77, 197, 158, -64, 30, 113, -57, -53, 204, -251, -33, -126, -5, 115, -91, 144, 95, 6, 19, -4, 165, -306, -19, -50, 122, -12, -271, 151, -77, 94, 21, 122, 118, 8, 36, -31, -280, -212, -345, -136, 11, 33, -83, 87, 196, -1, 126, -185, -69, -282, -170, -62, 55, -179, 259, -210, 287, 338, -171, 20, -146, -234, -21, -64, -72, 23, -209, -162, -16, -112, -189, 46, 183, 159, -16, -172, 299, -163, 30]
5134C0J5R3p8k1n6k43K56M1j98J84PJ14j52J50J3l68M41k38J9J74l88L06j81j06
5158a86M14k92j74O1M49k23Q1n4k66J7OJ08j73K47K37J2l60r3L13j15l32J51J99
5181B7j8N5J47l04J48J23j47o4j71L42j46j40J69J5k4M3K7l76J55J62P3PP4j15
5205F2k28J48j18J1L5K88j85m4k8J26j31%K19j75o2qJ49J25p8m0k18J85jO4q8
5230HK43k16j64L42k16q4NK49k48k4j20K09%J46j89J65l9j22j41k2K21R8k04K93
5254A90l1j24M2J75k95J85k30l0L09j48l3M1j67K80p9j70N5OJ84k09pJ54n2l49
5278c03L68j58q6L65j98j29M08j28j33l9O6k9J03k35J91J58k00J74j55n6l6n9
5300a11J26j2p0J94l64K07K37k87j91N95k93j14p9L99k42L9R9r6K11k50nj3p9
$$ y = [30, 45, 138, 60, 39, -17, -260, -4, 37, -161, 23, 30, 144, -8, 142, 155, -213, 228, -10, 9, 183, -205, 101, -80, -186, 228, -64, -238, -177, 272, 49, 130, 76, -190, -173, -167, -59, -232, 15, 252, 264, -96, -189, 124, 9, -323, -172, 27, 9, 64, 211, -93, 55, 178, 31, -33, -204, 138, -8, -148, 21, 36, 12, 55, 82, -294, -139, 23, 96, 103, 177, 62, -166, -18, -136, -125, -90, 198, 13, -31, -59, 67, -64, -64, 155, -20, -82, -90, 59, 184, 106, 66, -152, 33, 32, 96, 8, 251, 35, -129, 213, -3, -87, -82, 167, -81, -105, -225, -16, -16, 130, -59, 106, 67, -55, -196, -218, 3, 101, -103, 190, 159, 35, 77, 252, -43, 142, -88, -118, 191, 43, 10, 51, -116, 164, 85, -85, -30, -24, 160, -49, -56, 98, 46, -303, 65, -93, -179, 186, -12, -141, 267, 139, 6, -33, 33, 4, 107, -128, 63, 221, 21, 195, 40, -16, -52, -111, 15, 3, -67, 127, -237, -30, 207, -80, -271, 324, 31, -83, -162, 237, -5, 34, 133, 37, 248, -2, -7, -20, -99]
5323i9J65j36r3K93k01j52R0M20l14N7J58j39j0K1L1j43N3J76l60K90j1lJ07j71
5347B9k15L15l6j08K55m8k07J03R0m4l72R2K69j59r0J21l1o2Q3r8K31m48N30p1
5371A29k48L71j58r3j7L35l21K1Q0q8K60k24J78k24n1M6p5j2J77j19K8J17l08
5394a96J67j7J05l9O7p1k15K63k47O5K48q2j83L4j0L05k1l21M94k75K4O4j85P3
5418D7j07k7LJ21K75k37Pj46K1N6K16l12n3J84j14K13k22K8Ml0l7K28OPm3l23
5444b35J1K16J42k12J81M1l7k97M76l32p3J22J07k39K27o3M9j18J99n19K80L69
5466B95m31K11k35m0J68J08j61K30j17R4O4j17l29L51r8n8K68m42J22J40j03J61
5488H1k43K97k59j04N13l62M8k91L08k17J90lj24M3K17j16j06L43j5l65L19l17
$$ y = [-99, 66, -70, -163, 130, -71, -223, -133, 287, -27, 30, 188, 49, 39, 60, 91, -52, 1, 177, -183, 107, 96, 93, 200, 29, -186, 129, 93, -15, 240, 192, -15, 88, 178, 134, -238, -146, 123, -36, -126, -5, -36, -98, -15, -113, 118, -330, 200, 129, -119, 252, 94, 1, -16, 319, -2, 19, 99, 11, 271, 47, 225, 1, -50, -4, -79, -91, 86, -33, -5, 112, -196, -29, -46, 59, 20, 87, 16, -199, 64, -183, -118, 130, 48, -135, -101, -111, 194, 173, -148, 346, 71, 95, 159, -26, 47, -60, -87, -84, 37, 312, 75, 82, -64, -43, 13, 229, -83, -136, 48, -66, 147, -75, -47, -43, -73, -110, 118, 124, 131, 88, -235, -224, -8, 134, -78, 103, 144, 107, -190, 286, -46, -119, 3, 110, -129, 98, 35, 84, -34, 165, -354, -74, 295, -136, 75, -160, -200, -32, 76, -85, 145, 28, 122, 186, 69, -260, 91, -7, -65, 203, -239, -117, 23, -80, 81, -162, 135, -124, -228, 285, -77, -29, -320, -12, -229, -39, -42, -166, -123, 94, -22, -128, 215, 200, -165, 154, -163]
5510a63J98J14J41m2k31j78K10p3k24K48Q0k95nK32J00o6O2Pj05J31j09l5l0M
5534b9Q7J2j5K7l8l68J81J61j77J07L3M6m9O3P4p0j77J25J70j12J50j34k96J95
$$ y = [-163, 35, 149, 290, 248, 17, -161, 49, -24, -248, 0, 80, -215, -220, 12, 112, 46, 108, 115, 10, 141, 32, -3, -33, -29, 58, 70, 55, 82, 44, -324, -143, 18, -159, -52, -19, 27, -22, 41, 115, 45, -132, -7, 163, 51, 201, 67, -229, -34]
$$ [...]
8191f9
##END NTUPLES=NMR FID
##END=
