##TITLE=1H_Pr Ox-base
 200.13Hz,CD3OD.
 8 sc
 
2.4.2026
##JCAMPDX= 6.0         $$ Bruker NMR JCAMP-DX V2.0
##DATA TYPE= NMR FID
##DATA CLASS= NTUPLES
##ORIGIN= UXNMR, Bruker Analytische Messtechnik GmbH
##OWNER= pz
$$ XWIN-NMR		Version 3.5
$$ Thu Apr  2 13:32:25 2026 Russian Standard Time (UT+4h)  she@DPX200
##.OBSERVE FREQUENCY= 200.1313
##.OBSERVE NUCLEUS= ^1H
##.DELAY= (6, 6)
##.ACQUISITION MODE= SIMULTANEOUS
##.ACQUISITION SCHEME= undefined
##.AVERAGES= 8
##.DIGITISER RES= 18
##SPECTROMETER/DATA SYSTEM= spect
##.PULSE SEQUENCE= zg30
##.SOLVENT NAME= DMSO
##.SHIFT REFERENCE= (INTERNAL, DMSO, 0, 14.3821)
##AUDIT TRAIL= $$ (NUMBER, WHEN, WHO, WHERE, WHAT)
$$ ##TITLE= Audit trail, XWIN-NMR		Version 3.5
$$ ##JCAMPDX= 5.01
$$ ##ORIGIN= Bruker BioSpin GmbH
$$ ##OWNER= she
$$ F:/spectra/data/she/nmr/H-C/1/audita.txt
$$ ##AUDIT TRAIL=  $$ (NUMBER, WHEN, WHO, WHERE, WHAT)
(   1,<2026-04-02 13:31:12.42 +0400>,<she>,<DPX200>,
      <created by zg, POWCHK disabled, PULCHK disabled
       configuration hash MD5:
       00 E9 B6 7A A2 85 ED C7 34 08 36 98 17 FE 4E 26
       data hash MD5: 16K
       5A EA AB 2C 9F D5 B4 ED 4F 5F F9 F9 C5 7C 69 70>)
$$ ##END=
$$ 
$$ hash MD5
$$ ED 81 FF 62 91 59 3F A5 23 41 FE 10 89 82 28 6E
##$RELAX= 
##$RELAX= 
##$RELAX= 
##$RELAX= 
##$RELAX= 
##$RELAX= 
$$ Bruker specific parameters
$$ --------------------------
##$DU= <F:/spectra>
##$EXPNO= 1
##$NAME= <H-C>
##$PROCNO= 1
##$TYPE= <nmr>
##$USER= <she>
##$AMP= (0..31)
100 100 100 100 100 100 100 100 100 100 100 100 100 100 100 100 100 100 
100 100 100 100 100 100 100 100 100 100 100 100 100 100 
##$AQSEQ= 0
##$AQ_mod= 1
##$AUNM= <au_zg>
##$AUTOPOS= <>
##$BF1= 200.13
##$BF2= 200.13
##$BF3= 200.13
##$BF4= 200.13
##$BF5= 200.13
##$BF6= 200.13
##$BF7= 200.13
##$BF8= 200.13
##$BYTORDA= 1
##$CFDGTYP= 0
##$CFRGTYP= 5
##$CHEMSTR= <none>
##$CNST= (0..31)
1 1 145 1 1 1 1 1 1 1 1 1 1 1 1 1 1 1 1 1 1 1 1 1 1 1 1 1 1 1 1 1 
##$CPDPRG= <>
##$CPDPRG1= <>
##$CPDPRG2= <>
##$CPDPRG3= <>
##$CPDPRG4= <mlev>
##$CPDPRG5= <mlev>
##$CPDPRG6= <mlev>
##$CPDPRG7= <mlev>
##$CPDPRG8= <mlev>
##$CPDPRGB= <>
##$CPDPRGT= <>
##$D= (0..31)
0 0.7 0 0 0 0 0 0 0 0 0 0.03 0 0 0 0 0 0 0 0 0 0 0 0 0 0 0 0 0 0 0 0 
##$DATE= 1775122271
##$DBL= (0..7)
120 120 120 120 120 120 120 120 
##$DBP= (0..7)
150 150 150 150 150 150 150 150 
##$DBP07= 0
##$DBPNAM0= <>
##$DBPNAM1= <>
##$DBPNAM2= <>
##$DBPNAM3= <>
##$DBPNAM4= <>
##$DBPNAM5= <>
##$DBPNAM6= <>
##$DBPNAM7= <>
##$DBPOAL= (0..7)
0.5 0.5 0.5 0.5 0.5 0.5 0.5 0.5 
##$DBPOFFS= (0..7)
0 0 0 0 0 0 0 0 
##$DE= 6
##$DECBNUC= <off>
##$DECIM= 32
##$DECNUC= <off>
##$DECSTAT= 4
##$DIGMOD= 1
##$DIGTYP= 9
##$DL= (0..7)
0 120 120 120 120 120 120 120 
##$DP= (0..7)
150 150 150 150 150 150 150 150 
##$DP07= 0
##$DPNAME0= <>
##$DPNAME1= <>
##$DPNAME2= <>
##$DPNAME3= <>
##$DPNAME4= <>
##$DPNAME5= <>
##$DPNAME6= <>
##$DPNAME7= <>
##$DPOAL= (0..7)
0.5 0.5 0.5 0.5 0.5 0.5 0.5 0.5 
##$DPOFFS= (0..7)
0 0 0 0 0 0 0 0 
##$DQDMODE= 0
##$DR= 18
##$DS= 0
##$DSLIST= <SSSSSSSSSSSSSSS>
$$ [...]
##$SUBNAM0= <"">
##$SUBNAM1= <"">
##$SUBNAM2= <"">
##$SUBNAM3= <"">
##$SUBNAM4= <"">
##$SUBNAM5= <"">
##$SUBNAM6= <"">
##$SUBNAM7= <"">
##$SUBNAM8= <"">
##$SUBNAM9= <"">
##$SW= 18.0517328524113
##$SWIBOX= (0..15)
0 0 2 0 0 0 0 0 0 0 0 0 0 0 0 0 
##$SW_h= 3612.71676300578
##$TD= 16384
##$TD0= 1
##$TE= 0
##$TE2= 300
##$TE3= 300
##$TEG= 300
##$TL= (0..7)
0 120 120 120 120 120 120 120 
##$TP= (0..7)
150 150 150 150 150 150 150 150 
##$TP07= 0
##$TPNAME0= <>
##$TPNAME1= <>
##$TPNAME2= <>
##$TPNAME3= <>
##$TPNAME4= <>
##$TPNAME5= <>
##$TPNAME6= <>
##$TPNAME7= <>
##$TPOAL= (0..7)
0.5 0.5 0.5 0.5 0.5 0.5 0.5 0.5 
##$TPOFFS= (0..7)
0 0 0 0 0 0 0 0 
##$TUNHIN= 0
##$TUNHOUT= 0
##$TUNXOUT= 0
##$USERA1= <user>
##$USERA2= <user>
##$USERA3= <user>
##$USERA4= <user>
##$USERA5= <user>
##$V9= 5
##$VALIST= <valist>
##$VCLIST= <CCCCCCCCCCCCCCC>
##$VD= 0
##$VDLIST= <DDDDDDDDDDDDDDD>
##$VPLIST= <PPPPPPPPPPPPPPP>
##$VTLIST= <TTTTTTTTTTTTTTT>
##$WBST= 1024
##$WBSW= 4
##$XGAIN= (0..3)
0 0 0 0 
##$XL= 0
##$YL= 0
##$YMAX_a= 593031
##$YMIN_a= -822282
##$ZGOPTNS= <>
##$ZL1= 120
##$ZL2= 120
##$ZL3= 120
##$ZL4= 120
##$ABSF1= 10
##$ABSF2= 0
##$ABSG= 5
##$ABSL= 3
##$ALPHA= 0
##$AQORDER= 0
##$ASSFAC= 0
##$ASSFACI= 0
##$ASSFACX= 0
##$ASSWID= 0
##$AUNMP= <proc_1d>
##$AZFE= 0.1
##$AZFW= 0.1
##$BCFW= 1
##$BC_mod= 2
##$BYTORDP= 1
##$COROFFS= 0
##$CY= -3
##$DATMOD= 1
##$DC= 2
##$DFILT= <>
##$DTYPP= 0
##$F1P= 0
##$F2P= 0
##$FCOR= 0.5
##$FTSIZE= 0
##$FT_mod= 4
##$GAMMA= 1
##$GB= 0.15
##$INTBC= 1
##$INTSCL= 1
##$ISEN= 128
##$LB= 0.25
##$LEV0= 0
##$LPBIN= 0
##$MAXI= 10000
##$MC2= 0
##$MEAN= 0
##$ME_mod= 0
##$MI= 1.114404
##$NCOEF= 0
##$NC_proc= 0
##$NLEV= 6
##$NOISF1= 3.799351
##$NOISF2= 2.8
##$NSP= 1
##$NTH_PI= 0
##$NZP= 0
##$OFFSET= 14.38212
##$PC= 1
##$PHC0= -3704.942
##$PHC1= -1.007697
##$PH_mod= 1
##$PKNL= yes
##$PPARMOD= 0
##$PSCAL= 0
##$PSIGN= 0
##$REVERSE= no
##$SF= 200.129724274929
##$SI= 16384
##$SIGF1= 3
##$SIGF2= 2
##$SINO= 400
##$SIOLD= 16384
##$SREGLST= <1H.CDCl3>
##$SSB= 0
##$STSI= 0
##$STSR= 0
##$SW_p= 3205.1282051282
##$SYMM= 0
##$S_DEV= 0
##$TDeff= 0
##$TDoff= 0
##$TI= <>
##$TILT= no
##$TM1= 0
##$TM2= 0
##$TOPLEV= 0
##$USERP1= <user>
##$USERP2= <user>
##$USERP3= <user>
##$USERP4= <user>
##$USERP5= <user>
##$WDW= 1
##$XDIM= 8192
##$YMAX_p= 0
##$YMIN_p= 0
$$ End of Bruker specific parameters
$$ ---------------------------------
##NTUPLES= NMR FID
##VAR_NAME=  TIME,          FID/REAL,        FID/IMAG
##SYMBOL=    X,             R,               I
##VAR_TYPE=  INDEPENDENT,   DEPENDENT,       DEPENDENT
##VAR_FORM=  AFFN,          ASDF,            ASDF
##VAR_DIM=   8192,          8192,            8192
##UNITS=     SECONDS,       ARBITRARY UNITS, ARBITRARY UNITS
##FACTOR=    0.0002768,     1,               1
##FIRST=     0,             0,               0
##LAST=      2.2672688,     0,               0
##MIN=       0,             -822282,         0
##MAX=       2.2672688,     593031,          0
$$ Real data points
##PAGE= N=1
##DATA TABLE= (X++(R..R)), XYDATA
0 0 0 0 0 0 0 0 0 0 0 0 0 -8 8 -8 8 -8 8 -16 16 -16 24 -24 32 -40 45 -53 61 -69 79 -93 105 -117 133 -151
34 -151 170 -194 216 -241 268 -299 333 -367 409 -450 500 -551 605 -669 737 -813 894 -985
52 -985 1088 -1201 1329 -1474 1640 -1834 2060 -2331 2659 -3073 3604 -4318 5334 -6883 9541
67 9541 -14982 30729 -178161 -822282 -800666 -331847 171065 342699 228594 42853 27122
78 27122 145991 247939 205072 20058 -271711 -504769 -481065 -155759 237943 431114 334692
89 334692 114460 -8112 27417 56919 -68322 -282363 -371459 -237951 17572 221616 283814
100 283814 219471 118519 50845 12007 -45219 -134489 -237869 -301557 -231720 13194 309488
111 309488 446138 318523 19320 -236184 -270843 -107473 46342 34498 -90654 -167682
121 -167682 -98119 88985 266037 299656 165334 -41100 -199734 -241314 -166834 -50368 15997
132 15997 19188 30709 100751 182928 185474 73182 -86420 -182816 -163333 -82041 -30493 -27902
144 -27902 -15456 53383 151798 210406 168597 17840 -163478 -252673 -189296 -29161 106628
155 106628 121462 24566 -62317 -26803 101268 186487 136820 -24019 -188192 -244606 -164581
166 -164581 -19560 98709 148639 133098 79490 32664 11950 -10387 -61666 -118867 -133037
177 -133037 -85328 1253 73097 92677 77377 73697 85954 67091 -11972 -121904 -196066 -179305
189 -179305 -62397 89884 178483 155491 58048 -33891 -52136 6406 59348 14344 -117210
200 -117210 -219386 -183656 -5346 208040 302039 204647 -1449 -158759 -178793 -89104 8059
211 8059 21844 -42222 -86298 -30473 97447 197693 185766 56775 -105423 -188995 -152280
222 -152280 -52815 22275 34499 10971 12909 71100 138274 131042 24160 -112914 -183001 -144705
234 -144705 -37549 53293 71637 39916 21592 46085 86106 91049 27929 -85114 -175217 -168735
246 -168735 -63654 67587 141105 122700 45995 -14895 -16839 11708 13427 -32365 -93911 -119980
258 -119980 -73487 27031 115387 133221 80884 6156 -40302 -44293 -30556 -35614 -60958 -69370
270 -69370 -31365 39011 98866 108684 60584 -11733 -56760 -51812 -23361 -12189 -32881 -58179
282 -58179 -44271 25083 105971 128195 68229 -28747 -93124 -88612 -34066 14776 16321 -16938
294 -16938 -34818 -4732 56856 101102 83690 5514 -76857 -102247 -64334 -7091 24949 21331
306 21331 5769 8707 36509 59709 48283 4807 -45779 -76681 -68632 -27541 15171 33094
318 33094 29341 23663 29937 42773 39449 2378 -53615 -86546 -71242 -21387 28845 53357 45551
331 45551 24603 14840 18802 17141 -3207 -38538 -70944 -73991 -33197 30100 73987 74127 39637
344 39637 -668 -19934 -13754 -6705 -22193 -50705 -61219 -33973 22460 76826 91235 54516
356 54516 -3791 -42768 -48448 -33958 -20551 -21390 -26644 -12169 27039 65911 73674 43198 -8269
369 -8269 -51144 -61956 -43343 -19555 -5292 3583 15593 31783 45986 46813 25763 -10393 -41881
382 -41881 -56287 -49497 -25004 5495 26393 34297 36826 35882 24801 3637 -22027 -44448 -51317
395 -51317 -37108 -10435 16209 36518 45427 36994 15285 -4915 -17877 -25499 -28682 -27927 -22440
408 -22440 -7557 16452 36090 39302 27991 8675 -12277 -25900 -25474 -18460 -14335 -11659 -4079
421 -4079 10132 29495 41951 33702 5662 -23521 -36591 -33177 -19797 -3041 9580 14097 16311
434 16311 17620 15862 11038 3381 -10299 -25374 -28474 -16516 226 12421 16001 11105 5073 6274
448 6274 11591 9808 -1058 -16023 -28380 -28639 -12013 11860 26768 25902 14023 1753 -2458 779
462 779 -1041 -14449 -29108 -27044 -6394 19463 33963 26198 4242 -12582 -11143 1305 7894
475 7894 -964 -19952 -31923 -20597 10354 36595 36458 14437 -9065 -16850 -7211 3843 -1220
488 -1220 -21329 -34758 -22836 12165 47354 56559 28932 -16278 -43693 -36765 -8881 11103 8086
501 8086 -10101 -17480 471 31386 46379 29029 -9344 -41886 -46409 -20342 12257 23381 8132
514 8132 -12225 -12817 11788 41559 45047 10336 -40696 -66542 -49083 -2676 38120 45684 20194
527 20194 -7283 -8902 9962 22062 9084 -24845 -54096 -49677 -6912 42931 62686 40947
539 40947 -4151 -37113 -29683 4976 23331 2679 -33165 -44809 -16262 31345 57301 40857
551 40857 556 -27831 -29402 -12688 3781 6116 -9974 -26988 -18883 17030 54329 58260 16592
564 16592 -42114 -67595 -38742 12082 36288 20076 -9893 -19894 682 31492 38605 12161
576 12161 -26958 -48300 -38139 -3530 31339 38683 14328 -15893 -23477 -3571 24697 30343 1337
589 1337 -38042 -47405 -16369 26176 42981 22407 -11192 -22520 -3351 19344 16976 -8914 -32902
602 -32902 -33102 -6538 27917 44478 28194 -9306 -39717 -35206 2654 38098 34176 -8454 -46374
615 -46374 -37814 9737 49718 43375 -2420 -42286 -40754 -2653 33860 37451 6225 -31376 -43127
628 -43127 -16949 27009 49828 28599 -18482 -48169 -31359 15959 47198 29568 -20694 -52220
640 -52220 -32250 20700 55962 39523 -13249 -52980 -42431 7431 49866 45430 -1452 -50096
652 -50096 -58811 -15727 44897 71906 38444 -27460 -68905 -49571 13001 58885 43322 -15825
664 -15825 -56784 -39812 16608 59520 50164 -1596 -49577 -54066 -16438 28177 44634 19983
676 19983 -22773 -40041 -11332 35570 51480 15875 -41067 -65340 -29475 32524 59706 28505
688 28505 -25877 -49089 -20020 32499 57863 27688 -33684 -72573 -53955 8812 68380 73564
700 73564 18179 -49972 -69090 -24455 39519 62285 21776 -43928 -70765 -30896 37862 73552
712 73552 48495 -12314 -56562 -49991 -3963 35744 34153 -1014 -33742 -30940 7042 45623 44455
725 44455 384 -44565 -50071 -12056 32855 41710 7299 -32762 -35824 1664 42651 47239 7549
738 7549 -44024 -61396 -27564 28565 58781 38653 -12634 -49569 -38400 10030 48624 40743
750 40743 -6932 -50697 -50126 -5505 42744 51863 16957 -26732 -39953 -15562 18683 29715 7752
763 7752 -23074 -31387 -6982 27158 38196 13871 -25284 -43018 -19743 24661 46250 22371
775 22371 -25829 -51467 -28526 23269 55550 38178 -13984 -53765 -46602 798 47071 53647
787 53647 13486 -39668 -59250 -26676 29939 60238 37964 -16814 -55171 -42985 6023 45382
799 45382 41605 3235 -34036 -39635 -11438 22885 34028 15621 -11433 -23820 -13058 8203
811 8203 17472 4693 -14866 -18658 -1661 20332 26301 7997 -18762 -28663 -11938 13525 23600
824 23600 10399 -12840 -24366 -10868 16623 31668 19091 -10520 -33643 -30478 -2385 26583
836 26583 30434 8000 -18571 -25406 -7131 17947 26364 8555 -17819 -28557 -15902 7111 22180
849 22180 18730 2391 -10306 -8627 1044 6213 550 -10905 -17004 -6895 13766 26842 18324
862 18324 -5109 -23761 -22513 -1952 18720 19153 -102 -19222 -19230 -773 20500 25869 9642 -15064
876 -15064 -26877 -17334 4521 20376 17384 -790 -15815 -13202 3009 16491 14095 -1264 -16311
889 -16311 -17171 -4965 9365 14025 7816 -1531 -5693 -2547 2805 2679 -5314 -11703 -7223 6678 17833
904 17833 15163 -1596 -18337 -19502 -3151 15555 19973 7282 -12246 -21720 -11883 10089 23976
917 23976 15771 -6684 -24146 -19464 2709 22316 20593 722 -18395 -19890 -4262 14365 19924
930 19924 8067 -11379 -21432 -12877 8052 23178 18598 -3129 -22040 -20106 -224 16518 15136
943 15136 133 -12407 -10224 3590 14410 10749 -3574 -16484 -17145 -4604 13252 21430 12516
956 12516 -6229 -18342 -13771 3107 15725 11614 -5591 -17718 -12267 5005 18430 16517 656
969 656 -14600 -15633 -3678 8749 11049 1353 -10023 -11507 -544 14159 17876 6673 -10643
982 -10643 -20338 -14285 2131 14331 12801 1271 -8446 -6326 3675 10717 6640 -7135 -16975 -13040
996 -13040 1556 14441 15998 5882 -7298 -12411 -5827 4870 9650 3229 -7857 -13368 -6213
1009 -6213 8453 16917 11037 -3010 -12498 -10461 -928 6675 5219 -2628 -8310 -5914 4399 13536
1023 13536 14288 2012 -14005 -19759 -9483 7078 15836 10373 -2362 -9867 -5922 3921 9299 5786
1037 5786 -3828 -12211 -12122 -2068 11753 16241 7206 -7051 -14167 -7867 5658 11854 4665 -7689
1051 -7689 -12375 -6027 6056 14327 11485 -1330 -12386 -12161 -2331 8071 9498 967 -8100 -7216
1065 -7216 2090 10028 9130 931 -8858 -12938 -7749 3267 12171 11994 2591 -9116 -11949 -3160 7716
1080 7716 9589 1622 -7560 -9601 -3227 6102 10534 6174 -2869 -8887 -7667 -431 6347 5926 -848
1095 -848 -5572 -2678 2948 5680 2670 -2712 -5766 -3717 416 3054 2977 1070 -2033 -2864 463 5156
1111 5156 4619 -1659 -9649 -9651 -671 10025 12919 5250 -6255 -12016 -7191 2948 9629 6743 -3058
1126 -3058 -9994 -7234 3205 11524 9994 15 -9798 -11652 -4537 5391 9813 5924 -2167 -7076 -4986
1141 -4986 2051 6954 4621 -2973 -7562 -4973 1286 5126 4540 631 -1924 -1725 301 1628 691 -2152
1157 -2152 -5042 -4019 1892 7598 6632 3 -6096 -5834 -438 4496 3080 -2419 -5362 -2378 3421
1172 3421 6792 5314 -718 -7014 -7852 -1949 5115 7535 2982 -4381 -7841 -2393 6254 8812 2502
1187 2502 -5979 -9782 -5022 4665 10252 6265 -3336 -9421 -7124 1658 10312 9498 -352 -10377 -11673
1202 -11673 -3530 7664 13144 7519 -4281 -12152 -8951 1121 9831 9745 349 -9020 -9399 -911 7921
1217 7921 9422 2582 -6371 -9542 -4155 4564 8591 5222 -1889 -6953 -5801 -112 4993 4505 694
1232 694 -2553 -3180 -497 2487 2505 -533 -3282 -2755 378 3781 4629 892 -4356 -5053 -1097 3404 4521
1249 4521 1169 -3121 -4146 -556 3013 3087 640 -2109 -2201 -368 1812 1962 -59 -2616 -3767 -970
1265 -970 3373 6024 2966 -2920 -6995 -4304 2171 5973 3239 -2459 -4939 -1786 3358 5696 3037
1280 3037 -2450 -6800 -5908 -1377 4587 7910 5083 -1676 -6876 -6112 -422 4491 5175 1666 -3001 -4131
1296 -4131 -2063 894 2416 2577 1212 -110 -855 -1759 -2597 -2320 342 3012 4028 2885 -482 -3935
1312 -3935 -4583 -1241 3037 4911 2856 -3046 -7586 -4742 4310 10710 7915 -2088 -11152 -11863 -2699
1327 -2699 7786 11426 7815 -472 -8249 -10774 -4904 5453 11391 7207 -3342 -10805 -8223 2064
1341 2064 8815 6835 123 -4215 -4136 -1915 8 952 1294 1752 1120 -491 -461 348 -190 -1848 -1504 898
1359 898 2665 1009 -1864 -3383 -665 3880 5496 1957 -3791 -6920 -5646 -227 5853 8409 5539
1374 5539 -1209 -7152 -8049 -3486 3182 7002 5667 1047 -4200 -6402 -4139 1342 5398 5824 3036
1389 3036 -2365 -6881 -7428 -2653 4957 10319 8340 -1208 -10061 -10591 -2239 7433 10137 4197 -4525
1404 -4525 -9120 -6750 763 8138 10570 4729 -6538 -13761 -10198 2094 12530 12366 2082 -7805
1418 -7805 -9436 -3868 2047 4119 2282 806 674 433 -1186 -2854 -2880 -635 2907 5678 4847 -1004
1434 -1004 -7969 -10069 -3577 8122 14448 9189 -4553 -15847 -13979 254 14627 16988 4077
1447 4077 -13006 -18847 -8073 10381 20075 12670 -5856 -19660 -17083 -911 15577 19522 8339
1460 8339 -9256 -18830 -12202 3803 14955 11914 -1028 -10728 -8919 1102 7759 4903 -2592 -5909
1474 -5909 -2534 3431 6296 2876 -3979 -7995 -4748 3819 10388 8016 -3239 -13166 -10973 2401
1488 2401 14086 12346 -832 -12943 -12779 -1116 11024 13288 4061 -8193 -13764 -7993 5244
1501 5244 14403 11170 -1883 -13315 -12686 -1236 9649 10582 2118 -6064 -6184 -602 4017 2972 -1848
1516 -1848 -5517 -3100 3638 8101 5245 -3353 -10150 -8069 2076 11462 11001 -873 -12218 -13010 -1555
1531 -1555 11864 15125 4804 -9922 -15732 -7726 6905 15155 9783 -4681 -14750 -11147 2882
1544 2882 14215 13079 651 -12108 -14425 -4651 7909 12596 6397 -3658 -8692 -4496 3162 6146
1558 6146 2055 -4739 -6063 -740 5939 7771 1925 -5898 -8461 -3104 5567 9207 3790 -6054 -11315
1573 -11315 -5667 6310 13346 7944 -5195 -13877 -9668 2900 12207 9771 -1885 -11420 -10171 545
1587 545 11068 12387 3114 -9455 -14680 -7605 5680 14183 9855 -2328 -11226 -8419 2030 9323
1601 9323 6630 -2379 -9008 -7112 1466 8324 8676 1788 -6453 -9209 -3622 5491 9048 3415 -5892
1616 -5892 -9374 -2629 6884 9586 3123 -5718 -8289 -3274 3308 6211 3319 -1992 -5144 -3176 2655
1631 2655 6740 4959 -2273 -8215 -7205 386 7539 7308 526 -5298 -4817 624 4865 4029 -908 -6172
1647 -6172 -5645 614 6519 7093 1398 -5612 -7252 -1923 4841 5997 1073 -5030 -6538 -1748 5349
1662 5349 8110 3502 -4595 -8828 -5322 2733 8120 5249 -3033 -7904 -4480 3604 8185 5281 -2097
1677 -2097 -8064 -7293 -964 5868 7559 3592 -3853 -7181 -3476 4276 6947 2166 -5450 -7833 -2836
1692 -2836 5017 8321 4000 -3176 -6454 -4016 917 4770 3604 -1425 -5373 -3562 2217 6587 5032
1707 5032 -1681 -7102 -6155 476 6203 5463 -384 -5813 -5425 379 6666 6683 351 -7129 -8409 -2709
1723 -2709 5337 8550 4015 -3183 -6931 -3725 2583 6159 3728 -3055 -7379 -5587 1517 8473 8205
1738 8205 865 -6943 -8062 -2203 4696 6162 1588 -3748 -5027 -755 3954 5093 1763 -3261 -5294
1753 -5294 -3132 1648 4469 2818 -1384 -3815 -1933 2765 4975 1598 -4077 -5803 -2596 3239 5564
1768 5564 2920 -2094 -4174 -1573 2297 4004 1638 -2981 -5725 -3618 2252 6928 6353 279 -6030
1783 -6030 -6988 -1490 4725 5888 961 -4222 -5227 -560 4606 5415 1440 -3923 -5691 -2614 2068
1798 2068 5138 3194 -1903 -4405 -2640 1990 5264 3378 -2245 -6464 -4648 1367 5752 4937 -281
1813 -281 -4858 -3868 1362 5040 3329 -2303 -6016 -4343 1787 6818 5557 314 -4725 -5522 -1962 3120
1829 3120 4947 1546 -3399 -4892 -955 4177 5868 1722 -4736 -6525 -1940 3780 5301 1788 -3538
1844 -3538 -4796 -1255 3952 5506 2008 -3151 -6119 -3942 1661 5897 4709 -462 -4740 -4347 705
1859 705 5356 4297 -1596 -6237 -5570 477 5982 6707 1850 -4582 -6385 -2691 2559 4582 2262 -2424
1875 -2424 -4136 -1680 2722 5005 2740 -2484 -5626 -3552 2310 5757 3643 -2713 -6215 -3575 3795
1890 3795 7808 4037 -4110 -8588 -5205 2796 8101 5935 -1690 -7652 -6142 1069 7687 7404 -421
1905 -421 -8849 -9607 -1540 8789 11668 3969 -7480 -11851 -5024 5774 10196 4806 -4586 -9416 -4632
1920 -4632 4290 9168 5539 -2650 -8303 -6697 611 7433 7220 -24 -7321 -7759 -862 7550 8617
1935 8617 1183 -8181 -9465 -2020 6759 9137 2803 -5823 -8849 -3217 5108 8644 4171 -4486 -9902
1950 -9902 -6672 3273 11006 9425 -644 -10778 -11439 -1468 9912 11668 2374 -8276 -10777 -2820
1964 -2820 7647 10663 3369 -7243 -10478 -4096 5763 10424 5414 -4852 -10647 -6276 4276 10799
1978 10799 6903 -4164 -11762 -8435 3510 12315 9241 -2631 -12092 -10218 1570 11703 10595
1991 10595 -664 -11074 -11513 -1388 10251 13388 4206 -8290 -13902 -7277 5598 13121 8918
2004 8918 -2955 -11330 -8939 1349 9651 8400 -1052 -8951 -8000 525 8123 8304 427 -7119 -8223
2019 -8223 -1038 6577 7960 1382 -7223 -8985 -1706 7978 10878 3606 -7906 -12296 -5218 7091
2033 7091 13194 7247 -5894 -14076 -8646 5119 14987 11389 -2776 -15174 -14278 -711 13406 15497
2047 15497 4050 -10439 -15165 -5688 8143 13553 5852 -7018 -12970 -5897 6542 12550 6154
2060 6154 -5861 -11637 -5825 5398 10778 5167 -5635 -10982 -4905 6351 12474 7377 -5390 -13742
2074 -13742 -9600 3158 13831 11837 -1137 -13392 -13173 -672 12993 14762 3401 -11590 -16682
2087 -16682 -7237 8401 16395 10438 -4366 -14530 -11431 1454 12536 11227 -265 -11217 -10951
2100 -10951 -203 10636 11211 1236 -9783 -10806 -1944 8881 10792 1649 -9820 -11488 -1315
2113 -1315 11274 13952 2814 -11468 -16319 -5616 10321 17511 8830 -8355 -18441 -11300 6659
2126 6659 18972 13806 -4310 -19090 -16252 844 17111 17902 3305 -13535 -17379 -5672 10417
2139 10417 16093 6687 -8388 -15332 -7188 7082 14513 7709 -5868 -13479 -7920 4855 12177 7508
2153 7508 -4958 -12087 -7455 4977 13078 9195 -3972 -14496 -12127 1388 14154 14244 1281 -12942
2167 -12942 -15763 -4195 11229 16686 7177 -9109 -17684 -10394 6285 17444 13446 -2288 -15615
2180 -15615 -14589 -339 13186 14062 2101 -11224 -13583 -3290 9665 13348 4297 -8278 -12729
2193 -12729 -4726 7536 11919 3885 -7366 -11034 -3315 8354 11771 3405 -8587 -12971 -5294 7716
2207 7716 13772 7515 -5868 -13846 -9190 4009 13757 10699 -2570 -13152 -11559 322 11855
2220 11855 12046 1813 -9342 -11923 -3884 6994 11019 4994 -5323 -10042 -5286 4279 9629 5996
2234 5996 -3325 -8994 -6297 2266 8333 6172 -1545 -7540 -5852 1699 7854 6710 -1289 -8573 -8263
2249 -8263 185 8860 9950 1790 -8066 -10886 -3425 7149 10996 4704 -5978 -11214 -6165 4800
2263 4800 11468 7541 -3534 -10876 -8436 1763 9932 8635 -803 -9024 -8254 257 8591 8563 396
2278 396 -8222 -9274 -1208 7622 8997 1707 -6756 -8442 -1552 6804 8583 1641 -6980 -9216 -2915
2293 -2915 6339 9912 4684 -4640 -9701 -6181 2544 8963 7274 -1396 -8558 -7804 -40 7712 8463
2308 8463 1350 -6489 -8334 -2816 4527 7433 3796 -3307 -7106 -4391 2374 7072 5416 -1569 -7514
2323 -7514 -6168 870 6910 6404 293 -5767 -5993 -697 4950 5935 1122 -5177 -6365 -1498 5116 7447
2339 7447 2588 -5150 -7916 -3390 4069 7478 3512 -3397 -6623 -3655 2786 6719 4294 -2173 -6445
2354 -6445 -4255 1350 5554 4310 -1101 -5128 -4275 992 5039 4103 -579 -4724 -4730 -439 4178 4801
2370 4801 1362 -3229 -4586 -1647 2715 4108 1306 -3108 -4374 -1591 2633 4456 2151 -1571 -4042
2385 -4042 -2940 295 3227 3416 634 -2652 -3561 -1080 2457 3883 1555 -2043 -3605 -1796 1471
2400 1471 2705 1752 -809 -2343 -1419 950 2593 1556 -1033 -3027 -2451 1060 3517 2557 -639 -3136
2416 -3136 -2520 521 2932 2396 -732 -3517 -2388 758 3584 3042 -244 -3426 -3348 40 2928 3261
2432 3261 518 -2152 -2839 -858 1564 2527 1043 -927 -1937 -1468 521 1573 1098 -766 -1433 -435
2448 -435 990 1361 49 -1289 -1377 -19 857 858 169 -349 -433 -124 -168 -348 180 525 353 -353 -467 142
2468 142 267 397 -214 -486 -122 -161 -45 207 472 370 -122 -888 -992 -61 858 814 130 -543 -930 -366 240
2489 240 698 498 301 -210 -811 -1090 -491 657 1261 924 -458 -1183 -842 381 983 869 -320 -1160 -860
2508 -860 642 1186 1052 -256 -1227 -1305 46 1280 811 -458 -931 -899 352 1562 1265 -984 -2366 -1494
2526 -1494 888 2937 2252 -782 -3214 -2620 505 3168 2747 -36 -3242 -3342 -532 2907 3588 1083
2542 1083 -2395 -3474 -1433 1806 3540 1598 -1824 -3598 -1925 1759 3531 2268 -1064 -3192 -2614
2557 -2614 460 2813 2527 25 -2511 -2608 -140 2582 3030 688 -2630 -3665 -1185 2411 4043 1989
2573 1989 -2006 -3888 -2319 1610 3882 2593 -1437 -4244 -3247 756 4237 4132 -4 -4001 -4519 -769
2589 -769 3777 4518 768 -3625 -4696 -1398 3300 5102 2096 -3047 -5265 -2669 1976 5060 3340
2604 3340 -1671 -4953 -3485 1422 5056 3997 -1149 -5529 -4523 388 5167 5211 369 -4523 -5440 -933
2620 -933 4352 5599 1563 -4276 -5850 -2102 3593 5875 3191 -2698 -5847 -3738 1474 5191 4397
2635 4397 -772 -4959 -4594 -92 4775 5057 1052 -3774 -4966 -1687 3043 4978 2323 -2188 -4622
2650 -4622 -2566 2176 4777 2580 -2059 -5079 -3274 2055 5430 3531 -1672 -5453 -4065 1319 5141
2665 5141 4242 -789 -5489 -4866 -27 5117 5632 874 -4910 -6326 -2016 4003 6368 2769 -3660 -6327
2681 -6327 -3434 2761 6210 4104 -1695 -5755 -4477 732 5106 4608 23 -4574 -4472 -282 4083
2696 4083 4472 223 -4232 -4802 -612 4245 5119 1017 -4143 -5395 -1510 3980 5678 1730 -3851 -6084
2712 -6084 -2503 3459 6522 3333 -2757 -6529 -4433 1513 6559 5534 -455 -5836 -6187 -479 5163
2727 5163 6340 1778 -4373 -6227 -2480 3460 6158 2988 -2606 -5578 -3058 2454 5139 3068 -2110
2742 -2110 -5513 -3495 2059 5812 4300 -1828 -6452 -4939 1386 6338 5574 -1036 -6632 -6071 221
2757 221 6361 7090 1106 -5891 -7480 -2456 4882 7925 4054 -3597 -7769 -5150 2090 7389 5807
2772 5807 -850 -6610 -6166 -253 5443 5809 991 -4447 -5229 -1399 3431 4847 1381 -3335 -4872 -1530
2788 -1530 3741 5397 1698 -3759 -5851 -2193 3668 6129 2988 -3201 -6316 -3448 2499 6566 4763
2803 4763 -1876 -6836 -5615 522 6583 6900 809 -5904 -7411 -2369 4762 7430 3245 -3709 -6954
2818 -6954 -4253 2451 6571 4490 -1268 -5483 -4333 535 4455 4021 -416 -4216 -3770 449 4212
2833 4212 3665 -307 -4413 -4319 -102 4515 5116 722 -4546 -5250 -836 4277 5262 1581 -3927 -5852
2849 -5852 -2470 3023 6214 3905 -1767 -6016 -4720 679 5491 5265 68 -4707 -5408 -931 4116
2864 4116 4964 1673 -3204 -4556 -1721 2276 3839 1921 -2028 -3868 -1802 2147 4229 2081 -2258
2879 -2258 -4601 -2602 2277 4810 2911 -1733 -4782 -3490 1169 4485 4007 -529 -4526 -4562 -605 4282
2895 4282 5279 1474 -3720 -5477 -2524 2789 5542 3191 -1696 -4861 -3617 793 4525 3667 -385
2910 -385 -4000 -4077 -464 3287 3681 809 -2865 -3238 -433 2568 2849 606 -2370 -3354 -710 2207 3518
2927 3518 1494 -1913 -3619 -1892 1817 3800 1974 -1703 -3904 -2365 1395 3853 2867 -658 -3600
2942 -3600 -3260 -356 3206 3779 998 -2776 -3872 -1576 2244 3680 1728 -2021 -3815 -2083 1423
2957 1423 3465 2265 -559 -3179 -2189 502 2749 2291 -533 -2689 -2625 83 2650 2608 455 -2501
2973 -2501 -3181 -986 1929 3007 1090 -1595 -3187 -1461 1570 3091 1906 -1184 -3148 -2075 684
2988 684 2643 2137 -338 -2366 -2134 208 2154 2407 316 -2241 -2617 -802 1986 2775 796 -1901
3004 -1901 -2516 -967 1566 2468 951 -1375 -2400 -1177 967 2662 1690 -642 -2639 -2173 78 2358
3020 2358 2440 122 -2187 -2558 -179 2197 2648 599 -1641 -2459 -1154 1111 2268 1382 -729 -2124
3036 -2124 -1748 479 2265 1761 -251 -2253 -1941 118 1819 1898 247 -1735 -1943 -622 1439 1953 541
3053 541 -1209 -2127 -864 1140 2297 1247 -829 -2128 -1379 434 2122 1672 -283 -1959 -2006 -157
3069 -157 1586 1637 535 -1301 -2159 -777 1225 1810 957 -627 -1788 -1153 427 1547 1258 -216 -1441
3086 -1441 -1370 26 1389 1406 81 -1257 -1129 11 1283 1505 92 -1320 -1514 -249 1093 1717 766
3103 766 -1128 -2012 -993 864 1958 1595 -403 -1938 -1563 225 1792 1658 289 -1492 -1891 -612
3119 -612 1186 1999 928 -790 -1897 -1447 572 1837 1130 -162 -1468 -1195 257 1082 1247 -24 -1227
3136 -1227 -1082 -314 988 1044 79 -1054 -1152 -225 1140 1265 387 -1215 -1662 -426 1099 1730 851 -877
3154 -877 -1738 -1430 556 1894 1483 -51 -1779 -1890 -126 1571 1789 584 -1407 -2271 -1122 914 2030
3171 2030 963 -690 -1749 -1245 397 1750 1201 -139 -1476 -1344 -21 1506 1403 4 -1217 -1471
3187 -1471 -163 1417 1398 148 -1222 -1592 -387 1325 1860 598 -1002 -1892 -1037 802 1800 1199 -356
3204 -356 -2080 -1619 232 2028 1884 160 -1691 -2058 -555 1520 2083 727 -933 -1691 -972 606 1596
3221 1596 1003 -634 -1575 -1239 292 1472 1147 -380 -1391 -1257 180 1604 1354 -176 -1684 -1324 133
3238 133 1632 1521 -76 -1612 -1472 -483 1079 1877 627 -958 -2036 -941 1091 1967 1268 -692 -1968
3255 -1968 -1578 324 1876 1754 14 -1503 -1678 -393 1034 1525 720 -843 -1493 -877 669 1477 926
3272 926 -504 -1607 -1072 363 1417 928 -484 -1390 -1113 521 1557 1243 -150 -1212 -1031 45 990
3289 990 1551 288 -1088 -1351 -387 1066 1711 657 -900 -1692 -1090 948 1698 1109 -450 -1625 -1276
3306 -1276 20 1496 1367 3 -1251 -1466 -311 1008 1668 332 -1115 -1285 -403 996 1633 727 -728
3323 -728 -1381 -821 639 1125 784 -315 -1013 -1205 142 1363 862 -194 -1026 -1271 13 1264 1278 53
3341 53 -1016 -1233 -396 1056 1405 415 -886 -1440 -930 257 1576 1044 -397 -1104 -1096 51 972 1162 260
3360 260 -882 -1174 -314 658 1220 363 -793 -1140 -628 644 847 383 -431 -835 -537 299 995 435 -318
3379 -318 -898 -507 267 950 700 -422 -1098 -705 338 1278 954 -197 -1372 -1288 -11 1222 1448 457
3397 457 -919 -1303 -473 578 1349 700 -128 -1150 -1112 18 1007 1239 441 -727 -848 -360 407 706 211
3416 211 -325 -417 -286 324 661 9 -556 -541 -103 293 334 -14 -371 -920 -71 611 1196 265 -482 -1283 -819
3437 -819 473 1403 1113 116 -1104 -1148 -250 754 1064 468 -496 -1035 -759 199 1195 1244 -41 -709 -711 -302
3457 -302 384 789 218 -325 -259 -231 209 476 41 -210 -330 68 481 -4 -171 -256 -250 184 610 485 116 -772
3479 -772 -852 -296 557 954 733 -322 -1166 -963 -76 862 936 538 -371 -1021 -822 168 975 774 54 -821
3499 -821 -910 -516 228 617 415 -269 -443 -438 88 239 187 -81 -302 -209 -229 -79 99 9 10 -204 452 199 -76
3522 -76 -445 -352 -78 438 641 130 -242 -870 -442 57 749 656 140 -692 -1017 -495 430 879 846 63 -671
3543 -671 -763 -211 678 1100 599 -364 -792 -491 127 497 301 -16 -92 -367 -382 336 420 215 -17 -421 -215
3564 -215 176 171 -61 -23 -357 254 360 126 -50 -533 -288 110 638 487 -70 -359 -665 -376 327 764 628
3585 628 -145 -884 -622 25 877 1019 166 -664 -922 -262 416 590 482 -108 -717 -385 141 563 437 32
3605 32 -359 -318 -55 428 529 21 -315 -417 91 661 470 -36 -809 -700 112 670 712 28 -555 -842 -198
3626 -198 374 952 430 -331 -943 -621 210 1142 875 -134 -880 -1090 50 994 910 177 -612 -1003 -229 603
3646 603 782 409 -497 -1171 -532 353 791 723 -117 -954 -780 361 846 657 -202 -764 -680 334 1073 875
3666 875 96 -790 -740 -111 477 906 224 -623 -792 -387 582 948 319 -561 -988 -525 331 794 649 -234
3686 -234 -943 -807 202 951 793 2 -854 -844 84 856 1105 193 -808 -956 -295 497 1241 615 -631
3705 -631 -1117 -603 509 1155 765 -459 -1083 -729 239 830 873 48 -816 -832 -363 662 991 298 -791
3724 -791 -1042 -302 733 1242 343 -669 -1027 -286 492 954 277 -644 -983 -668 598 799 544 -213 -932
3743 -932 -727 266 1045 1224 -144 -1379 -1019 -204 1175 1307 197 -1010 -1104 -418 562 1239 607 -701
3761 -701 -1304 -745 442 1101 743 -222 -930 -882 126 886 760 -248 -1000 -823 240 993 735 154 -928
3780 -928 -853 128 1016 1012 94 -843 -1101 -325 841 1317 632 -727 -1142 -614 623 1471 974 -455 -1320 -1211
3800 -1211 166 1217 1194 -11 -1142 -1060 -277 829 955 342 -759 -917 -439 576 1226 406 -834 -1171
3818 -1171 -426 622 1105 435 -700 -1029 -513 714 1030 736 -492 -1238 -846 299 1029 836 -281 -1296
3836 -1296 -1197 -41 1363 1350 82 -1002 -1499 -472 949 1619 570 -542 -1422 -790 561 1037 792
3853 792 -406 -1024 -731 44 964 786 -227 -945 -740 85 942 641 -94 -884 -817 -63 1094 1017 -52
3872 -52 -1106 -1083 -65 1008 1328 326 -703 -1226 -548 698 1255 581 -534 -1356 -1060 280 1192 1164
3890 1164 -307 -1187 -1006 -64 994 1023 141 -839 -754 -109 636 993 355 -525 -976 -394 604 816 376 -615
3910 -615 -884 -355 668 962 609 -292 -1100 -640 257 920 698 -330 -998 -889 17 1197 922 102 -823
3929 -823 -1188 -573 754 1142 280 -641 -1292 -452 550 805 286 -491 -1033 -644 138 848 509 -373 -739
3948 -739 -526 188 791 503 -35 -728 -655 117 792 681 65 -808 -799 -15 810 829 269 -565 -706 -207 402
3969 402 877 409 -379 -1012 -352 335 1068 671 -188 -553 -695 -26 505 686 -65 -581 -660 115 531 682
3989 682 81 -530 -342 50 572 588 -171 -406 -486 -107 322 772 405 -426 -823 -111 321 725 259 -490 -522
4010 -522 -392 397 778 594 -67 -553 -535 210 920 566 -87 -743 -695 -145 710 759 34 -601 -808 -247 409
4031 409 834 106 -417 -606 -63 360 738 284 -282 -730 -218 174 486 268 -115 -663 -151 284 499 364
4051 364 -352 -610 -533 228 350 396 -343 -738 -679 45 460 484 147 -403 -632 -288 310 760 208 -361 -755
4072 -755 -408 482 591 398 -95 -689 -390 176 537 743 53 -503 -374 46 407 316 -24 -490 -474 23 318
4093 318 509 5 -514 -502 18 745 520 8 -864 -738 -92 458 932 337 -427 -816 -430 186 694 577
4113 577 -256 -725 -528 152 506 693 -8 -314 -587 10 607 464 165 -299 -359 121 319 568 -5 -632
4133 -632 -418 -44 555 344 72 -475 -574 40 353 644 194 -383 -767 -298 242 853 653 46 -813 -585
4153 -585 4 641 550 101 -389 -639 -331 357 542 517 -268 -527 -340 -68 340 271 -167 -334 -131 242 393
4174 393 344 -480 -545 -17 217 485 176 -336 -430 -170 375 796 361 -130 -804 -659 134 679 706 21 -508
4195 -508 -745 -344 622 611 323 -390 -524 -166 353 606 348 -165 -514 -178 196 458 80 -119 -356 -122
4215 -122 221 481 16 -268 -484 -247 329 598 230 -498 -562 -316 -1 729 467 45 -703 -643 -380 478 683
4236 683 320 -165 -761 -515 249 667 587 -201 -529 -471 125 818 623 6 -338 -357 -124 421 429 -120 -552 -270
4258 -270 -46 432 370 -85 -379 -461 70 310 775 -50 -566 -903 144 387 767 269 -347 -673 -407 260
4278 260 842 593 -130 -750 -635 44 553 718 91 -428 -563 5 414 672 198 -273 -504 -36 142 443
4298 443 177 -257 -233 -10 50 499 152 -24 -304 -102 84 540 278 -173 -369 -196 -53 349 558 60 -485
4319 -485 -760 -64 698 675 -91 -475 -523 -108 391 729 270 -419 -663 -453 280 569 137 -182 -718 -569 377
4340 377 489 473 -154 -630 -563 251 420 423 -285 -509 -453 105 538 356 43 -530 -418 -81 463 577 302 -677
4362 -677 -732 -158 384 514 350 -328 -526 -149 260 859 266 -184 -538 -432 80 386 311 -86 -412 -370 -84
4383 -84 316 457 183 -392 -429 -288 346 720 21 -379 -458 -73 201 351 269 -129 -514 -386 56 325 498
4404 498 11 -718 -580 29 613 702 -27 -457 -379 -12 517 501 -63 -648 -501 25 530 417 -104 -545 -491
4425 -491 -78 630 470 159 -248 -498 -300 230 625 305 -40 -498 -352 113 267 368 55 -387 -316 86
4445 86 355 308 193 -151 -294 9 420 136 57 -305 -567 -101 204 425 25 -89 -486 -110 294 373 81
4466 81 -313 -728 -302 37 466 302 -272 -500 -415 146 380 455 205 -373 -647 -161 474 617 229 -227 -464
4487 -464 -425 276 357 110 -49 -418 112 72 389 139 -237 -305 -145 116 476 255 -305 -596 152 300 378 294
4509 294 -374 -620 -50 233 488 319 -266 -773 -334 -7 335 579 131 -109 -369 -237 116 487 213 -271
4529 -271 18 -394 61 362 316 54 -258 -96 -147 227 191 -79 -396 -125 239 281 202 12 -517 -370 47 265
4551 265 423 -99 -470 -355 12 365 620 107 -431 -590 -221 368 650 339 -171 -428 -346 161 435 500 -125
4572 -125 -434 -461 45 434 445 -55 -394 -191 -14 432 126 -319 -144 -175 92 423 203 -110 -174 -249 84 402
4594 402 535 -16 -491 -297 -164 222 317 82 -311 -405 -188 -35 306 161 -20 -198 -175 -65 185 312 172
4615 172 -109 -31 -202 82 225 128 -214 -262 -215 230 243 162 -154 -231 147 212 246 214 -123 -460 -255 99 361
4638 361 264 -41 -385 -305 273 289 156 -57 -359 -143 9 529 378 -151 -385 -497 -5 368 302 157 -337
4659 -337 -146 -85 182 264 159 -276 -226 -268 296 439 45 -397 -366 151 187 177 163 -259 -296 -85 80 264 273 -159
4683 -159 -337 -225 146 349 275 -114 -399 -219 -69 1 104 127 -314 -340 -180 187 400 -10 -52 -512 -456 355
4705 355 309 246 60 -420 -306 -65 401 202 -176 -271 -291 -154 196 425 -206 -316 -448 128 394 346 21 -334
4727 -334 -428 -69 406 442 18 -235 -557 -160 318 395 147 -419 -524 -365 213 521 399 -165 -577 -423 43
4748 43 373 285 40 -397 -372 39 290 369 141 -106 -236 128 139 355 -65 -151 -274 -124 254 563 154 -276
4770 -276 -606 -104 60 419 139 -276 -422 -189 110 389 511 -186 -404 -354 132 260 481 155 -219 -511
4790 -511 -38 427 415 237 -128 -515 -195 226 457 125 -186 -480 -347 98 557 284 -93 -326 -124 25
4810 25 387 183 62 -417 -283 119 372 467 -204 -496 -270 -61 481 380 117 -420 -334 35 226 494 368
4831 368 -240 -602 -472 164 419 394 -25 -300 -251 -22 365 403 129 -210 -234 -224 288 334 -25 -222 -152 140
4853 140 339 301 102 -355 -112 180 197 253 89 -212 -423 -149 182 538 348 75 -436 -431 -64 262 484 91
4875 91 -302 -529 -97 179 355 366 -236 -529 -279 228 259 273 -75 -403 -242 173 302 49 33 -221 -181 -36
4897 -36 98 257 -224 -367 -269 319 395 145 -54 -432 -409 -16 85 544 -151 -315 -387 -21 352 377 135 -284
4919 -284 -384 -249 -5 319 337 77 -340 -419 -121 352 584 58 -463 -341 -221 283 139 -79 -99 -176 -181 348
4941 348 412 107 -204 -311 -41 408 270 44 -208 -529 -309 257 249 205 -241 -698 -288 -51 418 321 -37 -542
4963 -542 -353 236 260 157 171 -214 -454 -84 200 258 326 -180 -305 -324 48 257 399 -171 -179 -71 -102 379 56
4986 56 -33 -200 -112 -57 218 472 56 -183 -245 3 275 249 210 -223 -364 -35 443 570 183 -121 -313 -394 216
5009 216 296 219 -4 -414 -60 -43 426 291 169 -339 -254 21 215 99 136 -168 -512 -40 320 382 283 -63
5031 -63 -193 -99 70 290 70 -424 -190 42 -148 94 129 17 -261 -251 -9 132 100 34 -288 -116 115 163
5053 163 125 64 -66 -181 -58 198 302 291 -122 -116 -101 -112 216 134 28 -194 -92 -66 158 181 100 -308 -376 182
5077 182 567 239 -116 -73 -294 -357 55 84 133 -202 -315 -205 -3 84 74 -20 -248 -346 -97 174 60 -48 -259
5100 -259 -21 93 82 333 -102 -157 -207 29 38 297 0 -139 -172 -98 99 224 62 -205 95 -250 60 380
5122 380 219 -165 -204 -121 53 122 155 169 -27 -84 -83 -4 79 100 -61 -365 27 -87 -16 -90 -26 46 -6 -60 -22 -155
5148 -155 -3 87 93 -28 -26 32 -23 54 -113 197 145 337 -91 -282 -92 -12 274 264 82 75 -94 -124 87 -27 99
5173 99 73 83 18 -358 -35 -48 78 296 -23 -137 63 22 130 21 42 -115 -23 -22 123 -92 188 65 -186
5196 -186 -20 -57 60 59 179 62 204 39 58 -292 -26 13 45 -8 105 -12 -79 -296 179 -34 -4 116 -195
5219 -195 81 -63 -94 -43 68 -2 -147 -173 -273 -73 232 -91 73 -120 -129 83 -48 3 98 -38 -138 -255 -216
5242 -216 -179 156 79 14 164 19 -36 -46 134 -41 29 213 53 24 -403 -143 85 45 -61 -166 -141 -36 -32 50
5266 50 274 30 -167 -189 -13 -308 80 160 48 -75 9 93 63 213 171 71 -32 -108 186 56 -22 -45 -37 -156
5290 -156 -28 -176 -26 -66 -106 103 102 117 -3 9 -194 -78 6 283 -31 -30 -257 -141 115 232 276 -137 31
5313 31 -13 -273 18 19 162 0 -171 -330 -53 225 203 -63 5 -134 -249 144 44 -26 -305 27 42 82 145
5336 145 -26 -71 -123 -34 99 75 -27 -192 -403 -164 -42 315 24 -85 -289 -109 -63 94 171 -95 -373 -296
5358 -296 -81 -72 105 269 5 -366 -397 142 287 91 81 -375 -79 45 64 276 -121 -281 -186 -100 155 -18
5380 -18 182 -131 -340 -88 3 147 141 -233 -248 -94 216 107 160 -153 -190 -215 -40 178 -55 -285 -5 -283 -19
5403 -19 324 113 240 -216 -86 -95 354 150 -93 -282 -221 163 276 38 150 37 -422 -246 -92 236 11
5424 11 -22 71 -206 125 31 62 63 -92 -23 -30 196 29 -84 -193 -134 -36 145 219 -17 19 -261 -83 328 24 180
5449 180 -69 -240 -90 -89 300 97 -116 23 -40 16 265 160 -143 -39 -6 -235 148 255 166 -11 -112 -164
5471 -164 45 162 322 -39 -20 -80 -7 232 -76 -16 -44 -97 -180 176 292 -87 -281 69 101 81 -5 -26 -68 -46
5495 -46 -29 42 295 132 -190 -171 -250 49 192 286 -95 -316 -213 -134 151 -7 180 -156 -254 -56 174 249 282
5518 282 56 -205 -120 -77 -130 -10 -16 95 3 -102 -79 -74 245 -9 -149 -72 -158 31 21 -98 14 63 171 98 114
5543 114 -218 -64 87 68 169 21 -398 -52 -1 15 217 205 -50 -331 -347 -56 -37 145 -35 -296 -219 -303 238
5566 238 65 331 197 -71 -85 146 169 222 86 -13 -219 -14 -62 88 -26 18 -89 59 148 167 -119 -192 -254
5589 -254 -64 154 -47 129 -163 102 -60 -40 141 296 -158 -55 -22 -113 124 347 -59 -10 -219 -237 72 150
5611 150 90 -232 -216 -83 -47 149 79 -11 -115 -256 158 109 -57 -5 -97 19 -120 162 108 58 -198 -236 126 58
5635 58 181 -388 -122 -40 109 59 466 55 -36 -146 -268 -114 218 57 -17 -110 -49 -2 180 231 193 -9 -230
5658 -230 -23 75 202 210 12 -6 -66 -29 254 83 -255 -142 -112 -131 211 200 -182 -160 -8 -15 221 192 116 -231 18
5683 18 24 243 280 221 -178 -96 16 126 227 -137 -194 -220 -163 133 234 169 -94 -200 -8 116 192 196 62 -279
5707 -279 -104 0 -135 367 41 -91 -36 -158 100 329 55 -125 -355 18 123 282 255 -139 -272 -105 -146
5728 -146 316 147 -66 -351 -243 13 228 82 77 -57 -248 26 246 1 128 -288 -264 -29 29 174 268 -71
5750 -71 -507 -193 -69 338 195 -7 -416 -137 42 50 247 65 -334 -246 -118 -4 368 8 -169 -278 -256 172
5772 172 301 254 42 -259 -276 -364 256 64 -34 -161 -269 -41 156 274 -79 -83 -361 -59 178 325 98 -371
5794 -371 -180 -148 -28 351 96 74 -327 -379 247 493 407 161 -420 -310 210 292 190 108 -236 -247 -101 129
5816 129 252 54 -142 -214 -249 52 208 254 -203 -81 -206 -31 48 10 -15 -61 -345 206 190 328 86 -53 -213
5839 -213 133 279 197 244 -218 -222 28 270 326 133 -17 -201 -334 131 236 184 -266 -266 -104 -152 185 441 174
5862 174 -303 -337 -288 183 477 190 -60 -43 109 20 134 147 -134 -208 -136 32 170 56 -253 -272 -261 78 236
5885 236 -58 27 -298 -367 222 403 254 2 -499 -291 -68 223 282 63 -260 -258 -133 95 465 173 -203 -338
5907 -338 -216 -103 405 324 48 -136 -291 -143 248 488 33 45 -247 -17 86 136 -116 -357 -159 -69 106
5928 106 144 -99 -249 -390 -85 389 354 117 -174 -431 -352 110 95 267 119 -185 -275 -202 168 409 270 -114
5950 -114 -535 -192 339 197 131 82 -399 -263 152 193 28 -32 -126 -135 90 335 -15 106 -426 -318 106 152 206
5973 206 -106 -10 -389 12 153 449 56 -323 -522 -169 81 462 52 -343 -488 -137 0 100 277 -196
5993 -196 -182 -379 8 113 233 120 -225 -328 -20 132 122 1 -236 -311 -224 40 444 -17 -214 -344 40
6014 40 157 376 272 -208 -342 -146 124 405 140 80 -64 -288 -84 357 275 -265 -229 -279 -127 309 343 278
6036 278 -201 -393 26 22 101 118 -62 -31 -93 4 329 -16 -161 -224 -119 53 192 131 48 -224 -59 51 183
6059 183 41 110 -36 -112 -52 3 247 40 -252 -360 -197 -2 163 123 -153 -106 -251 118 28 17 -53 -252 -42
6082 -42 3 164 -40 35 -115 -76 -29 121 152 44 -126 129 -69 -121 -52 -2 3 -301 13 95 121 -32 98 -173
6106 -173 -338 -79 220 122 21 -344 7 165 47 234 -48 35 -177 -7 -131 58 57 -135 -358 49 93 76
6128 76 86 -194 79 14 170 266 -176 -370 66 -180 41 81 231 250 -149 -222 124 31 -91 159 -154 -120 -49
6151 -49 35 160 -84 -21 -207 -71 -1 86 -97 100 31 101 227 2 152 -83 -290 -110 -47 105 166 100 31 19
6175 19 344 39 311 -139 -39 17 97 24 177 15 29 142 -61 -35 109 37 -7 -35 -236 5 191 67 53
6198 53 18 -28 -9 227 -143 -29 -57 158 10 -75 88 75 -172 38 66 -73 -8 11 -116 -52 313 -67 127 11
6222 11 -65 13 -175 21 69 115 61 -294 260 7 -123 -63 -40 104 15 -99 61 -20 49 -85 76 -98 -84 -207
6246 -207 -168 -190 0 13 -54 101 -187 -64 149 47 -57 119 36 -214 -112 66 22 123 151 -234 -63 -17 -17
6269 -17 254 -51 101 87 202 6 -205 19 73 140 -278 -60 -79 18 82 -307 -18 -70 18 -23 84 194 -53
6292 -53 -42 85 12 69 -63 23 12 22 228 -139 3 67 43 77 32 97 -18 69 159 83 18 45 -93 56 116 -92
6318 -92 -5 -125 -184 -219 34 -26 -77 -228 -137 -6 84 267 227 -180 -8 -166 178 362 119 131 -15 16 -92 -95
6342 -95 70 -112 -141 39 154 286 243 61 -47 -15 0 121 157 173 -51 -99 -76 27 170 -158 -188 -41 18 111
6366 111 51 252 -48 -146 -141 230 242 152 116 69 -164 -255 242 101 38 42 -129 18 356 243 128 -1 -115 236
6390 236 11 420 175 -35 -305 -383 172 85 155 -59 -182 -347 -22 196 386 120 -75 -250 -44 178 -60
6411 -60 156 -128 -205 -276 46 240 139 -7 -31 -251 195 136 16 -182 -245 -234 76 269 268 145 -190 -202 -24
6434 -24 291 70 -36 -9 -55 34 126 219 164 -123 125 -183 30 243 207 9 -266 -124 41 235 119 31 -188
6457 -188 -290 -300 115 407 6 -47 -196 -64 88 1 18 73 -78 -191 39 342 270 -130 -242 -381 -1 388
6479 388 257 -170 -191 -238 -90 305 251 136 -295 -112 -57 236 155 122 -274 -294 -148 63 189 170 -53 -177 -108
6502 -108 22 96 138 -195 -126 -257 -96 241 234 -170 -13 -134 116 143 -36 8 -39 -196 117 280 364 184 59
6525 59 -193 -6 67 269 97 -185 -135 -283 -59 155 233 -159 -298 -286 -76 -115 60 122 -128 -380 -440 -83 140
6548 140 74 89 -433 -62 176 32 79 -169 -236 -69 88 213 159 -120 -166 -42 48 358 -4 17 -31 -140 122
6571 122 395 258 -60 -267 -366 -70 59 414 137 40 -391 10 2 -9 248 -234 -200 -54 224 92 297 52
6593 52 19 -9 -14 136 138 161 -226 -19 -109 208 244 207 -171 -258 -68 208 142 241 -111 -211 -321 230 248 273 -85
6618 -85 -305 -238 30 94 134 -55 -171 -295 -93 322 224 117 -141 -307 -186 -131 310 252 -252 -293 -123 182 78
6641 78 62 -258 -96 -226 65 -27 262 -76 -184 73 118 230 303 32 -128 -203 69 179 132 72 -253 -256 -29
6664 -29 -202 183 292 -158 -433 -168 12 38 304 -92 -164 -311 -58 254 265 122 -133 -212 -77 64 294 60
6686 60 -50 -191 26 136 296 -12 -259 -240 -128 238 265 229 59 -203 -249 93 238 318 153 -261 -62 -8
6708 -8 227 333 -119 -364 -364 -20 152 -252 -86 -243 -257 -204 153 295 170 -105 -139 -194 -162 156 -46 14 -16 192
6732 192 3 144 -19 -166 -315 -128 227 207 140 -156 -60 -156 22 -74 148 -37 -157 -190 -196 113 17 366 58
6755 58 -246 -70 141 349 326 -28 -351 -255 11 309 224 339 -256 14 3 316 -109 71 -22 -255 28 193
6777 193 46 -129 -84 -134 -289 153 72 107 -150 -63 -157 -115 312 230 58 -214 -132 -64 325 253 -58 -343 -49 -139
6801 -139 -188 86 32 -61 -164 -74 -15 71 9 -63 -61 -117 14 27 248 18 -180 19 143 -31 158 114 -8 -11 -3 161
6827 161 284 133 -134 -46 -245 193 0 118 -79 -81 -46 12 129 51 64 -173 -134 90 10 -129 -97 -222 -134 -133
6851 -133 181 151 -115 -122 -107 5 222 69 212 -90 -32 27 119 122 26 -248 -213 -74 45 203 312 109 27 157
6875 157 -51 66 -157 -132 117 32 -3 211 -126 42 -198 -101 239 -72 80 -36 -49 -261 -56 -26 29 -105
6897 -105 68 -222 -1 59 -189 116 -2 -9 -99 5 101 212 116 -38 -145 -49 95 -140 83 -37 -74 -84 -9
6920 -9 101 -261 132 56 183 423 -97 90 110 -120 -20 7 22 39 -157 67 29 -34 -42 207 75 -179 -50 218
6944 218 140 1 -83 -39 171 137 94 125 218 71 20 19 68 -107 12 -184 28 -14 19 -130 103 228 -161 -144 -169
6969 -169 37 -56 23 101 107 118 31 -221 159 10 -189 80 -59 135 20 -73 163 97 157 98 151 20 -153 -139
6993 -139 -112 52 65 193 -17 310 256 -28 154 88 -39 104 28 -145 109 -44 -88 16 -154 -26 -6 -4 47
7016 47 -4 -72 23 62 -30 128 191 71 34 -163 -116 -122 -53 173 21 213 21 -217 6 169 207 0 -37 -189 61
7041 61 185 115 -129 -286 -138 -194 85 180 -185 -148 102 26 -87 172 -56 140 -153 -126 109 20 34 -129 -139
7064 -139 -153 52 -9 -133 1 106 -196 45 -53 86 38 -352 73 56 155 117 57 109 -161 -13 -93 102 119 -55
7088 -55 20 -122 -127 140 103 248 10 -198 131 85 -86 -80 22 -137 -82 -4 65 -45 12 -67 -27 27 -10 -82 86 -72
7114 -72 -40 29 157 134 -213 -49 29 -115 47 170 35 95 -150 -14 11 128 105 45 -143 -5 -76 92 140 4
7138 4 -166 -179 26 -44 -2 -91 -117 59 15 -2 -84 -66 14 100 151 180 88 80 -229 -128 197 99 214 -38 -50 -163 -114
7165 -114 -64 70 -240 -1 72 -104 -124 140 215 89 20 31 -79 125 109 142 -166 24 143 149 -149 -100 -30 39
7189 39 -5 35 -46 15 -91 220 218 52 86 49 -34 113 23 41 91 -74 61 194 -285 -39 65 188 -152 -192 -89
7214 -89 119 -16 149 239 -97 -236 -43 -69 46 201 -106 -219 -49 53 271 59 131 32 -257 87 252 243
7236 243 -73 39 -114 -1 19 -175 17 -38 33 134 -85 286 -34 109 65 174 114 146 10 98 -132 69
7258 69 344 223 185 -37 80 -148 -92 -23 116 65 37 -112 -219 -141 52 83 7 -58 -6 -70 -3 -67 94 17 -97
7283 -97 -61 94 4 21 17 -99 -4 57 125 -158 -50 -176 166 122 197 53 -103 157 -68 321 174 -70 -41 -130
7307 -130 -163 -3 2 291 -22 -185 -24 -119 -107 -40 -39 -50 -78 -66 52 182 -153 -125 52 173 254 -69 -138 -221 109
7332 109 -177 -135 -117 43 3 18 155 7 14 25 35 -223 -22 173 -102 66 86 34 196 -67 168 38 101 -247
7356 -247 -2 -61 -27 65 -36 -1 -99 -77 44 -14 155 176 30 149 -36 195 133 8 12 164 40 145 113 -83
7380 -83 -198 -193 84 218 222 126 -103 -192 197 39 117 128 -298 -79 23 62 -5 121 -140 -112 -112 22 -42 68 -167
7405 -167 -128 -32 92 49 43 -114 -142 -199 -4 -63 -2 -48 -130 164 115 185 220 102 -22 -56 18 35 -44 -2 -187 29
7431 29 34 17 185 14 -93 69 105 6 -38 -25 63 -23 -45 79 104 -64 192 84 61 -142 -121 8 -58 32 164
7456 164 185 -155 41 -2 -75 175 -82 88 105 -121 17 -101 0 84 74 -24 -47 -92 187 -102 -120 248 32
7479 32 40 -34 -9 -128 76 51 73 -170 6 -98 -75 160 171 -72 -84 -45 -84 8 198 80 -165 64 3 -236 -101
7504 -101 -175 -167 267 -19 148 -49 -41 -182 -79 26 38 22 -22 0 -113 10 -99 -62 75 -69 -14 -172 160 149
7528 149 -103 66 -117 92 118 49 50 26 305 165 -22 225 -10 -56 -62 -142 23 64 -178 -105 -19 -125 189 -130
7552 -130 -187 110 114 -153 133 10 130 -34 -76 76 -87 -10 142 187 -84 197 -24 49 -24 39 -162 71 3
7575 3 -90 -42 89 -9 -98 263 47 169 10 164 -58 194 43 72 -60 20 -40 -92 -84 110 -8 20 -115 119
7599 119 -34 -92 -110 -75 -77 -10 189 110 -5 52 189 101 -42 154 150 -86 42 192 102 123 -102 131 79 61 39
7624 39 41 72 -73 -41 -33 85 7 -94 60 -38 156 189 -230 -142 -48 40 49 186 150 16 -159 -128 87 -50 119 101
7650 101 -73 -47 -175 19 66 -9 -61 -25 -124 -54 -57 90 106 96 -156 -239 -34 -109 101 -13 103 23 -106 -39 85
7675 85 -20 -18 23 -59 20 120 88 -99 -113 103 2 204 -28 -52 -175 -32 -106 253 -144 41 143 -73 143
7698 143 -66 -46 -130 -101 111 -159 -46 -27 17 -33 -145 -5 -71 7 106 -36 -156 -40 -43 -40 -162 -131 18 185 98
7723 98 -219 74 123 42 61 39 -14 87 -26 -173 -46 87 -119 -26 -11 191 194 -16 110 42 47 87 -133 75 -61
7748 -61 -80 65 -155 -88 -314 125 -239 -75 -21 2 -150 31 96 58 173 2 34 -182 -130 49 66 -43 -41 -39 -44
7773 -44 4 33 -30 -79 178 169 15 -16 -31 122 -205 -41 8 -110 -54 -91 -42 -108 -88 -35 201 -151 -97 -245 30 -133
7799 -133 138 54 93 -5 -41 62 -212 -94 -66 62 -158 148 -32 -115 -68 -55 -16 -6 9 104 82 -21 -151 48
7823 48 -99 -43 -14 -64 68 37 -238 84 174 88 88 160 14 -250 -98 -64 83 -64 -237 -193 -11 -1 -185 50
7847 50 -73 60 -39 90 -179 -35 53 99 5 58 44 187 -95 109 119 201 -131 -97 1 -157 72 -50 -178 33
7871 33 -188 173 33 21 264 -89 -47 -9 24 -279 -120 64 25 116 -127 266 13 -92 31 82 89 102 89 -51
7895 -51 144 137 302 -6 148 176 -35 -201 -17 -47 -88 -106 0 8 -1 76 16 -104 60 64 277 -56 91 223 18
7920 18 60 40 -92 35 -164 131 54 18 136 -78 117 179 97 -200 113 99 -14 110 3 0 28 24 -45 -38 50 31
7946 31 13 84 -150 17 -31 -138 -121 53 -187 92 140 0 106 77 40 -113 -133 38 -100 79 -1 -112 54
7969 54 -8 -43 -65 -233 -181 -42 -15 -96 82 -46 -172 -91 -255 166 -112 184 -55 -50 173 67 16 -70 32 -120
7993 -120 -134 60 -47 -40 13 -73 48 -29 -23 71 -74 -58 -199 -90 69 9 51 -50 -20 -83 89 -201 4 -156 95
8018 95 131 37 -21 -105 63 -17 127 -73 -19 4 29 -67 -163 -186 15 -66 99 -48 -66 53 37 -157 -221 -23 21 229
8044 229 0 70 114 -21 5 -25 -84 151 90 -93 -94 94 -18 66 78 -29 12 -53 80 -136 -2 -65 39 168
8068 168 98 -21 -138 28 -43 -7 -137 51 -25 -35 -107 234 -67 105 -28 -4 40 -173 128 -74 -50 -134 21
8091 21 24 -31 56 -22 215 -29 -93 14 13 -25 -91 82 7 249 46 226 179 -83 -157 -212 69 82 131 -202 126 210
8117 210 22 -84 147 -102 -25 6 -43 -29 23 -332 -134 -327 71 91 226 101 -157 -100 -190 -39 181 37 43
8140 43 63 -79 120 -154 154 107 144 -62 170 70 69 -21 -206 -45 -98 1 -57 20 -142 -198 190 147 -72 23 121
8165 121 -244 -56 -96 237 -22 -18 68 178 -55 -217 -101 97 -66 -44 60 76 50 -123 41 135 -153 1 162
8188 162 -240 112 87
8191H7
$$ Imaginary data points
##PAGE= N=2
##DATA TABLE= (X++(I..I)), XYDATA
0 0 0 0 0 0 0 0 6 0 0 -8 8 -10 16 -21 24 -32 40 -48 62 -72 88 -105 121 -145 170 -198 232 -267 309 -353 403
31 403 -460 523 -594 670 -752 846 -946 1061 -1180 1316 -1463 1621 -1796 1985 -2193 2420
47 2420 -2669 2944 -3240 3574 -3935 4335 -4785 5287 -5856 6501 -7243 8102 -9122 10345
61 10345 -11845 13741 -16217 19615 -24578 32555 -47525 85502 -398765 -561799 289000
72 289000 593031 551634 164645 -47396 -82437 61346 64997 -44528 -254638 -381984 -377783
83 -377783 -109729 270735 536535 457959 154025 -149023 -225707 -142328 -74593 -158420 -253046
94 -253046 -186745 64813 301117 368413 247526 57213 -93598 -146379 -147946 -151836 -169782
105 -169782 -159650 -89945 70210 284313 414328 314306 14809 -289741 -395421 -248875
115 -248875 9838 149905 85032 -47019 -67125 53951 207711 256276 137248 -83688
125 -83688 -259159 -289709 -182228 -13724 118030 149356 106625 77361 96720 105238 32032
136 32032 -106755 -214600 -205553 -88550 40390 93136 77565 70358 105865 135307 97893 -18541
148 -18541 -166607 -254444 -204221 -34320 140471 203862 128875 -5981 -72353 -10004 96318
159 96318 106531 -13522 -168468 -235787 -159722 11817 162471 208641 156242 59970 -28945
170 -28945 -76136 -79184 -75188 -88002 -90853 -46806 36409 112182 135412 96304 34287 -2263 -14534
183 -14534 -46570 -109896 -156613 -133109 -29194 110839 206142 188598 71240 -59762 -121594
194 -121594 -90955 -13284 23909 -31273 -121930 -129802 -5134 177229 282766 215077 2862
205 2862 -204454 -261899 -157491 805 92973 74048 454 -21831 48714 140019 148512 43445
217 43445 -113585 -215529 -189193 -58631 72746 121157 89121 38564 26756 57007 71343
228 71343 10667 -105017 -183822 -154258 -33816 92172 143052 103425 31765 -1555 12786
239 12786 26824 -2150 -73140 -141944 -144199 -52480 84365 173761 159523 63357 -42319 -86923
251 -86923 -60018 -16641 -14011 -48969 -73344 -45413 33606 117674 142768 85321 -12990 -85874
263 -85874 -97255 -62258 -22940 -11299 -17452 -3700 43321 92108 99829 52646 -25372 -86516
275 -86516 -92367 -49129 -1022 13302 -2187 -10061 19097 75263 105845 65390 -30776 -111710
287 -111710 -119732 -57835 21127 59215 39699 -140 -8550 26219 65969 64246 6190 -74427
299 -74427 -116426 -82781 -4037 57349 66396 37847 9958 8285 24387 26001 -5465 -50219 -75304
312 -75304 -63560 -19478 33603 63470 55541 28489 8740 4918 3794 -11473 -45162 -74052 -64205
325 -64205 -11773 47544 76768 65009 27247 -7420 -19238 -14964 -16813 -32892 -49324 -47909 -16723
338 -16723 36637 81738 83528 40078 -15952 -50799 -50577 -27720 -11325 -17221 -27745 -14161 27093
351 27093 70371 83871 50525 -14374 -68284 -77459 -47664 -10799 10456 12585 11546 25239 50205
364 50205 58064 29968 -21240 -64464 -75230 -49062 -5329 26096 34139 31765 31000 30666 24065 5535
378 5535 -23778 -50598 -57777 -40145 -8476 24829 46525 48049 33489 15935 936 -16306 -34130
391 -34130 -44610 -42284 -24376 6617 34863 47616 44074 27796 2476 -23725 -36477 -34336 -25145
404 -25145 -14312 -2187 10032 23739 36466 36756 19559 -4963 -25345 -35085 -32051 -17030 -359
417 -359 8180 11491 17195 24642 28772 21637 -1071 -30363 -45184 -35855 -12582 9390 23621 26713
431 26713 20253 12035 5734 -836 -9017 -15752 -21571 -23530 -13450 6366 21473 24248 16589 4986
445 4986 -3526 -3313 -378 -4273 -14520 -21716 -19252 -6364 14670 31522 31089 14129 -5076 -16117
459 -16117 -15557 -9116 -7331 -14321 -17481 -3863 19766 35008 30155 7470 -17401 -25950 -14420 1547
473 1547 5217 -5464 -17169 -15314 5513 32362 39824 19515 -12261 -30130 -24855 -6941 4766
486 4766 -974 -14654 -14657 8318 37767 48999 28764 -14319 -50601 -52564 -20725 15199 28006
499 28006 14779 -4640 -6215 13366 32549 25911 -6574 -40838 -50762 -28328 10264 36548 31362
512 31362 5326 -12956 -5802 17379 30040 12653 -28129 -60389 -51887 -5770 43094 61144
524 61144 39198 -2190 -27399 -19335 2927 8464 -10105 -34282 -38716 -9940 36841 65033 49328
537 49328 2330 -41381 -51874 -23139 15633 24222 -3079 -30191 -21792 17478 51768 48509 8331
550 8331 -35382 -47365 -26774 1205 15719 11114 -4371 -12004 4358 33992 46436 21396 -29962
563 -29962 -68017 -57262 -2639 46506 48958 12888 -18921 -18311 7797 28240 17555 -17614 -45071
576 -45071 -40490 -7698 29833 46950 30493 -5850 -30068 -22508 5155 24479 14885 -17977 -41857
589 -41857 -27586 15251 47029 39563 2328 -29185 -27106 289 18647 7333 -18996 -29176
601 -29176 -11972 19798 41011 33159 -30 -34367 -43162 -17135 23493 41500 17614 -26896
613 -26896 -45101 -14965 34299 52013 19704 -30733 -51499 -24534 21400 43480 23778 -16216
625 -16216 -40781 -28409 10323 43381 40401 723 -41093 -46071 -8579 36323 44774 7349 -38808
638 -38808 -46014 -5104 43780 52055 10647 -41198 -55104 -18207 34957 53656 21601 -31425
650 -31425 -57466 -32472 23466 64836 53639 -5013 -61590 -66854 -15710 46826 63931 19718
662 19718 -40991 -56304 -12344 43796 58496 19243 -38182 -62550 -34641 18152 50152 39449
674 39449 -1439 -36695 -33397 6908 42177 32729 -15620 -56715 -47984 7662 58865 54994 941
687 941 -47314 -43990 2850 45535 41977 -7453 -57386 -60097 -9723 53908 78196 41225 -29891
700 -29891 -75705 -54967 11537 61364 49654 -10523 -61330 -52080 10723 67271 64531 7079
712 7079 -52697 -66801 -27655 27339 50232 24849 -17471 -36256 -14834 25261 44446 19413
724 19413 -29469 -54902 -31777 17908 48770 33618 -11432 -40028 -22928 20728 44405 23345
736 23345 -24758 -57202 -41770 11096 56254 54529 8493 -41109 -52737 -16406 33702 49691
748 49691 16655 -34169 -54605 -24958 28377 57351 36603 -13372 -46388 -35983 3010 31989
760 31989 25794 -5455 -28846 -20817 10811 34628 26075 -8951 -38339 -33398 3728 39534 37945
773 37945 -2252 -42370 -42545 -5 45362 49846 7975 -42488 -55584 -19764 32928 56701 32142
786 32142 -20824 -56654 -43467 8364 54076 52678 5256 -46211 -56742 -16929 35533 53056
798 53056 22752 -23862 -45368 -26652 12295 37748 29079 -2466 -26445 -24679 -3358 16624
810 16624 17043 -1253 -16918 -11330 9376 23189 15485 -8796 -28006 -22597 3539 24397 21352
823 21352 -694 -20121 -18991 2547 24675 24232 -170 -27254 -33058 -12035 19218 35464 21525
836 21525 -9346 -28659 -20194 5519 24115 18736 -6546 -26865 -22452 1373 22763 25049 9175
849 9175 -10324 -17487 -9123 3327 6231 -1386 -9504 -7875 5656 20593 20594 1949 -20529 -26967
863 -26967 -11796 12160 24107 12895 -9960 -21408 -10161 11584 24104 15467 -7659 -26061
875 -26061 -23447 -2063 18885 23784 9636 -10923 -18757 -7837 10113 16479 5589 -11274 -18409
888 -18409 -9793 6760 17052 13101 765 -8603 -8689 -2476 2807 1407 -4859 -6993 887 12569
902 12569 15187 4086 -12955 -20866 -10966 9317 20905 13921 -4789 -19481 -17122 755 19426
915 19426 21075 3036 -18547 -23904 -7796 15808 25336 11024 -12719 -23095 -12771 7901 20180
928 20180 14418 -3758 -18804 -17571 -278 18324 21779 6049 -16250 -24709 -10573 12201 21833
941 21833 10444 -7958 -15119 -5976 8654 13249 2867 -11521 -16867 -7593 8437 19625 16535
954 16535 -243 -16995 -19282 -5659 11888 16753 4896 -11892 -16269 -3304 14100 18643 6626
967 6626 -10921 -19325 -10738 4888 13795 9311 -3311 -11085 -6218 6498 15261 10161 -5900 -18737
981 -18737 -17277 -2514 13610 18549 8423 -6154 -11599 -5119 5844 8324 -78 -11569 -13713
994 -13713 -2747 12696 17846 9873 -4634 -14479 -11793 -662 8938 8402 -1030 -9903 -8801 2538
1008 2538 14254 14227 1481 -12473 -15267 -6008 5718 9954 4273 -4370 -6523 -448 8608 11474
1022 11474 4354 -9143 -18409 -13633 2741 16666 16632 3474 -9679 -12065 -2799 7109 8083 286
1036 286 -8540 -10837 -4271 7341 15363 11406 -2563 -14133 -13563 -1637 10765 11129 -539 -10874
1050 -10874 -9511 1717 11937 12620 2721 -10151 -15039 -7212 5465 11783 7430 -3172 -9161 -4349
1064 -4349 5820 10035 3505 -5982 -11592 -8850 852 10959 13133 5740 -5883 -12902 -9197 2766
1078 2766 10977 7561 -3322 -9706 -6224 2973 9909 8404 -7 -8328 -9583 -3469 4862 8603 4464
1093 4464 -3398 -6266 -1235 4660 4719 -562 -5371 -5174 -849 3688 4659 2073 -695 -2637 -2293 1230
1109 1230 3918 1319 -4743 -8124 -3652 5992 12341 8352 -2954 -11946 -10970 -1119 8457 10173 2521
1124 2521 -6951 -9315 -2282 7778 11185 3936 -7384 -12648 -7484 2855 10456 9378 1397 -6481
1138 -6481 -7606 -2353 4931 6603 1213 -5758 -6827 -1235 5040 6424 2742 -2226 -4044 -2063 639
1153 639 1329 -162 -2469 -3173 -63 4905 7239 2935 -4659 -8030 -4187 2492 5593 2097 -3543 -4435
1169 -4435 603 5323 5409 620 -5196 -7886 -4476 3069 8004 5743 -881 -6819 -6143 1367 8162 6180
1185 6180 -2283 -8801 -7507 921 8694 9272 1103 -7990 -9007 -2282 6838 10171 4168 -6827 -12147
1200 -12147 -6626 4408 12269 10348 35 -10762 -12115 -3198 7881 11471 5349 -5583 -10968
1213 -10968 -5796 4857 10133 6155 -3100 -9430 -7600 1340 8470 7812 766 -6110 -7292 -2886 4008
1228 4008 6629 3035 -2235 -4119 -2789 772 2977 1565 -1479 -3276 -934 2449 3962 2387 -2179
1243 -2179 -5360 -3389 1721 5170 3440 -1243 -4461 -3223 1331 3960 2091 -1029 -2941 -1711 823
1258 823 2030 1053 -1214 -2483 -1476 1600 4606 4047 -714 -5867 -6103 -735 5133 6236 1200 -4335
1274 -4335 -4256 405 4912 4383 -374 -5500 -6082 -1897 3671 6863 5819 151 -6010 -7675 -3265 3425
1290 3425 6234 3919 -1433 -4859 -3862 284 3103 3100 1571 -563 -1991 -2222 -1615 -983 228 2235 3704
1307 3704 2692 -196 -3344 -4594 -2556 1782 4457 3714 -164 -4616 -5460 -141 7452 8743 1142
1322 1142 -8498 -11964 -5700 5738 12592 9508 254 -7853 -10668 -6848 2319 10365 9910 1326 -8604
1337 -8604 -10967 -3041 7572 10305 3510 -4884 -6798 -3263 474 2561 2480 1543 880 -330 -1313 -1050
1353 -1050 -65 -462 -1088 -592 1753 2603 425 -2292 -2172 916 3978 3320 -1771 -6067 -5399 -1027 4896
1370 4896 7827 5738 -361 -6581 -8550 -4900 1818 7441 7214 1806 -4023 -6471 -4695 260 4853
1385 4853 6210 3076 -2063 -5500 -6634 -3056 3226 8526 8322 1589 -7621 -11858 -5849 4775 11148
1400 11148 7759 -1606 -8796 -8215 -1138 6508 9534 5598 -2807 -10941 -11268 -2010 10109 14345 6569
1415 6569 -5696 -12497 -8067 1165 6477 5420 1339 -1286 -1276 -1167 -1575 -2110 -641 1908 4028 3565
1431 3565 569 -4696 -7827 -4864 3715 11370 10666 46 -12355 -15359 -5267 10159 17794 9956
1445 9956 -6411 -18021 -13756 3227 17756 16935 1166 -16001 -20271 -7136 11557 20632 13065
1458 13065 -4406 -17961 -17052 -2296 13587 16828 5485 -8759 -13053 -5265 6143 9458 2823
1471 2823 -5122 -5992 -342 5166 4944 -419 -6088 -5927 463 7740 8936 2174 -8571 -12317 -4401
1486 -4401 9273 14668 5753 -8657 -15114 -7080 7136 14299 8575 -4256 -12895 -11007 295 11837
1500 11837 13765 3488 -10188 -15186 -6649 6976 13533 7884 -3667 -9232 -5541 2185 5310 2081
1514 2081 -2986 -4199 114 5614 6276 242 -7085 -9237 -2688 7458 11680 4847 -7672 -13639 -6844
1529 -6844 6776 14991 9569 -4353 -15246 -12384 1274 13534 13852 1864 -11625 -14419 -3645
1542 -3645 10397 15394 6087 -8199 -15465 -9323 4315 13475 11198 80 -9353 -9450 -1288 6078
1556 6078 5964 -310 -5702 -4132 2847 7120 4562 -2457 -8290 -6233 1478 8229 7185 -1336 -9066
1571 -9066 -8645 795 10644 11197 627 -11368 -13152 -2859 9668 12922 4170 -8561 -12224 -4454
1585 -4454 7248 12618 6817 -5338 -13626 -10977 1347 12593 13402 3072 -9476 -12619 -4133 7043
1599 7043 10268 3058 -6709 -8881 -2424 6239 9241 4495 -4340 -9200 -6770 1410 8583 7323 -929
1614 -929 -8458 -6712 2221 9397 6945 -2181 -9179 -7030 908 6751 5991 308 -4448 -4709 -526 4600
1630 4600 5517 934 -5879 -7988 -2812 5520 8966 4232 -3614 -7274 -3532 2728 5231 1928 -3408
1645 -3408 -5759 -1936 4491 7444 3971 -3430 -7654 -5454 1785 6890 4802 -2067 -6194 -3909 2106
1660 2106 7010 5619 -1259 -7616 -7370 -505 6690 8108 1618 -6381 -7380 -963 6746 7166 563 -6481
1676 -6481 -8432 -3193 4542 8459 5839 -1170 -6906 -6652 -103 6281 5683 -1147 -7055 -5579 1976
1691 1976 7989 6706 -566 -6655 -6658 -1057 4031 5269 1827 -3262 -4969 -977 4519 5845 1630 -5287
1707 -5287 -7492 -3010 4405 7254 3009 -3547 -6447 -2677 3797 6942 3238 -4245 -8413 -5317 2440
1722 2440 8422 7045 -405 -6812 -6488 -521 5253 5804 566 -5915 -6744 -1329 5936 8721 4044 -4781
1738 -4781 -9192 -5690 2176 7360 5345 -1154 -5520 -3858 1571 5254 3664 -1705 -5267 -4217 -58
1753 -58 4114 4775 945 -3006 -3672 -353 3685 3541 -1064 -5167 -4405 1039 5559 4953 196 -4151 -3784
1770 -3784 41 3572 3041 -703 -3977 -4060 -7 5198 6586 2571 -4288 -7705 -4796 2514 7020 4374
1786 4374 -1826 -5608 -3609 2133 5703 3483 -2150 -5677 -4342 176 4868 5027 855 -3626 -4477
1801 -4477 -393 3759 4298 458 -4754 -5620 -1037 4725 6199 2416 -3258 -5633 -2146 3308 4956
1816 4956 622 -4464 -5349 -854 4870 6537 2463 -4029 -6543 -3845 1430 4923 4153 -805 -4668
1831 -4668 -3592 1591 5303 3869 -1454 -6264 -4678 1662 6001 4443 -818 -4974 -3602 1401 4969
1846 4969 3709 -1331 -5110 -4738 -370 4731 6057 2082 -3533 -5735 -2356 2989 5205 1901 -3938
1861 -3938 -6084 -1923 4500 7294 3944 -2751 -6858 -4997 586 5305 4568 92 -3571 -3456 216
1876 216 4015 3935 -424 -4675 -4714 -564 4463 5504 663 -5077 -5699 -177 6044 6132 -197 -7203 -7528
1893 -7528 -560 7031 8333 1902 -5715 -7924 -2580 4962 7970 3389 -5309 -9736 -4943 4878 11261
1908 11261 7686 -3102 -11445 -9408 856 10276 9345 -184 -8578 -8355 9 7818 8041 656 -7062
1923 -7062 -8354 -2571 5384 8579 3839 -4104 -8750 -4629 3679 8886 5251 -3650 -9799 -6058 3522
1938 3522 9485 6566 -2042 -8770 -6842 1462 7801 6936 -617 -7856 -8332 -1051 8083 10832 3641
1953 3641 -7266 -12161 -6300 5521 12644 7908 -3948 -11738 -7817 3130 10674 7751 -2609 -10417
1967 -10417 -8173 1634 9656 8704 -245 -9146 -9136 -811 8743 9678 1591 -8805 -10901 -2265 9132
1982 9132 12127 3183 -8833 -12605 -4275 7993 12804 5201 -7012 -12646 -6311 5857 13191 8679
1996 8679 -3824 -13096 -11078 988 11627 12269 2345 -9531 -12150 -3621 7175 10737 3679 -6197
2010 -6197 -9887 -3904 5633 9528 4460 -4528 -9141 -5163 3364 8492 5166 -3213 -8517 -5868 3399
2025 3399 9959 7096 -2981 -11248 -9215 1803 11514 11055 -200 -11606 -12326 -1331 11228 13874
2039 13874 3513 -11144 -16295 -6732 8894 16808 9753 -5348 -15655 -11468 2346 13510 11396
2052 11396 -1010 -11864 -10865 716 11162 10892 -311 -10617 -10353 -225 9636 9463 -131 -9422
2066 -9422 -9160 721 10233 10073 166 -10819 -12228 -2503 10283 14160 5258 -8994 -15030 -7023 7536
2081 7536 15600 9079 -5928 -16172 -12049 2737 15181 14549 1542 -12403 -15354 -4752 9183
2094 9183 14304 5907 -7518 -12888 -6176 6506 12752 6774 -5358 -12064 -7383 4176 11485 7466
2108 7466 -4421 -11505 -7244 5301 13225 8641 -5581 -15400 -11067 3852 16355 13938 -1093
2121 -1093 -15695 -16194 -1527 14944 17851 3967 -14220 -19681 -7136 12163 20433 10602 -8165
2134 -8165 -18836 -12744 4224 16172 13106 -1861 -14218 -12990 542 13071 12832 518 -11923
2147 -11923 -12695 -1639 10583 11715 1331 -9777 -10985 -1245 9970 11826 2047 -10687 -14070
2160 -14070 -4580 9849 15874 7588 -7698 -16286 -10087 5282 16032 12388 -2581 -15600 -14875
2173 -14875 -461 14448 16962 4489 -11998 -17760 -7330 8848 16461 8867 -6091 -14735 -9306
2186 -9306 4528 13767 9917 -3257 -12681 -9989 1950 11701 9505 -1795 -11124 -8478 2519 11245
2200 11245 8394 -3139 -11875 -9570 2379 12333 11519 143 -11547 -12697 -2142 10815 13698
2213 13698 3714 -9675 -14081 -5435 8141 13976 6983 -5763 -12922 -8517 2688 11242 8975 -1158
2227 -1158 -9292 -8952 -94 8436 8931 822 -7749 -8895 -1779 6454 8532 2453 -5680 -7801 -2468
2242 -2468 5626 7838 2788 -5510 -8661 -3900 5482 10452 5561 -4459 -10751 -7531 2836 10561
2256 10561 8466 -1723 -10270 -9473 -315 9489 10553 1603 -8898 -11151 -3334 7471 10899 4239
2270 4239 -6249 -10451 -4499 5436 9970 4980 -5140 -10031 -5524 4065 9707 5869 -3263 -9090
2284 -9090 -6127 2932 8855 5731 -3012 -9006 -6410 2461 9247 7639 -1339 -8842 -8738 -1114 7233
2299 7233 9155 2876 -6106 -9379 -3955 5075 9281 5049 -3645 -8811 -5756 2086 7704 6336 -163
2314 -163 -6303 -6488 -798 5600 6824 1765 -5108 -7681 -2758 4863 7671 3642 -3813 -7072 -4044
2329 -4044 2830 6470 3609 -2418 -6349 -4166 2351 6796 5190 -1698 -7465 -6014 735 6925 6469
2344 6469 -157 -6221 -6354 -299 5984 6208 872 -4876 -6255 -1418 4499 5947 1711 -3749 -5529
2359 -5529 -2134 3585 5431 1743 -3512 -5541 -2380 2625 5276 3339 -1429 -4542 -3577 591 3996
2374 3996 3313 -739 -4281 -3409 1076 4248 3528 -387 -3725 -3780 -858 2618 3635 2099 -1409 -3829
2390 -3829 -2371 944 3672 2924 -457 -3394 -3277 -123 2946 2857 246 -2120 -2345 -391 2112 2311
2406 2311 245 -2241 -2632 -562 2569 3380 840 -2273 -3542 -1186 2060 3248 1004 -2057 -3178
2421 -3178 -935 2654 3586 1356 -2237 -3646 -1911 1905 3743 2012 -1360 -2974 -2081 579 2609
2436 2609 2025 -271 -2049 -1988 -387 1317 2038 546 -1202 -1464 60 1283 1161 -406 -1482 -944 858
2453 858 1223 681 -248 -721 -532 -118 88 129 512 482 195 -180 -458 242 222 -129 -248 -572 -205 156 406
2474 406 303 90 37 -549 -911 -311 638 821 429 -493 -946 -470 126 718 752 112 -164 -680 -884 -229 530
2495 530 1184 930 -174 -856 -1190 -371 998 1111 237 -647 -1074 -223 961 1302 209 -947 -1365 -796
2513 -796 737 1431 603 -686 -1293 -465 1034 1642 418 -1564 -2214 -278 2130 2539 768 -2083 -3137
2530 -3137 -975 2171 3291 1243 -2064 -3803 -1826 1706 3828 2476 -1033 -3604 -2593 219 3343
2545 3343 3039 -100 -3215 -3078 -93 2777 3115 220 -3047 -3428 -933 2124 3232 1432 -1652 -2931
2561 -2931 -1554 1370 3103 1839 -1312 -3523 -2488 1078 3603 2945 -271 -3416 -3329 -124 3347 3704
2577 3704 324 -3150 -3998 -904 3066 4506 1990 -2632 -4737 -2719 1834 4910 3096 -1589 -4838
2592 -4838 -3274 1434 4649 3757 -825 -4846 -4230 19 4385 4644 720 -3755 -4736 -1092 3700 4949
2608 4949 1265 -3877 -5434 -2005 3552 5796 2815 -2861 -6084 -3361 2100 5836 3891 -1793 -5812
2623 -5812 -4415 1454 5472 4931 -143 -5131 -5361 -700 4408 5406 1614 -3528 -5301 -2271 3023 5671
2639 5671 3036 -2001 -5290 -3716 1463 4887 3844 -614 -4196 -4262 -132 3967 4137 112 -4045 -4727
2655 -4727 -595 4081 5155 979 -4080 -5193 -1402 3985 5426 1881 -3784 -5869 -2679 3426 6004
2670 6004 3310 -2617 -6166 -4380 1572 6259 5050 -1039 -5887 -5318 96 5629 5846 854 -4828
2685 -4828 -5977 -1780 4008 5900 2210 -3003 -5447 -2562 2394 4957 2590 -2159 -4903 -2987 2288
2700 2288 5340 3345 -1860 -5373 -3958 1671 5390 4038 -1323 -5676 -4293 780 5633 5369 262
2715 262 -5384 -6011 -1110 4905 6582 2395 -4124 -6767 -3333 3134 6716 4175 -2037 -6613 -4968
2730 -4968 1137 5725 5030 -194 -5086 -5012 -248 4416 4687 422 -4352 -4865 -553 4382 5558 1118
2746 1118 -4567 -6146 -1617 4463 6480 2304 -4355 -7100 -3067 4224 7437 4109 -3310 -7630 -5210
2761 -5210 2048 7424 6228 -593 -6661 -7208 -1149 5782 7523 2371 -4916 -7417 -3026 3601 6725
2776 6725 3635 -2536 -5841 -3773 1521 5168 3605 -1272 -4859 -3604 1244 4775 3925 -1222 -5265
2791 -5265 -4388 1011 5461 4896 -295 -5381 -5461 -121 5522 5898 923 -5347 -6764 -2291 4727 7603
2807 7603 3544 -3491 -7714 -4912 2176 7308 5739 -761 -6456 -6263 -235 5468 6164 1212 -4532
2822 -4532 -5837 -1856 3307 5263 2181 -2842 -4598 -1911 2635 4548 2024 -2600 -4867 -2275 2707
2837 2707 5435 3035 -2420 -5508 -3248 2255 5473 3705 -1652 -5613 -4419 950 5416 5046 232
2852 232 -4773 -5815 -1701 4038 6220 3042 -3136 -5855 -3381 2343 5540 3737 -1623 -4904 -3827
2867 -3827 759 4119 3528 -94 -3373 -3221 223 3333 3535 93 -3792 -3814 -63 4090 4129 706 -3889
2884 -3889 -4647 -1181 3320 4749 1745 -3061 -5200 -2555 2585 5475 3362 -1677 -5248 -4413 578
2899 578 4908 4671 345 -4374 -4823 -1119 3867 4917 1615 -2627 -4739 -2214 2102 4225 2317 -1474
2915 -1474 -3611 -2361 1146 3265 1854 -1074 -3259 -2233 1076 3046 2671 -581 -3360 -2950 0
2930 0 3095 3209 191 -3404 -3262 -587 2860 3425 995 -2676 -3883 -1734 1788 3844 2495 -1310
2946 -1310 -3921 -2737 692 3814 3077 -498 -3558 -3295 -102 3000 3321 789 -2344 -2788 -957 2161
2962 2161 3206 1066 -1832 -2914 -1463 1830 3273 1473 -1415 -3332 -2024 719 3053 2382 -570
2977 -570 -3036 -2535 69 2603 2646 -42 -2597 -2927 -679 2269 2863 905 -1900 -2880 -1142 1240 2361
2994 2361 1208 -1048 -2763 -1712 727 2561 2020 -413 -2768 -2198 607 2544 1807 -503 -2574 -1912
3010 -1912 5 2129 2226 325 -1863 -2650 -945 1411 2949 1376 -1293 -2856 -1678 1141 2780 1771
3026 1771 -687 -2528 -2012 435 2337 2131 160 -1826 -2189 -866 1576 2346 716 -1780 -2224 -1047
3042 -1047 1321 2352 1238 -879 -2110 -1365 791 1702 1264 -415 -1977 -1638 186 1836 1878 -188
3058 -188 -1884 -1900 -264 1583 2213 699 -1411 -2430 -1169 992 2215 1227 -600 -2104 -1851 436
3074 436 1957 1594 -23 -1342 -1813 -401 1346 1693 643 -1150 -1649 -556 922 1598 630 -957 -1510
3091 -1510 -722 767 1409 586 -686 -1476 -715 577 1601 1264 -400 -1694 -1626 20 1600 1918 483
3108 483 -1468 -1940 -510 1468 1894 980 -943 -1976 -1073 312 1946 1619 -63 -1577 -1824 -392 1411
3125 1411 1773 606 -1142 -1634 -593 877 1471 757 -475 -1159 -754 551 1417 792 -343 -1339 -971
3142 -971 692 1507 963 -389 -1556 -1193 514 1662 1237 -323 -1522 -1637 -86 1369 1857 801 -1219
3159 -1219 -1910 -887 1078 2195 1348 -939 -1849 -1683 222 1770 1849 180 -1730 -1872 -530 1171 1905
3176 1905 667 -1042 -1755 -730 888 1552 900 -827 -1720 -1039 695 1642 919 -741 -1431 -1179 723
3193 723 1640 1084 -300 -1507 -1533 -134 1611 1645 410 -1496 -1891 -675 1327 2071 1114 -1232 -2077 -1022
3211 -1022 826 2079 1354 -377 -1885 -1534 -109 1222 1569 483 -1238 -1498 -561 1021 1547 442
3227 442 -1105 -1491 -517 871 1606 443 -1044 -1691 -597 928 1759 976 -888 -1551 -1001 422 1704
3244 1704 1343 -389 -1611 -1489 130 1628 1763 365 -1587 -1947 -531 1315 2148 719 -1241 -2045
3260 -2045 -1026 462 1548 1383 -363 -1542 -1474 4 1416 1432 144 -1313 -1579 -299 1285 1504 431
3277 431 -879 -1428 -233 1038 1590 430 -1032 -1573 -697 942 1567 747 -543 -1363 -1022 533 1435
3294 1435 974 -324 -1387 -1214 82 1429 1456 -17 -1216 -1463 -506 1284 1458 729 -667 -1360 -908
3311 -908 454 1382 988 -467 -1331 -924 414 1563 1165 -26 -1312 -1148 77 1208 917 203 -1031
3328 -1031 -1168 -262 897 1339 416 -639 -1437 -675 677 1215 545 -569 -1407 -995 452 1245 899 -346
3346 -346 -1447 -1360 70 1276 1295 307 -978 -1506 -529 600 1274 728 -487 -1312 -686 421 1247 947
3364 947 -111 -1281 -1029 201 856 665 -44 -658 -581 -18 415 636 199 -593 -941 -49 748 931 99
3383 99 -744 -866 -148 806 1252 309 -841 -1474 -479 903 1439 872 -509 -1344 -993 3 1012 1112 -56
3402 -56 -960 -1297 -614 475 1032 646 -353 -1163 -867 49 806 698 -32 -510 -541 176 562 263 -114 -455
3422 -455 -275 445 560 206 -379 -758 -298 366 807 508 -295 -1186 -812 74 1138 1576 423 -720 -1267
3441 -1267 -706 519 1210 928 -274 -1030 -876 -274 671 1141 237 -429 -928 -555 258 889 622 -44 -252
3460 -252 -391 -215 444 112 -82 -196 -27 244 268 91 -315 -348 -193 234 582 115 -407 -832 -784 138 821
3481 821 971 -21 -966 -1080 -192 448 1032 529 -378 -811 -716 -137 862 1202 510 -424 -967 -729 18 685
3501 685 800 148 -523 -454 -103 115 362 491 -24 -295 -132 25 30 62 24 -175 -24 127 227 -186 -404 -287
3523 -287 306 766 297 -269 -791 -705 -136 567 1033 205 -314 -896 -512 141 483 834 182 -600 -1078 -640
3543 -640 160 908 638 130 -921 -843 19 587 639 441 -240 -423 -251 -81 334 293 39 -14 -207 -23 166
3564 166 186 -128 -210 -115 273 302 52 -481 -534 108 300 565 268 -115 -828 -327 72 471 692 75 -546 -983
3586 -983 -502 633 1109 637 -454 -876 -604 59 873 795 39 -382 -788 -279 453 506 342 -239 -365 -235
3606 -235 285 370 96 -268 -560 -225 350 683 217 -531 -469 -207 491 788 482 -87 -758 -449 137 882 675
3627 675 -13 -811 -843 15 896 987 273 -721 -1234 -513 624 941 632 -247 -880 -795 239 744 660 -192 -747
3648 -747 -847 -29 787 797 35 -772 -1064 -428 780 920 219 -642 -913 -255 677 979 374 -552 -778 -344
3668 -344 184 798 642 -188 -789 -777 212 1043 781 -109 -960 -966 -112 730 989 330 -697 -1085 -212 865
3688 865 1002 406 -405 -885 -465 382 876 723 -404 -1036 -679 253 894 909 -84 -1205 -1062 205 1014
3707 1014 989 167 -785 -1038 -245 753 703 276 -581 -876 -649 455 883 636 -330 -1110 -622 284 929 958
3727 958 -312 -1110 -762 263 1175 822 -116 -915 -723 12 916 878 61 -676 -1086 -320 779 1002 492
3746 492 -719 -1330 -692 512 1353 755 -429 -1419 -850 393 1243 833 -123 -1010 -1023 -107 901 1171 195
3765 195 -814 -1176 -343 724 1205 515 -763 -996 -344 541 991 534 -722 -1150 -588 461 1082 337
3783 337 -575 -1155 -822 355 1376 849 -1 -1073 -1252 -86 1325 1367 -20 -1102 -1330 -296 930
3800 930 1511 468 -716 -1217 -784 382 1347 719 -269 -937 -831 230 1128 785 -87 -853 -839 10 970
3819 970 967 -183 -998 -825 5 989 868 65 -926 -1024 -170 830 1167 398 -685 -1485 -603 767 1679 590
3839 590 -469 -1301 -1001 428 1268 1215 -28 -1089 -1159 -75 930 978 274 -818 -1290 -243 740 957
3857 957 268 -661 -994 -156 630 865 381 -708 -1118 -474 445 1285 541 -842 -1193 -632 581 1180 686
3876 686 -368 -1350 -969 274 1251 1140 181 -1075 -1230 -181 908 1294 593 -674 -1322 -608 438 1223
3894 1223 661 -623 -1237 -554 153 1114 623 -109 -912 -698 186 805 988 -130 -851 -726 176 956 843
3913 843 68 -800 -834 -128 847 1219 405 -765 -1160 -472 676 1103 466 -649 -1233 -637 667 1160 955
3932 955 -166 -1061 -777 163 958 931 160 -705 -585 -250 631 804 -109 -692 -767 -300 616 945 220 -360
3952 -360 -824 -492 726 868 596 -374 -952 -620 603 933 502 -191 -866 -514 308 824 593 -133 -813
3971 -813 -769 55 648 847 197 -562 -860 -400 682 728 383 -508 -728 -242 337 686 330 -373 -753 -357
3991 -357 224 636 551 -352 -518 -417 181 816 655 -51 -651 -414 140 837 674 -139 -659 -553 40 601
4011 601 738 -213 -561 -761 -226 566 773 144 -438 -798 -301 255 754 430 -457 -799 -503 -11 1028 527
4031 527 -118 -932 -678 235 546 607 -187 -556 -663 -168 608 670 -220 -291 -687 -61 354 451 98 -228 -594
4052 -594 -176 614 558 104 -462 -617 -350 494 680 349 -555 -727 -459 -19 774 458 -15 -608 -495 -127
4072 -127 344 544 169 -560 -701 -122 300 702 368 -263 -603 -166 281 429 126 -374 -489 -259 345 656
4092 656 454 -169 -554 -235 87 718 130 -404 -719 -552 397 880 634 -49 -926 -866 -71 705 794 117 -612
4113 -612 -849 -316 524 714 261 -271 -729 -277 124 335 385 -4 -524 -252 259 282 221 -345 -548 -292 518
4134 518 292 400 -221 -501 -178 130 705 377 -118 -663 -717 6 668 744 263 -657 -1030 -410 492 905 368
4155 368 -275 -595 -447 267 619 691 139 -374 -541 -185 216 286 103 -357 -448 135 402 359 -130 -521 -523 294
4177 294 664 507 -258 -629 -449 -71 634 848 5 -616 -629 -150 715 732 307 -489 -830 -523 334 866 545
4198 545 -141 -588 -803 105 525 598 46 -397 -495 -151 382 331 112 -342 -169 -75 338 307 127 -245 -657 -137
4220 -137 309 556 207 -512 -439 3 310 596 388 -405 -739 -588 276 571 526 18 -849 -748 3 766 529
4241 529 100 -425 -763 -171 358 884 410 -370 -916 -101 482 458 386 56 -509 -412 116 561 376 -193 -469
4262 -469 -459 218 658 323 -9 -794 -324 282 644 556 -146 -678 -704 -19 690 584 36 -400 -555 -95 352
4283 352 592 252 -386 -631 -352 86 479 199 70 -513 -400 405 450 438 -75 -557 -294 21 387 212 -41
4304 -41 -326 -532 61 304 367 202 -321 -594 -95 431 513 316 -364 -794 -471 206 836 364 -96 -632 -568
4325 -568 138 661 531 -68 -719 -611 306 385 689 19 -435 -811 -214 379 443 39 -558 -512 -235 433 378
4346 378 23 -632 -742 -150 372 496 36 -401 -501 -203 348 470 435 -44 -454 -364 47 567 263 -127 -494
4367 -494 -423 4 205 307 -33 -499 -556 -41 93 428 188 -431 -483 -464 221 449 196 -104 -361 -394 77 408
4389 408 511 30 -475 -474 293 523 341 196 -397 -529 100 29 621 250 -288 -517 -329 270 613 217 -319
4410 -319 -630 -271 233 398 240 -245 -604 -270 370 549 105 -320 -902 -252 423 539 398 -322 -453 -347
4430 -347 181 501 656 49 -476 -646 94 447 245 268 -238 -482 -328 90 434 321 -158 -329 -197 114
4450 114 239 291 47 -309 -137 138 172 164 -25 -132 -311 -85 447 268 -140 -431 -317 -47 391 285 125
4471 125 -351 -612 -143 371 492 178 -244 -683 -274 74 437 359 -293 -498 -514 -2 559 355 -103 -488 -272
4492 -272 -88 246 323 -81 -144 -172 303 278 293 -173 -383 -487 228 482 410 174 -342 -410 41 360 208 240 -436
4515 -436 -404 1 289 464 333 -318 -361 -482 -93 522 385 55 -544 -201 -20 227 222 117 -184 -294 4
4536 4 203 315 249 -123 -221 -41 26 366 161 -241 -277 -59 82 462 93 -326 -562 -257 -55 562 242 -158
4558 -158 -453 -411 66 533 545 206 -339 -309 127 404 431 -46 -341 -462 -271 286 316 257 -229 -598 -103 106
4580 106 303 53 -198 -302 -99 136 497 -30 -230 -97 19 127 174 221 -235 -456 -145 -58 271 444 54
4601 54 -407 -232 -140 228 388 165 -313 -237 -125 276 288 -6 -212 -477 -186 136 419 309 65 -45 -191
4622 -191 80 203 199 35 -88 -167 23 311 276 -167 -363 -328 36 423 372 61 -420 -299 28 288 423 -6
4644 -6 -224 -525 -105 17 440 211 -340 -380 -191 21 327 226 -180 -323 -221 133 167 159 41 -261 -79 292
4666 292 181 274 -78 -189 11 23 470 4 -203 -256 -143 -76 378 252 129 -205 -103 75 337 99 107 -254
4688 -254 -140 -122 11 367 72 -143 -413 -258 144 180 129 63 -484 -322 -111 243 359 -49 -378 -106 40
4709 40 375 496 32 -297 -498 -294 506 603 -16 -417 -320 108 119 480 178 -366 -352 -80 116 243 305 -267
4731 -267 -270 -427 49 461 281 -130 -575 -398 130 484 541 61 -244 -545 -7 350 446 53 -319 -217 -368
4752 -368 82 498 220 -171 -549 -288 131 375 333 -58 -153 -156 23 323 43 0 -525 -249 134 274 480 83
4774 83 -186 -379 -186 323 367 -17 -93 -491 -191 271 581 153 -82 -405 -142 65 407 538 -114 -357 -197
4795 -197 -149 351 262 19 -184 -315 -29 263 510 -205 -249 -378 -194 428 378 237 -466 -421 -338 281 548 80
4817 80 -63 -291 -95 315 156 250 -120 -382 -465 174 606 529 -43 -453 -481 -22 256 656 201 -281 -333 -241
4839 -241 137 254 220 -197 -340 -171 24 403 213 -112 -379 43 7 216 -14 -150 -299 -181 53 526 369
4860 369 -213 -441 -357 -31 307 447 20 -291 -512 -23 300 508 411 -132 -559 -445 141 422 265 -320 -360
4881 -360 -299 -21 532 213 256 -318 -351 -8 497 160 82 -255 -452 61 245 263 -75 -189 -200 2 266 476
4903 476 -42 -323 -369 -240 302 429 226 -198 -300 -274 74 259 349 -282 -485 -554 -88 223 477 164 -304
4924 -304 -545 -246 265 406 -47 -112 -196 -232 65 200 268 -79 -87 -69 -26 98 70 -171 -217 -338 229 116 253
4947 253 -85 -117 -240 -211 413 258 137 -459 -593 -133 301 558 182 -105 -340 -29 88 316 196 -194 -287
4968 -287 -338 97 479 223 -196 -312 -254 156 144 224 64 -182 -241 -63 302 112 -85 -95 -213 -111 107 202
4990 202 -98 -221 -590 -251 203 347 51 -194 -327 -111 158 404 386 -29 -337 -212 -314 512 148 -11
5010 -11 -171 -135 -92 -19 143 163 -61 -121 25 4 304 72 46 -382 -365 28 226 286 -176 -352 -362 4 344 395
5034 395 -103 -289 -205 -94 237 175 101 -45 -322 -146 158 326 249 -144 -170 -272 211 240 221 -253 -300 -40 -7
5057 -7 275 230 -84 -441 -374 -33 277 239 285 -71 -232 -250 215 110 324 79 -320 -162 -23 203 77 -3 -359
5080 -359 -222 15 119 344 -169 -131 -315 6 225 228 -117 -181 -82 21 183 30 121 -34 -247 -46 116 311
5102 311 240 -221 -243 96 138 185 148 110 -202 -209 4 -23 266 63 -167 -253 186 238 221 75 -76 -237 -153 96
5126 96 158 153 -62 -256 -101 65 185 112 167 124 25 -191 118 0 -65 -72 -283 42 -64 147 -107 -40 -110 110
5150 110 15 -128 96 -51 -6 63 -112 228 146 -98 29 -97 -56 -22 253 124 -347 -38 -179 81 71 184
5172 184 -120 -23 -155 81 -9 27 135 26 -39 -96 -233 -46 102 14 85 85 6 -117 -5 -67 42 48 -222 -139 -58
5197 -58 -8 87 -56 95 -311 -41 -173 -14 -24 -131 49 190 -27 -123 -91 -50 127 182 20 -119 -201 -170 4
5220 4 107 94 135 145 112 3 -40 58 202 145 -106 12 74 -104 -60 -118 -55 104 -179 -119 -36 195 176 58 152 -55
5246 -55 45 277 114 -4 42 12 -102 29 -93 -145 -5 349 -40 -14 -206 -252 -97 -56 62 69 -43 33 -83
5269 -83 -235 -26 92 47 -102 -302 53 57 221 36 21 189 -155 -162 168 -4 -56 89 -145 48 64 -64 33
5292 33 -196 -38 -72 152 8 -40 -137 -190 38 99 117 -132 -205 -369 -7 -2 157 32 -214 -182 -177 -140 180 48 225
5317 225 -393 -233 -88 120 397 101 -40 -211 -162 -90 77 187 -115 -157 -137 90 41 306 139 -138 -77 -130
5339 -130 -34 17 19 39 -150 -81 235 201 -104 -175 -89 -34 172 240 137 -113 -63 3 186 257 381 215 -137 -265 61
5364 61 204 332 -7 -36 -125 -59 41 35 -71 -114 -63 -119 97 246 219 -132 -60 1 -5 262 150 -27 -85 -98 72
5389 72 130 204 -52 105 -162 -59 239 45 255 -123 -191 -324 104 309 -259 -113 -227 -168 122 275 4 84
5411 84 -288 -83 85 44 140 -211 -265 14 -30 384 238 61 10 16 -106 180 268 1 -94 -313 -135 35 495
5434 495 -7 74 -127 -241 202 375 272 7 -180 45 96 192 13 -70 -277 -125 -76 263 370 124 -289 -130
5456 -130 31 103 151 95 -172 -183 -87 58 372 253 -109 -386 -154 -79 129 134 -47 56 -57 31 -68 116 26 -145
5480 -145 25 59 127 42 212 83 -62 -169 -286 -35 177 33 -87 -265 1 55 223 -9 -179 -114 27 26
5502 26 152 64 9 -144 49 74 102 174 -129 -78 -190 50 89 218 -45 -329 -134 2 -128 219 108 -36 -196
5525 -196 80 -107 14 165 58 -248 -90 134 96 -231 -91 -86 -51 96 238 -83 -242 -59 6 37 243 34
5547 34 -82 -3 -62 -133 -22 32 -46 -161 -84 -88 -19 210 86 -139 -290 -215 126 43 -144 154 -94 -46 -187 -72
5571 -72 268 160 32 -67 -62 190 -134 272 -85 -134 179 142 38 -18 -333 -41 -78 144 356 -164 -157 -46 74
5594 74 -62 -15 370 139 -111 -230 33 146 167 54 -68 -287 -277 84 -121 76 64 -56 -154 25 -17 120
5616 120 211 -77 -113 175 23 7 20 -202 72 -124 195 54 -98 204 -269 -9 291 66 -146 -300 -174
5637 -174 -164 48 154 152 -143 -183 -331 -131 58 262 78 -254 -365 -26 157 322 210 -117 -226 -378 -81
5658 -81 117 477 183 -134 -121 -89 294 131 -101 -25 -160 131 -41 135 -148 1 -112 103 67 56 79 27 -277
5681 -277 20 -84 290 85 -191 -131 -251 -29 17 168 -234 -136 -264 -122 266 210 -198 -117 -117 -83 -46 147 103
5704 103 131 -347 -121 69 145 386 -78 -394 41 123 228 149 85 -171 -344 -22 232 -42 -130 -30 -259 -88
5726 -88 -16 165 -51 -225 37 -188 42 196 -29 86 -267 -181 -34 -49 194 -140 -249 -200 167 -30 137 172
5748 172 -90 -353 -89 371 250 321 -117 -142 -428 169 259 195 -164 -165 -339 47 163 3 -139 -265 -305 -110
5770 -110 102 327 215 -109 -223 -90 18 294 147 -21 -185 -49 14 113 171 -195 -76 -91 33 371 89
5791 89 -151 -438 -280 259 110 134 -203 -177 -143 -193 296 219 160 -267 -399 -250 77 106 247 -23 -287 -321 138
5814 138 257 293 -68 -136 -186 76 128 243 26 -334 -153 -42 92 132 67 -220 -7 84 430 199 63 -214
5836 -214 -318 -143 -77 250 50 -26 -59 -116 124 290 50 -38 -456 -257 -256 65 237 120 -503 -439 -115 312 453
5859 453 -33 -98 -256 -338 -46 223 277 83 -171 -226 -43 66 191 -9 -233 -138 -35 145 33 -6 -288 -139
5881 -139 204 213 228 88 -179 -323 6 279 397 -49 -107 -284 -234 197 155 123 -11 -303 -241 78 293 193 79
5904 79 -171 -66 -1 135 93 163 -162 -37 -205 22 43 102 -20 -465 -233 -41 103 -20 -257 -208 -46 27 165
5927 165 75 -110 -519 -308 -109 198 210 -74 -213 -472 -231 158 301 64 -297 -275 -106 207 206 612 -8 -491
5949 -491 -293 129 361 190 125 -396 -156 -26 159 242 172 -142 -253 -114 42 188 154 -62 -199 146 54 233
5971 233 137 -181 -317 -283 28 379 159 -67 -329 -149 216 432 253 -25 -308 -315 5 243 371 72 -347
5992 -347 -276 -408 391 10 70 -209 -391 -289 256 319 270 -85 -358 -302 -7 302 -86 97 -396 -264 70 275
6014 275 242 -83 -159 -390 48 215 222 26 -179 -479 -17 297 173 81 -121 -345 -297 34 387 265 -226 -376
6036 -376 -125 292 305 163 -37 -22 -335 -92 238 257 -75 -73 -162 92 182 233 94 -62 39 -123 207 261 -79
6059 -79 -88 -211 -112 239 327 262 -14 -192 -186 -136 328 215 -90 -99 -108 17 113 141 210 -160 -568 -219 43 168 -99
6084 -99 -115 -42 -92 101 385 316 -212 -87 -84 -213 225 49 -31 -202 -47 45 112 137 -118 -250 -256 27 177 80 244
6109 244 -122 -205 122 -85 74 -112 -218 -172 -128 165 77 76 -196 -120 21 56 97 79 -127 -158 -73 222 14 201
6133 201 -149 -105 -312 123 230 37 208 -237 -351 -81 121 -33 33 -40 -140 -48 72 21 -25 -256 -282 159
6155 159 96 144 174 -324 37 26 107 55 58 34 -174 -213 68 161 110 85 -113 50 -231 189 96 -20 -157 78 -111
6180 -111 -25 195 112 -79 -125 67 143 230 31 14 97 -83 109 15 85 177 -74 162 -57 111 207 70 171 275
6204 275 103 -127 -133 48 -224 -5 113 178 -115 69 122 -265 44 94 -64 109 117 -32 -225 25 14 115 -118
6227 -118 -78 -1 -12 24 6 121 -51 -126 272 45 -51 -33 70 152 -75 -129 -73 -2 -220 -79 -17 30 174 -95 1
6252 1 -127 73 33 212 -30 18 134 -1 99 -40 203 -85 -17 -273 11 -200 20 29 24 79 -207 -44 -190
6275 -190 51 76 82 109 70 -226 -100 -5 -48 200 -44 5 -103 68 320 277 -31 -90 28 -126 -13 157 22
6298 22 229 -142 -85 58 -19 46 18 -86 -205 -117 54 241 76 84 -141 61 51 145 -15 -67 -49 -311 66 272
6322 272 117 115 -130 -122 23 -29 -7 -113 78 -244 31 -13 210 84 -31 -359 -159 153 292 101 32 -105 39
6345 39 -67 -166 63 -71 -166 10 28 98 233 -337 -19 -110 -129 105 110 -8 -152 -130 94 27 96 159 -78 -165 -18
6370 -18 50 151 226 -73 -175 -151 19 176 79 40 -93 -109 -8 44 79 -81 -216 -458 -31 63 365 247 -90
6393 -90 -265 -17 105 78 36 -65 -104 -92 58 142 78 -168 -133 -174 -121 234 18 90 -138 -186 -88 169 235 -2 -136
6418 -136 -102 -182 130 115 24 -140 -198 75 172 340 183 -71 -260 -200 228 305 169 153 -104 -189 116 144 260 80
6442 80 -25 -22 -279 156 207 211 -167 -263 -129 -14 258 -24 90 -146 -127 171 399 182 -158 -167 -358 -45 351
6465 351 94 37 -228 -235 154 167 278 117 -122 -66 56 222 375 -11 -396 -176 101 237 364 126 -230 -184
6487 -184 -143 7 270 177 -174 0 -338 69 100 400 -125 -227 -245 -29 256 77 154 -98 -181 -15 36 -9 202
6510 202 -125 -36 -43 -86 123 220 -96 -243 -113 45 246 51 -19 -105 -89 -159 181 74 59 -239 -311 -129 180 372
6534 372 212 -82 -592 -123 -114 143 62 -20 52 -321 -32 103 193 56 -222 -143 78 127 198 -17 -231 -74 310
6557 310 254 22 96 -141 -283 -232 281 -71 79 -72 -124 -155 154 229 230 -11 -541 -287 -32 185 299 -124 -128
6580 -128 -301 26 349 249 100 -166 -448 -98 126 102 193 -99 -357 -286 15 116 157 6 -50 -96 -95 115 -115
6603 -115 -89 -184 -61 127 145 145 28 -308 -331 -232 162 339 87 -216 -241 -112 185 308 35 -12 -164 -202 253
6626 253 251 148 11 -346 1 127 190 182 52 -197 -72 -114 59 86 -40 -127 -195 -323 204 215 -208 -125 -102 -58
6650 -58 192 200 -3 -233 -152 -173 377 141 32 44 -157 -268 -172 78 81 11 -214 -189 127 -62 186 116 -138 -323
6674 -323 -21 -40 118 53 41 -13 -72 57 170 193 -234 -76 -123 -134 349 159 -155 -218 -30 94 234 -66 -161
6697 -161 -180 -298 78 139 231 -44 -158 -421 -146 215 554 43 -254 -336 -210 268 225 161 5 -66 -98 26 148
6720 148 148 -284 -254 -197 -24 273 150 87 -90 -38 -18 17 0 136 -193 -158 -84 129 20 142 45 -120 -64 58
6744 58 131 217 80 -136 -129 112 -24 276 -76 -130 -360 -186 47 18 45 109 -109 -25 107 181 183 -295 -179 -28
6768 -28 162 294 118 -27 -118 38 78 212 91 27 -83 -43 62 144 260 -36 -131 -244 -106 153 36 -64
6790 -64 -124 -215 142 7 247 1 -78 -268 111 105 186 24 -94 -268 4 -40 109 43 60 -12 -89 -52 112 172 -9
6815 -9 -86 -277 69 -114 -13 -51 -35 15 88 -60 213 -184 27 -140 18 327 235 154 -47 -39 -217 194 343 -28
6839 -28 -73 -193 172 143 -240 115 -107 -134 -169 -43 58 159 50 -15 -57 50 11 12 -27 -88 -157 -21 6 3 -36 -79
6865 -79 -31 -89 31 13 -25 157 -60 91 -59 -78 132 -302 -21 71 15 -94 75 64 -46 -90 -103 50 41 101 -10
6890 -10 79 -108 -43 -49 -8 185 -71 -293 9 -45 -12 -191 -27 -94 -163 -148 130 161 141 33 -25 -93 8 -164 -31
6915 -31 -127 -200 129 -131 -1 114 15 23 -137 108 40 -57 94 107 -3 62 24 -36 15 -58 14 -1 -23 115 -13 -208
6941 -208 -55 94 -45 87 36 -51 -63 -32 82 158 45 -95 -144 -72 -269 -8 -26 275 35 95 -16 160 -13
6964 -13 96 -59 -224 42 127 253 -33 52 -128 163 89 53 -37 71 286 98 111 91 -139 -36 -233 56 -22
6987 -22 101 40 8 -30 17 -19 71 46 62 -377 77 8 121 181 -17 -41 -62 115 -155 -131 -55 150 -72 79 -67
7012 -67 -35 -52 -44 -60 -21 -113 -1 9 -118 -86 228 81 46 -75 -43 -40 100 28 39 -106 137 54 9 86 -71 16 -6
7039 -6 3 38 65 -389 106 -213 0 6 69 -13 -105 216 120 116 -17 71 -288 -189 -185 128 82 85 32 147 -73 221 80
7066 80 22 -86 -345 14 142 205 51 68 -103 -29 107 87 178 -56 -184 45 -101 -38 29 40 43 -58 59 103
7090 103 19 16 46 -205 70 -229 166 34 110 -92 -138 42 207 37 -134 42 46 -157 -143 297 -115 7 -78
7113 -78 -196 208 -67 -50 21 -152 -322 35 233 73 249 -77 -28 64 107 -11 56 41 -202 -147 -23 194 7
7136 7 -81 -127 -85 18 188 66 68 -18 -4 49 -56 -157 -55 -136 0 -8 76 -98 13 -172 23 -46 199 41 10
7161 10 -78 -147 27 -110 39 33 -54 -52 -119 34 53 40 72 -125 -3 -139 11 65 -35 210 -250 20 145 114 -2
7186 -2 0 -228 -40 -66 -72 -27 -39 -102 25 -114 128 124 -230 -185 -68 45 46 14 141 -42 70 93 -106 -168 12 -205
7212 -205 60 134 184 -36 44 -92 -27 -84 190 174 72 94 69 -184 -17 54 -7 -123 -51 -26 -27 105 46 21 36 -78
7238 -78 109 47 -78 14 -50 26 -124 33 117 -143 -69 -213 15 23 -228 -47 -257 -32 2 132 -80 -129 76 -139
7262 -139 -122 110 143 -4 -160 0 -348 57 -48 72 113 228 -209 -318 -151 59 106 7 80 92 69 44 -178
7285 -178 -17 -83 -102 17 275 26 -254 -119 -203 -213 104 195 -122 -169 82 138 204 130 -107 -78 -214 -5 35 33
7309 33 89 59 -52 -192 53 61 233 -18 -239 -171 143 -169 88 -40 22 -50 -60 137 -84 82 -366 36 89
7332 89 183 233 142 -69 -77 40 -44 -110 224 -102 -208 111 187 -59 28 -94 -121 -83 55 178 30 54 -78 -56 253
7357 253 111 125 -70 -23 -54 124 10 -58 17 -67 -96 19 64 -163 -48 -15 -33 -72 48 -10 72 16 -25 -62 236
7382 236 205 20 28 -245 -60 90 191 124 -82 3 -145 125 8 -32 113 -56 -152 -60 -33 -21 -15 -91 -41 -10 190
7407 190 -180 58 -204 -215 -26 216 118 126 0 -209 32 -97 40 -56 67 -225 -128 205 102 14 -144 -37
7429 -37 -174 162 105 278 -125 -69 151 -42 -60 67 167 -116 128 -162 6 -6 -130 144 -167 -174 21 184
7451 184 158 -36 -51 183 66 208 154 170 -104 241 89 31 178 213 65 -379 7 75 -158 97 97 -209 -67
7474 -67 51 -116 192 91 -179 -13 -18 -162 -78 39 -202 -86 -68 6 -97 249 -22 -105 -169 108 102 -6 -109
7497 -109 53 31 247 -53 -140 62 -16 -85 4 -72 106 -7 -20 206 99 -177 164 -45 -19 61 -90 153 -131
7520 -131 6 -60 220 -14 117 160 -6 28 -95 -14 -17 -52 88 -18 -151 -52 46 -24 43 66 159 -278 28 137
7544 137 68 -119 176 -229 24 -67 -106 -183 6 104 -185 -24 -116 25 -118 -241 1 65 83 -29 -271 82 246
7567 246 -83 105 -18 34 -249 47 66 -265 3 -63 -138 -98 -200 -154 -36 -15 110 -9 87 -132 -65 60 37
7590 37 -71 220 91 22 168 147 -162 -200 179 54 53 -69 137 129 -64 110 -159 -5 28 -31 -166 136 -3
7613 -3 75 -214 104 -207 -99 -37 147 148 25 -19 -87 53 13 -139 -12 -59 40 -59 -78 -53 -81 -86 -102 252 55 40
7639 40 105 -164 107 -169 -113 -17 42 44 -106 -102 -9 -200 -156 29 37 62 46 123 -51 45 -16 84 24 18 -172 88 87 125
7667 125 -57 150 -18 63 -113 22 55 67 148 -28 -143 -101 91 -110 57 38 -10 171 60 -55 -106 -57 -291
7690 -291 -73 -99 -21 -22 75 100 24 -8 153 -25 101 18 -33 -20 54 151 -98 18 -71 255 94 -224 153 -81 74
7715 74 365 -80 -149 112 197 -95 -1 137 279 11 2 55 -25 230 -150 -46 16 47 188 -79 154 7 -30 25
7739 25 -36 118 1 -39 3 -39 -89 212 -99 28 -3 105 -177 -111 195 -89 -127 -139 -72 109 63 160 100 98 19 39
7765 39 -79 -14 28 130 1 39 -125 9 65 52 -33 -181 -113 -16 19 -101 168 -224 82 80 -47 -1 138 26
7789 26 -166 13 -254 63 -70 -84 102 132 -59 177 7 68 -31 -145 69 238 -16 46 -58 -60 -17 -98 -93 -100 -146
7814 -146 -71 63 132 -2 95 60 -285 -114 45 146 -96 -79 -39 9 62 195 -61 -41 40 148 42 83 -1 44
7838 44 25 -271 -25 -40 -67 -16 -47 48 -56 222 -28 -139 22 2 -8 98 144 -125 11 -1 -85 -64 142 113 0
7863 0 -160 -173 131 260 -196 58 -172 -94 -23 114 -145 -42 -93 -76 118 -159 -21 5 84 47 42 -203 81 19
7887 19 28 72 42 -87 -151 99 -91 51 57 130 -200 -22 -192 -198 -67 132 -127 49 144 -180 -59 -152 -32 31 3
7912 3 309 -244 -94 -61 -211 278 144 -69 -41 -193 -74 130 87 58 -94 4 60 -64 177 145 140 -66 158 28
7936 28 -98 -50 -149 46 -96 -21 190 -48 -70 -130 -48 -8 95 94 -80 208 106 -74 -46 34 -64 -98 -3 14 -77 -99
7962 -99 -6 156 113 0 23 -55 -35 34 -119 -74 0 80 73 -14 129 -4 -9 -33 42 -9 179 -47 -6 -156 -67 -4 -28
7989 -28 -27 42 95 0 -30 84 -38 -91 48 116 -25 -163 -38 -104 49 87 -80 17 -12 -62 -243 250 -109 -108 155
8014 155 -64 -32 2 -46 -160 190 203 -188 -24 132 242 -83 -160 115 -169 276 -222 -67 -30 -36 -147 66 -153
8037 -153 -74 34 -82 -44 73 -70 146 71 112 -81 159 287 37 -61 127 -128 -196 -40 151 -86 -176 -145 -117
8060 -117 -3 85 -178 151 -55 41 -14 49 -179 69 -114 97 6 -56 81 -10 95 14 -41 94 -229 209 -110
8083 -110 -33 -63 79 3 34 56 -52 -17 219 4 -198 92 -120 -10 76 -20 -116 -169 -112 20 21 5 -91 24 -22
8108 -22 -312 50 92 -167 120 -64 128 -185 19 29 40 -111 1 50 -56 -13 152 -81 -20 -102 135 -20 62
8131 62 1 38 -25 -85 31 -17 119 -172 2 -39 242 198 142 -80 60 -30 31 -158 -135 131 -245 -32 -121 -4
8155 -4 56 -259 -218 204 -108 254 27 -54 -280 -129 123 -92 -214 -64 -27 -182 -64 35 -124 126 -273 -17
8177 -17 -60 -63 203 62 -169 -6 127 161 102 -80 142 62 22 -108
8191a08
##END NTUPLES=NMR FID
##END=
