##TITLE=1H_Pr OSt
 CDCl3
 8 sc, 
 21.09.2022
##JCAMPDX= 6.0         $$ Bruker NMR JCAMP-DX V2.0
##DATA TYPE= NMR FID
##DATA CLASS= NTUPLES
##ORIGIN= UXNMR, Bruker Analytische Messtechnik GmbH
##OWNER= root
$$ XWIN-NMR		Version 3.5
$$ Wed Sep 21 15:41:20 2022 Russian Standard Time (UT+4h)  she@DPX200
##.OBSERVE FREQUENCY= 200.1313499994
##.OBSERVE NUCLEUS= ^1H
##.DELAY= (6, 6)
##.ACQUISITION MODE= SIMULTANEOUS
##.ACQUISITION SCHEME= undefined
##.AVERAGES= 8
##.DIGITISER RES= 18
##SPECTROMETER/DATA SYSTEM= spect
##.PULSE SEQUENCE= zg30
##.SOLVENT NAME= CDCl3
##.SHIFT REFERENCE= (INTERNAL, CDCl3, 0, 15.7039)
##AUDIT TRAIL= $$ (NUMBER, WHEN, WHO, WHERE, WHAT)
$$ ##TITLE= Audit trail, XWIN-NMR		Version 3.5
$$ ##JCAMPDX= 5.01
$$ ##ORIGIN= Bruker BioSpin GmbH
$$ ##OWNER= she
$$ F:/spectra/data/she/nmr/H-F/1/audita.txt
$$ ##AUDIT TRAIL=  $$ (NUMBER, WHEN, WHO, WHERE, WHAT)
(   1,<2022-09-21 15:40:22.17 +0400>,<she>,<DPX200>,
      <created by zg, POWCHK disabled, PULCHK disabled
       configuration hash MD5:
       00 E9 B6 7A A2 85 ED C7 34 08 36 98 17 FE 4E 26
       data hash MD5: 16K
       99 67 38 6B E8 AD EE D6 D4 BD 77 F8 D4 C4 42 F3>)
$$ ##END=
$$ 
$$ hash MD5
$$ CC B8 08 EC 65 DF CF D7 0A 0B 9A 63 3A BD B6 0F
##$RELAX= 
##$RELAX= 
##$RELAX= 
##$RELAX= 
##$RELAX= 
##$RELAX= 
$$ Bruker specific parameters
$$ --------------------------
##$DU= <F:/spectra>
##$EXPNO= 1
##$NAME= <H-F>
##$PROCNO= 1
##$TYPE= <nmr>
##$USER= <she>
##$AMP= (0..31)
100 100 100 100 100 100 100 100 100 100 100 100 100 100 100 100 100 100 
100 100 100 100 100 100 100 100 100 100 100 100 100 100 
##$AQSEQ= 0
##$AQ_mod= 1
##$AUNM= <au_zg>
##$AUTOPOS= <>
##$BF1= 200.13
##$BF2= 200.13
##$BF3= 200.13
##$BF4= 200.13
##$BF5= 200.13
##$BF6= 200.13
##$BF7= 200.13
##$BF8= 200.13
##$BYTORDA= 1
##$CFDGTYP= 0
##$CFRGTYP= 5
##$CHEMSTR= <none>
##$CNST= (0..31)
1 1 145 1 1 1 1 1 1 1 1 1 1 1 1 1 1 1 1 1 1 1 1 1 1 1 1 1 1 1 1 1 
##$CPDPRG= <>
##$CPDPRG1= <>
##$CPDPRG2= <>
##$CPDPRG3= <>
##$CPDPRG4= <mlev>
##$CPDPRG5= <mlev>
##$CPDPRG6= <mlev>
##$CPDPRG7= <mlev>
##$CPDPRG8= <mlev>
##$CPDPRGB= <>
##$CPDPRGT= <>
##$D= (0..31)
0 1.2 0 0 0 0 0 0 0 0.06 0 0.03 0 0 0 0 0.0002 0 0 0 0 0 0 0 0 0 0 0 0 
0 0 0 
##$DATE= 1663760421
##$DBL= (0..7)
120 120 120 120 120 120 120 120 
##$DBP= (0..7)
150 150 150 150 150 150 150 150 
##$DBP07= 0
##$DBPNAM0= <>
##$DBPNAM1= <>
##$DBPNAM2= <>
##$DBPNAM3= <>
##$DBPNAM4= <>
##$DBPNAM5= <>
##$DBPNAM6= <>
##$DBPNAM7= <>
##$DBPOAL= (0..7)
0.5 0.5 0.5 0.5 0.5 0.5 0.5 0.5 
##$DBPOFFS= (0..7)
0 0 0 0 0 0 0 0 
##$DE= 6
##$DECBNUC= <off>
##$DECIM= 32
##$DECNUC= <off>
##$DECSTAT= 4
##$DIGMOD= 1
##$DIGTYP= 9
##$DL= (0..7)
0 120 120 120 120 120 120 120 
##$DP= (0..7)
150 150 150 150 150 150 150 150 
##$DP07= 0
##$DPNAME0= <>
##$DPNAME1= <>
##$DPNAME2= <>
##$DPNAME3= <>
##$DPNAME4= <>
##$DPNAME5= <>
##$DPNAME6= <>
##$DPNAME7= <>
##$DPOAL= (0..7)
0.5 0.5 0.5 0.5 0.5 0.5 0.5 0.5 
##$DPOFFS= (0..7)
0 0 0 0 0 0 0 0 
##$DQDMODE= 0
##$DR= 18
##$DS= 0
##$DSLIST= <SSSSSSSSSSSSSSS>
$$ [...]
##$SUBNAM2= <"">
##$SUBNAM3= <"">
##$SUBNAM4= <"">
##$SUBNAM5= <"">
##$SUBNAM6= <"">
##$SUBNAM7= <"">
##$SUBNAM8= <"">
##$SUBNAM9= <"">
##$SW= 18.0517283424941
##$SWIBOX= (0..15)
0 0 2 0 0 0 0 0 0 0 0 0 0 0 0 0 
##$SW_h= 3612.71676300578
##$TD= 16384
##$TD0= 1
##$TE= 0
##$TE2= 300
##$TE3= 300
##$TEG= 300
##$TL= (0..7)
0 120 120 120 120 120 120 120 
##$TP= (0..7)
150 150 150 150 150 150 150 150 
##$TP07= 0
##$TPNAME0= <>
##$TPNAME1= <>
##$TPNAME2= <>
##$TPNAME3= <>
##$TPNAME4= <>
##$TPNAME5= <>
##$TPNAME6= <>
##$TPNAME7= <>
##$TPOAL= (0..7)
0.5 0.5 0.5 0.5 0.5 0.5 0.5 0.5 
##$TPOFFS= (0..7)
0 0 0 0 0 0 0 0 
##$TUNHIN= 0
##$TUNHOUT= 0
##$TUNXOUT= 0
##$USERA1= <user>
##$USERA2= <user>
##$USERA3= <user>
##$USERA4= <user>
##$USERA5= <user>
##$V9= 5
##$VALIST= <valist>
##$VCLIST= <CCCCCCCCCCCCCCC>
##$VD= 0
##$VDLIST= <DDDDDDDDDDDDDDD>
##$VPLIST= <PPPPPPPPPPPPPPP>
##$VTLIST= <TTTTTTTTTTTTTTT>
##$WBST= 1024
##$WBSW= 4
##$XGAIN= (0..3)
0 0 0 0 
##$XL= 0
##$YL= 0
##$YMAX_a= 60574
##$YMIN_a= -99415
##$ZGOPTNS= <>
##$ZL1= 120
##$ZL2= 120
##$ZL3= 120
##$ZL4= 120
##$ABSF1= 10
##$ABSF2= 0
##$ABSG= 5
##$ABSL= 3
##$ALPHA= 0
##$AQORDER= 0
##$ASSFAC= 0
##$ASSFACI= 0
##$ASSFACX= 0
##$ASSWID= 0
##$AUNMP= <proc_1d>
##$AZFE= 0.1
##$AZFW= 0.1
##$BCFW= 1
##$BC_mod= 2
##$BYTORDP= 1
##$COROFFS= 0
##$CY= 11.3945322036743
##$DATMOD= 1
##$DC= 2
##$DFILT= <>
##$DTYPP= 0
##$F1P= 2.36226072786647
##$F2P= -0.459571619588291
##$FCOR= 0.5
##$FTSIZE= 0
##$FT_mod= 4
##$GAMMA= 1
##$GB= 0.15
##$INTBC= 1
##$INTSCL= 1
##$ISEN= 128
##$LB= 0.24
##$LEV0= 0
##$LPBIN= 0
##$MAXI= 10000
##$MC2= 0
##$MEAN= 0
##$ME_mod= 0
##$MI= 1.114404
##$NCOEF= 0
##$NC_proc= 0
##$NLEV= 6
##$NOISF1= 3.799351
##$NOISF2= 2.8
##$NSP= 1
##$NTH_PI= 0
##$NZP= 0
##$OFFSET= 15.70392
##$PC= 1
##$PHC0= -18042.72
##$PHC1= 23.20069
##$PH_mod= 1
##$PKNL= yes
##$PPARMOD= 0
##$PSCAL= 0
##$PSIGN= 0
##$REVERSE= no
##$SF= 200.130013532006
##$SI= 16384
##$SIGF1= 3
##$SIGF2= 2
##$SINO= 400
##$SIOLD= 16384
##$SREGLST= <1H.CDCl3>
##$SSB= 0
##$STSI= 0
##$STSR= 0
##$SW_p= 3612.71676300578
##$SYMM= 0
##$S_DEV= 0
##$TDeff= 0
##$TDoff= 0
##$TI= <>
##$TILT= no
##$TM1= 0
##$TM2= 0
##$TOPLEV= 0
##$USERP1= <user>
##$USERP2= <user>
##$USERP3= <user>
##$USERP4= <user>
##$USERP5= <user>
##$WDW= 1
##$XDIM= 8192
##$YMAX_p= 0
##$YMIN_p= 0
$$ End of Bruker specific parameters
$$ ---------------------------------
##NTUPLES= NMR FID
##VAR_NAME=  TIME,          FID/REAL,        FID/IMAG
##SYMBOL=    X,             R,               I
##VAR_TYPE=  INDEPENDENT,   DEPENDENT,       DEPENDENT
##VAR_FORM=  AFFN,          ASDF,            ASDF
##VAR_DIM=   8192,          8192,            8192
##UNITS=     SECONDS,       ARBITRARY UNITS, ARBITRARY UNITS
##FACTOR=    0.0002768,     1,               1
##FIRST=     0,             0,               0
##LAST=      2.2672688,     0,               0
##MIN=       0,             -99415,          0
##MAX=       2.2672688,     60574,           0
$$ Real data points
##PAGE= N=1
##DATA TABLE= (X++(R..R)), XYDATA
0@%%%%%%%%%%%%%%%Qj6J6j6J6k4L2l2M0m8N6o4P2q8J00j11J27j47J67j87K12k39
37a26K66k97L34l72M13m60N10n64O23o89P61q39R23j015J118j233J361j502J662
56H74j844K048k284K562k891L288l779M408n247O423q205J1265j7956O2121n3535
71b752p7568R9498K4145m0682j4841J7954j6330J2705J5668k1084k3165K4438
83b014J5894r521j2603j932J889J3575L9j2685o29J0722m524l171R117m17j1139
98g399O607Q584r268k609J3483k788r561R505N566j7635j719K1031n67k1322J071
113g021J3683o645j1411R521P709j3140n451J4972K236j6982K530K0321n275j8722
127a3675Q570J7388q486j0455J0861N715j2296k066J1042J812p047r53J754k369
$$ y = [0, 0, 0, 0, 0, 0, 0, 0, 0, 0, 0, 0, 0, 0, 0, 0, 8, -8, 8, -8, 8, -16, 16, -16, 24, -24, 32, -32, 40, -48, 52, -59, 68, -79, 88, -99, 113, -126, 140, -157, 177, -195, 218, -242, 268, -296, 327, -362, 399, -440, 483, -532, 586, -647, 714, -788, 874, -970, 1078, -1206, 1356, -1535, 1753, -2026, 2382, -2865, 3558, -4647, 6618, -11338, 50783, -2752, -80320, 19178, 43323, 2641, -12200, 5754, -10576, 2129, 17797, -3287, -26452, -2014, 13880, 4359, -8244, -10176, -8287, 5288, 5327, -7358, -7987, 2735, -1789, -4960, 4157, 3740, -7399, -792, 7792, -1476, -4085, 9398, 6610, -2951, 6554, 12120, -5515, -7234, 13797, 13230, -8092, -7021, 6662, 17, -11394, -1873, 5836, -7304, -12755, 2217, 4453, -12529, -9999, 10322, 5047, -13675, -5105, 12283, 3797, -6658, 4203, 9918, -2378, -4444, 6598, 8410, 1363, 410, 2164, -205]
141b05k94K486p59j973J482N39l229k960J071M472J954n431l369M284O83m725
157e974L473P525n978o599Q572M743p747J601R262m468q731O675O672o891l495
172a360O926K11q860j144N725Ol127Q44j006l996Q82N238j107l718J938L986j851
189d13l264P42L847K238j173k563n12J994J829O28l15j696j322J268J725r30p66
206A317J321j662k511J701J944m075j400N370p04p887L19O775j290l749M192J382
222A043n728M80P096k67l430K003J852k564M07K422m50l13L03j174j415N42r7
239G10o3J007j242l870J036K516j398j127K239p00l089J438J945j545N13L207
255A577r35l721Q11L332R44M4j58j408m48K269J021j514k6J086r02j688r53J248
$$ y = [-205, -499, 1987, 1228, -745, 737, 1276, -1953, -4913, -3842, 630, 2584, -2847, -6216, -1932, -1249, -5974, -2501, 5024, -954, -7553, 1019, 5762, -1985, -384, 8878, 4410, -4321, 2354, 9026, 2135, -1360, 5566, 5777, -3083, -4227, 1498, 1504, -1623, -779, -1785, -5781, -4899, 339, -768, -4486, -2548, 1438, -413, -3677, -2935, 912, 3150, 1977, -586, -1098, 896, 2725, 3353, 3038, 1342, 20, 1288, 3013, 2083, 1317, 2638, 976, -1535, 166, 2110, -1965, -3365, 2005, 1301, -6586, -6267, 508, -782, -4531, -339, 1043, -4685, -4205, 2891, 2624, -806, 1197, 3049, 485, 892, 3314, 2864, 2551, 2854, 1680, 265, 807, 710, 647, 1654, 412, -3458, -2422, 94, -1304, -2431, -192, -892, -3981, -2543, -598, -2143, -1630, 1577, 642, -3079, -2268, 1064, 2008, 2052, 1894, 486, 38, 2307, 3328, 1814, 1788, 2874, 1972, 284, -669, 579]
273E79O37j233p56m40r98j473J555K077j228j548N65J95q74J746K463l78j305
290d16N22N26QR72J413j43j333j178O74J360k74j231K65M78j906j551J620Q21
308F27j874K20P27k127j628K617J638j351q00L23m19J3J781R59r4P8n07L8J390
327A611R39j21l98J85r21o98P01M94r91P2l04j195o52J48r4P25j95j351j146P76
347b415Q49M34R75J03j481p19K181J040k94P26J62p86k09O75L13P22k00j030K1
366A067oj129J7J867m28k496n62R03j013k25J663k33j637o01R50R2N24J194k0
385g3o98J16L35J405R43l78n22L70J75j066P53J043m29j087k66l69m94j48M44
404E4n8n79p52j034M82Q93Rkrj054p34K028J491p12m98Q79l40l56J295N38K02
$$ y = [579, 1216, -17, -773, -1213, -2211, -3684, -2129, -52, -1280, -2828, -2263, -2068, -2942, -1196, 1267, 889, -416, 106, 632, 640, 1612, 3025, 2882, 1549, 371, 1045, 2405, 2131, 900, 1165, 1643, -263, -1814, -194, 627, -1247, -1027, -300, -2427, -4055, -1438, 200, -1151, -1951, -1628, -2047, -2034, -253, 706, 612, 690, 183, 221, 1611, 2550, 2429, 2031, 2216, 1295, 597, 1298, 1792, 801, 873, 569, -626, -1278, -1130, -1224, -499, -694, -2045, -3191, -2415, -1566, -1132, -157, -54, -1535, -2254, -73, 967, 673, 1399, 1561, 775, 566, 1241, 1554, 2276, 2076, 1046, 1067, 1061, -68, -51, 1816, 1388, -1108, -1670, -767, -1780, -2005, -342, -575, -2212, -2813, -1863, -1771, -1247, -53, -73, -771, -655, -320, 1085, 2028, 1650, 1128, 1498, 1673, 607, 1360, 2403, 1974, 887, 621, 252, -242, -390, 54, -4, -583, -1335, -2369, -1887, -994, -985, -987, -996, -2050, -2784, -756, 735, 23, -475, 404, 64, -292, 1003, 1541, 1743]
425A743J69j7r98m09Q21K14j30O78k073j387Q95J283j968k81J385j520j528Q89
443b234J732m36j67N65j027p56J648J949n75m90L04J72m2P56J48K39N77o81j666
462A6K38Q57m63l67J052n49k463k20J266O39j185n1J1j329NJ670J225q61j020
481a529L71O98O04K58M40L31K68o52l14O09N29L58K23j57j699j661J396J512r44
500F41j703O40M04j682o69J411M54q54n39K31J69N15P39Q9K81m34j82J366R14
519A791n50l35R23J6j603L2J585K15o83o33j08q43l89L07M37K40j312q05k3K62
539a476r0O71O29j141l94Q94J695j032l41J003K43P0j39J58O32Q00n39j012k33
558C98M44m7Q68J7j366j121k3N11l49K42N83j023j124j19M68O72N61k65q03O08
$$ y = [1743, 1912, 1895, 897, 488, 1309, 1523, 1393, 2071, -2, -1389, -494, 789, -1179, -1460, -75, -1595, -3123, -2234, -502, -938, -1105, -540, -1567, -2323, -675, 1274, 699, 209, 513, 685, 643, 1399, 1547, 1786, 2363, 1682, 16, 254, 1111, 648, 281, 1333, 784, -1679, -1899, -633, 6, -1179, -1230, -1219, -2548, -2543, -873, 352, -509, -1529, -1158, -460, 144, 402, 842, 1173, 1441, 789, 475, 1084, 1613, 1971, 2194, 2037, 338, -1323, 73, 1585, 641, -1062, -422, -18, -1700, -2369, -958, -504, -1358, -1897, -1666, -1497, -982, -243, -154, 127, -307, -489, 877, 1791, 1241, 906, 1829, 1845, 242, 274, 1859, 2074, 1391, 758, 650, -193, -582, -275, 162, 402, -910, -1715, -1738, -1476, -1566, -895, -266, -1407, -1801, -907, 788, -244, -585, 418, 661, 731, 592, 750, 1382, 2182, 1643, 631, 398, 842, 795, 1663, 1680, 314, -807, -830, -319, -668, -426, 157, -866, -1990, -2109, -1641, -969, -408, -673, -1476, -868]
578h68R36m21K50O58M02m7j25o4M54R05n4j110m06N50n90k84J167o2j052r43k01
599i05o24K07J255j20j291j93J49l31Q91O84n6K83L77m25n82J092J134j61m04
618I80L51k66l95O60Q14r89j125L0L76l56K56O4o23j057l22K80N26L34k42o54
638a358J89k3k02K27J620r8q06N61O52o81j10J497J005j690o48J039J50o39O89
657A374M21j538o81kJ78J73L49r61j046K54J99N6M68O16j010n27J104K21m52O64
677a40J295j29j026L53M55o60J028J014o85j261M47j99O2L20j59o45l85m74l12
696a101N32O75r32j077N26N82m40m3R67O0k42p2J51J18Q66L75N95l86q46M4J083
717A435L15o32J20j29j062k63Q42K32o83o20l91m59L60J77q3M6l03j06k74O60
$$ y = [-868, 68, -353, -103, 555, 957, 910, 785, 721, 1175, 2080, 2026, 916, 510, 1060, 470, 186, 1353, 1291, 239, -704, -905, -1529, -1322, -67, -187, -1478, -1671, -1522, -1853, -962, -278, -334, -51, 326, -99, -681, 411, 1545, 1384, 980, 1331, 1065, 670, 1330, 2144, 1155, 30, 60, 436, 80, 336, 400, -223, -1280, -1602, -1322, -796, -462, -704, -1358, -1169, -1192, -1394, -1167, 453, 355, -451, 110, 762, 81, -29, 1468, 2473, 783, 135, 1174, 1324, 685, 1374, 1795, 257, -424, -426, -248, -75, 274, -687, -1733, -1479, -1280, -1224, -756, -140, -1150, -1677, -573, -352, -804, -140, 1155, 1026, 0, 353, 808, 148, 1176, 2190, 1505, 244, 691, 492, 554, 874, 715, 70, -315, -789, -1101, -569, 106, -826, -1903, -1377, -795, -1235, -1278, -311, -251, -493, -565, -414, -296, 570, 945, 1540, 1154, 308, 352, 1435, 1750, 1118, 1238, 1109, 47, -216, 626, 858, 175, -445, -836, -1295, -935, -758, -841, -795, -1098, -1204, -1478, -818]
737h18L63l45Q94M89r50j98J058L52J49M65K38j224k40R26L97k54k31m54o70Q9
757C6j6p2R7k47r97k19P99j50l61L20O37n39p81M67P41K65L15J96q9n35K22J134
779A223M27k43n81N0n89J30P90M7p03p26o35N63O2k35j35j9k38p48K30O61k35
800i04n3K93M03n86j47J153N67m7k11K31l17r8Q97M58N6n89o70k62K30K64l94
821B74k66j46n93l00K81L89n59k16M86m81m96L32R44J88Nr0l14J42M17P75N26
842A298m28l43k74O44L46j26Q3L5q90n07L85K08k80n77J63l94k83k78K94J05J17
863g02k36k88K37j02N17P96K07o35j43L80O11K40M11km38j59nL73J84m75k33m20
885A18j56k98rQ03q33l85p1m6k91j46J122l9m36j36j54J60P00N93j42j55j03K04
$$ y = [-818, -455, -800, 94, 583, -367, -565, 493, 845, 994, 1459, 1697, 473, 233, 1159, 1556, 1302, 1071, 617, -53, 36, 20, -52, 45, -202, -1199, -1418, -619, -769, -1130, -810, -173, -712, -1493, -1026, -285, -20, 295, 491, 402, -133, 89, 1223, 1650, 1407, 826, 876, 287, 417, 1207, 1254, 551, -175, -810, -247, -185, -420, -555, -574, -812, -1560, -1330, -669, -904, -957, -664, -261, -847, -994, 159, 726, 679, 468, 699, 382, 284, 1181, 1639, 1695, 1106, 436, 174, 404, 668, 274, 8, -138, -731, -1031, -750, -361, -920, -1136, -650, -1131, -1627, -1295, -351, -163, -158, -248, -562, -420, -3, 772, 1298, 870, 527, 253, 897, 1243, 1117, 1200, 1235, 345, -162, 223, 431, 151, -426, -263, -657, -940, -1218, -924, -819, -702, -938, -1226, -989, -1091, -574, 222, 429, -206, -349, 31, 642, 882, 1293, 1291, 853, 694, 689, 1062, 1246, 771, 538, 118, -38, -336, -345, 458, -375, -760, -831, -877, -1168, -1314, -192, -231, -667, -803, -957, -797, -97, 496, 354, 199, 96, 300]
907C00M87N32k16k21j47l28R2n0N41l75n78k44O0m12l97P39l63P4l42j88j7J2
929a041N69R8M4l08k64L80R05L79l75R0R6j69j7J055j23l11k30k90k09m0K43k4
951D58k15n38m11J47j23l27J83L67j67p81K72K13P79j04J50Ll11L47P67L90n62
972E37m8N7J18J59M6J72l39l19l01k74M21m0j12l9l71o95j42L15M15k00J5J42
994d83l57l51R02L32o1j9M94m37j71R07L54k00k3j54m26K42O93m21m89m0l94m47
1016e49M03M00q23K5O98p05j141N30P63J24l40J75k35k67P19M91M5R6J34l17J31
1037C57P04k92k61J73K39p23J42N90l07q90O06P9j210O2N92j9p11M29k69n59j26
1058a394P43P32l1l30l22Q9N04M64J21K43q5j11l04M38J36l37P5L40n51k99N0
$$ y = [300, 787, 1319, 1103, 882, 735, 407, 499, 449, 990, 615, 37, -207, -147, -559, -956, -217, -580, -506, -848, -1036, -1053, -1041, -472, -374, -330, -638, -902, -522, 383, 762, 387, 477, 573, 404, 387, 1442, 1319, 1008, 778, 488, 279, 239, 482, 458, 243, -295, -706, -559, -682, -1009, -826, -459, -626, -1407, -1135, -922, -143, -247, -97, -94, -405, -58, 709, 1099, 537, 489, 546, 664, 823, 869, 1041, 702, 383, 82, -192, 229, 189, 77, 38, -333, -1028, -1170, -855, -440, -640, -625, -483, -840, -1191, -289, 43, -18, -37, 457, 20, -151, 756, 1110, 910, 887, 733, 307, 549, 1242, 821, 332, 292, -102, -549, -146, 254, -569, -544, 154, -551, -1692, -1162, -399, -275, -615, -440, -675, -942, -223, 268, 313, 409, 543, 226, 357, 1061, 769, 508, 681, 920, 197, 339, 929, 622, -268, 338, 417, -793, -731, -139, -158, -869, -440, -709, -1268, -1394, -651, 81, 50, -280, -602, -513, -9, 455, 576, 819, 734, 623, 319, 757, 893, 556, 631, 971, 420, 121, 171]
1079A71J86n79J12j73k98k92J40L64N60p50n16n5L61J48M49K28j12k92n0N57J79
1100C38Q64l77Qk89L29k81L42J30j95l49j17m86n87J34O26j13r80K66k37k61O63
1121e72O28l18o84J5N03J65M64K13l56p7M29l52L05N76L12n90k27N25o88r8O29
1142H02J0o13p3q8q74oR72n3q25k74J16k6M16J83J18m49K06M59J06J09N02o72
1164D6L68N3P1l25M94M95r11J09K54l46o74Q06L1k97o02j77R1o0K59K55n98l32
1186i90L99m63P65L06k31k67K92K72l11M25O65m47k92M61jk30K50M16k79n44j6
1207A80m9m42M58J29n45M6m68k9J44K92N5o20L44k2k55N17L93J8l41J77L85k66
1229A01K10J68M05o9n77L41L2Kj69J29j44p31r8N09Rk47q5k68m29R5M9L83L01
$$ y = [171, 357, -222, -110, -283, -581, -873, -733, -369, 191, -559, -1075, -1130, -769, -621, -172, 56, -56, -348, -398, 159, 338, 1202, 825, 833, 544, 873, 592, 934, 1064, 869, 520, 403, -83, -670, -536, 90, -23, -1003, -737, -974, -1235, -572, 56, -262, -946, -931, -428, -263, 201, 414, 58, -19, 410, 58, 363, 939, 1251, 661, 434, 959, 271, 173, 802, 812, 199, 126, 38, -836, -842, 130, 77, -748, -1022, -906, -932, -516, -333, -215, -664, -458, 1, 107, 216, 718, 46, 414, 467, 538, 213, 707, 1202, 291, 400, 654, 308, -366, 440, 471, 174, -428, -605, -514, -574, -315, -60, -658, -990, -591, -1054, -289, 17, -214, -481, -189, 83, -228, 197, 862, 415, 123, 584, 583, 353, 603, 1019, 740, 196, 180, 131, -311, 147, 276, -269, -223, -691, -720, -576, -284, -229, -849, -505, -527, -782, -265, 128, 146, -195, -18, 367, 101, 311, 479, 884, 815, 238, 579, 611, 613, 444, 573, 429, -302, -400, 109, 118, -129, -214, -482, -911, -816, -767, -384, -83]
1252h3m70n08P13L95l99j35R13k10j65K69J93K13l76M29J13l82l25K40k4j15M5
1273C31k60m20O5j97K73Oj73l53m6J71j13K70o9L92m53J42M83L22l20L03L26l68
1295C12Q7k6P9J76J97k9l35p1l57K64m2K7l56m17J07l89J65L24k8l66o1n1N26
1318b64M1J34N1K28l93K10M31m7N8J99j34j31j85L44K51l8k27m24k57L77n39M00
1340H5N9j83n62k32L13K33j17l43M61k87K9L60J86j79q9L94J04j34K11J05L84
1361G98nj84j45k55J32j04L49Lo50j10o7J90L7K6k96m67J56m5M16j00l9k53L99
1384b14p5j04O59K25j06j46n6J61J94k6J70j46k3k72J03j32L57j64k09n17k86
1405f07J44K13j36K82m83j58J54j99K70J65P0Q5p8L14j85J32M36Q4J84j21m39
$$ y = [-83, -553, -1061, -348, 47, -352, -487, 426, 216, 51, 320, 513, 726, 350, 779, 892, 510, 185, 425, 401, 286, 331, 71, -349, -284, -481, -208, -202, -375, -728, -774, -603, -716, -446, -515, -123, -576, -434, 49, 371, 51, 354, 680, 312, 399, 373, 452, 628, 825, 796, 461, 390, 33, 297, 255, 282, -74, -491, -384, -773, -608, -284, -312, -678, -739, -790, -264, -223, -89, -38, 190, -203, 7, 438, 391, 449, 648, 514, 383, 198, 542, 793, 755, 528, 104, -153, 224, -315, 85, 144, -39, -601, -833, -520, -287, -404, -747, -286, -573, -544, -184, 2, -177, -266, 128, 232, 98, 309, 414, 798, 793, 609, 464, 209, 341, 237, 586, 589, -61, -171, -238, -48, -11, 15, -281, -748, -592, -637, -221, -321, -360, -613, -214, -289, -393, 266, 491, 385, 239, 183, 344, 538, 512, 682, 536, 513, 241, 344, 212, 569, 405, 196, -321, -607, -463, -250, -386, -104, -587, -745, -591, -790, -520, -355, -285, -200, -278, 36, -149, -17, 419, 503, 687, 566, 127]
1426A27K1L40K34J94k25o82K10j11m5L4J05l84j83k5M3J96O5m72J06j37K67k61
1448e83K70O00j90k63n7L76J50k63O47k24k10q2J07K84J0j35l9j48m11K3L27j42
1470D7l84k28O1j57J03l1K10m3P9k98K98l6K30L50J7K70l37j44L40K35r1J73Q0
1493G44Q1o13J63M06l74n00J82p0l33j33N89l17m22N2j00k8J14K94J21K17l43
1514b70k06K26N26K49l31K36p0k31J04M31Mp7O9o85J35r2K46L37p68J36k66r3
1536c90K20N8k26j80M43n44m0L93K44l66K35K56l14j25O25K53k64K37l1k64L22
1557E42l5K8P7j50m14J33J84m09j18J53j85l44L2L37N0n79K13K96j32k08L78Q6
1579f5L1J60M2j84R5L78j88L92j14o15L62n6J95l57J74M1l28k61L52J02k81j27
$$ y = [127, 148, 488, 722, 916, 691, 9, 219, 108, 63, 97, 202, -182, -365, -390, -347, -151, -86, -558, -452, -589, -322, -583, -313, 287, 97, -166, -223, 153, 303, 40, 687, 463, 253, 171, 278, 562, 572, 437, 398, 250, -161, -138, 189, 47, -337, -565, -504, -661, -558, -589, -379, -422, -343, -641, -343, -379, -149, 201, 218, 488, 151, 7, 347, 582, 491, 664, 744, 825, 212, 375, 781, 407, -93, 89, 19, -314, -447, 142, -175, -597, -545, -645, -673, -559, -265, -144, 73, -270, -476, -250, 276, 525, 194, 430, 360, 129, 233, 664, 668, 591, 660, -25, 110, 18, 264, 601, -167, -31, -297, -390, -170, -112, -338, -518, -75, -619, -659, -266, -22, -388, -153, 103, -211, -336, 289, 542, 278, 515, 484, 220, 542, 507, 535, 612, 462, 48, 181, 365, -44, -162, -9, -194, -538, -506, -169, -119, -698, -485, -189, -321, -529, -151, -65, -34, 126, 168, -16, 79, 457, 269, 661, 547, -68, 294, 238, 433, 76, 250, 291, -37, -298, 54, 156, -125, -252]
1601b52j88k07J50K20Ok53J86L5q7M17l65L47K23K83p81J91L19L03RJ09l80O2
1623C47j22J84PP7l63N5p0k73j92J59pj54J93l99j90K44p7N6M20lk00K85J43j38
1647a8M56o7J6M9k08M84K1n7j53j37j76j94L3p3J86k03n03M65l70n4K05J42k41
1670c97n3J34j35j98O92J45k61M6j53K42K19L1K8j06J73L6o3J46Q4n12k46M12
1692B64j59j36n2K43k26j74O9K5m83L20N0M7q7M1r3J55N41j11j28L9j15J32J77
1715C39M73k65k37n6K72l64O1n3K62k98l57R8k23J37q4lk6J7k42K45K10k33N1
1738b76R6ml3J08M13p4k58M09k41J96Q7J0P7j48K7k60RJ37o7j45l07k5J05j20
1762b84n4J18n9rl31N2K6K08K56J6j42L23j75Q6r5K64K35l01L4M70j20m10K54
$$ y = [-252, -440, -647, -497, -277, -271, -524, -338, -303, -390, 27, -338, 9, 232, 515, -266, -75, 244, 547, 556, 665, 285, 347, 225, 409, 416, 493, 130, 185, 115, -158, -350, -191, -198, -352, -159, -558, -748, -504, -581, -525, -105, -108, -308, -23, 120, -18, 438, 371, 387, 436, 228, 712, 733, 676, 523, 386, 210, 16, 49, -24, 162, -41, -544, -79, -449, -503, -298, -156, -397, -450, -316, -451, -649, 43, 188, -73, -27, -180, 62, 281, 312, 340, 234, 407, 443, 380, 526, 610, 98, -148, 264, 105, -31, -83, 160, -66, -240, -171, -146, -629, -309, -259, -212, -299, -258, -351, -196, 345, 234, 106, 145, 30, 162, 339, 812, 547, 310, 254, 526, 162, 223, 170, 432, 134, -223, -125, -348, -211, -295, -298, -324, -307, -549, -304, -94, -327, -276, -180, -184, -217, -109, 304, 230, -28, 381, 140, 336, 423, 433, 510, 362, 389, 129, 138, 275, 208, 63, -244, -269, -164, -284, -338, -220, -279, -288, -619, -567, -541, -333, -77, -61, -203, 120, -55, 31, -64, 200, 435, 134, 168, 638, 518, 108, 362]
1785C62R0l59R0J41k80j7j77q7j84l1m0K60q1R5R6j45k28N5j3N93J93m09m1KL82
1810B67o9J78o1P2k39J35J62J70k50j45o2j84m30M52o5j40J22j54j7k69K48j70
1832d49L03j7l37J01N1J51K96j14K33j32MK29j57K18n6l7K08j86j18OK03j97o7
1855A36k73j86K7P4Nj35k14J97j77K21P1K66M6l91pK71L19j14J20K03j24j49P9
1878B65K21n8R5k29O9p8q4r9N6j85K7m41J46O9j24K24M0k70N3N1O8M7r0J60N6
1903a1k41K86K64j81K20j51n5K21k14J92j04k7J96j19j78o5Q3p2j2j17k71k54
1925f10J67L51k26J80m5q4m6J00L0J52k29J16L48q3j14O04p9k08p4r7M52m85n5
1948F5J60ml11j69J08k11J92N4k57N5l1r9K14J50k3k86J46n7J38M4M67r5k17M2
$$ y = [362, 452, 93, 183, 324, 44, 27, -150, -237, -421, -452, -492, -232, -313, -218, -122, -267, -495, -440, -453, 140, 333, -76, -117, -115, 267, 198, 376, 315, 387, 148, 283, 445, 615, 365, 220, 158, -26, -456, -4, -69, -209, -87, -241, -258, -527, -279, -449, -146, -163, -500, -399, -348, -197, 99, -15, 218, 86, 90, 319, 162, 380, 324, 287, 495, 309, 191, 197, 400, 203, 136, -137, -323, -296, -222, -217, -352, -566, -369, -546, -325, -254, 12, 58, -333, -340, -69, 250, 136, 256, 459, 335, 186, 265, 486, 428, 523, 294, 363, 285, 201, 102, 158, -27, 0, -441, -295, -226, -350, -126, -86, -356, -303, -252, -184, -137, -227, -67, -11, -252, 34, 298, 117, 337, 186, 131, 352, 138, 330, 226, 199, 395, 276, 98, 33, 116, 44, 32, -85, -356, -610, -443, -92, -318, -138, -183, -267, -313, -213, -183, -31, -260, -144, 204, 121, 7, 611, 532, 324, 250, 153, 605, 120, 65, 225, 221, -90, -259, -151, -362, -170, -116, -373, -318, -349, -448, -234, -84, -107, -393, -247, -304, -166, -122, 345, 250, 33, 75]
1972G5r4J20J35J73k14L3k4j08M0J56j91O2k9k00o34J02M19Q1k85k8m3K57j34
1995c31K70l2j13K5N6LJ70p9K51j83O1K44m17K91K59n9k56P6k11N6M6n8P3p9l04
2020b41k1r6J33J77l43q3L57k02K86Oj02K00k71J77J4K96j49m0J76o3k79K98l
2043B27K2j71K47k17k62k2Q0L02m96K32j58l93L77J37j95j27K93k32J34R3n9K22
2065C4j49K55N1j0K39j69J42k34J03l2j03j25K15j75j8jj39J09Q6k52K29j65k57
2088c66n0L23l9K5J10j31K5m01P68p1k18J61r0L55j60j07K41j61J85m03M01k30
2110A67k31K20j3L4l11k63L37lK0J06k30j80J34r0K54k22L01k44K63J65k87J69
2132I6p8L70j4k9k03J00K9j19J63k35j20O1J2J5j64K15j22l45P4J2O3Q6l38J94
$$ y = [75, -19, 101, 236, 409, 195, 228, 204, 96, 136, 292, 101, 163, 134, -66, -700, -598, -179, -98, -383, -411, -454, -197, -331, -61, -93, -206, -181, -125, -122, 48, -31, 220, 37, 98, 342, -75, 216, 475, 416, 160, 236, 25, 81, 127, 69, 142, 63, -241, -262, -358, -225, -48, -391, -474, -117, -319, -33, -27, -129, 71, -200, -23, -9, 287, 138, 98, 274, 211, -68, 230, 227, 249, 78, 325, 108, -154, -176, -96, 206, -290, -58, -216, -609, -232, -95, -290, -417, -124, -356, -222, -129, -188, 34, -115, 140, 191, 181, 420, 251, 393, 159, 262, 230, 127, 2, 217, 42, 24, 23, -116, -7, 79, -173, 56, -109, -366, -416, -93, -132, -107, 3, -128, -103, -504, 264, 193, -25, 136, 46, 401, 241, 134, 375, 214, 399, -4, 397, 167, -64, 156, 143, 177, -134, -397, -60, -63, -43, 63, -167, -347, -213, -303, -49, -271, 30, -214, 49, 214, -73, 96, 18, 388, 374, 345, 142, 242, 271, 152, 315, 80, -40, 21, 33, 48, -116, 99, -23, -368, -294, -282, -219, -133, -471, -277]
2156b77P2o6K32J54K0m61M43k60M25k26J06N8k2MJ8m9K10l4n7j15j33k29J37K9
2180b1m8j35N5k64O9J29p8J3K11j95m9J58j6J18J39J87j79k55K59l2J96k2QN0
2204B98l7l3k37M38l90j45j55r2K56p2L37o02o6L05j16N9N0K7p6J07O6q1O5J22
2228B8J60m2pM2n5J56j1J42j90P1q8J38m40O4q9M5Q5m47K47J57k28J94o5j49J65
2253a17j39J76j96J01K30m04K66K53k7J16j98J88J41j91j25K45j89O4J04n1j34
2274A13k47J90o0r3l09K22K4J3q1N4J35j95K39l94K82L00k35L56q9m20M10J5o2
2297A68K84l82jk0K51lp7k04n8j19k14L02q3K86j19J28m23N1l7J04NJ1Q6R7j8
2322A5m5J74j03K2Pl2J28J74Q6k0l31k65K26k7M15m23K14j63M9n22L14J78k07
$$ y = [-277, -205, -271, -39, 115, 135, -326, 117, -143, 282, 56, 162, 220, 198, 202, 220, 171, 381, 347, 290, 175, 42, -187, -50, -21, -69, -204, -149, -413, -344, -215, -293, -280, -69, -264, -313, -155, -171, -53, 86, 273, 94, -161, 98, 66, 262, 240, 248, 298, 261, 228, -9, 429, 39, -106, -261, -353, -97, -169, 168, -434, -500, -195, -311, -252, -202, -175, -251, -144, -78, -159, -94, 28, 188, 146, 139, 181, 126, 282, 271, 413, 223, 294, 206, 344, -96, -32, -121, -76, 9, -438, -191, -34, -262, -68, -133, -282, -117, -256, -80, -276, -175, 55, -349, -83, 170, 143, 259, 61, 249, 390, 199, 74, 319, 130, 194, 298, 247, 113, -134, 56, -4, -97, -406, -184, -160, -147, -228, -174, -39, -234, 5, -389, -107, 193, -42, 314, 225, -195, 215, 230, 168, 452, 70, 69, 49, 300, 297, 220, 16, -42, -161, -375, -73, -156, 130, 11, 139, -284, -233, -270, -166, -161, -150, -64, 33, 15, -30, 144, 41, 63, 70, 38, 166, 340, 426, 406, 75, -190, 36, 9, 424, 1, 215, 52, 101, -421, -107, 71, -136]
2345a36k97J83K7k01N5J80L9K84l10l5L86j21P8j96L34m75K08n7M56k55N1l9r0
2368F9l8J53J27k16k35M3J01j43j32jJ14m0J9j9K22k01J26j07R3J09R8P2j89J99
2392B24j62K93m0k84J54l2J80k10l09J30J47j60O3K33l27l93J69p9L14J0j45J62
2414f2j95J38k52N24n3l46L49j37R3j19J78L71l12j01K53k85K81p4j31K93m86
2435g3L00m75L14j78Q8p8j88R6L97m70K9j8K54q9j87J16L79k96J75j02j31K81
2457A44p3J45j14L34m52R4M7j45J8K50k04J50o9rj48k62l1O5j25L70m3k56M0K24
2481e0nj43J81on4J21K19k49J0P2j1q0L2L55j69j62r2K13k53m8J00k17K47j75
2505a64r9m5J98K19j88k63J21j26K06L32k58L1P8P0J58k82K59r7j19Q3J72j36
$$ y = [-136, -433, -250, -223, -424, -369, -189, -150, 134, -176, -211, 175, 54, 132, -64, 270, -205, 3, -54, 402, 147, 198, 159, 69, 31, 184, 311, 95, -140, -97, 4, -139, -271, -272, -158, -198, -179, -198, 24, -177, -51, -158, -65, 44, 142, 214, 25, 224, 62, 355, 315, 31, 185, 153, 333, 123, -186, -56, 91, -69, -6, 227, -100, -493, -324, -403, -89, -79, -224, -62, -257, -119, -371, 153, 100, -246, 103, -34, 59, -60, 118, 489, 177, 76, 329, 44, 325, 251, 120, 413, -73, 227, -248, 66, -112, -24, -102, -290, -194, 203, -267, -238, -256, -2, -91, -278, -162, 217, -79, 96, -6, -137, 144, 71, 216, 102, 436, -16, 78, 125, -20, -2, 248, 44, 194, 125, 116, -32, -294, -325, -260, -385, -15, -58, -314, -274, -50, -55, -198, -17, -23, -77, 44, 263, 14, 24, 96, 85, 5, 37, 392, 223, 61, -31, 182, -71, -119, -19, -236, 11, -164, -263, -308, -110, 109, -79, -342, -221, -347, -141, 191, -67, -36, 42, 112, 270, -12, 247, 150, 31, 114, 286, 150]
2527A50J4J19L5k71J09j03j99J60o9k95J51L0k96k3L71%n5J10j06n9J10J56M9
2550H8l03L24j15o6J55N5J80j62JJ47j34j27J8J7k96J58Mr7j7O5j31K4J11k24
2574c25N2L03j20P3j86j63oM24Q1j04M6J28n8j33k35K41M23l10J07J2j41O2j94
2597b3R3J16n31O84n05J22m9J08p4l39l1K65J07q1J23j42M9j45M28%q7j55J40
2620G3J82R2l85J28K17l64J36Nl32M63l74l2J92r8n1k72N24n90M27k75K48J0o8
2643a44K20l23J08NK98k25J14J58k20O5J40j8k06j22J73pK9J15j26m5j69L8k9
2666a71K37m86J78j07J55r0n3K91j57J01R7J67j37J57o0j8j75K25Q3j41L25j82
2688B39q6p0j34L03l62K42o1p7j29J62j72n6J17j67j19O8K43j72K96j62l0J80
$$ y = [150, 164, 283, 318, 47, 156, 53, -146, 14, -55, -350, -199, -169, -465, -488, -117, -117, -172, -62, -168, -227, -117, 39, 88, -215, 109, -6, -72, 83, 138, 318, 156, 157, 304, 170, 43, 61, 78, -218, -60, -56, -153, -170, -105, -236, -212, -101, -325, -273, 30, -90, -17, -203, -366, -372, 52, 133, 29, 75, 203, 145, 12, -223, 18, 441, 131, 238, 250, 109, 171, -23, 70, 186, -345, 339, -166, -44, -93, 15, -59, -398, -429, -164, -57, -138, -15, -157, -108, -253, 175, 175, 88, -67, 73, 255, 347, -38, 90, 307, -57, 79, 84, -248, 215, -159, -191, 1, -97, -148, -420, 104, -486, -59, -334, -86, -76, -144, 76, -247, -139, -134, 164, -61, 53, 211, -9, 56, 196, 178, -28, -150, 23, 16, 45, 160, 34, -11, -180, -142, -171, 66, -420, -242, -349, -194, -284, -337, -46, -203, -102, -5, 162, 25, 182, 122, 104, -71, 154, 237, 96, 421, 239, 153, 83, -51, 252, -110, 132, 71, -6, -135, 27, -145, -201, -84, -251, -370, -302, -59, -231, 65, -97, -127, 53]
2710E3k70O0j45M71J6o3j39J04j0K6J8K78k33p6Q3r3n2L0K5j04pj34j04L16j11
2735f1q1j58k23K65L78j20n4j76K61j4J40O4k5j3Q0k6j70M03l37M4o2J61j59l41
2759b24K0L07j62N2j82J48k3P4n7J7j08m8m7K67m62K72Q4J31q9j65L58l4K20l79
2783c0K87j36J47L3k04J97l68K89l74J79p6L7Q9r2j83O8J27j85J25J9J14m41L74
2806dj41J14L41k57K37k70J00J5L5j48J08j76L66k96J45m4m2n7o3Kj86L62r2N2
2830A01k27J62l40K36R3r1P3j10K45L6k99K59O9P2j75l0J27k9j13j5J50K38m15
2853A7J33j65K07Om36J39j58j2J43n8R4j18K69l23J03K54k10j03j5K85L1o9P4
2876H8N5p4K8M1j54jJ62r4L10j92j16j62m8Q8rK26r8j0k15k42M92k36lj34L19
$$ y = [53, -217, -157, -302, 169, 185, 122, -17, 87, 77, 103, 121, 399, 166, 90, 173, 80, 28, 58, 83, -21, -28, -162, -266, 50, -61, -142, -300, -523, -258, 120, 0, -54, -230, 31, 17, 157, 221, 196, 183, 263, 237, 67, 470, 133, 177, 115, 276, 117, -224, -204, 103, -59, -7, -189, -41, -64, 10, -47, -30, -138, -186, -233, 34, -428, -156, -72, 59, -30, -195, 163, 129, 349, -30, 257, 121, 268, 301, 97, 294, -74, 215, -159, 20, -56, -19, 70, -22, -205, -137, -10, -195, -70, -51, 63, -378, -4, -145, -31, 310, 53, 290, 20, 120, 135, 170, 22, 130, -46, 320, 24, 169, 125, 83, 26, -37, -35, -221, 141, 49, 101, -126, 36, -304, -68, 25, -66, 7, -103, 142, 178, -121, 138, 207, 279, 104, 74, 201, 172, 59, 44, 194, 432, 17, 150, -15, 192, 198, -238, -99, -257, -269, -126, -184, -90, -208, 61, -262, -159, 95, -115, -218, -233, 52, 83, 14, 88, 143, 69, 97, 138, -16, -17, 145, 51, 361, 169, 53, -109, -157, -69, -78, 148, 50, 40, -175, -417, 75, -161, -164, -298, 21]
2901B1r2k08M37j04J18m6j5k41M90l81J61K69j58n4M7k44K0J97J06l41n0n2J57
2924C7j27J40l73J01j87K80j64J75L7J7J45j81K63j31o7M9N3k29K76k2K9j6M2
2947A47j77J03j44J47j44J93k55j6P9R1j44J89k55m9J8J75O5j89m0m6L33r9j57
2970a75J34L72l86J57J2j75J97L7N3k1r0j63K78l07R9J37j11J75l24M7p0l5J71
2993A2k26K51r9l25K46J56r4K28j28L34l48j07M48j43k29M7k33J97J7LK95l4m33
3016a65P8j54M27k31J04N8j95Q0k85J94n3r8J12P7P6j34O0L3j9L81j35P4j85q6
3040A4K33k67K25l39L45J01j43K84l45J68k66j50L4J94j48j38J20k49J58K22k95
3061b42K01j11K10k06L36k66J6K63K8k26m2L81l34k1J97o1L5k88P6J97j4p1j30
$$ y = [21, -71, -279, 158, 54, 172, 126, 111, -130, 360, -21, 140, 409, 251, 197, 244, 0, 20, 217, 323, -18, -68, -120, 37, -90, 50, -323, -222, -409, -129, -293, -118, -81, -64, 81, -100, 163, 32, -35, 14, 67, -162, 114, 92, 121, 105, 147, -30, 73, -71, 76, -68, 125, -130, -146, -67, 24, -120, 69, -186, -235, -217, -42, 23, -166, -206, -252, 81, -18, -175, -41, 331, -55, 102, 114, -61, 136, 173, 226, 205, 115, -48, 230, -77, 22, 159, 48, 223, -101, -54, -124, -159, 12, -214, 37, -62, -387, -141, 15, -79, 149, 21, 355, 7, -100, 348, 205, -24, 23, -210, -13, 4, 7, 302, 268, -165, -87, -241, 186, -45, 59, 117, -78, 2, -283, -89, -142, -240, -128, -51, 25, -109, -49, -16, -35, 346, 211, 285, 100, 14, 247, -20, 205, -134, 211, 312, 169, 453, 108, 276, 10, -140, -106, 88, -60, -198, -78, -327, -169, 53, -242, -41, -152, 58, -148, 188, -78, -62, 201, 229, 3, -39, 342, 8, -13, 184, 123, 158, -130, -54, 143, 129, 58, -72]
3084g2o5P9J01k22j29K45J84k85O9j24J44J7R0n2O2j17j3L25K73m92J56j02J42
3107B14k95L23k18K13m0j40J39j77J53n1m6l07K69l2j53o6J94k28L49k54q6K9
3129b10J59N9l15K45L30k69J06K51l24O9K20l41Q3N6j72J50k81qK77j91K24j2
3151A06j65R8k63R9O2j70J69R2j94K98j97j14K13Q8J4q9k65K30l4L06k80j5K44
3174B33rk92pK28n28N67k88O8J2r7J58l27L55j27k01J99l9L6o9K13k10M4M27m90
3198a44K02J16K04l56K4R6Pm2N5j06n2k10K50N3j74jNq7k82lK91o1J46k04K01
3223g2l8J18k89L34L15l68l1Q7k42J89J38K3j69J82k82J27j49L92r1m4K3j14j75
3246a36K38k84j17K51j82K68Q3o3j12O3k86J6J81l7p4N6M19l16Q3R8k50M05k35
$$ y = [-72, -137, -58, 43, -179, -308, -63, 121, -164, -95, -219, -75, -58, 32, -20, 42, -75, -88, 237, 510, 18, 174, 72, 214, -81, 242, 24, 237, 197, 57, 196, 19, 172, 121, 75, -232, 37, 5, -148, -214, -20, -248, 101, -153, -239, -210, -51, 8, -307, -62, 268, -1, 105, 356, 32, 101, 321, -20, 63, 119, -53, 97, -184, -192, 85, -106, 118, 106, -59, 39, -224, -125, -63, -233, -64, 28, -166, 132, -65, -179, 34, 122, 136, 47, -218, 12, -22, 284, 4, -11, 233, 224, -68, -75, 153, -375, 192, -96, -28, -16, -113, 45, -282, 73, -54, -255, -56, -95, -59, -128, 85, -125, -81, 346, -144, 58, 174, 378, 22, 46, 142, 149, 107, 162, 56, 4, -206, 44, 97, -77, -78, -73, -160, -442, -445, -154, -215, -69, -273, -72, -110, 8, -281, 53, 368, 0, -31, 56, -186, 3, 141, 164, -5, 177, -105, 22, -127, 265, 174, 130, 153, 39, -136, 102, -182, -299, -48, -230, 38, 121, 58, -54, 9, -277, -261, -80, -117, -191, -135, 284, -32, 51, 149, -101, 304, 69]
3269F9j1R8l6j69J77j0j39j03J83k46K01j41j9J66l81L93o6qj17Lk88M97r9n0
3293i6J2j6J45k01J91J39j59N3J55j88lj0K16j01L6m01L99m07J1K30j4K51m57
3316b15R5j64J66j05L07q7Nj12J59j49K60M8p0j50K5J02j76N6r9J7R9J08k00K06
3340A26R7n97M59j43K01n1j52k72K57p2J93j82J22N8N4k10L5J76j47L7J94k97
3362a14J61j6J10j00J17l22J50J20j99J62l02L41P1Jk79R4Qrk16N9lK74J11j98
3386B1K1j09N3r9O3K83j49l9k33J12R3k5K84l9q6n9k06K84l1l9O1m24M0J29PR3
3412Fk57O6O1J43j0q2L45m51J35L7J63l38O3J79p9j34J3K81Q7l92J75J30j4m22
3436b95M17l7L3k06K53m19K95j22k14L13j30K15m34K49j06K40q4J93j39J26k13
$$ y = [69, 58, 156, 120, -49, 128, 118, -21, -124, 59, -187, 14, -127, -146, 20, -361, 32, -34, -42, -159, -156, -444, 53, -46, -96, -84, -100, 45, -156, 35, 174, 15, 68, 223, 35, 32, 22, 238, 137, 173, -228, 171, -236, -225, 5, -9, 242, -215, -120, -284, -118, -223, 84, -3, 2, -110, 49, -100, 160, 208, 138, -12, 13, 115, -61, -5, -104, -87, 12, 120, -80, 126, 223, -374, 85, -58, 143, 92, -60, -332, -75, -147, 46, -136, -14, 44, 98, -112, -77, 99, -48, -11, 183, -114, 47, 31, 141, 41, 158, -164, -14, 106, -93, 69, -233, 108, 179, 180, -99, -5, 3, -6, -222, -163, -166, 108, 219, 21, 42, -67, -14, -113, -50, 233, 84, 45, -188, -76, 17, -8, 276, 237, 151, 92, -114, 170, 139, 100, 161, -263, -223, -94, -87, 6, -251, -185, -124, 19, 9, -73, 272, -179, -44, -7, 156, -182, -119, 60, -19, -153, -140, 141, 228, -164, 11, 141, 127, -295, 122, 85, 118, -88, 165, -254, 41, -81, -295, 18, -112, 103, -331, -82, -188, 52, -32, 161, 22, 148, -65]
3457f5O0L2n6M30m69J76K07l58j18K47q7j34Q0P1K28m62J53j2N7k31J15J21j02
3480a17jk05M14k20J6j72L70l1k40M37j20l46L22K42j3l20N3j3j65L19j23j30
3502d3L3q3QJ72j66J19J44l71K0P3n3K56j71rm0k69J98J16K74q6k4K2r6jn3MK49
3529B23k73K69m66K32Q6L1JJ7j53J32o1j8p3j37J52l96M04N1J39k80n2Q0J60K6
3553I4P6j00j13L84j26m2j48j38M9n3J19J1o1j12n8n0L71k19p1K14j8k0j49r3
3577b53L49q9j7K3j39J20K02j22k5j0Qm3q0K06j56J09j58J39j75J45ON4R6k22
3601c2r2J95k9J00k69O5n0j33P9m1L0M7PK79j78O4Q0l02J36K30J06k62nR9k12
3626h8K8J38j47K14k14L6L8m9J4l22K6q0K24j35L59p8j80Nj57K08K51l59M07q9
$$ y = [-65, -5, 27, -29, 401, -68, 108, 315, -43, -161, 86, -1, -135, -55, 16, 244, -218, -65, -77, -20, -251, -136, -15, -117, -118, -323, 91, -129, -113, -285, 85, 54, -186, 251, 131, -215, 107, 349, 336, 16, 69, 56, -109, 210, 87, -43, -10, -93, -85, 87, -79, 40, 184, -187, -167, -94, -147, 109, -62, -71, -111, -380, -182, -66, 208, 122, 98, 120, 24, 23, -30, -26, 223, -50, 219, -247, -15, 71, 102, 103, 120, -33, 99, 38, 20, -53, -190, -38, -434, -30, 21, 160, -120, -172, -92, 68, 94, 170, 70, -43, 341, 215, 173, 25, -113, -64, -117, 2, 13, -48, -160, -218, -268, 103, -116, -187, 27, 9, -11, -160, -253, 96, 7, -10, 13, -126, -6, 196, 74, 49, 39, 47, 4, -76, 130, -26, 83, -75, 64, -111, 34, 40, 94, 190, -32, -124, 71, 42, 142, -127, -62, -112, -245, -166, -207, -177, -130, -123, 156, -22, 42, 122, -180, -44, 186, 292, 30, 25, 124, -88, -60, 78, -69, 145, -69, -33, 5, -44, -30, -352, -326, -406, -182, -317, 42, -36, -216, -211, -368, -160, 91, -268, 139, 50]
3650E0P5j82J18N7q6L25k02j20p9J40j36K08j90k01Q4L62p6q2N7j69N1k33J94
3673c5Q5M3j21j6L8J52J01j37k07R4J4j8k6J64N1p5r9P0j33J30k48M11l49Q4o5
3698i2J9j1P9n4m6L88k09m4l23M33j21o9Q3j65J69j54K70j12j08N1K7J56k6j18
3722B3j05M6J87l1j19N0J1q4l7O7j78J13l5K46k31j5P5J12k32J3K56j75J73o4
3746F6j74K36%J32j16Oj39J07j07L7P6k3j70J62N5p4kk67N5k7M26l95j9J26j31
3771a60K53J03l11p9K59M2p78M34J70J85r0K51m10L32Lj53Q3L08m13K59j98j38
3793d8J54m12L86r8j47M31l41M3j65L70k51j71K79m10K94O3J55j86K34j60K82
3814C02j31j75K29l53J15M9N0j69J58p0m5j95K57j8N0l9R9k95P4R4NJ95n33M38
$$ y = [50, 125, -57, 61, 118, 32, 357, 155, 35, -44, 96, -40, 168, -22, -223, -139, 223, 147, 65, 122, -47, 4, -229, -35, 50, 93, -28, -44, -6, 146, 247, 110, -97, -3, 11, -7, -33, 131, 182, 107, 8, 78, -55, 75, -173, 238, -111, -27, -92, -73, -84, -5, -59, -105, 283, 74, 30, -293, 140, 19, -50, 33, -132, 37, -117, 153, 41, -67, -16, 11, 167, 141, 23, -82, -36, 151, 120, 1, 51, 62, -22, -59, 8, -170, -57, -92, 154, -77, -92, -17, 95, -137, -124, 132, -43, 130, 66, -108, 128, 128, 260, 144, 150, 11, 118, 11, 48, 124, 101, -69, 93, 148, 74, 72, -195, -140, -167, 259, -136, -155, -29, -160, 93, 196, -115, -194, 65, 107, -671, -237, -67, 118, 28, 279, -131, 201, 204, 51, 134, 442, 29, 288, 90, -48, 106, -306, 80, -18, -165, 266, -75, -32, -197, 173, -78, -249, 30, -380, -86, -23, 132, -54, 180, 20, 302, 171, -4, 225, -128, -13, 36, 86, -83, 75, 5, -40, -235, 22, 4, 54, 15, 114, -181, -107, -13, -8, 187, -346, 92]
3838I2r2j14J60p9p0J70j2Q4J05l98Q1K74Or4J07j10q6j50K98j49k2K7j38o3J21
3863e2L8O4L3n7j3j38K88j96j84Q3K92j18j84J32K23k36M4o3L5k5o0Q7j9q2L16
3888B08k31Q8n8q5J54r4l36J17K46o8k03k16N29M7J41j5ml37J55m2o8M6K14l26
3912a38L11J39k51j00k3K31j83M2J93j20o6j8j69K55p0p9R8m7j73J60j58K20j53
3935i9J01N6J7j06R9l4k14N2j77M05o7M8j02R3J05J56l13q3m2J01J48j08K52n35
3959b47J57J92o2l94K31J3K17l50M21j83l0j66L11j96j61L36k4J02pk31K30m7
3981A12J0K53l05j54L00j05k16J54j89n4k9L15o8l84L25j70J42Jj49L49r2K3p1
4004bJ21k73J95J19j96J06Q0J94l39m8L25l68J63j19k44J68J65k26O4N2J9K15
$$ y = [92, 0, -114, 46, -33, -103, 67, 55, 139, 244, -154, -73, 201, 207, 113, 220, 110, 24, -126, 172, 23, 1, 28, -110, -173, -52, -14, 50, 83, 26, 13, -125, 163, -33, -217, -134, 158, 40, -144, -12, 211, -25, 19, -44, -9, -34, -94, -7, -26, -108, 208, -23, 65, 7, -78, 76, -18, -354, -237, 9, -59, -262, -478, 51, 98, 239, 224, 220, -117, 38, -4, -72, -26, 188, -138, 173, 312, 61, -39, -62, 169, -14, 28, 221, 101, 35, 17, -152, 103, 33, -46, 52, 5, -168, -8, -166, 54, -99, 2, 58, 75, -31, 68, 34, -180, -128, -305, 100, 33, 81, -21, 72, 177, 333, 20, -63, -105, -4, 144, 36, 288, -247, -90, 102, 40, -354, -123, -110, 107, -243, 178, -5, -35, -201, 110, -86, -247, 89, 65, 167, 160, -71, 159, 112, 122, 375, 70, -84, 216, 111, -105, 49, -140, -194, -223, 92, 24, -360, -35, -205, -63, -62, -211, 138, 46, 69, -2, 119, -154, 41, 160, -36, 70, 150, 344, 5, -43, 282, -86, 77, -42, -286, -118, 47, -179, -115, -63, -44, 171]
4026A71j51j01m9J62j58J59k96J45Q1l8Q5p4J58l81M70j87k4Q3Q5L4j41L5n2J36
4050A52j47K00l34%J37L5j48L7J89Ok97O1J6L53n87K62j86J55j18L05m1j90p3
4073b13J52L8m0J8n5J95j42l9K14k23J99j50J06j08o2M3K76j52k93J74l3L04k99
4096i0M5J36j36J07J34K3j96o1Q5j79P5J81J16k32L1j31J41m2j6K37j94k26J72
4119b0R5j39J49r7O8k40L30j93l9O2J38j18K83k58MJ36j22j05K66l70J20K18l59
4142a91Q8M73n04n6L83j61Q7j90L5NL06l20j35l0J39K48k40p4J05J92k12P8L6
4165F2j12r5J45K66j77l2O5J30j64p5J78l00k5K88j89m1j08qL53j52l33L66j03
4188f1j71K31k50n0J76M1P6R5j65kJ56j20P6j14QJ0J31q6m9K90k48J83P7j54k08
$$ y = [171, 20, -81, -130, 32, -126, 33, -263, -118, -37, -75, 10, -64, 94, -287, 183, -4, -28, 55, 140, 174, 33, 68, 16, 152, 5, 205, -129, -129, 8, 43, -105, -68, 121, 127, -170, -109, -93, 260, -327, -65, -251, -96, -214, 91, 50, -140, -213, -61, -23, -63, -45, -100, 95, -47, -86, 128, -95, 104, -46, 60, -48, -110, -67, 209, 57, -236, -62, -95, 209, -90, -45, 91, -45, 62, 196, 219, 23, -38, 47, -132, -57, 124, 240, 8, 39, -92, 49, 7, -9, 228, 34, -192, -20, 75, -64, 85, -12, 56, -184, 146, -47, -86, -24, 114, -4, 279, 21, 25, 161, 39, -66, 200, -170, -50, 168, -191, -103, 370, -134, -190, 193, 32, 119, -71, -36, -31, 275, -45, -180, -210, -71, 177, -63, -137, -32, 160, -52, 26, 62, -50, -145, 0, 266, 89, 57, 122, 252, 88, 13, 191, -109, -134, 154, -35, -76, -184, -192, 161, 9, -324, 42, -61, -232, -1, -251, -301, -125, -84, -8, 87, -78, -80, 76, -44, 32, -82, -74, -64, 67, -19, -68, 222, -26, 157, 234, 80, -128]
4213a28J00L3l47L63J4l4o1j16K55Q6Q6l22J79j52JJ3j35PL68J42l27L40k56P2
4237A81j19J97j29k54J05lL5L90o90L52j03l8M2j96K76k23K55P5j61k62L24J11
4259A65j20r7K31l09J72j60L67k14J2J93o1j19K27k15k1p5Jp5O7mn3O0l05M29
4283I6Lj01n1j3k49K64kj55K37k79L79p4o1m7L08l72k6K71M4M8j86j28Q7K08k47
4308d6J32k36l06L65K34j79j06J57j51m2O7J64j06J56j83o0K4R8J16k91N9L86
4330B52l32N4n9R8J2P5O5m21K33J31k47K00J0j72O0P1j66K04l8q8j0M5l97K83
4354a37jp2K96j57M7K5k60K89j05K65j84J60k02j56K73Q7k97j60Q3K14J3p6J93
4377A38p6L5o4j10J08k09J81k84J75L34k9n28L55j2n9j6J94p7R3j67J81Q6l38
$$ y = [-128, -28, 5, -342, 21, 35, 1, -60, -176, 79, 165, 251, -71, 108, -44, -43, -30, -165, -158, 210, 352, 25, 365, 109, 181, 62, 259, 130, -124, -19, -22, 13, 403, -287, 65, -38, -76, -34, -230, 46, -177, 78, 153, -8, -270, 54, 165, 45, -52, 179, -130, 42, -118, 249, 35, 47, 240, 179, 60, 287, 72, 51, -24, -23, -98, -31, -35, -88, -28, -333, 96, 99, -2, -53, -66, -315, -51, -53, -208, 29, -250, 129, 55, -6, -53, 255, -117, -143, 128, 172, 220, 34, -94, -7, 201, -46, 86, -150, -456, -91, 143, -36, -142, 15, -136, -178, -111, 53, -53, 103, -80, -140, -116, -18, 98, -193, -134, 252, -80, -26, -85, 13, 25, 100, 165, -256, -23, 108, -139, 61, 71, -101, -41, 30, -136, 68, 30, -58, -68, -23, -420, -137, -138, -210, 86, -71, -24, 1, -259, 30, -75, 190, 6, 166, -36, -192, 81, 168, -129, -289, -206, 8, 21, -55, 138, 62, 97, 33, -77, 31, -178, 3, -281, -106, 228, 199, -329, 26, 14, -45, -61, 133, 56, 149, -18, 163, 249, -89]
4400h9M70k76K21l60j88J8J07M53n43K4nJ65j13j7J68l8K9m2J07j94L68m26J39
4423b2K58j44L4k51J48p0K05J76l22k2k5r2L86j85k65K63o7j96L58q9J5k25J58
4446B6R8j48Q3k00K10k05J84Q9j62M1pj5J1J51k36Q3l2J04o8j7K05K8j11m2J30
4471B00j48j99K90j76m5j5l2J52k03M34l01j16J84O5m14O40j92O5l18K10J36l42
4493a25J81J89N7k45j44K39l86Q0J98l05K14K8J41j69n0J72rj01J54Oj55l8J35
4516F7l06J46R5j8j22K00m3o2K44k77j97M91k62Q0L7J80o4k70O9j45Q7n3J24j74
4540a73r9K26qm4K41j03k2M9j85k14J53J04J24k68L05Rm9M4l9K67k70j25Mp5P4
4565g4P6o5p2J83K01l09m9K99k80k4J18l36J04J90L7rJ02l42K89j38K01O2k04
$$ y = [-89, 381, 105, 326, -34, -222, -204, -97, 356, -187, -163, -168, -3, -116, -133, 35, -3, 26, -16, 91, -103, 265, -161, -22, 236, 92, 126, -125, 23, -47, 158, 334, 12, -10, -35, -127, 259, 74, -191, 72, 5, -191, 167, 78, 93, -132, 26, 124, -24, 59, -141, 69, -136, 48, 137, -25, 16, 9, -6, 5, 156, -80, 3, -29, 75, 7, -10, 195, 223, 112, 70, 200, 52, -147, 143, -33, -78, -93, -125, 27, -176, 258, -43, -159, 25, 90, -324, 316, 124, 189, -129, 81, 217, -125, 56, 245, 302, 57, -87, 152, -234, -154, 44, -261, -47, -19, 122, -47, -97, 75, 66, -35, 119, 125, -30, -68, 67, -239, -93, 2, -16, -138, 62, 19, -43, 201, -76, -273, 218, -44, 36, 73, 253, 189, -81, -12, -157, -70, -123, 1, -173, -272, -46, -54, -98, 143, 40, 18, 67, -118, -332, -179, -75, 49, -219, 86, 95, 46, 90, 51, 318, 48, -77, -73, -148, -74, 2, -63, -135, 48, 249, -60, -109, 190, -90, -114, 4, -332, -228, -38, -1, -10, 92, -250, 39, -99, 102, 164, -40]
4588d0P8q0J71m11J96J60J75r8j13L54m83J04K2R3q3n8J56J4j01j21mK6P0M9L3
4613A09m10L57k0J46k7k14J90J96k12j24J23k09j30J74L28l87q2L04k16K14J57
4634B67k24LJ91k98J64j53j50J27L7L7OJ09j99R3K18l38LJ40k5o7j40M51j85k13
4658a46K8J01k44p7K63j29J5K61j39R3j82K52l90K3N1K41Q3k55J70j64k7K64j08
4681a6j92J73K1K79l76K42l8N6p1k76J27o8J46J15K4j13j3j47J43L8j47kO8j05
4705a32N2J08J19O0k52J29k84K61L67l96j30J05K9J58k36o3L41l37L44r1k00K
4727d6P9k3rJ02j55j1M0NN4j7k37k7K87r9K72j70j89J2O9r4K24k9K1k9j74P5R1
4754B2J9J07J9k31M58l01K46n12L20j6lj92j52L07K2l7P8j46k66L41J31k94lN2
$$ y = [-40, 38, -42, 129, -282, -86, 74, 249, 151, 38, 392, -91, 13, 35, 128, 45, -13, 143, 157, 56, -65, -69, -43, 27, 76, 109, -301, 56, 36, 182, 155, -59, 131, 327, 115, -9, 114, -95, -225, -51, 277, -110, -192, 112, -104, 110, 267, 43, 46, 237, -61, 103, -50, -200, -73, -36, 1, 7, 116, -83, 10, 228, -110, -107, 33, 8, -59, -199, 252, 67, -146, -118, -17, -261, -338, -75, -204, -189, 72, -67, 26, -156, 96, -294, -271, -220, 21, 104, -151, 19, -145, -172, 92, -16, -208, -35, -14, 265, -111, 131, 93, 149, 78, -198, -71, -139, 7, 122, 146, 33, 20, -127, 16, 54, -93, -95, -27, -132, -80, 28, 147, 207, -45, 84, -200, 61, 428, 32, -98, 7, 36, 194, -42, -105, 236, -101, 243, 152, -48, -46, 33, 10, 1, 103, -52, -63, -23, -18, 36, 19, -218, -245, 42, -57, 215, 45, -144, -132, -63, -157, 67, 38, 59, 30, -144, -69, 22, 41, 148, 167, -64, 394, 93, 339, -173, 147, 131, 128, -64, -216, 91, 113, 76, 154, 8, -258, 83, 214, -80, -83, -31]
4778c1%j3j8oJ51j50M08m49RN5K57k95j07R5O7J13m8j42o0%K40j89K47m54o4K33
4804a51L6L84k81O1l33K09O4J37l2j87J86L4j04P2%j75J03Q0J51j46k49K20j47
4827f8J88l22J53n3M6L2J82n1l34Q3K04j56J64O1j73PO0J48j54j49J19l21L48
4850A4l0j9P0o0J40L8m48K45q3nJ97k63M06j45P6q8q7R1PJ21j26j77K10k15r9
4875b30K45M5J26j85K1L07k66J43l12O1M8K98l27r5L16k88q4J95K78k18l2n2l0
4898c6J12j07k92M64j29k53K02O1J37k2J12p3k51j26J80mK56n1j56R4j34J31k61
4921a46J60K1O1K46l76J34%n7n1M0k55J61O7j35O5M2J05m8j0q1J51k5j63J11J49
4946A66j47J92j78M6k0k39Q5P9J96ok11M4L1K11k10q3O1Kk3r3K81l22J53j30K77
$$ y = [-31, -31, -44, -62, -68, 83, -67, 341, -108, -99, -44, 213, -82, -189, -94, -27, 86, 38, -104, -164, -164, 76, -113, 134, -320, -384, -151, -115, 269, -12, 49, -284, -75, -11, 126, 94, -93, 93, 127, 23, 95, 95, -80, 23, 103, 254, 108, -141, 79, -68, 120, -202, -49, -102, -56, -24, 158, 107, -227, -144, 60, -96, 68, 129, -44, -37, 23, 171, 17, -132, -13, -334, 14, -16, -35, 35, -25, 115, 153, -295, -50, -133, -138, 59, -204, 202, 57, 133, 45, -42, 49, 56, 177, 51, -126, 84, -131, -230, 15, 60, 186, 1, 22, 329, 63, 206, -106, -45, 3, 301, -26, -121, 195, -93, -177, 18, 296, 78, 46, -6, -36, 76, -31, -323, 141, 12, -241, -39, 22, 159, 137, 249, 176, -75, -201, -21, -25, 231, 180, 24, 118, -16, 115, -146, 14, 35, 96, 342, -34, 100, 100, 43, -8, 32, -223, -62, 5, -130, -65, -23, 82, 34, 24, -57, 94, 69, -94, 17, 166, 19, 211, 33, 79, 59, -180, -95, -16, 180, 174, -37, 7, 38, 249, 39, -44, 17, 19, -4, -97, 184, -138, 15, -115, 162]
4971A62k16pK64m89L22j30J3K61k23j01l4K31k11K44j33J25j7m0J00k25k6J0J60
4994D0k15K32Q6k2k31j08R4K09j20L3m8k56M75l49K48j62J91l03L45L0j40J17
5016A46n2n2j48O7j45K59j05q7l2k1QL70P6m61Q2p9K52j65p6K55o8j53L46l26
5040a09r0K56k16J12n7J43o1O9n7j60J51oj82L74j77j49J13k2n3K21k72k6m8L37
5064I1q7j86K15l32Q2K96j79j51M37L9m06J06m4K40k96j72M89k79M3j70K43J40
5086A19r5o9q5J75K5j99K63k38J87l0k6j48j04L55j87K88j49j48J56j06j23L72
5108B33j52r2M8l11M85j65J59j10nl1o3J56j48J98k14l3j37M04q7k33j3L16q9
5131A16o1J32m13M45j56m8M0j6J1R2k91J06N9K00j74o0n1p6J21R6j9l5P1j42l
$$ y = [162, -54, -61, 203, -286, 36, -94, -81, 180, -43, -144, -178, 53, -158, 86, -47, 78, 61, 21, 121, -104, -130, -120, 40, -175, 57, 143, 121, -110, -218, -124, 85, -35, -2, -50, -306, 169, -180, 68, -94, 97, -206, 139, 169, 29, 146, 94, 42, -106, -39, -184, 75, -30, -117, -149, -170, -162, 208, 284, -177, -95, -174, 78, -87, -163, 92, 24, -129, 217, -109, -199, 57, -159, -47, -104, 39, -22, 47, -10, -170, -19, -25, -207, 167, -10, -159, -46, -68, -121, 100, -172, -198, -246, 91, 4, -182, 33, -299, -217, 79, -100, -251, 186, 225, -181, -75, -119, 121, -175, -347, 142, -137, -94, -264, -21, 119, 24, -45, -130, 45, 70, -129, 134, -104, 83, 53, 27, -121, -225, 130, -57, 231, 82, -66, 90, -16, -139, 233, 81, -11, 37, -274, 211, 46, 205, 95, 90, 59, -4, 152, 4, 202, -12, -45, -182, 222, 135, -98, -111, 205, 116, 55, 187, -226, 219, 63, 15, 55, 39, 50, 142, -149, -43, 16, 216, 42, -18, -69, -145, -24, 72, 53, 18, 89, -53, -56]
5156e6j35L94P5o74N22O3j76J1j22J03J54j82j73P6R3K4L30k41M5j47J99l94K98
5179H7n0K6r8Ln4J21k22K38K5j53J27j76K48j48n2j01J26R3N6m7M0K02j33l0M
5204A32l16L38m03L34L5k52K56j39J72j15J1m5j68J68j60K58l33Q9n2K21N7q4
5226DJ96k51L7j06K48q2j06P6J14j48K12k0k66L5N6J51n2l20n1M92j33k76J86
5249dj60N6J94l5j95k4L46k16l8l6J84J80j59p5J44j34j16n0K11k50O2K34k43
5272a24j0k7L20j17o1J97l02L49k25J08Kk65L09k6p2o7Q5j43l5N3K09j08r3N8
5296A5L2k17%J57N4Q7J23l19r5P1j83K89j99K69l04L46k7k97K62K5j73OJ37L5
5320I4J04k91J88l52J24K22O8l34J44J17PqJ10M1m87L18j11J12L3m6M4m6k32K87
$$ y = [-56, -191, 203, 278, -396, 126, 189, 13, 24, -98, 5, 159, -23, -196, -120, -27, -3, 327, 86, 131, -16, 183, -211, 87, 37, 63, -35, -32, -86, 35, -187, 51, 76, -77, 50, -126, 122, -26, -78, -179, -53, 40, 96, 49, 89, 291, 158, 128, 132, -184, 154, -249, 85, 120, -132, 124, -15, 157, 42, 53, 8, -160, 8, -152, 106, -227, -138, -190, 31, 88, 4, 200, -51, -14, -120, 128, 46, -60, 16, 130, -18, 194, 174, -92, -57, -1, 150, 98, -222, -273, 219, 86, -190, -4, -164, -108, 86, 51, -144, -168, 178, -38, -76, -112, 72, 252, 93, 18, 162, 28, -88, -138, 73, -177, -115, 119, -124, -134, -161, 159, 42, -19, 178, -124, 225, 0, 108, 110, -155, 154, 128, 56, -11, 74, -69, -104, -51, 158, 50, -43, 15, 47, -170, -170, -13, 41, 128, 251, -68, -163, -92, -275, 14, -185, 84, -220, 126, 99, -198, 64, 89, -84, -78, 59, 94, 198, -93, 95, -257, -133, 89, 157, -177, -33, 84, 91, 83, 193, 234, -253, 65, -46, 66, 99, 53, 97, 51, -181, 106]
5344A06k3j62M0k50J52M3j35O8J26j6n2J09L75m76K0J23K6Q6j33L29m18J97j36
5367aL48n42L98k16j34K35j75J41j1J21j58j60J39j16J85k64K50J12j86k44J09
5388a69%r2L53OP5k06j51J27QJ67J1j67J4L4k60L84p9R2m6k38L23o7j55m3J71
5413I2j42J11j56K82l42J33l7J41j01O4k23J83K4O1J97k62J37N5j07m4nqj87P1
5437f3K18j20p7j67J27L20k14K64j41k50j27K1M90l12J26l13p8L80n4j71J67j42
5459a16j4M5K7K09j63M9N5k39Q8J32k41J21K27l78J47J16j59K87j74j21l1P7J65
5482A09j04k53r0J13N3N03j66j46n3j75M29l25R5m5J13n0O1K09k41R5j20J67j28
5505E1q8K4r6K19j04J48j27Jk00j50K41J43k18R7L8j73J38J63k0l3K88m68L3K2
$$ y = [106, 83, -79, -39, -289, -137, -94, -229, -161, -35, -51, -103, 6, 381, -95, -75, 48, 74, 160, 27, 356, -62, 135, -1, 347, -195, 203, -13, -147, 88, -87, 54, 43, 164, 6, -154, -15, -131, 54, -210, 40, 152, -34, -278, -169, -169, -261, 92, 98, 173, -33, -184, -57, -49, 118, 129, -38, -24, 10, -250, 134, 55, 147, 101, -137, 186, 119, -36, -79, 92, -50, 61, -95, 187, -155, -22, -59, 82, -19, 45, -178, 5, 29, 90, 287, 25, 162, 217, 110, 66, 61, 53, -134, -63, 155, 35, -42, -209, -82, 238, 24, 288, 147, -103, -230, -209, 281, -31, 95, -218, -296, 84, 30, -141, 26, -116, -130, -85, -58, 151, -12, 37, 92, -147, -59, 73, -168, -47, 180, -198, -51, 65, -94, 193, 19, -102, -133, -56, 109, 5, -248, -338, -225, -172, 331, 165, 19, -34, -209, 220, -105, -10, -55, 58, 8, 69, 278, 37, 132, 12, 179, 51, -37, -13, -109, 110, 6, 154, 27, 28, -172, -322, -81, 62, -156, -59, -21, -194, -56, 107, 87, 54, 342, -126, -93, -71]
5529g1K31k53J23J44l17R9M30n23K10p8K26j47j40J38r6j4J50j71m3J87K4j33
5551b4J74l64L39o04M65j4q1J94l49N80m78K44p1l9J93m42L47j07m7K48j42p2
5573e0N6k1K63p8j08j44k2j28N8K77j18k6q5R7q6J73r8j13R4J88k9j77k28M34
5597A29j13J20l08K92Q5l60J15Q6j81J18k6pm3R2O9O3j05p8k59L37M6KO0l18J37
5622d7L57o8k68OO2j60j49M03o3l16L37k17K28l61J84K61l01r7K95k4j67j33L90
5645A52l60n9K19q4j0K52m16K07j3L4o7qJ67J9J34k80K91p0k1k16L18l38L32l0
5669A53l58J54J70J04j97k07M6J89j36K3l2J81k82K66J2j41r4R9j74J14L14l12
5691a08j5Q0N4j3l5J19j34J1j66K89j98M43k40P9k17J52r7J94l1m34M24j08J70
$$ y = [-71, 160, -93, 30, 174, -143, -44, 386, -137, 73, -5, 221, 74, -66, 72, -24, -38, 112, -59, -102, 85, 109, -24, 150, -214, 125, -479, -14, -28, -109, 85, -264, 316, -162, 82, 11, -28, 165, -277, 70, -37, -84, 164, 22, -50, 6, -15, 248, 170, 62, -82, -104, -232, -174, 103, -15, -41, -126, -29, -115, 58, -40, -153, -59, 129, 100, -77, -305, 129, 16, 136, -172, 120, 205, -155, -40, 46, -135, -17, -43, -50, -93, -1, 68, 131, 26, -52, -311, 26, 72, 74, 134, -184, -47, 310, 242, -26, -20, 42, -118, -267, 136, 73, -243, 94, -123, 105, -256, -72, 189, -112, -209, 86, 62, -105, -238, 152, -208, -267, -48, -132, -142, 110, -306, -99, -112, -78, -145, -153, 14, 33, 167, -113, 178, 108, 87, -129, 189, -149, 183, 153, -205, -51, 119, 223, 26, -181, -135, 54, -82, -59, -91, 90, -192, 74, 86, -55, -149, -50, -224, -110, 204, -108, -123, -43, 11, -2, -37, 82, -52, -41, -207, 82, -116, 327, 87, 166, -51, 101, 4, 198, 167, -267, 157, 49, 219]
5714B19k33L8N4n0m3o3Rk05MM98R8j50j2p6p2o9j25J11NQ0k24J98p0j01P3N2M1
5741a3k7j27K41J43j86J66l02J79j17q0K73k16K64r8k63J89r5P4j68J19J18J0
5763H4k76K08J00r9M2k12%N2J62k6J19k30l6m7J76O5Q3j13l4j80K36k74L16Np1
5788E0J61j21j02J49N9m9n01K26J71l1K43k21m4J40n7o5m6j04O6j4O2j03N3M3
5812c5O2K3J23k01l26M51j45K29q1l34L39j4O7l03J46J82j53l9q6k5K62k17j37
5835b12j39Q5M84m66K43N1o6N7k73L45L1p8j03k4q4J28J85k96J62J62m17KK65
5858D2L35k27M8l47L94j0nk16J12j3N1j94n5R0L4l3r8j2K74l25M3O4J16K0o7L4
5884E5k33K08r6P9n6J88pk08K02m18L90o8k0J71j58J66m03L37r7K3K11j26Mj8
$$ y = [219, -14, 24, 78, 28, -15, -78, -69, -274, -270, 228, 326, 176, 164, 88, 16, -53, -178, -67, -62, 18, -206, -8, -78, -179, -106, -54, -13, -40, -167, 74, 217, 31, 197, -105, 74, -43, -123, 150, -66, 198, 100, -163, 26, -69, 5, -163, -44, 74, 84, -192, 16, 116, 17, 59, -153, -153, -101, 61, 35, 154, -76, -112, -159, 17, 82, 165, 52, 18, -162, 74, -200, 116, 121, 50, 211, 90, -12, 137, 196, 147, -354, -128, 43, 12, 255, 34, -10, 130, 73, 8, -38, -142, -76, -90, -28, -131, -78, -35, 27, 50, 173, -28, -354, 97, -48, 181, 100, -234, 105, 91, 158, -145, 1, 183, 30, -9, -95, -120, 142, -75, -212, -351, -266, 218, -248, -5, 46, -20, 37, -236, 109, 140, 62, -41, -65, -149, -21, 164, -132, 30, 192, -225, -223, 42, 377, 150, 198, -149, 245, 235, 230, 14, 126, 113, 164, -30, -85, 5, 39, 6, -92, -104, 170, -155, -112, -48, 68, 88, 21, 55, -178, 30, -66, 13, -43, 145, 138, -70, 132, -286, 104, 36, 16, 187, 29, 195, -208, 129, 32, 55, 266, 140, 144, 126]
5908A26k94r4K20j7L11q7k69l8L09j52j9k08K05O4j68J0J45r2j05R6K02j08R3
5931A30j0l26K87j14O0O9l65N05l34J50j65M86j75k11J15P0mj68p6K45l10J13
5953b8J50k08K48J19k52Oj35Q9J66q8j63K59j37r1J0M6j27K81K0q3o0J0P5o35
5977e28M70L3j98J25R1L0j93K98j47K33j20J07j10o6j52M3R2r3r5J68m5k12J65
6000a04N6K25l12J37o2j01Qn7J87J78o8k57J12K71j83M5j09N4l1J6m7J87r8l74
6024c27M77l1l57J26N9Kj07L12l35J11P8J00m38M1R8K14q4m9J54j27J49p6J79
6047A69j60rn5J15%k23PJ86m7O4k9m1J45P2j09J30k07J10k50J6J34K9k04l8L3
6072a62K21K95q4l08P4J34j26j14o0J88m0L2p0k29L78l68L28o8Q1j35j32P8J54
$$ y = [126, -168, -262, -42, -59, 252, 165, -104, -142, 167, 15, -4, -212, -7, 57, -111, -101, 44, -48, -153, -57, 145, 37, 130, 120, -206, 81, -33, 27, 96, -269, 236, -98, 52, -113, 373, 198, -13, 102, 172, 168, 0, -76, 169, -141, -28, 122, -86, 162, 281, 29, 35, -100, -11, 155, 67, -96, 163, 26, -65, -55, -9, -136, 145, 165, 82, 22, 32, 107, -528, -58, -25, -223, -98, -7, 23, -170, 128, -19, 214, 94, 201, 91, 25, -127, -84, 8, -85, -180, -12, -57, -269, -104, -48, 177, -135, 2, -60, -161, -153, -210, -23, 155, 87, -170, -58, 213, 30, 75, -34, 20, -11, 5, -42, 145, 47, -327, 150, 119, -238, -112, -53, -51, -158, 154, -181, -70, 8, 108, -330, -289, -191, 23, -61, -110, 44, -83, 66, -10, 169, 9, 0, -55, 60, 60, -163, -156, 30, -17, 47, 18, -23, 122, 194, 85, 215, 8, 118, -132, -116, 18, 47, -157, -195, -162, 59, 354, 270, -38, 36, 170, 44, -70, -130, 58, 18, 50, -20, -249, 129, -239, 89, 21, 102, -33, -165, -87, 67]
6095F7j03K07q2k02L6K53l8l69L75l66J70K0n6K0J28o0J30k05K44j54l2K12j13
6118H2nk09j69K71n9J87k06J9L95j90j39QJ99k77L4J58J00k86M3N2P4n0N8n28
6142d38O32k44j15L5J99J3j07r6L9K35l80K94l21K46J23r5j71J24o0P9J15k13
6164a06L48j78l58L18M2R0l13J27R5j28K65l07K45j57P1k48J41J41j21j3M0l3
6186c9K22k50k3o2J63J33j59j4p0J43l8j49K93l7kk27R6L5J09k38J18lO0r2K6
6211er9K33k90N8K14k39J9J59%J33n28L98j66q2L40p1k24Q5J09j88K18rr4P7r3
6236d5N5o1K29J12j73N5k21j10K90o6k22L62m06L41p4k59K64o0k7j27K02L6M5
6259A40j30L3j20J1k5r1L19j20n1k02M37k89P4J80k88Q9O1Q4l13L30o3k89M59
$$ y = [67, -36, 171, 89, -113, -77, 176, 138, -231, 144, -222, -52, -32, -88, -68, 60, 0, 130, -75, 169, 15, -17, 195, 82, 77, -132, -301, -30, -89, 98, -108, -89, 306, 116, -23, -15, 184, -93, -59, 99, 199, -87, -44, 8, 82, 32, 90, -438, 194, -50, -165, -130, 69, 82, -25, -121, -82, 153, -227, 67, -254, -8, 115, 20, -151, -27, -87, -8, 107, -106, 242, 64, -294, 24, 66, 156, -157, -30, 65, -63, 202, -105, 140, -17, 54, -194, -53, 88, -33, -46, -6, -39, 183, -67, -90, -152, 11, 144, -15, -29, -99, 44, 6, -143, 150, 113, 111, -116, -20, 15, 124, -114, 4, 1, 61, -31, -5, -104, 129, -161, -103, 111, -128, -109, 50, 50, 183, -345, 53, -113, -195, 145, 74, -150, -65, 44, -144, 74, 65, -29, 48, -45, 10, -51, 178, 290, 117, 172, -49, -159, 131, 65, -157, 205, -201, 140, 66, -193, 71, 11, -16, -143, 59, 95, 140, 10, 43, -77, -66, -91, -182, 137, 17, -34, -236, 201, -88, -14, 166, -122, -33, 28, 112, -201, 129, 66, -223, 236]
6282B36l47k62L70k6r5K21K8j31j91Q3R9j1M5P3o6L9j91J34P0Jj37m7L35j90P8
6307A18k21J02P6j44J22j19K44j26K9l6j91qJ55O6n8J44O2j35k50K74k29R4m2
6330g3R5k13O3K74j04p9p4J01j37L36j65pQ6j37o9k52K25p9L32Rm29L16n4j70
6354b05L99n6k21M6J55k22N9L59m17J38J4k85J83NJ43j14O7k9j45L0J91l77N27
6377B45k90N8j04R9L06l17l7P0L67m85j46K42K69m02K56l4k91n1K88K9k54nK4
6400a63K90k28R3j18M11j63m36K69J33q4l53K25K26j87oK16j06jJ6k63OL24J03
6423B04l02J31p9m6L3J20j11l02K52J52j29p9j53K44K7j0K94l26J83j24P1L3M3
6446A26K47n00J16j99L09l21J71n2m0j1M6J07M0r3J53k97j55L18n9J25P5j46q
$$ y = [236, -111, -373, -3, -29, -124, 97, 125, -6, -197, -114, -15, -26, 19, 92, 26, 65, -126, 8, 78, 79, -58, -105, 230, 40, 118, -103, -1, 75, -69, 53, -66, 178, 52, 81, 45, -146, -154, 1, 67, 9, 153, 215, 80, -170, 104, -125, -31, -73, 22, -191, -128, 146, 42, -37, -111, -10, -147, 189, 24, 17, 103, -34, -103, -355, -130, -209, 123, 132, -297, 19, -35, -205, 194, 138, -83, -37, 118, -104, -45, 314, -103, 35, 49, -236, -53, -48, 95, -19, 48, 19, -126, -96, 95, -282, 245, -45, 13, -91, 8, 314, -3, -40, 30, 397, -88, -234, 8, 277, -125, 131, 97, -194, -245, 43, 72, -182, -187, -163, 127, -101, -8, -126, 285, 122, -314, -45, 88, 4, -349, -124, 102, -85, -91, 125, 19, 18, 34, -229, -223, 101, 204, -98, 33, -46, -92, -59, 61, -50, -352, -100, 52, -77, -156, -309, -65, -38, -48, 246, -80, 103, -21, 50, 83, 126, 373, -127, -11, -210, 99, -222, -51, -103, -143, -154, -108, -1, 39, -54, 99, -198, -353, -35, -94, 31, 106, -40, -48]
6469d8k50M08r3m6J15j81K39j79o7J65j40K46n7k59J73kq1J39p1J0R3j18k78K66
6493a6N3k37O7J07k87J48J3K15J27k51p1Q6N3L11r4k28o2K69J50m15r6J33j9J
6517d3J85m7J95k43J21k69P2j78L5K37L5j26r1J4O1J7J83j16R4j42L03l96P7R2
6541G0m8N2j36M2j24n4J8K0j0J54R1l11N2k17K85j25K33K06k22P5K9Q4o9k24K62
6566A33P1l89K73K6K7l19K29k26K20M1J71m71K5MM95m94L42l34M69n27M7L11j72
6589d8J39K7m5j21q2L22j28j72J33R1l24J3K09O6oNl01P3R0J24P6k37OJ46j80
6614a24K69m17L66J6l04r6K19P9j24M85l87j30L38p3k37J93j31J55j09r0J01L5
6636C4J5J39l87K66q7K3k11M22q3j1k31L83l58k04N11k53K9L0j87J13R2J5q9j5
$$ y = [-48, -298, 110, 17, -29, 86, -95, 144, -35, -102, 63, -77, 169, 112, -147, 26, 24, -57, 82, 11, 21, 114, -4, -282, -16, 37, -200, -133, -26, -313, -165, -152, 63, 190, -61, -132, -46, 7, 318, 224, -4, -66, 203, 353, -62, -158, -25, -44, -43, 142, 95, 290, 47, 168, -101, -29, -207, -172, 65, 100, -26, -117, -103, -42, -25, 158, 42, 136, -6, 297, -99, -22, 70, 22, 74, -62, -20, -144, -198, -180, -160, -170, -16, 75, -236, -184, -401, -116, -241, -8, 198, -24, 51, 80, 164, 95, -129, 133, 204, -185, 88, 114, 141, -178, 51, -175, 45, 86, 257, -214, -189, -185, 310, -184, 158, -176, 293, -234, -187, 124, -48, 91, 118, 73, -48, -130, 192, 64, -108, 25, 116, -208, -195, 14, 80, 74, 79, -222, -149, -59, 65, 141, -96, -90, 56, -124, 145, -272, 94, 110, -194, -290, -71, 8, -116, 369, -18, -148, 190, 117, -120, 73, -58, 97, -12, -102, -1, 34, 49, 188, -199, 67, -20, 3, -208, 214, 131, 120, -111, 272, -86, -290, 221, -32, -3, 27, -160, -47, 45, 60, -29, -44]
6660d4K20k48K34j07P5k5m29L95j26LJ61j48J0O3j0j25J19L0J18n4Q2k39N8j27
6684a14k01J31J96J59l5l2m4nk15Q1rJ12j53o1J28k5o5K17j71K68m10L09j33J38
6708F6p1P9j34K7p0K19q1o3J21p5q2j02jP4J29n0J48l79J24K34p6k09O3N9m0K67
6734A77J2j53J8J92j52j73K07M0k84L07q2j08q3O8jP8J17j32m4q1p9J93k8j36
6758a27J05J92k22p0o7K79P6j86M4j84K99m6k82R1r7L13l42K55J0M6k50J36r0
6781a17j55J35J93j28J91j53j88K23l1m1K51j97N0pJ51l71P7J79j25M6j58J63
6803a2j54K9M0K00l53L35k67N4J15q9R3K52l68J30K3Q0j14q8K92k83K81j26m6
6826B4j23k6J81kj22k25K12K90k25N0O1j37J01K7J42l78K31q4k44M06k69j7L00
$$ y = [-44, 176, -72, 162, 55, 130, 105, -324, 71, -55, -52, 109, -39, -29, 34, 24, -101, 18, 48, 166, 112, 194, -45, 13, -114, -315, -184, 12, 171, 136, 104, 60, 55, -160, -79, -88, 24, -129, -190, -62, -87, -152, 65, -106, 162, -248, 61, -72, 66, -5, 74, -60, -33, -103, 116, 35, -28, 93, 18, -64, -166, -167, -93, 36, -14, 134, -245, -121, 113, 37, -172, -109, -50, -90, 177, 189, 36, 54, 246, 94, -79, 128, 168, -116, 191, 109, 1, -82, -14, -15, 63, 180, 48, 4, -77, -156, 37, 9, -127, -22, 170, -52, -122, -189, 90, 166, -20, 24, -160, 139, 93, -189, -98, -195, 118, -224, 31, 41, 87, -163, -27, -117, -272, -137, 56, -72, 119, -34, -222, 1, -30, -71, 180, -17, 33, 26, 177, -194, -117, 62, -63, -17, -175, -12, -166, -137, -97, 103, -250, 85, -182, -128, -13, -102, -9, 243, -125, 5, 28, 108, -6, -94, 198, -85, 196, 70, 24, -99, -125, 56, 54, -68, -293, -81, 209, -16, 34, 95, -42, 59, 86, 228, -150, 81, -3, -247, 159, -110, -127, 173]
6849A73k28L0l6P9K66j66ol23j41L41L2P7rj74O2J91l37J29o8J04LM4r8P4j78
6874a59J15L45k91p8K9Q7lj17J03j20K61k20n5o3K4J32K56j96o0K6j40O5J49J44
6898B34m62J54K07M4j12r9j8m2K94o4j45P7j59J39K04l31p3J13kJ20k21r0m3L30
6922E5l30J53K34k01O9q1K05N5k76J12K05k23Lj17K3j68J92j55M36j77j60L15
6944A69l26J21p6L34l20J1O2J89mk20k1K38l23j10K22n0OP0q9m7K68n9j45J05
6968Ej05L22k08j07M3j07K74l35K23k17J57Q3m5L3j34J99r5r8J84j20j68L19p9
6991B4n1J18j72L12j23r2J25n6lN2j23m0j59L03j48N1J16k6j93k20K87l2o9J85
7015F6R9k93L48k99J1L22j79j60Oo4L14j86q8K62l5m40L92r5M6k30K21k15K14
$$ y = [173, -55, -25, -61, 18, 284, 118, 112, -211, -352, -11, 21, 98, 89, -85, -23, 168, -169, -40, -108, -4, -1, 43, -55, 19, -159, -44, 301, 10, -68, -39, 48, 45, -72, 31, -89, 172, -48, -103, -166, -142, -10, 246, 50, -10, 16, -124, -59, 90, 234, -228, -74, 133, 177, 65, -34, -52, -94, 200, 136, -9, 68, -91, 48, 252, -79, -152, -39, -41, 79, -142, -232, -275, 55, -275, -122, 112, -89, -20, -101, 104, 159, -117, -5, 200, -23, -20, -137, -114, -282, -90, -245, 191, 14, -146, 169, -157, -36, -112, 222, -98, -87, -25, 164, 160, -60, -81, 157, -166, -276, -54, -104, -98, -28, -117, -164, 104, 45, -100, 5, -100, 222, 14, -93, -50, -157, 117, -218, 5, -212, -55, 28, -17, 16, -118, 81, -14, -112, 72, -48, -216, 103, 24, -27, 91, -81, 231, 108, 16, 141, 85, 82, 134, 11, -29, -188, 115, -33, 18, 134, 108, -85, -305, -18, -50, -119, 66, 165, -128, 220, -79, -68, 254, 75, -85, -79, -143, 171, -15, -103, 159, 124, -316, 76, -19, 27, -203, 18, -197, 17]
7038A7k0J09q9L46l96O3K30l53K43k49J02P8q4M3O3m16K13K38k14J83o1p2J50
7061A24k76Q7q6Q9J06k2P2l35O7K58j36M3POJ8Rr3K33o5Q1k68J17m1j75K78O2
7087A60p2n8J17M3l4l45K21j36J19j11j04J62N2j45J41Ll72M64l7P6j18K1l24
7110b77L89j65q3Q6N0m4J0Ko6j2N4L2k66J88J85J40j64p8N3q2J55j50n9K52l67
7135b17K45l0j21m9N17n17M0P3J98O4j14l73L6K28m4k5J65p8j9m0Q8K56m91K40
7159C2k04j16L28l52O1N32l00J42j35J1m3L2j09J62r1J06R6k1K52m35O1k5j62
7182a78N0K36k41J59j77J86l53M92n0J05q0n4k9K1m4PO5l71K99l27M41q3Q1l16
7206a61J66J95j22l63K46o0N32o84L58m60L55K85j83j65n7J68p7J51p2k13K38
$$ y = [17, -3, 106, 17, 363, -33, 30, 260, -93, 150, -99, 3, 81, -3, 40, 103, -313, -100, 138, -76, 107, 46, -26, 124, -152, -65, -151, -62, 44, 22, 94, -241, -174, 84, -52, -9, -2, 4, 22, 31, -62, 171, 106, 187, -81, 36, -5, -180, 98, 160, 88, 30, 147, 190, 156, -189, 32, -104, 15, -96, -200, -38, 14, -131, 10, 13, -359, 105, 68, 144, 26, 47, -277, 112, -53, -136, -50, 0, -44, -34, -32, -98, -110, -56, -24, -290, -102, 83, 223, 59, -19, 34, -48, 107, -43, -102, 150, -217, 28, -2, -123, -172, 345, -172, -132, -59, 139, 203, 89, -284, -248, -20, -64, -89, 76, -2, -21, -61, 27, 283, -208, 32, -172, -288, 40, -312, -251, 281, -19, 123, -12, -1, -44, -12, -121, 41, -50, 56, 152, 131, 383, -52, 9, -16, -178, -128, 108, -133, 26, -151, 35, -318, 174, 124, 229, 149, 95, 66, 87, 43, 50, 115, -256, 43, -284, 157, 74, 155, -161, 5, 200, 78, -285, -39, -99, 433, -251, 107, -353, 2, 287, 104, -61, -118, 50, -27, 124, 52, -161, 77]
7227G7j15k2j07P5N1k5J34k11P0K05j23k0j44P6J06J21j54J9ok13J12J93P7k15
7251c9P7l5o7j84L58q4j44q6J05j9K06n1J36k72M7k2k2M4J06r2o4J89j02O1l13
7276b67L10P8k05J59K41k06j96pj6K4Q4l7J10k77J72q0K54j72j02M9L84k33j75
7299a08J19J80K1n21J83J08P2j23N5k9l2Q3K54j41j12R7j79R2k87K95j73J59m2
7322b9J27j75k4J52j06p8rJ38j35J45j99L5L44j59L5N6q2L1N5j22K65j07l09m3
7346a94O7J08K69k16L4k35J40kM4l37J77J88k03Q4o1j79L85O0j44J28j04m5j13
7369a49K0L87j59k43M64k50J36k71L49m25J20j24MJ91k7m6K9m6J28k06J20k86
7391b84K80K39j93n5l2j77l1J10L40r5j57J81k44K51j48p9J09k24J40K95n3j99
$$ y = [77, -38, -60, -167, -92, -41, -66, 68, -143, -73, 132, 9, -11, -155, -79, 27, 148, -6, 13, 7, -206, -94, 99, 176, -39, 38, 3, -64, -248, 110, 26, -118, -204, -99, -118, 88, 37, 173, -99, -52, -74, -96, -52, 54, -38, -102, 87, -15, 46, -267, 43, 121, -84, 75, 316, 110, -86, -93, -109, -85, -1, -38, 72, -205, -33, -113, 141, -31, -133, -84, 300, 67, -108, 11, 191, 212, -309, -126, -18, 54, -69, -14, -43, -75, 8, 262, 121, 9, 106, -73, 19, -268, 27, -146, 13, -29, 98, -77, -101, 51, -55, -133, -142, -4, -139, 6, -193, -158, 186, 27, 62, 118, 36, 67, 122, 0, 265, 158, -151, -194, -127, -19, 250, 34, 68, -167, -27, -29, 15, -322, -145, 43, -160, -76, -137, -316, 69, 129, -15, 113, 9, -36, -149, -129, 258, 99, -144, 320, 70, 206, -65, 284, -141, -21, -145, -141, 50, 23, -23, 6, -40, 88, -118, 2, -284, -4, 235, 42, -13, -45, -222, -253, -143, 197, 102, -55, 126, -118, 133, -15, -94, 15, -209, -69, 226, 173, -26]
7413b6m7j30K78j57Q6l29L13j82K63m06K36p8K45L1j69J95K38k49k61J79R8j60
7435c2M0j9L8O9L9k78K12j38o7P5L0L5k8O8j05R5k33L36j27J02n5R0n4L5k6Qk53
7462a43P1J93m51J83K3n4K90j26k47J94j23J78K28k58N4j6L13k77p8m3O7K06j39
7485D5j73L14k39O7n2j65L81m42M60l37J09N2N3qj18q9K1K58j81R7j59J93J19
7508B06o0j89K12k20J88k32J15mj26j37M44k00J7n9M1l3K88m82J93L15l28M2N1
7531D2J37j96M4J21J08m43K67k00L43m43J76J30NM1l04M3J6k4L34j61q6M1Mm3
7555d8J49J68j55j74J70r4J89l0j61l05J66J37j87N32l11q1m7j32J79J17o2m1
7577b1k07J94j3L2J64n3j71K16k05K60J4k07N2k52L4M36m05l9K69L9n2j01K7J9
$$ y = [-26, -73, -203, 75, -82, 4, -325, -12, -194, 69, -337, -101, -179, 66, 97, -72, 123, 361, 112, -149, 30, 128, -32, 8, -11, 27, 96, 135, -143, 69, -69, -136, -61, -31, 4, -24, 44, -61, 34, -199, 137, 10, 112, 57, 147, 93, 128, 102, 110, -143, -72, 121, -330, -147, -124, -178, 112, -14, -261, -67, -190, -12, 216, -42, 12, -4, 309, 32, -46, -89, -22, 184, 45, -128, 186, -53, 14, -38, -203, 178, -264, 196, -141, -32, 20, 73, 65, -53, -142, -121, 137, -44, 53, -106, 87, 206, 146, -43, 169, -51, 137, -95, 20, 16, -110, -247, 197, -3, 14, -45, -4, -37, 251, -231, -38, 277, -51, -9, 42, 179, -17, 27, 148, 256, -187, 80, -120, 223, -220, -44, 86, 91, 132, -172, -129, -113, -137, 197, 36, -50, -9, -5, -48, 101, 269, 114, -60, 110, 16, 205, 175, 14, -291, -125, 12, -175, 357, 46, -35, -82, -214, -35, 82, 20, -21, -228, -34, -47, -15, 149, 96, -75, 141, -64, 196, 210, 3, 55, -197, -163, 273, -132, -171, 98, 137, 85, -16, 11, 30]
7601C0Kr9J76k62K56k6ok06N1K26j40J00N8j21j70P4J41o0K03k33k02M06J1O9
7625B78j82N9j87kK16O8n79K79R8P8j05j0r9J59L32m02j17K80j77L1j9J04R0l55
7649a62O2L63m52L07K1j66l8j4o0j5J81m1K22k26m5O4j11j2R4K00j35M1l9j27
7673h8N1J12j8k87M27J33l61j87L91k83J08K1R7j37M2J18m56J61L03q9L7j16m5
7696f6n0N3%p8M18j73Q5j84n5O2p5O7j21M5j98J88k09L41o5J64n1m1j0j15j43
7721b11L1J20J06r9N7Q0q9K1L7J09k35m4P9K16k73r1K87l38M3L22j34j32J90r9
7745d7j19J89J65l85K74k25J38L9m04M42J86m54L74l29K79j77J98K81o32J69K77
7766B39l32K3P2N5j84J58r7J87k4J52k22N4k17r7K08J20J63q9k02J4m0K72M8k58
$$ y = [30, 32, -67, 109, -153, 103, 77, 71, -135, -84, 142, 2, 102, 160, 39, -131, -57, 84, 24, 227, -6, -208, 198, 209, 278, 96, 155, -32, -34, 182, 250, -329, -50, 48, 126, 21, 11, -88, 71, 403, 1, -116, 164, -13, 18, -1, 103, 193, -162, -100, 263, -189, 118, 139, -27, -65, -79, -139, -154, 27, -14, 208, -18, -63, 1, -110, -122, -28, 172, 37, 78, 39, -88, -37, 75, 57, -230, 197, 330, -31, -218, 173, -110, -2, 19, 116, -21, 21, 139, -317, -156, 147, 58, 95, -21, -66, -116, -63, -63, -141, 277, 104, 189, 5, -50, 12, -63, 4, -117, -72, -270, -82, -291, 50, -15, 149, 98, 57, 47, -68, -211, -180, -60, 46, -53, 4, 84, -5, 16, 53, 162, -73, -117, -38, 178, -95, -186, 101, -237, -194, 128, -6, -138, 52, -47, -166, 23, 188, -197, 77, -148, -10, 29, -375, 67, 253, -201, 173, -156, 123, -54, 144, 425, -207, -38, 239, -93, -70, 2, 57, -127, 31, -66, 121, 97, 249, 27, 81, -136, -233, -25, 95, 258, 169, -33, -19, -59, 213, 261, 3]
7790Cl6j36J76m2o6R3n9K35o0J10o2L7J7m04K22j58K19j41J35J12l61J20Nj19
7814a60J27M4N4m0K38l98K10j14m1P9j56K98N5j83k5O8J5j37K2J04qK80l90j31
7838a89K56jj26l4J7K06k28o5L68l71J05j71K78jk00O3O7Lj1l3q8Q6J46k45K86
7863A18j93K59l14L%J58j08J67p5N2oR0l81K32P5j55l6K42n8k41O4K68j19l8J78
7888A82P1l7l45O5k31M09o3l21K03j06N28m53J84p7k44O1J75K13j69j47L2M0Q8
7911E8K18m75N78n38J60m9N6J25k09j26J65J18O4k76l9J63k97K40R5j22O2j3j02
7934a44J0k04J59L17nj64N0J06l39L70n8k56J70k03K95M5l42L03M2j01J72m4j17
7957F2j27K00j62j43K7K16k03J57P9n2k56K67j94J36j0j48L34k74J77q4n3K84
$$ y = [3, -33, -169, 7, -35, -101, -8, -67, 168, 108, 218, 156, 193, 210, -194, 28, -130, 89, -52, 83, 195, -166, -46, -41, -160, -33, 11, 65, 25, 263, -135, 75, -39, -80, -1, -157, 141, 196, 13, -12, 56, 71, -66, -44, 60, 52, 332, -58, -189, 67, 66, -60, -94, -77, 129, -99, -164, 204, -167, -62, -233, 45, 44, -156, -93, -26, -23, -34, -67, -155, -69, 77, -168, 118, -75, 184, -130, -127, -127, 31, -77, 90, 15, 67, 61, 151, -230, 2, 77, -78, -114, 128, 70, -171, -107, 161, 42, 4, 182, 253, 216, -129, -64, -295, 114, 51, -270, -67, -173, 355, -98, 86, 9, -235, -174, 1, 214, 45, -102, -70, -30, 58, 276, -199, 379, -159, 1, -48, 8, 133, -76, -202, -37, 81, 145, -131, -170, -7, -304, -64, 31, -91, -29, -42, -144, -134, -338, -179, 138, 133, -31, 19, 125, -214, 156, 98, -158, 12, -191, 104, 149, -193, 110, 152, 51, 223, 179, 62, -65, 135, -27, -170, -143, 73, -130, 27, 106, 54, -202, 65, -129, 7, -3, -151, 183, -91, 86, 2, -51, 233]
7979B33l37J49M9k99J48qM9J18J2j06n2m0J34j20J03q4J42k28K3J01Q0l06K53
8002A4oj69M99k87k82J65MJ01L0k57K59j02L1j37J22j60J25PM6o7K36j13j9J61
8026B01l48J55j08L0p2R0J7q7M7K54k61J93p3k9r8Q4R3j95J80rr8k65M35p4R9
8051A61p1j74k9K16k05M4q3L62j34o3Nj34K6K13o2j16K21j08j63K32j68r9j12
8074b41L60j55j40J63J48K3r7Qoq3Q9j02j28L95j41J1K3P8r6k65J28J25J66k49
8098A4J21K1m08J76J65j20o4R6m7J47q4j40O5O1j0J77j33J57k91N4L6p4l1K58
8122A46k22J31L5j90J05j48J27J46j05j44J03j46k6J40J50k02J36l6K47j74o5
8143HK1K3j70J2L24m48j52M36j24R5M4P8k32K1J54k41L2J81mj47K72l9k51K6J14
$$ y = [233, -104, 45, 94, -205, -57, -65, -16, 102, 114, 8, -44, -84, 50, -70, 33, -51, 91, -137, -114, -13, 67, -239, 14, 8, -161, 338, 51, -231, -66, -62, 39, 69, -188, 71, -31, 0, -137, -15, -175, -50, -43, 3, -64, 172, 59, 40, 201, -147, 8, -100, -70, -142, -52, -35, -122, -75, 179, -82, 111, 38, 9, -89, -5, 88, -107, 73, 64, -34, -299, 136, 62, 161, 90, -84, -113, 103, -102, -58, -141, 221, 87, 24, 29, -105, -79, 134, 72, -44, 177, 69, -94, 138, -30, -129, -241, 119, -36, -176, -13, 135, 158, 61, 69, 63, -20, 69, -33, -161, 234, 93, 104, 127, 205, 109, -156, -28, 97, 263, 14, 135, 156, -252, -76, 89, -31, -95, 1, -46, 101, 17, -123, -58, 3, -7, 170, 37, 194, -97, -43, -7, -81, -112, 146, -76, 55, 90, -100, 5, -143, -16, 130, 25, -119, -16, -162, -188, -48, 102, -100, 36, 0, 247, 73, 8, 29, 52, -118, -106, 218, -230, -382, 54, -70, 25, 69, 147, -85, -64, 90, -151, -119, 62, 58, -89, 183, 144, -107, -81, 33]
8168C3j98K5J77p6j91mL68l71R2J37M2O7k9Q5j48j12L6Rm9L20k32O9M
$$ y = [33, -165, -140, 37, -39, -230, -234, 134, -237, -145, -8, 34, 101, 72, 157, 9, -103, -67, -58, -107, 213, -19, 50, 54]
8191E4
$$ Imaginary data points
##PAGE= N=2
##DATA TABLE= (X++(I..I)), XYDATA
0@%%%%%%%%%%%%%%%%%%Qj6J6j6J6j6K1k9L2l3M1m8N3o1O9p8Q8j00J12j25J39j54
40h1J71j92K15k37K62k89L18l52L86m26M72n18N70o30O96p69Q54r54J070j204
60f38J365j564J818k152K608l275M346o340J1245m3776o3052J15314M4675o4714
74d140k2755L2800m665K449J6032j6188k2038K4945J8729j7226j5791L213N598
87I63Q232k317j4868k702J1817k115o890O290J459j0904L874J0832p166m614J3084
102D975M64j1411O242Q560j3061k680K0613N96k1748K30J7340l885j2151P832
116A916Q877j1967p226J3516L753j6562n56J8003m208k0174O464J8124q705j4288
130a3033R616Q124j1815k366J2557K579q431r66N074L36J55L380l59j931J030
$$ y = [0, 0, 0, 0, 0, 0, 0, 0, 0, 0, 0, 0, 0, 0, 0, 0, 0, 0, 0, 8, -8, 8, -8, 8, -8, 13, -16, 16, -17, 24, -24, 29, -32, 37, -41, 47, -53, 59, -66, 73, -81, 90, -102, 113, -124, 138, -151, 167, -185, 201, -225, 247, -271, 299, -331, 365, -404, 450, -504, 566, -638, 727, -837, 981, -1171, 1437, -1838, 2508, -3832, 7413, -36363, -99415, 15899, 60574, -4140, -26895, 5905, 1240, 3689, 19721, 3533, -18505, 6440, 25169, 7943, -7848, -4635, 963, 9195, 6878, -7990, -10692, 1125, -990, -7880, -1590, -131, -11035, -7161, 3671, -3495, -8109, 4975, 5439, -5972, 270, 8830, -4231, -6911, 13702, 14298, -7450, -7220, 10120, 6235, -5916, 1916, 10793, -1174, -8400, 5116, 8869, -7693, -8249, 9754, 5546, -14628, -8164, 9960, 1255, -13033, -3417, 4707, -7108, -9474, 3083, 5662, -2769, -3735, 1339, 1675, 1830, 5210, 4851, 2920, 3950]
145C950O31k851j933J762L294j69o040m074M457K065n185J073N682n333p286P885
161b072O132q215j277R254k797q731O379Q415o150n043P513K173p915k10P575
176E031J114m762L45P93k691N28M375j576n404Q53L487k594m216J136L425N43
192C87k788l072N84K771J891m10m31o06K11K080K206o68n85J310m72j732J632
209B308K425k961k020M137m75o834r0P200j531n401K318J720n534j13O453m95
225A107n321J335K500k463J85K952M2j321R14J79n07J443J144L27N10n03k721
242a98J301K974r91k305J346o55l204J86K674j720j679K154j177l701O21L906
258d68L74j542l52q07O23K280J403j367N1J310j62j022L44J783R65j058j249K67
$$ y = [3950, 4581, 1730, -203, 1559, 4853, 4684, -1356, -5430, -973, 1092, -4093, -3020, 2662, -2671, -9957, -2072, 4060, -4155, -5432, 3822, 1025, -7706, -1327, 7088, 938, -4105, 3408, 5581, -2334, -2544, 5031, 6145, 1383, 1728, 2521, -170, 358, 4733, 3157, -2247, -1394, 2093, -501, -4717, -3581, -156, 387, -2401, -5473, -4889, -2118, -227, -637, -1068, -1674, -1463, 617, 2823, 2155, 1570, 2880, 2408, 676, 2308, 4733, 1772, -248, 3889, 3414, -3420, -3510, 3690, 2159, -3242, -924, 796, -4738, -4851, 1602, 1107, -4214, -2879, -379, -2842, -2657, 295, 337, -984, -70, 109, -398, 1045, 2189, 2516, 3026, 2523, -198, 1103, 4077, 3086, 781, 2127, 1472, -1732, -1546, 1128, -592, -2271, -117, -1294, -4995, -4374, -468, -94, -1636, -1988, -2795, -2172, 108, 1511, 144, 195, 1505, 1343, 321, 665, 2448, 3413, 2355, 1106, 1373]
276A373m19q27J479J007j652k198J36O31q68L22J442j457k129J43J128k5N29J118
294b67m90j044m3J363J859L01r97J56J414r65r36K344J123j869r87R79j078j726
312h63J825J443k617k175P76j79l99J406j23r93n65K28Q2J133J084m82j90N02
330a07j98J57J347R58o43M4L8p69J87P06N08J25n88j326j190O35Q96n91m06m67
350f84j871n50J802Q38r34q10L41n33K99J249J176M62l55q94P56J015n2K04J794
369C253n63k286K7J594l36r14J033n53j807r00J028J90j88m6p20j228J33P43Q19
388g21J89n91p03N01P24NM21J314J23q22R6P22r0O39O22j38r79m32n25P01O76
409A732o55j127k79j210q20J671P64j391j018L35L69k42M94Q51r3J09J58m91L44
$$ y = [1373, 954, 127, 1606, 2613, 961, -1237, -1101, -470, -1338, -1016, 426, -1031, -3160, -3017, -1889, -1914, -1385, -267, -757, -1801, -1844, -481, 1378, 1679, 682, 838, 2252, 1287, 351, 2695, 3818, 1949, 962, 1941, 863, -863, 962, 2405, -212, -2387, -1611, -1790, -2189, -783, -906, -1899, -2464, -2236, -2154, -1021, 63, -419, -609, -107, -305, -148, 1199, 2157, 1514, 1558, 1596, 827, 1014, 1720, 2228, 2353, 1765, 439, -751, -116, 780, 189, -217, -684, -2555, -3105, -1303, -465, -1399, -2209, -1868, -2401, -2102, -853, 323, 785, 430, -464, 292, 1307, 1255, 1459, 3253, 2690, 404, 431, 2025, 1689, 775, 1808, 1255, -552, -1452, -424, -234, -422, -468, -1188, -2416, -2283, -1540, -721, -532, -1123, -1826, -1325, -601, -596, -175, 1139, 1262, 440, 536, 1258, 1168, 1807, 2429, 2291, 1312, 880, 355, 1056, 1732, 1077, -50, -329, -1539, -2359, -688, 76, -1315, -2333, -1998, -1629, -1871, -1377, -526, -619, -510, -352, -843, -499]
428d99J474O52n4n1n62j126J943J206j483j053R21l52j816M76J947j081j471L71
446e58r90r87J236J496j276j420M96L71L68O07L09j73M30K50m73K78J752k46n
465A465N58k28j751N42J654J25j627m01k27n33k48J048K91j862j084N76Q81l08
483a129n0P5j85Q0j50j8P79J259J49r6l40p31m9J866J576r31j570O81O24j357
503D83n64J359K90j299r04j16M8J48K02m43p58l97j81J237M17q24j36O57jk76
523a058L78J900M97j051l11N01Q2J99M28M70L8j160j236M67M33l6l52J39r39r01
543a512P85N85p43j461J077P47q01O4J10M92R34m65q20K60J261R38J84L05j106
562H34q96J022R89k19k76M05r87j420J59O15J07o9o19j276K75O49o82k16P53j4
$$ y = [-499, 975, 1627, 1573, 1522, 960, -166, 1777, 2983, 1500, 447, 1368, 1016, -800, -324, 1623, 542, -929, -558, -1548, -2535, -1299, 197, -1079, -2499, -2003, -1632, -1264, -657, -348, -521, -91, 159, -314, -36, 1716, 1470, 1465, 2023, 1795, 44, 586, 2240, 2365, 738, 337, 110, -423, -671, 377, 668, -1194, -2278, -1702, -821, -1129, -1179, -1104, -1289, -1209, -1359, -1377, -598, 661, 810, 714, 374, -357, -406, 1460, 3036, 2105, 535, 1216, 1840, 483, -81, 1278, 1568, 269, -635, -751, -703, -555, -353, -796, -1554, -1951, -2132, -895, -478, -1302, -1438, -781, -782, -1058, -680, 1220, 1717, 666, 355, 856, 938, 1137, 1565, 2035, 2073, 913, -323, 144, 577, 541, 189, 328, -611, -1512, -727, -142, -885, -2346, -1269, -522, -1323, -1259, -1149, -657, 277, -188, -1008, -748, 513, 1451, 1635, 1940, 834, -62, 960, 1949, 1730, 1454, 1859, 872, -548, -389, 226, 333, 264, -355, -1631, -1356, -707, -1389, -1605, -852, -866]
582h66l84j41M93K88P44J74n78J49Q55Q2k5J072L26j374n34O31K76n8O58l76j629
603b17l41K67j85L15L80r10q12M48n47k06N90R85o69m33O50M35m53O34J418o52
623F97q61O50J048k78j41N04l90m95n79Q65J65k04p20m07m40N5o41K76O19p0j289
644a636j60O37l41rJ577N07j498o05J611P79o37L78J098j053n03Q29O31M4j29
663A520m56j353L10R73l48m06K60r57j437R15O72j002M04P32o97r06M8J158k77
682h47O97Q68o81o24M88R15J32M85j85n80K81K42n66O59O72j235r52R2P24n99
702a4m11M32o21o95l15K76M74J56J07j41j67q01O26J381M8j78K61R9o13M44J271
723A619j3n71k75k25K84J1K49o1n63l97p53K14K90j90m80r8L87r52l92J241J62
$$ y = [-866, -1250, -1391, -898, -610, 134, 308, -270, -121, 734, 816, 791, 1863, 2189, 815, 281, 912, 1188, 1130, 1788, 1412, -217, -558, -291, -476, -161, 219, -691, -1503, -1055, -1602, -1808, -1218, -233, -902, -1335, -685, -250, -703, -69, 1349, 697, -164, 486, 1534, 1256, 1115, 1619, 1229, 734, 155, 1020, 1185, 981, 261, -146, -586, -531, -1172, -896, -277, -347, -1636, -1796, -1159, -1500, -1509, 68, 575, -923, -1528, 83, 862, 225, 603, 1701, 648, 145, 974, 1605, 1649, 1520, 1064, -289, 21, 994, 646, 240, 500, -457, -1894, -979, -307, -1309, -905, -173, -870, -1776, -1728, -570, -847, -150, 718, 37, -587, -99, 816, 948, 1433, 1248, 668, 949, 1191, 625, 1284, 1956, 721, -231, -139, 585, -14, -425, 7, -614, -1309, -1624, -1348, -874, -718, -611, -752, -919, -1720, -1094, 287, 335, 157, 418, 517, -96, 348, 1619, 1606, 1035, 760, 535, 819, 830, 1079, 1018, 455, 58, -695, -481, -191, -381, -861, -959, -572, -1524, -1916, -675, -513]
744e13l31J52O43j050L26J264L84l54q7p2J2N43N45j93p1p4p07n12J044k03o56
765I0l27L20k84q97L25L78k09j67j30l61N0R0R96K03o96L55j29L66M09N75J70
786A127l14k99j56R74L37o45l42J64j56n98j48O60j94q38k48J22n85m23Q39M21
806c02m90n30M7j75L17R25N66m3l33j05M02N19N55m37m6k40p9L99J72J83o62l03
828C40J96l38r43N88J58l65n86O9n23K9L33P10o7l39m54P5R21P21q4L1N1m23M2
851A42J018N37o19j49K9r2l42J07K67k66n00m53j77J59j30j4J61m9j263mO12M11
873f15J65L78k65o24L68N71N41K56l6k43L52k00M7K93L35k95p24P5Q9j49n4K68
895E33k06r28l20J97j12L29J06k65o74L0K76M25L81J13p3o3K00J89J60J018k31
$$ y = [-513, -844, -692, -49, -1099, -773, 491, 875, 521, 434, 362, 374, 917, 1462, 1269, 1198, 1124, 417, -95, 949, 746, 90, -237, 83, -201, -1098, -773, -395, -604, -771, -901, -1262, -1212, -1122, -126, 77, -619, -264, -393, -27, 382, 957, 1127, 813, 514, 358, 1332, 1669, 1024, 682, 846, 690, 92, -56, 604, 410, -428, -676, -554, -1139, -1562, -723, -302, -792, -1322, -1275, -1450, -1133, -208, 358, 315, -18, -123, 279, 798, 1353, 916, 870, 630, 551, 950, 1122, 1305, 643, 340, 536, 198, -745, -157, 1, -364, -950, -881, -1404, -1375, -1042, -332, -399, -738, -1192, -1117, -196, 525, 441, 472, 523, 100, 142, 1160, 1697, 1078, 929, 958, 866, 524, 631, 898, 632, 132, -321, -498, -339, -469, -483, -322, -371, -1634, -1638, -1026, -615, -450, -72, -337, -961, -593, -22, 519, 775, 739, 496, 848, 648, 695, 988, 1323, 1028, 304, 379, 468, 319, 265, 533, 327, -601, -921, -724, -836, -507, -401, -666, -1340, -1310, -1034, -609, -228, -115, -188, -251, -51, 138, 298, 1316, 1085]
916A085n46N4L48j97j06O58j56o82l23j22j01K32k79O0n42m40m61L29Q58j71o27
937a129J36lL9L72P68J64k30j40N2L65L51K26K46m45L5N1n3R5j26Ml36l97n99
960e54L4M00J92m72l42l25j69N9O99q4j20r9j28P38P5K38L41r9J37j99M71K73
982A066j16q9L57o71l19NM41L3n64R4l00n11l11M35J38m86j22ok18J72O07J08
1004b57m3k8q6K67L35Q06k77k97K99k62j02M87N02n07l69L79o58r02O98Q13m02
1025C96p90R5l43n08L55O72o34l54K93k1k2P05P0l24L58K56l77K29J004j87p03
1046A70O70Pm83P4N51J21j050L59l9r08M0O68j70j4p93m63L30L83J83j46r8k80
1068h88L9L49L29j2Q6J43L65m05J97M58L35k03l70L66M8j57j34K83n9q67o18M95
$$ y = [1085, 539, 593, 941, 744, 638, 1296, 1140, 458, 135, 13, -88, 144, -135, -75, -617, -1057, -1518, -1189, -331, -502, -1129, -993, -996, -957, -585, 183, 347, 117, -23, 29, 394, 745, 971, 1217, 772, 807, 858, 805, 900, 774, 778, 442, 45, -554, -520, -120, 72, -400, -742, -1067, -1236, -1177, -478, -562, -682, -781, -909, -171, -96, 142, 483, 384, 521, 322, 793, 1066, 950, 861, 1218, 547, 228, 233, 674, 707, 143, 237, -63, -574, -885, -450, -312, -798, -920, -926, -1144, -972, -365, -257, -300, -328, -414, -147, 188, 994, 717, 420, 719, 457, 355, 842, 1344, 837, 468, 847, 189, -713, -15, 798, 396, -394, -299, -642, -1150, -795, -123, -757, -1111, -818, -839, -861, -156, -86, -410, -52, 204, -173, 56, 1060, 873, 170, 840, 847, 364, 438, 989, 1110, 60, 419, 380, -528, -488, 180, 10, -4, -797, -1260, -930, -547, -364, -510, -608, -888, -849, -500, -171, -183, -97, 46, 411, 6, 203, 661, 996, 793, 423, 789, 837, 680, 546, 829, 770, -97, -715, -220]
1090b20KL7K65k24o60m58M72K51q4K31O9m49J57K69N1P64K14jm09K68Om29M13
1113E35O46k61q07K31K50n97J80M40p51q84L21M23j10K6j68n29l0K11K46Q7K73
1134b68K54n36R4P20m02K65O99J67n33j85N59l88r2M89K20j026k85N77K28o49
1154i2K13m70n29K11K00j1L78m29l50k17N31K84j09M82J67n02L0L41K59k37P27
1175H77K81o85n00N11O9Q6L10m43n89l51K79k31M96k0r74k9K66K86l92M58K31
1196f4l82n76P46M27n27M78L70qm84N31j4L8K72M23p31j05K3l90N33K14m88l88
1218a02l47J29r9k19L53p7m28KL38m44K91K06K05j30j27M01K19J29M91k48n5k35
1240B53j49N85J19j35k34r1k56r4K52L18m80k37o37M32J56j38n05J65L35o24M57
$$ y = [-220, -218, -181, 84, -140, -800, -1258, -786, -535, -619, -388, -319, -768, -611, -342, -291, 473, 687, 686, 277, 545, 551, 122, 535, 1181, 920, 113, 344, 594, -3, 177, 617, -134, -1018, -697, -274, -384, -358, -526, -1055, -1085, -874, -628, -541, -268, -14, -550, -456, 264, -138, 127, 826, 993, 460, 275, 834, 446, 354, 843, 1063, 37, -248, 329, 557, -92, 121, -349, -878, -667, -467, -478, -100, -529, -879, -1096, -565, -281, -390, 92, 259, -243, -213, 128, 387, 150, 877, 1158, 473, -27, 484, 553, 639, 949, 506, -83, -434, -155, -386, 110, 90, -884, -913, -647, -361, -753, -295, -64, -446, -1022, -276, 151, -376, 102, 472, 464, -20, 511, 497, 535, 807, 1230, 499, 394, 417, 27, 560, 774, 286, -102, -449, -320, -419, -638, -285, -362, -790, -788, -450, -894, -603, -397, -192, -322, -449, -48, 171, 300, 791, 543, 488, 253, 104, 689, 808, 673, 439, 348, 92, -2, 250, 568, 88, -149, -786, -354, -198, -336, -841, -676, -341, -965, -508]
1261e08K60j4J71J00R5l07K35M77P4K29k36R8l70k08O13M40l35n32m49p3L35j09
1283a4j42O8j35m73j54L83R3j07p3L15k34j18L29K81M2J43r2j00J57L40K35R9
1305H43j77k59k76K89K43j41r3j41k65m48M50j26l2n03mJ18k71J2L85K08m02R1
1327d99qK92q4M90J69j3o4J69n9J10L35k44L8j21l88J70L62K9o05j11J85o74J48
1350c73K2J63l74k34J84K09k06P2P1M82j11j89K0K72L20J37J24j72k16l2K32N11
1372I12l92j13P7m02l64M84J83l01k79j25j20q4k63M26J7J4k16k05M56j08M64
1393F1o5j36j34j32M61L66J76J32k42j25k11J84N65j27k99n87J18J97L5j68j61
1414i2P8m44l7N4j3j89N28q5k03j83J62O9N15o3R8J27j86m6K77N04rn62j01q0
$$ y = [-508, -248, -262, -91, 9, 104, -203, 32, 509, 583, 812, 576, 674, 304, 96, 709, 1149, 814, 282, -167, -240, 95, -14, -156, -88, -223, -696, -850, -467, -374, -481, -554, -239, -473, -591, -262, 19, 61, 204, 112, 12, 169, 509, 744, 843, 666, 407, 131, 420, 663, 522, 429, 288, 23, -425, 25, -101, -133, -636, -640, -522, -793, -781, -396, -188, -590, -499, -507, -215, -299, 191, 360, 347, 283, 452, 393, 503, 838, 594, 632, 511, 123, 293, 655, 684, 79, -32, 153, -521, -373, -351, -188, -562, -796, -612, -403, -609, -537, -466, 16, -95, -284, -264, 8, 328, 465, 589, 417, 201, 169, 401, 912, 520, 407, 484, 82, -282, 202, 385, 84, -195, -320, -440, -524, -787, -361, -344, -330, -546, -751, -295, -403, 61, -4, -140, -274, -406, 55, 421, 597, 729, 487, 362, 151, 335, 900, 773, 474, -113, 5, 202, 237, 69, -92, -14, -458, -495, -441, -454, -643, -115, -200, -403, -586, -424, -355, 160, 97, 195, 322, 136, 90, 367, 871, 862, 300, 199, 119]
1438A19K39O9J01m94j97j30J81j25q9l5J8j66j57j48N36j61j70L36J89k31o6L84
1460CJ2L85K13m90L33j58L8N44k00j59l88K03j21L17j75l58R2k31j63J07L9pk44
1483d08j60R1j02j36L93K61k47J6J16L96j39L02J90j03rj42J92k7N0Q3l26j56
1505A35q0K57l11k6j14O6m29n7m3j02M00J2q1l95L20m08M01M35K22j29j11N5N
1528B2K31M20j45j48L0m0j38K02p4o9k80J59n08J54K89n8m33r8J60l03r4K82J38
1551c01k32J39n0j82M96L46J17j84K8j72L30M72j87j52L7j72k20K13p9n7l02K02
1573I0k42k83Q8K9K42l32o7q2J81J53ok0Pl1Q6l88O74L68l57OJ76q8K87P5P8l90
1599B54J07J03o82N24j10k5l10R5k41r0P7n6O6M8j6k85k01M85L10q6j62K98k87
$$ y = [119, 358, 427, 528, 34, -163, -293, -112, -237, -326, -361, -343, -509, -666, -814, -278, -439, -609, -273, -84, -315, -381, 3, 15, 400, 613, 123, 456, 298, 336, 880, 680, 521, 133, 336, 215, 532, 357, -1, 91, -140, -303, -196, -157, -164, -408, -568, -477, -579, -715, -322, -61, -308, -292, -176, 220, 81, 383, 573, 470, 461, 319, 511, 484, 534, 617, 291, 135, 55, 312, 1, -25, -139, -73, -502, -559, -602, -704, -304, -292, -373, -768, -448, -856, -455, -20, 202, 73, -38, 17, 22, 253, 673, 528, 380, 410, 370, 232, 434, 360, 291, 11, 170, -338, -184, 105, 47, -386, -484, -324, -627, -721, -439, -301, -533, -394, -444, -626, -130, 216, 333, 149, 177, 5, 335, 807, 620, 468, 505, 333, 113, 326, 247, 190, -112, 90, -152, -435, -347, -318, -76, -408, -475, -557, -376, -223, -229, -249, -242, -273, -187, -575, 99, 467, 110, 116, 292, 204, 491, 566, 644, 254, 361, 464, -218, 306, 196, 171, -139, -44, -285, -375, -298, -354, -288, -240, -256, -541, -742, -257, 53, -33, -195, 103, -184]
1622a84q5M65M38o2l39K45j65j30K42j01o8Q9j83l25J19k26PK84j07l20j15J05
1644d16N9jn7J75j81k25L02K62L56k51o6n4L91j10K58J60j63j83N4J8j70k7k1
1667A10K30l79k11J49m1r8j69M89m54l70J30L70jn2o2j03K08L71q2L05j86N1R1
1690B96l1K40l2L1J76j78m35K42n1k31k34N33m81l15L15k29J95L6l38M4l86N03
1712c30j53N06P3k86J36j3K32j56K08J67J62m49J15K31k43K64j20J82l51j61j13
1733i9J93K1l8l69l36q0J12J23L12j37j88J24Q1J04N4R9J64j92j5Q7J16K46l38
1756D4M16l3m69L34J47j85r6K8n2j33j08J32J83k63m34j1O5j3p5L02j76R5l09
1779f11P2N65M7n5J24N7k2k74L15K71j20j50L89k41l47K30J44O2k45k74p6k64
$$ y = [-184, -269, 196, 634, 572, 233, 478, 313, 183, 425, 324, 256, 345, 162, -163, -44, -270, -263, 21, -86, -406, -521, -416, -357, -358, -415, -240, -421, -646, -344, -82, 274, 23, -43, -97, 294, 184, 442, 602, 439, 256, 310, 328, 158, 131, 110, 340, -39, -250, -101, -142, -240, -409, 80, -374, -744, -614, -244, -245, -297, -359, -462, -254, 117, 35, 340, 154, 205, 296, 265, 505, 473, 504, 680, 502, 67, 309, 258, 27, -207, 326, -155, -470, -155, -384, -189, -153, -491, -447, -833, -330, -483, 23, 96, -190, -54, -67, 165, 9, 217, 384, 546, 97, 212, 443, 200, 464, 344, 526, 175, 14, -99, 94, 115, 77, -292, -628, -708, -596, -473, -161, -298, -486, -362, -281, -177, -123, -24, 140, -52, -67, 20, 136, 382, 44, 460, 427, -42, 292, 439, 254, 158, 186, 134, 1, -107, 25, 208, -55, -489, -500, -435, -448, -523, -221, -397, -302, -611, -539, 26, 73, 18, 142, 199, 177, -97, 218, 489, 369, 219, 608, 367, 20, 250, 394, 456, 211, -63, -139, -403]
1801d03L9K40K9j42j71k96J90K35j28J95K12Qj54j8M60j09J33k19K75k32J5M44
1823F03j91l2k83R2J7Nl62L22j12m28q4L79l9j03k0J0O5m55R1N56j65j44p3L10
1847d1l1J36L08J9p9q2k20q1M16k40K06K17j97j24j93q0q0K69k33M8j83k45L3
1870d57K88j86O6L8j41J65J29P5l0J83k11K54R8q2K53L09n23J80p1m3J38J0j64
1893B78k29O2l49K45Q4o1k38r9l5m2k3K91K3k58P9L19m44L58j12L61r0O9k18J46
1917A17J20K15j66M6J07l66J58k5J7j99l3L7k69j52K39K50m56j97n4N08k00n4
1939c57J64j19K03j71J71L08n4Q8p9J83k72J48p6K65p6j07l16N5O7J14M6q5p2
1962B8k49m0k12j6Q3M91n61O8K28j3j7L07j04J43j15oJ14K84j34j4q0P6J35k95
$$ y = [-403, -364, -124, -95, -237, -408, -704, -514, -279, -407, -212, 0, 8, -146, -164, 296, 187, 320, 101, 376, 144, 159, 603, 412, 380, 97, 189, 206, 211, -151, 171, 59, -369, -453, -74, -113, -216, -236, -226, -161, -616, -525, 31, -134, -278, -351, -41, -72, 64, 372, 391, 312, 230, 10, -71, 345, 105, 311, 528, 331, 207, 14, -66, -146, 123, -110, -62, -245, -490, -457, -169, -355, -289, -251, -392, -227, -98, -23, -53, 130, -81, 173, 271, 189, 442, 751, 228, 408, 337, 294, 432, 442, 278, 49, 111, -238, 7, 91, 30, -208, -307, -342, -384, -407, -116, -93, -351, -272, 47, -397, -39, -151, 210, 120, 189, -29, 117, 237, 452, 286, 332, 439, 73, 231, 206, 223, 24, -9, 28, -241, -393, -154, 96, -360, -557, -611, -103, -303, -357, -193, -312, -109, -280, -109, 199, 145, 233, 154, 337, 65, 213, 137, 402, 326, 219, -97, -42, 25, 139, 185, 100, 28, -221, -261, -473, -489, -406, 85, -476, -408, -180, -193, -210, 97, -7, 136, 21, 15, 129, 413, 279, 265, 185, 261, 396, 101]
1986A01L20j42p3M1k62j74P2Q0j0l27m4k27L49K22l82J77L4J7j02r2K79n7L07
2009A07k7n1P2N4L63l95N34n58J45K13l30J04m3J74l75n3q8M24l98R2j9l18J12
2032b61m7J03r9K76o0j82J14k36J43O80k16j81P2K34j01J10J27j21j26K1O1l62
2054e1K03K71l75J31k94j20J5R3M4j83m23M47j05j80L57Q2r4J37r7K0NJ21L26
2077C30k21Q7oJ05J7K36k54m7k5k33J14L59k59k90P3o7j08j49J68L0k31J65J3
2100a93o2j00K27k12O21k25j14K28k01M54k56K72j06j06k80J78JJ76j2m11K50
2121A29k19k7J50N3n26M17k25J38j85Q2O4r6O8Q0J6R8m9J15J9m6j71J53L06n7
2145B87j6O1l0p2k15K18Qj99N9m21Q1K00j83J36j11m1k14K29J6k03L56r8J42j41
$$ y = [101, 421, 279, 206, 247, -15, -189, -117, -37, -47, -374, -418, -645, -296, -74, -456, -279, -245, -228, -330, -422, -143, -200, 107, 80, 29, 101, 155, 518, 123, 657, 99, 244, 457, 127, 231, 188, 362, -13, -66, -154, 270, -128, -36, -55, -373, -261, -308, -205, -304, -28, -88, -270, -156, -392, -249, 431, 215, 34, 106, 340, 239, 349, 476, 355, 229, 250, 311, -51, 152, 423, 48, 179, -115, -235, -220, -127, -83, -266, -689, -242, -347, -527, -170, -88, -182, -45, -142, -122, -117, 4, 330, 109, 196, 190, 295, 312, 548, 294, 247, 222, -11, 103, 462, 203, -87, -14, -81, -189, -338, -170, -140, -371, -206, -193, -255, -355, -128, -340, 281, 56, -58, 170, -31, 423, 167, 439, 333, 227, -53, 125, 126, 302, 290, -121, 129, -90, -117, 33, 86, -440, -23, -248, -110, -295, -213, -149, -245, -177, -97, -81, 17, -32, 83, 102, 56, -115, 38, 344, 287, 271, 332, 302, 230, 15, 233, 241, 42, 101, -320, -239, -39, -222, -86, -197, -238, -452, -223, -207, -410, -54, -152, -10, -151]
2169a51L4J3J81J81M1J8m6m41N12Q5j41p3k50L03k25M8M9j2m9l27nq0J93L09n4
2194A13r9l72q5R9R4K2K82J65k10p0M58l6p1Q1l41J00K25l31L30K5k00o5R9m6
2218A67m3j58J3n5k50J27n0j24Q9P2K43j70M2p2K1L06j66L11l36P1j46L35K70
2241D97m85k08N67j97J09j10K7Ll98M95k54k10K29k61J44r0k94K00K00O3j94K3
2263a44R2j54l8L70q8M13o53j1L10j6J16K5n8J16j41LK5k6q5l5l61J94j31J40
2287a37M3j21N6l52K02K69k99K25L4j31J80J55K2j9K90j89Q1j99nK48N5p4k50
2310H4J15J84k96n4M7j67Ml99L23p1j42K92j64K89j60j81l6J41J78J86Q5m00L9
2333a03p7L18o5L99l65J43m3m6J56N7k51j91J31j19nM2L16n07jk0J71j23j43%
$$ y = [-151, -117, -104, 77, 258, 299, 317, 271, -170, 342, 427, 286, 213, -37, 266, 41, 89, 138, 126, 77, -250, -255, -335, -142, 167, 113, 14, -358, -443, -344, -250, -228, 54, 219, 9, -61, 397, 361, 290, 371, 30, 130, 355, 24, 354, 379, 179, 114, 213, 167, 124, -34, -21, -76, -326, -199, -249, -373, -284, -212, 31, -139, -97, -169, -148, 158, -8, 303, -33, 38, -108, 227, 497, 12, -196, 371, 174, 283, 173, 200, 203, -195, 300, 46, -164, 65, -196, -52, -142, -436, -236, -36, 27, -167, -144, -52, -206, -244, 126, 38, 451, -202, -213, 97, 81, 197, 222, 164, 280, 139, 142, 167, 141, 56, 21, -340, -146, -277, -137, -94, -215, -159, -511, -309, -40, -339, -114, -80, -211, -31, 124, 146, 127, 417, 228, 309, 110, 105, 353, 408, 334, 84, 199, 383, 87, 33, 80, -87, -83, -482, -159, -230, -372, -80, -244, 45, -115, -296, -332, -191, -13, 173, 258, -142, -103, -180, 138, 73, 472, 107, 250, 207, 161, 317, 374, 123, -68, 63, -56, -61, -19, 297, -210, -211, -231, -60, -183, -326, -326]
2357c26M96l84j12J25K55k47K7M37k20l7J05n1L70n7k06j37O6J12j18l9K88l07
2379D0j25J53k91J67j38J31r2L3j22r2pK49j31R5Mj84L14K44j48p7P9P5kN2m8
2404A79J82j58R6j83k78K25o6K78k8k95l52K73j29J8K55jr0l97m8J71L56k09k31
2427d32M57K4Jr3K39k06o5J63R5k0j19L09k82K27J09m86J07j20j90K52nk9j34
2450a98K56k53l15L48J5j00P1N4J95J1r7NK27o9oj69P8K27j90j24J92O5j97j08
2474h2J0j4O5L0K5k15j04K92k02N5j17J9R4m6j26K7K73o5J97J74j61l18P9K94
2498A84J9k09M23j25k86L27l05j7P0J4o2R2l42K84pl24K49p9L5k16j6J57Q2J99
2522A47j86j55K75K7L0p6J08N2K22k58L3J03r2l45M10k41L43k87k0k50K41k19
$$ y = [-326, 170, -214, -326, -201, 54, -193, -166, 271, 51, 14, 119, 68, 438, 381, 175, 38, 104, 216, 98, 59, 347, 40, -85, 68, -223, -56, -194, -63, -155, -122, -244, -336, -343, -94, -225, -130, -126, -310, 4, 248, 100, 23, 102, 177, 175, 227, 179, 361, 203, 299, 116, -162, 63, -3, 275, 247, -48, -400, -127, -256, -238, 17, 16, -74, -471, -519, -348, 8, -201, -432, 25, 49, 50, -43, 196, -10, -75, 88, 183, 163, 44, 353, 71, 298, 407, -79, 28, -92, -282, -30, -35, -64, -198, 58, -195, -510, -162, -147, -247, -176, -122, 73, 84, -13, -8, 219, 150, 144, -25, 53, 280, 90, -34, 158, 223, 26, -82, -72, -86, -21, 9, 34, -181, -285, 7, -195, -140, -257, -238, -144, -190, -316, -289, -16, -81, 116, 290, 129, -189, -110, 184, 203, -6, 417, 292, 6, 333, 28, 11, 81, 95, 33, 125, -217, 67, 60, -264, -15, -94, -59, -275, -291, -134, -52, 147, -39, -194, 81, 108, 138, 62, 170, 222, 444, 186, 219, 322, 230, -115, 295, 54, 397, 110, 90, -160, 81, -138]
2544a38O9j19k70K41R6j4j26L17j81J99k72K38j21k1%J29r6J61R7j99L7K09r5
2567A41j20K96j32j67q5L33k93J24j47k48L1K09j65J29n8J02k07Ll7L4K15O7l19
2590b94K63j33L14l17J71K64j07j6K2K74m17j26K26J32n6k35k37K01oJ0j10P2
2612a05j04l29L51J15K3r9l2M2J99j12K59j06ok9J59r8J41J26R6l31j30l3l08
2635c11L42L9j45K8K7l13J90J20k18J54J11k59J05K23k02N7L03l18J47k99K38
2656A9J91j18N6J45m3j41r7L24N7j26m24K27j3K1J4j66j23K07j52Q7n3j45m9N6
2680b46o4K4K26k00J62M0K40k39K19q0j24K62j30P3K37m91K1L34k19J57o4j94
2702e6J55r7KQ2k58JJ13k32Rj89K80m8N5PL22l46N74j92q5K05j82J87l32J37K08
$$ y = [-138, -69, -188, -458, -217, -121, -135, -261, 56, -125, 74, -198, 40, -81, -102, -102, 27, -69, 92, 189, -10, 27, 236, 141, 21, 317, 185, 18, -67, 266, -27, 97, -50, -298, -267, -58, -223, -94, -152, -50, -257, -254, -291, -257, -42, 25, -294, -31, -164, 150, -167, 4, 268, 161, 145, 167, 441, 24, -102, 124, 256, 200, -35, -272, -71, -77, -67, -177, -105, -209, -538, -187, -72, -49, -148, -180, -138, 61, -51, 208, 102, 96, 67, 226, 128, 269, 395, 491, 160, 30, -3, -311, 31, 70, -75, -47, -20, -333, -143, -23, -241, -87, 24, -235, -130, 93, -109, -52, 251, -67, 80, -219, 19, 210, 92, 148, 293, 250, 109, 12, 336, 393, 267, -157, 70, 57, 78, 92, -74, -197, 10, -142, -55, -108, -253, -302, -246, -310, -286, -60, -260, -98, -58, 182, -57, 162, 82, -42, 220, 90, 163, 400, -91, -70, 264, 45, 202, 138, -56, 99, 2, 4, 86, -172, -171, -58, -290, -281, -470, -190, -238, -183, -176, 146, -200, 374, 182, 97, 302, 120, 307, -25, 112, 320]
2727C20n3j56j95j0K31N3r5k02RJ34L8p8j22lj56l3kL05m4l08O1L24r3K35mj6
2753A40M3j62J21j14R4J94k66N7J6j88O9o5K1L11l70J05Q6j98m1L44n17N7K65
2776Bj71K4j98P5M74n0m05K88j11j78J2L18k08J88K32j73q6J21N8k18K21k64K23
2799A74Q8k70J50l38p0K58p8j60L4Q0L3o7Q4k99K86K05k47K38k37L96k78K74q9
2822A67J36j7j88J78r4K1j41Q7k14P6n7rJ00l0l93J19K7R1lk58L03J9j24P4k5
2847a55L51N7l42M23k89K38Rl74L23j10j01K0j2j90L16R9Mj26l54L8J6J24q4j23
2871b42K40rj81M4l8Q2J24l12O52k87j32K06K6j69O6nJ02j12R3P4j35q2K39m8
2895A96k88L5J63p0n0m7k94M87l08N5J05j79P7l9O3L7q1J66k36J21J10K7J98j60
$$ y = [320, 267, 111, -84, -94, 137, 190, 95, -107, -98, 36, 74, -4, -126, -129, -285, -318, -320, -15, -59, -367, -306, 18, -75, 160, 156, 140, 183, 21, 142, 28, 122, 316, 50, 107, 123, -65, 4, -61, -40, 271, -99, 6, 92, -106, -147, 197, -320, -263, 2, -169, -145, -343, -268, 206, 156, -249, 39, -72, -250, -238, 80, -128, 60, 292, 119, 33, 154, 212, -6, 215, -49, 174, 262, -8, 142, -196, -266, -8, -86, -246, -212, -132, -99, -166, -82, -381, -95, 110, -137, 101, -136, 260, -18, 256, 167, 303, 286, 98, 276, 182, 203, 62, 149, -65, 11, -46, -55, 45, 15, -378, -259, -232, -141, -144, -402, -99, -80, -204, -130, -155, 196, 253, -89, 334, 45, 283, 292, -82, 241, 131, 30, 50, 38, -152, 164, 263, 267, 141, -213, -175, -159, -35, -119, -242, -2, -11, -192, -148, -186, -104, 20, -292, 360, 73, -59, 147, 173, 4, 70, 65, 167, 55, 148, 222, 87, 5, 244, 196, -92, -57, 106, 36, -14, -61, -355, 132, -176, -121, -16, -195, -118, -157, -94, -57, -138, 28, -208, -87, 23, 50, 248, 88]
2919H8J00j11nJ16J59j93k37j08K77k61J65K8k8N8p3p9jm2K02k49j19L31k28J64
2943d6m7J19Q9pR1j55J50k1j49Q1k3J51o2Q0k94O3q1K59m1j08N5l31O5Mj8k37
2969d13J66l5K29J24j64R1k0j21K12J63m74M48k24K62k89J0K77j30j23L0J40k02
2991d3J37J18k90j5j2J54j92N0j20J90o1k91J46M7K48l30K72N7j87n0M1K64q6
3014D7Q7j2L8l5k57QK23p8%O3O9j77J7l0r4N9P4j44K16K3j88J22q3j65J09K68
3040A60k84J89l9j6j41N32p4k82J80k91L15j52o5J57j1k50J8K89j35P8l18j62
3062c02J24K60q4j62P9N6J43j60J88p7j2R7R6k05J19m34P1J60L55M4l50K33l29
3085i0M3K66o9j31rj1N5k60L0L19J99m17j59j9L3J53J29l5n7j0j44K13J49m2m5
$$ y = [88, 188, 77, 72, 188, 347, 154, -83, -191, 86, -175, -10, 18, -10, 48, -25, -104, -105, -147, 55, -194, -313, 18, -210, -46, -93, 26, 115, 108, 199, 44, 194, 173, 24, 105, 82, 233, 171, 251, -43, 20, -61, 198, 157, 49, 104, -227, -162, -158, -176, -413, -247, -282, -53, 71, -93, -2, -22, -143, 69, 232, -242, 206, -18, 244, -45, -35, 242, 112, -11, 19, 159, -43, 94, 212, -78, -93, -105, 49, -143, -93, -213, -23, -84, -375, -229, -182, 66, -264, 8, 65, -122, -172, -131, 133, 47, 134, 122, 160, 125, -132, -124, 99, 21, 21, 84, 153, -24, -7, -37, -131, -72, 2, -142, 74, 97, -91, 31, -52, -217, -108, 160, -124, 65, 26, 10, -131, 401, 327, 45, 225, -66, 249, 97, 32, 189, 178, -72, -54, 235, 100, 178, -140, -302, -178, 82, -2, -164, -85, -29, 114, -46, 142, 65, 53, 150, 246, 41, 160, -274, -203, -43, 312, 356, 6, 239, -90, -47, 219, 150, 19, 10, -1, 54, -206, -176, 143, 342, -75, -234, -253, -220, -67, 62, 27, -30, -40, -184, 29, 178, 136, 91]
3110I1j14K58q0j4J81o98M18k3J90j36k06K12l9j14k31K03j6j4Q4m5M3j55K75
3133G0k52J53p8m9K93k48q2L02P9p4m2lj23K39l3j12j76N5K6J75j95j46M1R1K2
3158f7j91K56l38K27J34m32J03R7JN7N4J64j80K57P3j42j24K0J71j80JJ00N7K9
3182A47J39k89j33k0N4J48jr3J31j47M2r9n9p4K04P9j84N0J00j47K53K15k41j03
3206b8R5P3J2K23m26m8M07l50J09m5J23j30P4k3K68o00L66p7m3j49L38l10k7m0
3230b08M06k30r2J39J22k27j0m8K68Q2l70K76j16L05j75j26M24l39q2J14k31J7
3252a01o6j23L62p0l4l1p2J15j52J14lNj48M6N4L1J51l03K14L06m31L11J25l14
3276a4M58m16L8o6J97k07j86K51J46k54m8m0J23N5j91k36M07kk03J83J99k76J24
$$ y = [91, -23, 235, 155, 141, 322, -376, 42, 19, 209, 73, -133, 79, 40, -74, -305, -102, -118, -132, -48, -93, -50, -205, 70, -182, -29, -107, -156, 137, -111, -193, 109, 188, 114, 72, 69, -54, 185, 152, 40, -136, -81, -55, 120, -75, -221, -180, -89, -67, -258, -2, -340, -113, 21, -411, -308, -211, -210, -153, -99, 65, -115, 142, 215, 73, -51, -31, 140, -40, -39, 61, 118, 147, 286, -3, -136, -156, -102, 46, 45, -48, 83, -64, -22, -121, -180, -254, -50, 29, -155, -105, -5, -152, 101, 316, 75, -28, 67, 140, 152, 375, -51, -99, 308, -42, 67, 22, 145, 15, 89, 66, 334, -266, 100, 23, -20, -169, 169, -141, -168, -208, 198, -32, -124, 15, 137, -90, -100, -148, 120, 202, -168, 108, -8, 297, 122, -4, 420, 81, -1, 113, -118, -101, -167, -290, 72, 2, -32, -63, -135, -20, -172, -58, -61, -56, -204, -158, -104, -73, 78, -225, -11, 295, -136, 175, 300, -14, 444, 28, 66, 0, 197, -10, -196, 55, 201, -53, -101, -141, -18, 37, -154, -390, 17, 15, -188, -5, 194, -82, 42]
3299D2J9k50J31n6J12j06j0q7L48N0j88O1q5J27J89l15O9pkJ75j58j2Q0j75n5
3324a03j5K0J42p8j61J38j02K65l7p2J09k4r4j24L52k17R2J11l49L40j78J5L1
3347F1N5k11J66j29p4K24r4j75L24l66J54O8j06p2J9j04L23k67L67j77R0K93l37
3370C2Rp3l1j88N99l21m1m3j17K94Mk87K53l06K51j00R7j26J26o5q9K54l43J00
3394a11K26k27J19o9j1O7M5j10M7k96K41k5J39L3r5J46k22j10L1R2m6P6j67K98
3418G1k58P8J44k07K50o4j48J96J20p5l74L06rJ3j77L06pj83o9L5J51P0j18j3
3442C8n4K73k42j15L19o8q1P3l99p1K93j65R1Rk4J66j50kM55k02l28N11m04M14
3466C37m45P4K08n9Q5j15j41J61k88J19RM6L85l65k71L4M61j81l76L82j45p1j3
$$ y = [42, 61, -189, -58, -114, -2, -108, -118, -205, 143, 193, 5, 66, -19, 108, 297, -18, 51, 44, 42, 217, 59, 47, 127, -48, -103, -118, -98, 44, -34, -195, -57, -159, 106, 69, -3, 106, 82, -12, -136, 216, -1, 91, 202, -147, 193, 15, 30, 61, 116, -95, 71, -58, -132, 92, -2, -177, 147, -219, -65, 3, -103, -175, -156, -260, 63, -204, 163, -14, 76, 369, 32, 41, -32, -63, -251, 348, 27, -14, -57, -174, 120, 124, -163, 90, -216, 35, -65, 32, -94, 32, -33, -122, 132, -211, -111, 115, -112, 7, -62, -73, -6, 39, -71, -24, -320, -79, -104, 35, 68, -27, 119, -103, -213, -182, -90, -136, -60, -227, 71, -187, -109, 35, -172, 78, 14, -134, 62, 182, 107, -267, 39, 30, 43, -134, 172, 165, -18, -87, -52, 99, 169, 51, 38, -16, 257, 15, -100, 219, 151, 70, 143, -256, -327, -34, -199, -108, -99, -123, 43, -107, -109, 346, 144, -184, 327, -77, 337, -108, -34, 174, 115, 200, 85, -56, 105, -183, -64, -55, -9, 376, 11, -260, -226, 235, 54, -322, 60, -85, -156, -169]
3489a69J11K1N8r2r4nK92j64J90q5j9J6K20j76n8Q2p9J04l24K4N5O8J82j95j18
3514a55M18m04L59k06j32j60K96o7K17k54J33j11j65L15j51k31N25k15K85k48
3534D9J5k87K98j00K71r5l14N1K83j16j63J8L1J38j96Q4k28Q7l9L45k53j22J73
3557g0m2M6J80J01j71j49J64N3k12K5O9O7N0k6q9K62n86N90j83j09J5m81L31L12
3581A47j73k10K88J95j05k19R4O8m0j99K90j02j02J35r2J13J89l01l7L37j44j41
3603iN4l0j34J60J3k12J11rP8l47L01j85K08J08k55l5J89l04K25J79no7j02K07
3627A39o3k4J17k98R9Q2J19k10M5r9J52n9K12k51oK1R5Qj03p6L57k03j74qp2R2
3653a08L23j28o1Lk63L57k26P0J68q0n0r0j02J77OQ6oJ34j49j32N5J50j20J36
$$ y = [-169, -58, -37, 21, -71, -165, -170, 122, -42, 148, 63, 44, 60, 280, 104, 46, 128, 49, 153, -171, -147, -92, -24, 158, -37, -155, 263, -141, 218, 12, -120, -280, 16, -51, 166, -88, 45, -66, -231, 84, -67, -298, 227, 12, 297, 49, 64, -223, 75, -25, 246, 151, -163, -112, 171, 55, -108, -90, -59, 79, -117, -33, -261, -174, -213, 132, -121, -243, -70, -112, -66, 114, 215, 44, -105, 59, 112, -100, -75, -6, 61, 111, 85, -4, 258, -328, 262, 79, -30, -15, -496, -165, 147, -26, -236, 52, 247, 142, -77, 17, 85, 45, -154, 136, 34, -68, 67, -25, 88, 277, -24, -61, 276, 132, -9, 45, 15, -119, 41, 54, -158, -47, -56, 22, -325, -24, -209, -1, 107, -148, -183, 6, -298, -73, 106, 101, 34, -68, 139, 76, 52, 169, -129, -30, 52, 171, -39, 6, -93, 59, 0, 212, -39, -45, -24, 71, 79, -24, -100, 257, 54, -120, -128, -200, -108, 215, 87, 26, 29, -234, 123, -103, -33, 135, 55, 5, -85, -187, -10, -4, 82, 76, 210, 61, -71, -16, 134, 14, 150]
3677A50o9j54K29j64j56J51j49K15k4k40Q4L36q1L3N0k70kQ2N7j48J87L69n54
3700f8j14K72m7J42j61J23m29K63k9m24L84J75k33J98j54K58l48K77R6l51Q4L2
3722e4J94Mk78M1K41m4k01J01oj20J6L64k38n3P9m3m8J01o6J12k1j32k7K35j73
3747a6n7M4j0K9O3n3r2r0J75ql10M01l4RN8Q2k76k9L41k67j8NR8n2M0j60J48j93
3775a72PJ95k64K39K56k79p7J7K04k58M6J81j65J41p2o6L93j71j44J00k17M16
3797C10k02k63N7J67k92K87Q0k19J84j52j06J79k30K9L2K5P7K4pN5J44k2n7P2
3821A72Pj4j42o2K20j87J0j01Q1N6P7Np6J83k92K67k22P6q5M7K3r7J11k29J77
3846Ep2p2R0O7K3J38k33K95k43K77p1k82J61J84Q1j34q9l18J24j25J27p8K00p9
$$ y = [150, 81, -73, 156, -8, -164, -13, -162, 53, 29, -211, -127, 209, 128, 161, 211, -59, -61, 21, 78, -70, 117, 486, -68, -182, 90, 43, 185, 24, 147, -282, -19, -48, -472, -88, 87, -146, 52, -102, 156, -192, 85, 181, -170, -86, -54, 140, 144, -134, -93, 148, 104, -97, 4, -2, -122, -106, 258, 20, -33, 46, 3, -45, 56, -10, 102, 81, -51, -78, 157, -16, -73, -29, -39, -10, 53, 0, -92, -182, -7, -15, -325, 76, 42, 51, 109, 191, -85, -114, 227, -40, -58, -53, 45, -7, 33, -127, 21, -172, -165, 30, -234, 5, 261, -18, -95, -78, 126, -132, -86, 95, -70, 71, -1, -67, 326, 155, 11, 111, -106, 310, 108, -155, -98, 69, -223, 64, 144, -75, 109, -43, -149, 30, -200, -171, -139, -114, -37, -13, -20, 35, 179, 157, 100, 172, 179, 165, 23, -39, 181, -6, 4, -97, -16, 40, 117, 122, 46, 229, -63, 204, -18, 58, -27, 20, 43, -54, 57, -172, 5, -67, -139, -49, 18, 41, 179, -54, 241, -2, 275, 204, -78, 83, 267, 348, 214, 125, -193, -69, -194, -67, -145, 55, -24]
3870b4J13n9j16J39k09j92K80r6J44N3k53q3L41l7p7m8K16l09J92M7q4rM4J47
3894A20j99O4N5r5l4J75k10n4P5P0R9k43L35l5j0l68K32Rj62J87j67L4k9L57j46
3919F0p8K72J7k55j8J92j73J09n4j15l3J05k66R9l6J34n2R1j61K6q8K40k5l28
3943c37K73J48k17R3k34J44K28k23J74o6J61O9k46J12m8n7L3j04L3p2K55k08N8
3966c1p0j4J24k19j3M82k22k39J52j7J24KJ0j13K8K01J19l33RK41k41lq2M6k32
3991b91L15m3J2o1LRqj8J98l70N6L2P3m3L54k55o7j05O2J86j22O7qJ8J47l2k61
4018a52K33J4Q0n6j94J99K67l04o8J11l95M4N23l54j58J17j84J71R5k4K28l00
4040a07J9Q3l00K97l50L73j18J1J39J88k18Po2O4l8J60j85k23M44l68J92l15K20
$$ y = [-24, 89, 30, -86, 53, -156, -348, -68, -164, -20, 33, -220, -303, 38, 1, -76, -124, 92, -217, -25, 22, -62, -71, -27, 120, -79, -15, 40, -55, -89, 86, -124, -178, -103, -33, 66, -177, 158, 123, 113, -255, -23, -14, -176, 11, -156, -122, -151, 206, 60, -18, 254, 271, 16, -2, 190, 17, 126, 72, -43, -76, 29, -237, -138, -174, -40, -92, -1, -162, -136, -224, 16, -9, -337, -64, 84, -133, -40, -274, -130, 98, -125, 49, -17, 144, 213, -33, 79, 31, -26, 7, -97, -64, -136, 119, -89, -31, -101, -115, 9, -210, -223, 259, 37, -202, -50, -67, 57, 59, 69, -44, -16, 185, 304, -29, -20, 221, -20, -23, -105, -59, -291, 24, -19, -7, -68, -65, -56, -64, -82, 116, -254, -198, -166, -93, -136, 218, -37, -104, -209, -147, 39, -83, -16, -24, -6, 141, 109, -152, 81, 95, 175, 119, -75, 124, 391, 87, 19, 130, -265, -221, 302, -52, -210, -93, -277, -106, -11, -35, 193, -107, -88, -5, -305, -8, -358, 15, -103, -92, 47, 235, 17, 24, -38, 26, -12, 148, -37, -260, 184, -184, 8, -307, -87]
4063h7o8J77N9M0k02j97Q1L18j72k58K02K33j38J74j09J05k44M2N6k0J27M4O3
4086B26j21j47j00K30K18l19J5J65q3l98K43L7NJ52mk46P1J74j31j76J85J30n30
4109d04K32J74j19J64J69k34J08m7l8L5l1K53k85j02Q9q4J40nM8J16k19j09K44
4132I5P6o2j25j01j7L81l13r3J24j08K8l3J43R7k2o8K85k30K39k4j29k07P4K76
4156B86j47k92R3Qj3K31k84L8k17k0K35J9J9j89L1M2K61k62J28K03K5j38p3K69
$$ y = [-87, -155, 22, 81, 121, -81, -278, -197, 121, -51, -309, -107, 126, -12, 162, 53, 158, -86, -44, 12, -8, 119, 163, 226, 105, -42, -142, 88, 306, -13, 2, 167, 84, -314, -71, -34, -29, 123, 119, -127, -56, 118, -13, -189, -4, 126, -404, -172, 2, -117, 47, 216, -18, 90, 43, 5, 40, 9, 262, -23, -125, -36, -120, 20, 15, 63, 179, -40, -149, 95, 171, 109, -16, -117, -134, 247, -66, -159, -35, -143, -115, -148, -5, 92, 70, 2, 287, 57, 296, 272, 143, -64, 10, 286, 139, -153, -60, -52, -65, 166, -118, -80, -297, -317, -82, -63, -44, -233, -202, -160, 101, -161, -33, 170, 195, 57, -16, 253]
$$ [...]
8191b59
##END NTUPLES=NMR FID
##END=
