##TITLE=1H_Pr NoNCS
 CDCl3
 8 sc, 
 28.06.2022
##JCAMPDX= 6.0         $$ Bruker NMR JCAMP-DX V2.0
##DATA TYPE= NMR FID
##DATA CLASS= NTUPLES
##ORIGIN= UXNMR, Bruker Analytische Messtechnik GmbH
##OWNER= root
$$ XWIN-NMR		Version 3.5
$$ Tue Jun 28 14:10:46 2022 Russian Standard Time (UT+4h)  she@DPX200
##.OBSERVE FREQUENCY= 200.1313499994
##.OBSERVE NUCLEUS= ^1H
##.DELAY= (6, 6)
##.ACQUISITION MODE= SIMULTANEOUS
##.ACQUISITION SCHEME= undefined
##.AVERAGES= 8
##.DIGITISER RES= 18
##SPECTROMETER/DATA SYSTEM= spect
##.PULSE SEQUENCE= zg30
##.SOLVENT NAME= CDCl3
##.SHIFT REFERENCE= (INTERNAL, CDCl3, 0, 15.7039)
##AUDIT TRAIL= $$ (NUMBER, WHEN, WHO, WHERE, WHAT)
$$ ##TITLE= Audit trail, XWIN-NMR		Version 3.5
$$ ##JCAMPDX= 5.01
$$ ##ORIGIN= Bruker BioSpin GmbH
$$ ##OWNER= she
$$ F:/spectra/data/she/nmr/H-F/1/audita.txt
$$ ##AUDIT TRAIL=  $$ (NUMBER, WHEN, WHO, WHERE, WHAT)
(   1,<2022-06-28 14:09:29.95 +0400>,<she>,<DPX200>,
      <created by zg, POWCHK disabled, PULCHK disabled
       configuration hash MD5:
       00 E9 B6 7A A2 85 ED C7 34 08 36 98 17 FE 4E 26
       data hash MD5: 16K
       7D 82 AB F3 52 8C 42 16 E5 A5 8F CA 86 8E 91 A0>)
$$ ##END=
$$ 
$$ hash MD5
$$ 95 11 8D E0 ED 4E 72 98 45 01 B0 B4 55 A4 CF 70
##$RELAX= 
##$RELAX= 
##$RELAX= 
##$RELAX= 
##$RELAX= 
##$RELAX= 
$$ Bruker specific parameters
$$ --------------------------
##$DU= <F:/spectra>
##$EXPNO= 1
##$NAME= <H-F>
##$PROCNO= 1
##$TYPE= <nmr>
##$USER= <she>
##$AMP= (0..31)
100 100 100 100 100 100 100 100 100 100 100 100 100 100 100 100 100 100 
100 100 100 100 100 100 100 100 100 100 100 100 100 100 
##$AQSEQ= 0
##$AQ_mod= 1
##$AUNM= <au_zg>
##$AUTOPOS= <>
##$BF1= 200.13
##$BF2= 200.13
##$BF3= 200.13
##$BF4= 200.13
##$BF5= 200.13
##$BF6= 200.13
##$BF7= 200.13
##$BF8= 200.13
##$BYTORDA= 1
##$CFDGTYP= 0
##$CFRGTYP= 5
##$CHEMSTR= <none>
##$CNST= (0..31)
1 1 145 1 1 1 1 1 1 1 1 1 1 1 1 1 1 1 1 1 1 1 1 1 1 1 1 1 1 1 1 1 
##$CPDPRG= <>
##$CPDPRG1= <>
##$CPDPRG2= <>
##$CPDPRG3= <>
##$CPDPRG4= <mlev>
##$CPDPRG5= <mlev>
##$CPDPRG6= <mlev>
##$CPDPRG7= <mlev>
##$CPDPRG8= <mlev>
##$CPDPRGB= <>
##$CPDPRGT= <>
##$D= (0..31)
0 1.2 0 0 0 0 0 0 0 0.06 0 0.03 0 0 0 0 0.0002 0 0 0 0 0 0 0 0 0 0 0 0 
0 0 0 
##$DATE= 1656410969
##$DBL= (0..7)
120 120 120 120 120 120 120 120 
##$DBP= (0..7)
150 150 150 150 150 150 150 150 
##$DBP07= 0
##$DBPNAM0= <>
##$DBPNAM1= <>
##$DBPNAM2= <>
##$DBPNAM3= <>
##$DBPNAM4= <>
##$DBPNAM5= <>
##$DBPNAM6= <>
##$DBPNAM7= <>
##$DBPOAL= (0..7)
0.5 0.5 0.5 0.5 0.5 0.5 0.5 0.5 
##$DBPOFFS= (0..7)
0 0 0 0 0 0 0 0 
##$DE= 6
##$DECBNUC= <off>
##$DECIM= 32
##$DECNUC= <off>
##$DECSTAT= 4
##$DIGMOD= 1
##$DIGTYP= 9
##$DL= (0..7)
0 120 120 120 120 120 120 120 
##$DP= (0..7)
150 150 150 150 150 150 150 150 
##$DP07= 0
##$DPNAME0= <>
##$DPNAME1= <>
##$DPNAME2= <>
##$DPNAME3= <>
##$DPNAME4= <>
##$DPNAME5= <>
##$DPNAME6= <>
##$DPNAME7= <>
##$DPOAL= (0..7)
0.5 0.5 0.5 0.5 0.5 0.5 0.5 0.5 
##$DPOFFS= (0..7)
0 0 0 0 0 0 0 0 
##$DQDMODE= 0
##$DR= 18
##$DS= 0
##$DSLIST= <SSSSSSSSSSSSSSS>
$$ [...]
##$SUBNAM2= <"">
##$SUBNAM3= <"">
##$SUBNAM4= <"">
##$SUBNAM5= <"">
##$SUBNAM6= <"">
##$SUBNAM7= <"">
##$SUBNAM8= <"">
##$SUBNAM9= <"">
##$SW= 18.0517283424941
##$SWIBOX= (0..15)
0 0 2 0 0 0 0 0 0 0 0 0 0 0 0 0 
##$SW_h= 3612.71676300578
##$TD= 16384
##$TD0= 1
##$TE= 0
##$TE2= 300
##$TE3= 300
##$TEG= 300
##$TL= (0..7)
0 120 120 120 120 120 120 120 
##$TP= (0..7)
150 150 150 150 150 150 150 150 
##$TP07= 0
##$TPNAME0= <>
##$TPNAME1= <>
##$TPNAME2= <>
##$TPNAME3= <>
##$TPNAME4= <>
##$TPNAME5= <>
##$TPNAME6= <>
##$TPNAME7= <>
##$TPOAL= (0..7)
0.5 0.5 0.5 0.5 0.5 0.5 0.5 0.5 
##$TPOFFS= (0..7)
0 0 0 0 0 0 0 0 
##$TUNHIN= 0
##$TUNHOUT= 0
##$TUNXOUT= 0
##$USERA1= <user>
##$USERA2= <user>
##$USERA3= <user>
##$USERA4= <user>
##$USERA5= <user>
##$V9= 5
##$VALIST= <valist>
##$VCLIST= <CCCCCCCCCCCCCCC>
##$VD= 0
##$VDLIST= <DDDDDDDDDDDDDDD>
##$VPLIST= <PPPPPPPPPPPPPPP>
##$VTLIST= <TTTTTTTTTTTTTTT>
##$WBST= 1024
##$WBSW= 4
##$XGAIN= (0..3)
0 0 0 0 
##$XL= 0
##$YL= 0
##$YMAX_a= 85995
##$YMIN_a= -130474
##$ZGOPTNS= <>
##$ZL1= 120
##$ZL2= 120
##$ZL3= 120
##$ZL4= 120
##$ABSF1= 10
##$ABSF2= 0
##$ABSG= 5
##$ABSL= 3
##$ALPHA= 0
##$AQORDER= 0
##$ASSFAC= 0
##$ASSFACI= 0
##$ASSFACX= 0
##$ASSWID= 0
##$AUNMP= <proc_1d>
##$AZFE= 0.1
##$AZFW= 0.1
##$BCFW= 1
##$BC_mod= 2
##$BYTORDP= 1
##$COROFFS= 0
##$CY= 11.3945322036743
##$DATMOD= 1
##$DC= 2
##$DFILT= <>
##$DTYPP= 0
##$F1P= 2.36226072786647
##$F2P= -0.459571619588291
##$FCOR= 0.5
##$FTSIZE= 0
##$FT_mod= 4
##$GAMMA= 1
##$GB= 0.15
##$INTBC= 1
##$INTSCL= 1
##$ISEN= 128
##$LB= 0.24
##$LEV0= 0
##$LPBIN= 0
##$MAXI= 10000
##$MC2= 0
##$MEAN= 0
##$ME_mod= 0
##$MI= 1.114404
##$NCOEF= 0
##$NC_proc= 0
##$NLEV= 6
##$NOISF1= 3.799351
##$NOISF2= 2.8
##$NSP= 1
##$NTH_PI= 0
##$NZP= 0
##$OFFSET= 15.70392
##$PC= 1
##$PHC0= -18062.37
##$PHC1= 18.60069
##$PH_mod= 1
##$PKNL= yes
##$PPARMOD= 0
##$PSCAL= 0
##$PSIGN= 0
##$REVERSE= no
##$SF= 200.130013532006
##$SI= 16384
##$SIGF1= 3
##$SIGF2= 2
##$SINO= 400
##$SIOLD= 16384
##$SREGLST= <1H.CDCl3>
##$SSB= 0
##$STSI= 0
##$STSR= 0
##$SW_p= 3612.71676300578
##$SYMM= 0
##$S_DEV= 0
##$TDeff= 0
##$TDoff= 0
##$TI= <>
##$TILT= no
##$TM1= 0
##$TM2= 0
##$TOPLEV= 0
##$USERP1= <user>
##$USERP2= <user>
##$USERP3= <user>
##$USERP4= <user>
##$USERP5= <user>
##$WDW= 1
##$XDIM= 8192
##$YMAX_p= 0
##$YMIN_p= 0
$$ End of Bruker specific parameters
$$ ---------------------------------
##NTUPLES= NMR FID
##VAR_NAME=  TIME,          FID/REAL,        FID/IMAG
##SYMBOL=    X,             R,               I
##VAR_TYPE=  INDEPENDENT,   DEPENDENT,       DEPENDENT
##VAR_FORM=  AFFN,          ASDF,            ASDF
##VAR_DIM=   8192,          8192,            8192
##UNITS=     SECONDS,       ARBITRARY UNITS, ARBITRARY UNITS
##FACTOR=    0.0002768,     1,               1
##FIRST=     0,             0,               0
##LAST=      2.2672688,     0,               0
##MIN=       0,             -130474,         0
##MAX=       2.2672688,     85995,           0
$$ Real data points
##PAGE= N=1
##DATA TABLE= (X++(R..R)), XYDATA
$$ [...]
$$ plain form
1561 701 643 -80 670 -111 -38 653 -269 523 36 -1076 486 338 -650 -210 -620 200 262 -1128 -20 -254
1581 -254 -521 587 -634 -680 604 -245 535 141 -494 681 401 76 698 -556 98 975 -305 134
1599 134 -346 -311 919 -357 -509 338 -549 35 -217 -1002 131 -318 -420 520 -932 -418 707 -110 63
1618 63 -299 -306 1176 -263 -172 714 -148 423 588 -305 561 141 83 888 -540 -342 582 -289 90 -319 -663
1639 -663 756 -261 -378 229 -1044 78 350 -651 63 -113 -14 653 -437 -72 565 -54 687 200
1657 200 -510 605 265 225 558 -514 364 830 -376 -91 -184 -356 460 -526 -435 55 -788 241 138 -1050
1677 -1050 28 -148 -19 145 -839 -29 742 -436 275 60 -135 801 102 181 280 -344 608 500 -428 185
1697 185 139 63 534 -765 -303 240 -770 238 -400 -848 245 -130 -244 93 -792 366 419 -468 408
$$ packed form
1561G01n8p23P50p81P3O91r22P92m87j112J562j48r88M40m10Q20O2j390J108k34
1581b54k67J108j221m6J284q49P80l94o35J175k80l25O22j254O54Q77j280M39
1599A34m80L5J230j276j52Q47q87N84k52p85J133m49j02R40j452N14J125q17J73
1618F3l62pJ482j439R1Q86q62N71J65q93Q66m20n8Q05j428J98R24q71L79m09l44
1639f63J419j017j17O07j273J122K72j001P14j76R9O67j090L65O37o19P41m87
1657B00p10J115l40m0L33j072Q78M66j206K85r3j72Q16r86R1M90q43J029j03j188
1677a050J078j76J29J64r84Q10P71j178P11k15j95R36o99P9R9o24R52j08r28O13
1697A85m6p6M71j299M62N43j010J008o38m48J093l75j14L37q85J158N3q87Q76
$$ plain form
1716 408 -150 -5 872 -57 -40 531 89 889 128 -432 692 215 -40 248 -543 177 197 -565 487 -508
1736 -508 -580 549 -412 -411 -279 -626 368 -99 -694 305 66 -22 333 -485 113 385 -157 619 -90 -458 1030
1757 1030 41 61 262 -333 495 224 -449 175 -312 -216 442 -791 -351 -7 -428 180 -502 -685 558 -481
1777 -481 -149 148 -572 345 360 -136 342 -30 145 852 -411 7 378 -109 728 71 -362 582 -140 147
1797 147 477 -796 20 156 -444 43 -765 -384 496 -518 -400 -59 -473 640 -30 -500 443 -111 461
1816 461 527 -582 175 591 -20 504 -124 -182 767 -273 159 10 -522 414 70 -654 3 -564 -6 315
1836 315 -1091 -386 11 -229 418 -262 -31 748 -260 295 373 -649 621 476 -92 550 -1 402 835
1855 835 -373 56 330 -407 680 -229 -298 114 -437 295 -34 -915 20 108 -431 79 -534 148 401 -229
$$ packed form
1716D08n58J45Q77r29J7N71m42Q00p61n60J124m77k55K88p91P20K0p62J052r95
1736e08p2J129r61JJ32l47R94m67n95R99k39q8L55q18N98K72n42P76p09l68J488
1757A030r89K0K01n95Q28k71o73O24m87R6O58j233M40L44m21O08o82j83J243j039
1777d81L32K97p20R17J5m96M78l72J75P07j263M18L71m87Q37o57m33R44p22K87
1797A47L30j273Q16J36o00M87q08L81Q80j014J18L41m14J113o70m70R43n54N72
1816D61O6j109P57M16o11N24o28n8R49j040M32j49n32R36l44p24O57n67N58L21
1836C15j406P05L97k40O47o80K31P79j008N55P8j022J270j45n68O42n51M03M33
1855H35j208M29K74p37J087r09o9M12n51P32l29q81R35Q8n39N10o13O82K53o30
$$ plain form
1875 -229 -262 107 192 647 -260 -682 138 -215 248 380 -442 646 148 84 674 -191 -315 230 -87 -13 -263
1896 -263 -656 481 -120 -668 205 -544 -160 133 -490 84 -108 -284 686 -370 -392 387 -30 434 288 -423
1916 -423 799 386 -68 329 -219 135 482 -324 121 -160 -439 646 -382 -594 201 -442 30 -112 -996
1935 -996 113 -114 -41 240 -624 -10 655 -382 267 28 -164 656 175 42 529 -209 489 441 -449 207
1955 207 39 -84 417 -487 -181 233 -351 4 -244 -496 164 -265 -255 121 -739 119 350 -497 78 -103
1975 -103 0 544 -402 -149 402 -199 489 247 -383 673 249 120 360 -370 -78 447 -351 125 -315 -500
1995 -500 491 -396 -484 60 -568 154 -105 -632 342 -198 21 260 -377 -6 597 15 310 -50 -62 736 4
2016 4 61 209 -236 510 179 -554 190 -36 -154 500 -600 -248 266 -459 223 -227 -687 236 -334 -228 146
$$ packed form
1875b29l3L69Q5M55r07m22Q20l53M63J32q22J088m98o4N90q65j24N45l17P4k50
1896b63l93J137o01n48Q73p49L84K93o23N74j92j76R70j056k2P79m17M64j46p11
1916d23J222m13m54L97n48L54L47q06M45k81k79J085j028k12P95o43M72j42q84
1935i96J109k27P3K81q64O14O65j037O49k39j92Q20m81j33M87p38O98m8q90O56
1955B07j68j23N01r04L06M14n84L55k48k52O60m29J0L76q60Q58K31q47N75j81
1975a03J03N44r46K53N51o01O88k42o30J056m24j29K40p30K92N25p98M76m40j85
1995e00R91q87q8N44o28P22k59n27R74n40K19K39o37L71O03n82K95l60j2P98p32
2016DN7J48m45P46l31p33P44k26j18O54j100L52N14p25O82m50m60R23n70J06L74
$$ plain form
2037 146 -598 220 355 -446 338 -93 154 732 -301 4 395 -127 548 73 -555 446 -128 191 326
2056 326 -615 14 254 -552 99 -453 -448 508 -547 -215 137 -428 294 172 -430 202 16 232 492 -419
2076 -419 301 591 -127 360 -27 -25 715 -45 73 55 -375 458 182 -476 39 -102 -172 255 -630 -211 -23
2097 -23 -415 264 -275 -581 591 3 -76 114 -505 551 244 -265 509 -23 -84 764 -245 75 174 -168
2117 -168 629 -160 -668 420 -160 8 127 -569 30 33 -524 51 -466 -409 456 -251 -269 -126 -371 438 -137
2138 -137 -299 512 -68 126 533 -358 216 282 62 374 -382 -183 478 -80 -22 137 -378 337 -71 -436 19
2159 19 -376 -221 256 -499 -212 -54 -43 385 -342 -248 546 -91 153 218 -318 514 275 -54 367 -201 279
2180 279 649 -180 -54 82 -216 196 -244 -365 226 -218 -46 73 -683 4 -22 -350 70 -440 -79 440
$$ packed form
2037A46p44Q18J35q01P84m31K47N78j033L05L91n22O75m75o28J001n74L19J35
2056C26r41O29K40q06O51n52NR56j055L32L52n65P22j22o02O32j86K16K60r11
2076d19P20K90p18M87l87KP40p60J18j8m30Q33k76o58N15j41p0M27q85M19J88
2097b3l92O79n39l06J172n88p9J90o19J056l07n09P74n32o1Q48j009L20R9l42
2117a68P97p89n08J088n80J68J19o96N99Ln57N75n17N7Q65p07j8J43k45Q09n75
2138a37j62Q11n80J94M07q91N74O6k20L12p56J99O61n58N8J59n15P15m08l65M55
2159A9l95J55M77p55K87J58J1M28p27R4P94o37K44O5n36Q32k39l29M21n68M80
2180B79L70q29J26J36k98M12m40j21N91m44J72J19p56O87k6l28M20n10L61N19
$$ plain form
2200 440 -403 17 208 -187 527 289 -17 225 -122 324 441 -432 314 279 -224 358 -254 -62 207 -282
2220 -282 -82 -173 -668 375 47 -424 14 -324 167 43 -579 37 96 -227 389 -19 -92 435 15 301 354
2241 354 -387 633 204 -105 89 -140 230 283 -317 24 70 -460 442 -195 -587 26 -200 233 -32 -695
2261 -695 226 -42 -216 418 -211 -18 355 -68 234 -6 -96 648 43 -297 334 -93 321 174 -398 296
2281 296 72 -84 253 -466 -237 321 -153 -96 -358 -625 275 -93 -318 92 -436 142 258 -222 120 4
2301 4 84 455 -107 -58 364 84 293 290 -234 502 72 30 276 -403 -45 249 -409 -150 -355 -54 245 -338
2323 -338 -123 271 -245 19 -23 -399 137 15 35 207 -335 118 760 11 106 54 -13 573 -74 -44 162 -150
2345 -150 279 237 -379 185 -179 -99 177 -600 -84 253 -258 113 -144 -429 347 51 45 49 -315 403 404 -156 254
$$ packed form
2200D40q43M20J91l95P14k38l06K42l47M46J17q73P46l5n03N82o12J92K69m89
2220b82K00r1m95J043l28m71M38l38M91j24o22O16N9l23O16m08p3N27m20K86N3
2241C54p41J020m29l09J94k29L70N3o00L41M6n30R02o37l92O13k26M33k65o63
2261f95R21k68j74O34o29J93L73m23L02k40r0P44o05l40O31m27M14j47n72O94
2281B96k24j56L37p19K29N58m74N7k62k67R00l68k25M10n28N78J16m80L42j16
2301DQ0L71n62M9M22k80K09ln24P36m30m2K46o79L58K94o58K59k05L01K99n83
2323c38K15L94n16K64m2l76N36j22K0J72n42M53O42p49R5n2o7N86o47L0K06l12
2345a50M29m2o16N64l64Q0K76p77N16L37n11L71k57k85P76k96oMl64P18Jn60M10
$$ plain form
2368 254 116 73 460 -144 11 344 -83 294 0 -409 160 -64 -135 96 -496 132 263 -484 51 -371 -295
2389 -295 122 -381 -139 64 -203 229 83 -184 376 203 184 359 -306 293 343 -165 372 -62 13 635 21
2410 21 -147 269 -307 271 -101 -399 175 -267 -44 187 -566 -219 -12 -195 52 -213 -306 275 20 57 167
2431 167 -126 397 89 -192 242 34 114 411 -34 5 130 -113 368 -196 -254 135 -177 -121 -66 -486 15 190
2453 190 -270 -19 -164 25 248 -78 -144 37 -108 391 195 -169 309 183 144 350 -403 178 346 36 322
2474 322 -344 -136 272 -286 -188 20 -523 55 27 -372 -83 -231 85 170 -394 -9 -29 -109 136 -133 -188 345
2496 345 57 76 242 -54 292 225 27 223 16 140 251 -165 -74 49 -196 96 -132 -431 123 -250 -43
2517 -43 15 -442 45 6 -58 163 -218 11 452 -51 10 217 -8 518 192 -268 340 -6 295 234 -197 121
$$ packed form
2368B54j38m3L87o04J55L33m27L77k94m09N69k24p1K31n92O28J31p47N35m22P6
2389b95M17n03K42K03k67M32j46k67N60j73j9J75o65N99N0n08N37m34P5O22o14
2410B1j68M16n76N78l72k98N74m42K23K31p53L47K07j83K47k65r3N81k55L7J10
2431A67k93N23l08k81M34k08Q0K97m45L9J25k43M81n64n8L89l12N6N5m20N01J75
2453A90m60K51j45J89K23l26o6J81j45M99j96l64M78j26l9K06p53N81J68l10K86
2474C22o66K08M08n58R8K08n43N78k8l99K89j48L16Q5n64L85k0q0K45k69n5N33
2496C45k88J9J66k96L46o7j98J96k07J24J11m16R1J23k45K92k28k99N54l73K07
2517d3N8m57M87l9o4K21l81K29M41n03O1K07k25N26l26m60O08l46L01o1m31L18
$$ plain form
2539 121 78 -103 151 -248 -239 300 -130 -129 32 -355 236 -68 -294 188 -282 217 245 -381 209 288 -26 278
2561 278 -43 -27 540 -135 314 240 -189 392 295 -223 223 -255 179 171 -22 -12 -63 -237 -42 -155 -308 -302 -352
2584 -352 310 -377 -575 171 304 -22 332 -502 289 352 -218 152 -23 -333 142 98 -59 21 -141 500 242
2605 242 -159 263 107 -315 119 -361 -253 -190 -528 -57 -238 -349 152 61 -23 127 -75 55 300 -395 335
2626 335 182 64 456 -58 -12 386 -118 316 114 -155 124 -107 2 -2 -120 88 43 -289 137 -163 -224 267
2648 267 -214 -320 43 -228 82 60 -166 295 118 -23 319 -348 580 294 -82 108 239 122 598 68
2668 68 -335 167 0 -260 -88 -602 -111 -186 294 566 -376 -157 65 -238 -148 -102 -253 284 -48 54 167
2689 167 -217 117 277 -60 403 -29 43 586 -62 -112 110 -13 121 -22 -177 213 -214 -166 -67 -356 32
$$ packed form
2539A21m3j81K54l99RN39m30JJ61l87N91l04k26M82m70M99K8o26N90P9l14L04
2561B78l21J6N67o75M49p4m29N81r7n18M46m78M34qj93J0n1j74J95j13j53On0
2584c52O62o87j98P46J33l26L54q34P91O3n70L70j75l10M75m4j57Q0j62O41k58
2605B42m01M22j56m22M34m80J08O3l38M71j81j11N01r1q4J50k02J30K45o95P30
2626C35j53j18L92n14M6L98n04M34k02k69K79k31J09mj18K08m5l32M26l00o1M91
2648B67m81j06L63k71L10k2k26M61j77j41L42o67R28k86l76J90J31j17M76n30
2668F8m03N02j67k60J72n14M91p5M80K72r42K19K22l03R0M6j51N37l32J02J13
2689A67l84L34J60l37M63m32P2N43o48n0K22j23J34j43j55L90m27M8R9k89L88
$$ plain form
2710 32 3 -325 -155 -230 -97 198 -156 60 166 -268 358 173 -126 168 -18 145 56 -128 291 334 -117 240
2732 240 -43 -132 246 -108 -135 23 -331 98 115 -327 -70 -129 -121 148 -395 49 230 -144 301 -62 -111 363
2754 363 185 13 275 -222 266 419 -167 116 26 -13 204 -176 -19 188 -170 248 -117 -396 123 -281 -109
2775 -109 147 -161 123 99 -332 179 -137 -165 377 -254 126 214 61 418 93 -146 345 24 170 218 -331
2796 -331 27 187 -148 185 -246 -182 185 -164 -210 -148 -342 103 -54 -470 128 -142 -89 250 -229 9 230
2817 230 -25 312 -75 -201 366 -78 195 172 -206 305 103 -113 130 -264 -60 211 -371 137 -167 -259 131
2838 131 -178 -244 150 -331 -85 15 -328 18 20 -156 347 -65 115 501 -134 30 182 -137 346 7 -53
2859 -53 195 -56 192 319 -280 32 57 -102 218 -464 -67 -45 -187 -167 -72 -263 31 -95 -186 129 -167 70
$$ packed form
2710C2k9l28J70p5J33K95l54K16J06m34O26j85k99K94j86J63q9j84M19M3m51L57
2732B40k83q9L78l54k7J58l54M29J7m42K57n9QK69n43M44J81l74M45l63m9M74
2754C63j78j72K62m97M88J53n86K83r0l9K17l80J57K07l58M18l65k79N19m04J72
2775a09K56l08K84k4m31N11l16k8N42o31L80Q8j53L57l25k39M91l21J46M8n49
2796c31L58J60l35L33m31O4L67l49m6O2j94M45j57m16N98k70N3L39m79K38K21
2817B30k55L37l87j26N67m44K73k3l78N11k02k16K43l94K04K71n82N08l04r2L90
2838A31l09o6L94m81K46J00l43L46Kj76N03m12J80L86o35J64J52l19M83l39o0
2859e3K48k51K48J27n99L12K5j59L20o82L97K2j42K0R5j91K94j26r1L15k96K37
$$ plain form
2881 70 375 -376 154 27 -96 375 45 -6 159 -25 112 178 -242 240 105 -260 110 -138 -29 96 -446
2902 -446 13 87 -269 171 -402 -271 -33 -182 120 29 -188 81 183 38 197 -187 122 253 53 164 38
2923 38 61 360 158 -121 38 -231 95 10 -374 184 97 -229 69 -200 -17 45 -217 63 -155 -367 327 48
2945 48 -105 66 -42 139 227 -148 334 2 22 371 -193 6 146 56 230 99 -120 140 -54 -118 -28 -301
2967 -301 -30 95 -296 -64 -115 -246 174 -197 -229 75 -144 147 132 -97 335 20 80 278 -35 105 213
2988 213 -217 54 62 -1 180 -189 -145 78 -133 -9 -72 -418 -70 10 -114 97 -456 -45 329 -174 152 -253
3010 -253 -202 367 98 -43 236 -101 163 364 -101 155 -110 -123 348 -137 -17 102 -152 148 -120 -217 28
3031 28 -252 -306 -168 -350 -43 203 -285 -32 15 -258 209 -91 -174 181 -159 86 156 -241 97 116 68 345
$$ packed form
2881G0L05p51N30j27j23M71l30n1J65j84J37O6m20M82j35l65L70k48J09J25n42
2902d46M59P4l56M40n73J31K38j49L02r1k17K69J02j45J59l84L09J31k00J11j26
2923C8K3K99k02k79J59k69L26q5l84N58q7l26K98k69J83O2k62K80k18k12O94k79
2945D8j53J71j08J81Q8l75M82l32K0L49n64J99J40r0J74j31k19K60j94o4R0k73
2967c01K71J25l91K32n1j31M20l71l2L04k19K91j5k29M32l15O0J98l13J40J08
2988B13m30K71Qo3J81l69M4K23k11J24o3l46L48Q0j24K11n53M11L74n03L26m05
3010b53N1N69k69j41K79l37K64K01m65K56k65j3M71m85J20J19k54L00k68r7K45
3031B8k80n4J38j82L07K46m88K53M7k73M67l00q3L55l40K45P0l97L38J9m8K77
$$ plain form
3053 345 -402 129 169 -179 182 -140 -55 211 -119 -31 -23 -300 35 64 -307 18 -142 -104 140 -203 -20 205
3075 205 -94 248 -7 -172 417 30 61 95 -180 289 225 -153 32 56 -32 242 -188 -154 90 47 237 -154
3097 -154 -253 -15 -250 -77 -105 -161 81 97 -251 94 10 -122 369 100 308 75 89 240 -42 -32 229 -52
3119 -52 51 192 -329 177 -10 -151 67 -237 -177 285 -189 -228 -22 -212 81 -78 -272 -72 -100 133 171 -240
3141 -240 -7 202 -248 239 -12 -20 437 8 104 1 -37 185 18 -59 67 -131 16 154 -319 29 -100 -194
3163 -194 21 -317 -245 -5 -122 -81 44 -164 165 131 -19 79 18 99 214 -174 -17 173 5 201 44 -272
3185 -272 139 -40 99 8 -286 82 77 -215 84 -213 -180 44 -169 -149 -73 -283 123 -69 -116 220 -137 43
3207 43 279 -6 114 285 130 281 66 6 310 196 31 56 -333 129 78 -181 74 -318 -36 166 -181
$$ packed form
3053C45p47N31M0l48L61l22Q5K66l30Q8Qk77L35K9l71L25j60L8K44l43J83K25
3075B05k99L42k55j65N89l87L1L4k75M69o4l78J85K4q8K74m30L4K44m3J90l91
3097a54r9K38k35J73k8n6K42J6l48L45q4j32M91k69K08k33J4J51k82J0K61k81
3119e2J03J41n21N06j87j41K18l04O0M62m74l9K06j90K93j59j94K00k8K33L8m11
3141b40K33K09m50M87k51qM57m29R6j03l8K22j67p7J26j98J47J38m73L48j29r4
3163a94K15l38P2K40j17M1J25k08L29l4j50R8o1Q1J15l88J57J90j68J96j57l16
3185b72M11j79J39r1k94L68nk92K99k97L3K24k13K0P6k10M06j92m7L36l57J80
3207D3K36k85J20J71j55J51k15o0L04j14j65K5l89M62n1k59K55l92K82K02l47
$$ plain form
3228 -181 59 -104 -131 141 -172 -113 265 -119 57 -79 -136 103 162 -24 120 -99 8 221 -93 83 33 -90
3250 -90 235 -4 -120 178 -152 42 -8 -373 -77 -4 -250 -48 -42 37 23 -188 30 -19 -104 204 33 67 284
3273 284 -142 151 187 -156 203 128 87 304 -201 19 259 30 32 -89 -395 125 -74 -184 30 -352 -16 123
3295 123 -388 -70 -50 92 248 -116 -119 195 -90 59 172 -68 393 111 -87 282 -247 63 342 -35 -67
3316 -67 -69 -135 31 -45 -205 86 -219 109 -6 -391 -79 -72 -211 87 -160 0 177 -118 150 -92 -128 154 78
3339 78 -14 68 38 123 135 -83 156 33 55 203 -148 -225 125 -111 42 -226 -149 7 -233 -80 -61 -254 167
3362 167 -21 -251 193 2 -12 132 13 69 299 -13 181 151 -41 191 225 171 65 -73 -7 94 -146 -36
3384 -36 -121 -56 42 -176 -338 115 -417 -14 -53 -181 53 -205 6 100 -88 140 258 -126 80 168 -34 193
$$ packed form
3228a81K40j63k7K72l13N9L78l84J76j36n7K39N9j86J44k19J07K13l14J76n0j23
3250i0L25k39j16K98l30J94n0l65K96P3k46K02OP9j4k11K18m9q5L08j71L4K17
3273B84m26K93L6l43L59p5m1K17n05K20K40k29Kj21l06N20j99j10K14l82L36J39
3295A23n11L18K0J42J56l64lL14k85J49J13k40M61k82j98L69n29L10K79l77l2
3316f7ko6J66p6j60K91l05L28j15l85L12Pj39K98k47J60J77k95K68k42l6K82p6
3339G8r2Q2l0Q5J2k18K39j23K2J48l51p7L50k36J53k68P7J56k40J53J9j93M21
3362A67j88k30M44j91j4J44j19N6K30l12J94l0j92K32L4n4j06j38O6J01k40J10
3384c6q5O5R8k18j62M53n32M03l9j28K34k58K11R4j88K28J18l84K06Q8k02K27
$$ plain form
3406 193 -17 106 165 -137 152 158 31 117 1 70 63 -215 -181 5 -54 59 -158 -268 -36 -27 -98 -32 -328 13
3430 13 -28 70 230 22 1 206 -55 84 124 -45 332 12 -172 124 21 -58 52 -51 -63 -1 -112 -50 -188
3453 -188 -149 7 -241 -108 -53 -252 68 -60 -165 137 80 0 116 -18 67 109 13 204 82 29 122 -5 -40
3476 -40 -33 -81 170 100 -174 0 -197 25 128 -170 15 3 -173 51 -234 -102 49 0 -67 173 -108 224 222
3499 222 93 23 30 111 324 63 149 192 53 16 -91 -54 153 -142 5 -74 -233 -23 50 -266 44 -56 -161
3522 -161 20 -163 80 -28 -278 86 122 -83 270 12 66 178 -53 1 152 93 188 102 -127 189 8 75
3544 75 8 -203 190 49 -180 20 -152 -81 28 -319 100 6 -155 81 -194 -212 129 -162 51 256 -134 242
3566 242 107 28 381 -14 -18 152 -21 153 85 24 97 -173 -98 91 -187 65 63 -167 -85 -63 49 85 -154 -76
$$ packed form
3406A93k10J23N9l02K89Oj27Q6j16O9pk78L4J86n9J13k17j10K32Rp1O6k96L41
3430A3m1R8J60k08k1K05k61J39M0j69L77l20j84K96j03p9J10j03j2O2j11O2j38
3453a88L9J56k48J33N5j99L20j28j05L02n7q0J16j34Q5M2r6J91j22n3R3j27l5
3476d0Pm8K51p0k74J74j97K22J03k98J85j2j76K24k85J32J51m9o7K40k81L32k
3499B22j29p0PQ1K13k61Q6M3j39l7j07L7K07k95J47p9j59K10P3l16L10j00j05
3522a61J81j83K43j08k50L64L6k05L53k58N4J12k31N4J51n9R5q6k29L16j81O7
3544G5o7k11L93j41k29K00j72P1J09l47M19r4j61K36k75j8L41k91K13K05l90L76
3566B42j35p9L53l95mJ70j73J74o8o1P3k70P5J89k78K52kk30Q2K2J12L6k39P8
$$ plain form
3590 -76 148 101 60 7 -57 142 197 -123 77 -16 131 289 -152 81 34 -60 172 -95 -178 150 -158 -16 23 -66
3614 -66 -59 50 -192 -111 -137 22 30 -141 62 66 -107 417 -124 6 107 -24 228 224 -181 142 -41 -21 121 19
3638 19 -62 61 -32 -73 -72 -196 219 -39 -133 20 -67 51 80 -236 -69 -12 -92 -75 -207 85 199 -114 42 15
3662 15 -33 376 114 -18 158 73 135 -69 -105 321 25 -79 -9 -48 -61 25 -71 -1 -37 -48 25 143 -177 51 -165
3687 -165 74 125 -197 -77 128 -13 272 81 104 142 57 250 -2 19 168 258 32 129 -159 16 108 -174 -67
3710 -67 -134 -19 132 -208 -250 -5 -197 26 -57 -198 111 -164 180 175 -20 5 187 26 52 23 -65 102 51 16
3734 16 22 -44 256 97 -220 96 -18 -119 61 -281 -70 -98 -116 41 -144 -47 -20 -76 -61 41 -187 256 218 -38
3758 -38 90 -32 65 243 -82 -14 155 -4 191 55 -110 218 -104 -72 73 -238 -45 -177 -264 46 -77 -33
$$ packed form
3590g6K24m7m1n3o4J99N5l20K00r3J47J58m41K33m7r4K32k67q3L28l08J42L9q9
3614f6PJ09k42Q1k6J59Qj71K03Mj73N24n41J30J01j31K52mm05L23j83K0J42j02
3638A9q1J23r3m1Jj24M15k58r4J53q7J18K9l16J67N7q0J7j32K92J14l13J56k7
3662A5m8M09k62j32J76q5O2k04l6M26k96j04P0l9j3Q6r6P0l6j1P3J18l20K28k16
3687a65K39N1l22J20K05j41K85j91K3L8q5J93k52K1J49R0k26R7k88J75R2k82J07
3710f7o7J15J51l40m2K45j92K23q3j41L09k75L44nj95K5J82j61K6k9q8J67n1l5
3734A6Oo6L00j59l17L16j14j01J80l42K11k8j8J57j85R7K7n6J5J02k28M43l8k56
3758c8J28j22R7J78l25O8J69j59J95j36j65L28l22L2J45l11J93j32q7L10j23M4
$$ plain form
3780 -33 95 -57 -74 -40 -88 2 48 -260 58 23 129 80 -191 102 199 -25 275 50 -76 244 21 87 -5 -93
3804 -93 14 -298 -252 60 -146 -183 -34 -249 -179 121 -196 226 -28 -124 186 -70 -107 97 -83 152 302 -40
3826 -40 120 -96 36 296 -90 32 1 -9 -41 184 -21 -4 -25 -25 -84 -231 14 45 -100 64 -53 -128 96 -74
3850 -74 110 35 -1 232 162 -178 144 -62 199 132 -134 205 223 -117 113 -143 88 11 -20 79 -68 -120 110
3873 110 89 -265 -12 -129 -81 69 -132 -39 56 -124 168 73 33 212 60 96 46 -14 198 276 43 98 -170 -138
3897 -138 233 -138 -60 7 -93 58 -108 -67 -54 -70 -90 -181 -290 31 2 -82 23 -97 17 135 -64 7 44 -59
3921 -59 107 41 13 105 -98 151 17 -104 -22 62 -83 64 -190 -147 -39 -61 -74 -127 -137 78 -67 -152 29 -139
3945 -139 72 42 -155 -59 69 27 266 7 -42 187 -49 102 181 -236 161 35 -23 -51 -277 -104 205 -146
$$ packed form
3780c3J28j52j7L4m8R0M6l08L18l5J06m9k71K93R7k24L00k25j26L20k23O6r2q8
3804i3J07l12M6L12k06l7J49k15P0L00l17M22k54r6L10k56l7K04j80K35J50l42
3826d0J60k16J32K60l86J22l1j0l2K25k05J7k1%n9j47K45L1j45J64j17p5K24j70
3850g4J84p5l6K33p0l40L22k06K61o7k66L39J8l40K30k56K31p7l1R9j47n2K30
3873A10k1l54K53j17M8J50k01R3R5j80K92r5m0J79j52L6n0o0K12P8k33N5k68L2
3897a38L71l71P8O7j00J51j66M1J3j6k0r1j09L21k9q4J05j20J14J18j99P1L7j03
3921e9J66o6k8R2k03K49j34j21Q2Q4j45J47k54M3J08k2j3n3j0K15j45q5J81j68
3945a39K11l0j97R6J28m2K39k59m9K29k36J51P9m17L97j26n8k8k26J73L09l51
$$ plain form
3967 -146 -114 10 -87 -66 -53 28 35 -233 -52 -43 -112 115 -83 -125 69 -9 24 209 71 90 168 36 110 -57 -94 -44
3993 -44 -191 164 51 -78 -11 -36 -173 105 -185 -152 -4 -109 39 -66 -201 72 14 -121 176 -11 -46 179
4015 179 -64 77 6 28 171 124 141 109 -63 8 36 -68 62 -57 -24 43 -158 -61 49 82 -94 -121 -47 172
4039 172 -190 -143 30 -297 12 -56 -95 -36 128 35 86 -65 117 100 -30 93 54 -59 178 70 -33 27 -128
4062 -128 36 51 -181 20 -189 -189 11 -248 38 8 -132 71 -50 -207 92 -143 -77 -8 59 141 151 -122 183
4085 183 115 -21 127 -100 60 231 123 174 -1 -133 114 -69 -85 125 -275 45 -55 -37 131 7 -58 56
4107 56 91 -144 -31 -131 171 46 -162 137 -63 22 93 16 122 112 -20 65 -41 93 123 -112 -53 33 -102
4130 -102 85 -34 19 -45 13 22 -14 -148 -13 177 66 35 -5 -57 101 15 33 64 -72 216 71 -12 162 79 -14
$$ packed form
3967a46L2J24r7K1J3Q1Pk68J81Ro9K27j98m2J94p8L3J85j38J9P8j32P4j67l7N0
3993d4j47L55j13j29O7k5j37K78k90L3J48j05J48j05j35K73n8j35K97j87l5K25
4015A79k43J41p1K2J43m7J7l2j72P1K8j04J30j19L3O7k01R7J10L3j76k7P4K19
4039A72l62M7J73l27L09o8l9N9J64r3N1j51J82j7j30J23l9j13K37j08j03O0j55
4062a28J64J5k32K01k09%K00k59K86l0j40K03j21j57K99k35O6O9O7Q2J0k73L05
4085A83o8j36J48k27J60J71j08N1j75j32K47j83j6K10m00L20j00J8J68j24o5J14
4107E6L5k35J13j00L02j25k08K99k00Q5P1p7J06j0j32Q5j06J34L0k35N9Q6j35
4130a02J87j19N3o4N8Rl6j34J35J90j11l1m0n2J58q6J8L1j36K88j45q3J74q3r3
$$ plain form
4155 -14 152 -114 -72 94 157 91 4 -123 3 -240 -55 96 -133 148 86 -42 -51 -92 -139 51 132 71 39 67 18
4180 18 47 30 211 -108 -3 110 -126 202 119 8 32 -150 43 33 7 -36 30 -165 -35 -82 -144 55 -100 -112
4204 -112 122 -212 61 47 -18 94 -85 70 150 99 121 159 15 166 19 112 134 -117 2 141 -63 -27 28
4227 28 21 36 26 -73 -115 -242 -26 -138 -216 35 67 -49 2 37 -86 172 -99 -6 122 61 131 99 -15 69 71 -60
4253 -60 150 -97 17 71 -163 120 -130 -123 44 -31 48 27 -167 83 -16 -76 156 -7 44 161 -10 165 116 -5
4277 -5 112 154 -59 -117 60 106 52 6 203 -36 -168 -67 -45 -33 2 -159 -11 -118 -151 78 -106 -213 26 25
4301 25 -39 54 -95 44 -13 70 66 -62 50 -14 58 -68 -12 -83 159 -97 -48 2 101 98 -5 -134 -85 113 -95 -65
4327 -65 -89 -95 -3 -197 -157 -33 -39 52 -84 73 90 19 134 55 -27 122 19 93 86 -93 21 136 -236 -17 99
$$ packed form
4155a4J66k66M2J66O3o6q7j27J26k43J85J51k29K81o2j28rm1m7J90Q1o1l2K8m9
4180A8K9j7J81l19J05J13k36L28q3j11K4j82J93j0k6m3O6j95J30m7o2J99j55j2
4204a12K34l34K73j4o5J12j79J55Q0n1K2L8j44J51j47R3K2k51J19J39k04L6N5
4227B8pJ5j0r9m2j27K16j12p8K51L2j16N1L5j23K58k71R3J28o1P0l2j14Q4Kj31
4253f0K10k47J14N4k34K83k50PJ67p5P9k1j94K50r9o0K32j63N1J17j71J75m9j21
4277eJ17M2k13n8J77M6n4m6J97k39j32J01K2J2L5j61J48j07l3K29j84j07K39j
4301B5o4R3j49J39n7Q3mj28J12o4P2j26N6p1K42k56M9N0R9lj03j29M9J98k08L0
4327f5k4oR2j94M0J24oR1j36J57J7p1J15p9q2J49j03P4pj79J14J15l72K19J16
$$ plain form
4352 99 -74 -151 13 -25 82 -224 -142 65 -120 -13 -16 -197 89 -33 -192 -43 -95 119 79 14 157 -29 -45
4375 -45 118 -98 -19 129 -79 70 17 -65 142 -31 -51 -89 3 -55 12 -326 -183 17 25 -4 50 -66 -17 38 -33
4400 -33 25 -78 160 -37 64 128 -168 138 144 -179 5 -4 67 -22 -84 189 -1 15 14 80 -135 148 -51 -88 -159
4425 -159 -173 -25 -92 -64 308 138 -83 121 -6 -4 47 92 124 74 58 114 78 42 2 -110 -50 82 -59 -72 86
4450 86 63 -36 7 5 -68 -88 45 -46 -168 -25 -186 -128 83 -47 13 74 -72 93 -91 -21 112 -20 63 238 77
4475 77 -65 146 -79 135 66 44 -107 -104 -30 54 6 -11 -115 -81 -29 -56 -10 -110 -244 45 83 -18 150 -65 12
4500 12 60 -79 18 86 -36 156 -25 27 135 -35 164 53 -201 57 114 17 57 -67 -130 53 -155 -1 -150
4523 -150 -205 5 -10 -83 -162 -39 100 37 -119 83 89 17 269 172 43 238 23 81 102 -151 121 108 -63 57
$$ packed form
4352I9j73p7J64l8J07l06Q2K07j85J07lj81K86j22j59J49n2K14m0o5J43j86j6
4375d5J63k16P9J48k08J49n3q2K07j73k0l8R2n8O7l38J43K00Qk9N4j16M9N5p1
4400c3N8j03K38j97J01O4k96L06Ol23J84rP1q9o2K73j90J6jO6k15K83j99l7p1
4425a59j4J48o7K8L72j70k21K04j27KN1M5L2n0j6N6l6l6m0j12O0J32j41j3J58
4450H6k3r9M3kp3k0J33r1j22J43j61N8K11j30O0O1j46J65j84P0J33j32Q3J75j61
4475G7j42K11k25K14o9k2j51LP4Q4m8j7j04L4N2k7M6j00j34K89L8j01J68k15P7
4500A2M8j39R7O8j22J92j81N2J08j70J99j11k54K58N7r7M0j24o3J83k08J54j49
4523a50n5K10j5p3p9J23J39o3j56K02Op2K52r7j29J95k15N8K1k53K72j3j71J20
$$ plain form
4547 57 24 -12 -36 -5 -22 -7 -259 74 35 -113 -6 -122 -92 26 -87 53 -83 -17 9 114 -2 274 82 -32
4571 -32 -3 73 240 53 -7 60 31 86 103 -50 1 99 23 -68 -50 -64 103 -107 -3 -67 -158 -25 25 32 68 -110 -29
4598 -29 141 -17 25 -62 -125 -60 -18 3 168 -40 91 43 -37 42 -16 -36 -67 -163 -52 3 -211 -23 -92 -127 79 -92
4624 -92 -24 -98 70 5 208 -211 -82 131 26 19 -153 -97 148 -42 249 -47 17 117 -96 27 50 34 153
4647 153 21 -170 -9 44 -133 -66 -47 -130 93 -50 -240 9 -74 188 7 -26 -9 33 86 3 -104 71 144 7
4671 7 27 -156 -11 50 -44 98 -11 -135 13 11 89 -139 -158 -41 -152 -72 70 -110 -11 6 -170 -17 54 12 59
4696 59 111 -21 80 82 57 116 56 -6 97 137 117 -31 -71 75 116 -100 11 -30 -10 -5 -60 -105 65 23 107 -34 -18
4723 -18 33 45 51 -94 -9 145 18 33 -27 -35 169 176 34 30 164 -14 164 -46 -43 73 -83 134 -106 -147 -70 45
$$ packed form
4547E7l3l6k4L1j7J5k52L33l9j48J07j16L0J18j13J40j36O6K6J05j16K76j92j14
4571c2K9P6J67j87o0O7k9N5J7j53N1R8p6r1J8j4J67k10J04o4r1J33N0PL6j78Q1
4598b9J70j58M2q7o3O5M2K1J65k08J31m8q0P9n8k0l1r6J11N5k14J88o9l5K06j71
4624i2O8p4J68o5K03m19J29K13j05pj72N6K45j90K91k96O4J00k13J23K3j6J19
4647A53j32j91J61N3j77O7J9q3K23j43j90K49q3K62j81l3J7M2N3q3j07J75P3j37
4671GK0j83J45O1r4J42j09j24J48kP8k28j9J17j11Q0J42j80R9J7j76J53P1m2M7
4696E9N2j32J01Kk5N9o0o2J03M0k0j48m0J46M1k16J11m1K0Nn5m5J70m2Q4j41J6
4723a8N1J2Oj45Q5J54j27J5o0qK04Pj42mJ34j78J78k10LJ16j56K17k40m1P7J15
$$ plain form
4749 45 -141 -101 -128 9 -113 -206 93 -66 151 222 -34 -51 23 55 128 89 29 114 -87 -14 78 -119 71 119 36
4774 36 -48 -70 -205 31 -174 -78 -196 2 78 82 -239 -11 -94 -15 57 -122 55 -9 -105 -23 51 1 116 -79 124
4799 124 -113 20 88 111 -49 31 -99 -37 49 -104 -29 4 88 -58 -55 -12 129 -130 -69 -49 -70 38 121 1 90
4824 90 93 -8 267 -41 24 72 -49 10 74 -2 -103 -4 -56 -113 -24 4 30 103 -143 -174 -70 86 -117 0 -152
4849 -152 -143 -18 -13 -2 118 -73 84 202 -9 116 157 -50 92 71 -80 177 -52 26 106 17 -30 70 17 5
4873 5 111 -18 66 -164 -4 -189 -119 -20 -142 -65 -11 59 -33 2 -63 51 -8 -11 -31 -50 153 155 -40 33 44 12 77
4900 77 -120 -39 -30 -64 -57 -4 -77 121 -60 -48 122 -86 3 185 -171 0 63 -61 162 20 103 -25 116 -40
4924 -40 144 -38 44 -6 -114 -17 47 -125 60 70 65 15 -41 70 -21 -43 65 -42 115 -68 -70 91 -84 14 83
$$ packed form
4749D5j86M0k7J37j22r3K99j59K17P1k56j7P4L2P3l9o0Q5k01P3R2j97J90M8q3
4774C6q4k2j35K36k05R6j18J98P6Ml21K28q3P9P2j79J77o4r6Q2P4n0J15j95K03
4799A24k37J33O8K3j60Q0j30O2Q6j53P5L3Q4j46LM3J41k59O1K0k1J08Q3j20Q9
4824I0Lj01K75l08O5M8j21N9O4p6j01R9n2n7Q9K8K6P3k46l1J04J56k03J17j52
4849a52RJ25NJ1J20j91J57J18k11J25M1k07J42k1j51K57k29P8Q0q9m7J00n3j2
4873EJ06j29Q4k30J60j85P0R9j22P7N4P0r2L5o5J14n9lk0j9K03Kj95P3J1l2O5
4900G7j97Q1Rl4PN3p3J98j81J2J70k08Q9J82l56J71O3j24K23j42Q3j28J41j56
4924d0J84j82Q2n0j08R7O4j72J85J0nn0n6J11r1k2J08j07J57j83kJ61j75R8O9
$$ plain form
4949 83 105 -107 101 -111 33 -38 12 -36 21 10 17 -35 47 85 -21 29 26 -40 64 -91 -59 -31 -139 -75 -54 -48 -28 -126
4977 -126 -71 5 51 63 38 -2 -96 -23 0 -33 54 19 161 -89 32 175 -69 91 -30 -41 -2 -102 13 -37 -169
5002 -169 -91 -155 -46 106 -94 -1 45 -211 28 -186 -75 -38 -6 -84 4 -16 -78 141 -18 173 121 -32 167 44
5026 44 20 153 -173 88 139 -45 -4 -77 110 -39 -48 -66 19 -159 -8 -32 -217 -63 -68 70 39 -53 -14 2 130
5051 130 92 86 -99 63 95 2 158 3 137 -106 -117 98 -34 -27 34 -4 -35 -110 -4 -7 -35 -91 -60 15 -39 -61 -183
5078 -183 70 -18 4 -74 -45 136 73 -115 64 72 2 44 35 -18 -18 -43 31 136 -6 15 80 -56 11 -3 42 18 12 -18
5106 -18 -17 -57 -64 42 -51 -86 -62 -78 49 -21 -25 96 75 69 57 -59 255 160 -66 2 1 82 -16 -213 74 -71 -59 38
5134 38 -260 11 -15 -22 34 -86 -165 107 -68 168 -50 18 -12 38 -114 -28 -47 38 168 -118 -215 88 -26 37 100
$$ packed form
4949H3K2k12K08k12J44p1N0m8N7j1Pn2Q2L8j06N0lo6J04j55L2K8j08O4K1OK0r8
4977a26N5P6M6J2k5m0r4P3K3l3Q7l5J42k50J21J43k44J60j21j1L9j00J15n0j32
5002a69P8o4J09J52k00R3M6k56K39k14J11L7L2p8Q8k0o2K19j59J91n2j53J99j23
5026D4k4J33l26K61N1j84M1p3J87j49rj8Q5j78J51k4j85J54nJ38l1r2L9J6J28
5051A30l8oj85J62L2r3J56j55J34k43j1K15j32PO1l8l1p5J06lk8n6L1P5n4k2j22
5078a83K53q8K2p8K9J81o3j88J79Qp0M2rn3%k5P4J05j42K1O5j36O7j4M5k4ol0
5106a8Jm0pJ06r3l5K4j6J27p0mJ21k1oj2j16L14r5k26O8jQ1r8j97K87j45J2R7
5134C8k98K71k6pN6j20p9K72j75K36k18O8l0N0j52Q6j9Q5J30k86r7L03j14O3O3
$$ plain form
5159 100 -84 198 -4 -160 119 -196 -36 31 -86 93 -28 -53 30 57 -11 -23 -72 75 18 -44 36 -102 -20 57
5183 57 -171 26 71 -59 -41 7 76 102 -75 -37 160 -161 172 -58 -139 -82 -214 -14 -29 -148 -175 -81 107 -7
5207 -7 -108 -275 71 -71 21 29 -42 73 3 48 -20 -60 114 242 -81 30 4 -128 120 -55 -17 121 -142 -31
5231 -31 -32 -220 -85 163 1 -91 -114 -52 -30 60 53 -32 46 156 -26 6 157 -103 114 -74 5 25 114 18 60 -88
5257 -88 -32 43 14 129 55 -48 -76 103 134 29 -168 130 78 31 47 49 57 71 -45 -35 59 18 26 -3 -91 178 -14
5284 -14 99 5 -27 46 116 -85 -13 -70 -52 -68 6 -160 -66 96 85 -62 -8 24 -52 -3 -87 64 78 -20 29 14 99
5311 99 -21 132 47 8 27 -53 36 86 90 64 -65 -120 133 79 -20 4 -51 57 37 -163 48 -33 -29 28 -59 28 176
5338 176 -13 36 65 67 113 80 -47 -45 -38 51 -60 91 150 -67 -63 -33 3 -137 83 -17 -202 -107 39 66 5 -128
$$ packed form
5159A00j84K82k02j56K79l15J60O7j17J79j21k5Q3K7o8j2m9J47n7o2Q0j38Q2P7
5183E7k28J97M5j30J8M8O9K6j77L8J97l21L33k30q1N7j32K00j5j19k7R4J88j14
5207gj01j67L46j42R2Qp1J15p0M5o8m0J74J28l23J11k6j32K48j75L8J38k63J11
5231c1jj88J35K48j62r2k3O2K2R0pq5P8J10j82L2J51k60K17j88P9K0Q9r6M2j48
5257h8N6P5k9J15p4j03k8J79L1j05j97K98n2m7J6KQJ4j16J0R4m1Qk9q8K69j92
5284a4J13r4l2P3P0k01P2n7J8j6P4j66R4J62j1j47N4L2p6M9q4J51J4r8M9j5Q5
5311I9j20J53q5l9J9q0Q9N0Mk6j29n5K53n4r9K4n5J08k0k00K11q1MN7q7Q7J48
5338A76j89M9K9KM6l3j27KPQ9j11J51N9k17ML0L6j40K20j00j85R5J46K7o1j33
$$ plain form
5364 -128 -18 -114 -40 8 -93 175 51 23 60 142 38 78 118 -69 34 93 65 107 -44 110 -15 -24 188 -59
5388 -59 4 105 -226 24 -123 -44 17 -112 -52 -32 -115 83 -143 -97 8 -101 -29 64 -53 -63 -2 60 122 11 129
5413 129 135 -28 27 174 -135 7 109 -23 -35 55 126 27 9 -96 -51 -19 49 26 -14 -79 -65 8 106 57 -9 30 81
5440 81 -34 16 6 34 -52 137 -106 22 -68 -50 98 -33 -33 63 -13 -220 -62 -17 -20 82 -155 -37 -14 -92 4 -106
5466 -106 -57 4 -21 -161 69 -183 -57 -118 70 171 110 -21 18 107 31 77 36 80 81 -172 -178 -28 -76 -2 -147 -51
5492 -51 -34 -169 -37 9 141 73 -14 47 -22 137 111 199 -15 -9 8 6 115 -33 -35 165 49 154 -130 14 29 -122
5518 -122 -18 -80 29 -20 -2 -165 -2 -62 -24 203 -56 -47 220 -74 7 -175 -196 110 72 27 25 18 44 60 40 1
5544 1 48 170 82 -117 -173 -17 -10 11 89 -61 24 -129 95 98 -51 -51 -27 -15 -23 -107 -67 32 -32 -97 33 25 162 -43
$$ packed form
5364a28J10r6P4M8j01K68j24k8L7Q2j04M0M0j87J03N9k8M2j51J54j25rK12k47
5388e9O3J01l31K50j47P9O1j29O0K0q3J98k26M6J05j09P2R3j17j0O1O2O2j11J18
5413A29Oj63N5J47l09J42J02j32j2R0P1r9j8j05M5L2O8k3m0o5J4P3R8m9o6L9N1
5440H1j15N0j0K8q6J89k43J28r0J8J48j31%R6p6k07J58M5lJ02k37J18K3p8R6j10
5466a06M9O1k5j40K30k52J26o1J88J01o1j31L9Q9p6M6m1M4Jk53oJ50m8P4j45R6
5492e1J7j35J32M6J32o8q7O1o9J59k6Q8k14OJ7kJ09j48kK00j16J05k84J44J5j51
5518a22J04o2J09m9J8j63J63o0L8K27k59RK67k94Q1j82k1L06l8m5kpK6J6k0l9
5544AM7J22q8j99n6J56PK1P8j50Q5j53K24Lj49%K4J2qq4M0R9o4o5J30qJ37k05
$$ plain form
5572 -43 -151 -48 -68 69 19 -169 -78 118 77 184 -218 -109 153 -18 -160 27 14 71 100 22 -103 -191 -92 -28
5596 -28 32 -22 -43 -58 77 -4 67 -4 -126 -45 99 11 67 85 -47 58 92 39 -28 -104 96 -28 124 80 -108 -125
5622 -125 -6 -180 -68 -102 -28 132 -34 -147 -6 -61 -74 -42 21 84 51 50 41 63 30 -83 53 -47 76 -90 -83
5647 -83 -86 -135 20 78 -10 22 -38 46 -76 -55 7 -59 29 -62 9 -21 101 -47 -75 192 25 82 -40 12 29 75 28
5674 28 144 12 119 -80 -117 102 10 -14 70 -27 33 24 -168 133 -42 -86 2 -40 -52 -24 17 98 -217 109 31 -19
5700 -19 166 89 15 41 25 16 123 67 -106 11 226 -74 102 -71 -80 62 -68 97 -184 -136 68 -35 170 -93
5724 -93 -14 166 32 95 -34 -111 -67 23 -152 122 61 33 -55 10 5 47 -66 76 -23 -58 -48 135 -34 -32 19 50 37
5751 37 -124 -33 -59 -44 -151 21 -16 -65 37 -95 -19 49 140 83 -16 93 8 69 213 79 63 63 10 130 64 -88
$$ packed form
5572d3j08J03k0J37n0j88R1J96m1J07m02J09K62j71j42J87j3N7K9p8j25q8R9O4
5596b8O0n4k1j5J35q1P1p1j22Q1J44q8N6J8j32J05L4n3o7p6K00j24J52m4j88j7
5622a25J19j74J12l4P4J60j66j13J41n5j3L2O3O3l3jrK2l3j13J36j00J23j66P
5647h3lm9J55N8q8L2o0Q4j22K1O2o6Q8r1P1l0J22j48k8K67j67N7j22N2J7M6m7
5674B8J16j32J07j99l7K19r2k4Q4r7O0rj92L01j75m4Q8m2j2K8M1Q1l15L26p8n0
5700a9J85p7p4K6j6rJ07n6j73J17K15l00J76j73rJ42j30J65k81M8K04j03K05k63
5724i3P9J80j34O3j29p7M4R0j75K74o1k8q8O5nM2j13J42r9l5J0J83j69KN1L1j3
5751C7j61R1k6J5j07J72l7m9J02j32P6O8R1n7r9J09q5O1J44j34j6%n3J20o6j52
$$ plain form
5777 -88 56 -92 7 -72 -2 -3 90 -51 21 1 -74 223 0 12 106 5 9 -47 83 42 134 159 3 -45 31 -68 8
5804 8 -84 65 -148 11 113 -21 45 -43 21 -84 51 -16 -134 115 37 29 28 153 -16 -36 15 -39 69 -109 86
5829 86 39 41 -29 27 97 42 -42 32 13 60 -13 -20 61 21 -68 81 11 -109 36 -33 -16 128 -44 14 -35 -26 2 -97 87
5858 87 35 -57 -37 26 -31 45 -13 -82 26 -16 -24 2 -57 -28 53 -44 54 60 -71 88 30 -33 45 -113 -5 92 -78 88
5886 88 81 85 -74 80 -1 -83 -21 79 -71 38 158 30 109 -151 -151 23 -11 -69 68 -5 -48 -71 -6 -5 123 -139
5912 -139 -16 -88 -17 55 -107 73 10 166 139 -62 -81 -36 130 -39 181 -64 127 38 50 58 51 -129 -85 187 -133
5937 -133 -27 -108 -109 69 -225 -41 -61 -103 -42 -93 -29 -22 63 129 124 -30 -30 33 19 48 -10 -66 20 113 91 -47 8 136
5965 136 9 -87 46 74 134 110 -43 -177 -37 20 12 -49 -2 -26 -27 -34 -55 -158 -29 -42 -62 -142 45 82 5 26 131
$$ packed form
5777h8J44j48R9p9P0jR3j41P2k0p5K97k23J2R4j01Mn6J30m1R2K5j56m8P6r9P6
5804Hr2J49k13J59J02j34O6q8O4j05J35o7j18K49p8qjJ25j69k0N1n4J08j78J95
5829H6m7Kp0N6P0n5q4P4j9M7p3pQ1m0q9J49p0j20J45o9J7J44j72N8m9RK8r9J84
5858H7n2r2K0O3n7P6n8o9J08m2qK6n9K9Q1r7R8Oj31J59n8o3P8j58J08R7j70J66
5886H8pMj59J54q1q2O2J00j50J09J20j28P9k60%J74l4n8J37p3m3k3O5JJ28k62
5912a39J23p2P1P2j62J80o3J56k7k01j9M5J66j69K20k45J91q9J2Qpj80M4K72l20
5937a33J06q1jJ78k94J84k0m2O1n1O4PQ5O6nj54%O3j4K9n8n6Q6R3k2j38N5J28
5965A36j27r6J33K8O0k4j53j34J40N7qo1M7k4jpk1j03J29j3k0q0J87L7p7K1J05
$$ plain form
5992 131 107 -67 64 113 125 249 35 41 48 33 109 17 115 -42 -153 27 -57 17 -146 -31 -29 47 -113 -88 102 -15
6018 -15 7 -70 59 39 -55 4 139 -111 -37 108 17 -14 74 -45 161 13 -64 56 -151 -86 7 -50 43 -63 -90
6043 -90 71 -37 -62 -86 -23 73 18 -84 127 105 -203 147 -16 -12 172 -33 132 -107 -49 67 87 0 -22 -79 93
6068 93 37 33 103 -41 -43 -93 14 -64 -61 34 -104 -175 41 91 -85 -177 15 -101 -8 32 40 109 188 44 -18 82 83 72
6096 72 -143 -8 -6 -24 -10 -88 -19 -27 -126 29 113 -36 -89 -90 186 85 149 -23 15 -10 -67 86 63 4 -56 130 -34
6123 -34 62 -70 92 25 82 -38 -30 103 2 151 62 -49 -89 61 -34 134 22 74 51 -47 -12 -32 -8 -83 -6 69
6149 69 -45 -70 113 -48 23 -110 -110 -37 28 127 163 -83 -57 -158 58 -104 -268 58 -66 -27 -43 -76 -2 103 68
6174 68 -25 -24 29 -152 16 57 -99 57 -84 79 25 28 -8 94 96 -22 -92 128 -47 -82 15 36 -13 -94 -65 11 -101
$$ packed form
5992A31k4j74J31M9J2J24k14OPj5P6r2R8j57j11J80q4P4j63J15KP6j60K5J90j17
6018a5K2p7J29k0r4N9J35k50P4J45r1l1Q8j19K06j48p7J20k07O5R3n7R3j06k7
6043i0J61j08k5k4O3R6n5j02K11k2l08L50j63MJ84k05J65k39N8J16K0q7k2n7J72
6068I3n6mP0j44kn0J07p8LR5j38p1K16N0j76r2J92j16R3M0QO9P9j44o2J00Jj1
6096G2k15J35Kj8J4p8O9qr9J55Q4j49n3jK76j01O4j72L8k5n7J53k3n9o0J86j64
6123c4R6j32J62o7N7j20QJ33j01J49q9j11m0J50r5J68j12N2k3r8L5k0K4p5P7P5
6149F9j14k5J83j61P1j33%P3O5R9L6k46K6j01K16j62j64L26j24L9j6l3P4J05l5
6174F8r3JN3j81J68M1j56J56j41J63n4Ll6J02Kj18p0K20j75l5R7K1m9q1K9P6j12
$$ plain form
6201 -101 87 81 -102 -49 -9 69 -66 50 -74 -28 28 74 -79 204 -126 118 -82 -104 -128 22 27 -50 99 53 -31
6226 -31 -82 18 -1 -81 71 86 -52 -121 -27 -131 67 -3 -119 -19 -144 36 -165 2 -65 57 142 0 69 91
6250 91 116 91 22 4 -45 -11 -54 -55 35 -18 102 78 -71 -195 -94 -143 21 28 -69 -66 -187 -65 119 -61 58 -61
6276 -61 184 11 43 46 -92 128 60 -44 -29 72 0 73 112 -139 116 36 -135 -4 -25 190 -148 -96 112 -41
6300 -41 -15 36 -40 -77 -55 123 -56 72 45 100 17 -23 17 -30 112 -91 -181 29 24 2 -54 -104 17 38 -19 16 98
6327 98 -59 -18 -29 -24 -6 -22 19 -83 4 -3 64 86 126 -56 -101 -26 -115 -27 98 -15 40 111 -62 156 111 76 -3 -57
6355 -57 65 22 -5 10 52 -12 7 5 91 17 -86 -97 88 -14 26 -87 125 -20 58 97 -15 -60 -82 -2 84 47 -35
6382 -35 145 88 -141 67 23 20 48 -36 15 103 56 75 -22 -20 -54 -6 30 44 -99 -4 17 -35 46 -12 68 116 157 -33 8
$$ packed form
6201a01J88oj83N3M0P8j35J16j24M6N6M6j53K83l30K44k00k2k4J50Np7J49m6q4
6226c1n1J00j9q0J52J5j38o9R4j04J98p0j16J00j25J80k01J67o7J22Q5j42O9K2
6250I1K5k5o9j8m9L4m3jR0n3J20k4j49j24J01m9J64Pr7Lj21J22J84j80J19j19
6276f1K45j73L2Lj38K20o8j04J5J01p2P3L9k51K55q0j71J31k1K15l38N2K08j53
6300d1K6N1p6l7K2J78j79J28k7N5q3m0M0m7J42k03r0K10nk2n6n0J21K1n7L5Q2
6327I8j57M1j1NJ8j6M1j02Q7pO7K2M0j82m5P5q9Q8J25j13N5P1j73K18m5l5p9n4
6355e7J22m3k7J5M2o4J9kQ6p4j03j1J85j02M0j13K12j45P8L9j12m5k2Q0Q6l7q2
6382c5J80n7k29K08m4lK8q4N1Q8m7J9r7Kl4M8L6J4j43R5K1n2Q1n8Q0M8M1j90M1
$$ plain form
6411 8 13 -119 27 -45 96 34 248 -10 -70 -173 223 109 -76 -109 14 61 -86 -66 141 -90 -9 61 -6 8 22
6436 22 -20 8 59 127 115 -36 134 -3 -49 102 -113 57 -81 -106 74 66 -48 -13 20 8 23 -34 -136 -133 79 -12
6462 -12 27 -61 -140 34 -61 10 -346 76 121 -48 161 48 15 -113 -161 10 60 -107 121 117 1 74 -146 -58 98
6487 98 -59 105 -66 -29 8 -57 -76 -5 -56 -108 -90 -7 19 103 155 29 -5 57 118 -64 54 141 -80 104 27 -61
6513 -61 122 -9 -47 38 -239 56 -29 -62 27 31 -97 -94 -16 61 -80 -141 8 5 -61 6 -86 41 -123 -33 120 -44
6539 -44 84 42 13 -123 42 -61 30 199 216 -36 -23 -37 111 -50 -101 199 3 13 81 34 3 -51 9 -11 9
6564 9 49 78 -38 -31 -2 -135 98 9 104 4 -141 -26 114 -41 61 -39 -29 89 18 10 -75 -8 -75 -41 180 -223
6590 -223 -63 2 -42 -48 -15 125 -63 18 -15 -61 -79 22 156 -6 -139 152 139 8 -7 5 94 -86 18 -99
$$ packed form
6411HNj32J46p2J41o2K14k58o0j03L96j14j85l3J23M7j47K0K07k31Q1P0o7J4J4
6436B2m2K8N1O8j2j51J70j37m6J51k15J70j38k5J80qj14L5L3j2J5n7j02LK12r1
6462a2L9q8p9J74r5P1l56M22M5j69K09j13l3j28m8J71N0j67K28mj16P3k20Q8J56
6487I8j57J64j71L7L7o5j9P1n1n2J8Q3K6Q4N2j26l4O2O1j82J18Q7k21J84p7q8
6513f1J83j31l8Q5k77K95q5l3Q9Mj28LP8P7j41o1J49lo6O7r2J27j64R0J53j64
6539d4J28m2k9j36J65j03R1J69J7k52J3j4J48j61n1L00j96J0O8m7l1n4O0k0K0
6564IM0K9j16PK9j33K33q9R5j00j45J15J40j55J02j00J0J18p1qq5O7o7L4K21m03
6590b23J60O5m4oL3J40j88Q1l3m6j8J01J34j62j33K91j3j31j5J2Q9j80J04j17
$$ plain form
6614 -99 -99 -87 6 19 22 19 -73 152 -130 -32 -109 49 26 2 58 61 -37 -162 -52 69 -86 -72 50 -30 180 34 102
6641 102 -2 -47 -27 3 -158 84 9 115 -22 -55 41 -22 -96 -49 -33 58 -62 27 -82 -100 -2 -20 88 -90 13
6666 13 17 -22 98 66 16 -34 159 -59 -98 32 -141 89 180 97 -81 -1 27 3 131 -25 -53 89 -31 -8 162
6691 162 -31 1 -58 -84 -150 -32 42 5 65 126 -89 -180 -49 -126 115 29 -32 -69 -20 -18 13 -12 -73 76 81 -60 -95
6718 -95 -6 114 215 -31 -205 -70 -131 -10 -112 -199 159 28 -37 79 -30 6 -60 43 41 13 78 69 -92 -53 173
6743 173 49 -45 -91 28 -102 77 11 47 -78 250 72 -40 18 -51 -122 -39 26 -42 -72 -90 155 -63 -27 -95 -36
6768 -36 51 127 157 26 56 -97 12 9 34 52 -32 -21 108 67 84 -2 40 -54 2 107 99 48 -22 -51 47 -20 -49 33 -22
6797 -22 75 -3 51 -53 -28 -28 -84 125 -46 8 68 -116 -65 -41 -65 123 -167 90 -41 -125 -24 29 35 3 -42 -189
$$ packed form
6614i9%J2R3J3Llr2K25k82R8p7J58k3k4N6Lr8j25J10J21j55J4J22q0K10j46O8
6641A02j04m5K0L0j61K42p5J06j37l3R6o3p4M7J6R1j20Q9j09j8R8j8J08j78J03
6666A3Ml9J20l2n0n0J93k18l9J30j73K30R1q3j78Q0K8k4J28j56k8J42j20K3J70
6691A62j93L2n9k6o6J18P4l7O0O1k15r1J31p7K41q6o1l7M9KL1k5o1J49Nj41l5
6718i5Q9J20J01k46j74J35o1J21j02q7L58j31o5J16j09L6o6J03kk8O5rj61L9K26
6743A73j24r4m6J19j30J79o6L6j25L28j78j12N8o9p1Q3O5o8l0j8K45k18L6o8N9
6768c6Q7P6L0j31L0j53J09lK5J8q4J1J29m1J7q6M2r4N6J05qn1p0k9R8o7k9Q2n5
6797b2R7p8N4j04K5%n6K09j71N4O0j84N1K4k4J88k90K57j31q4J01N3Ol2m5j47
$$ plain form
6823 -189 -105 35 76 -33 -30 5 38 -11 -47 -43 -111 -130 -28 122 -125 51 -6 -98 127 158 61 132 74 -157 115 -2
6849 -2 44 64 -104 -41 -117 -85 47 -62 80 126 16 63 -32 -34 -10 -14 131 -24 55 -61 -117 97 61 -15 -59 5 -159
6876 -159 -27 -61 -57 109 -130 -95 -64 20 -14 181 -37 -84 -5 -13 -159 95 -146 75 19 -64 69 -30 -137 -25 27
6901 27 -57 82 31 137 -257 239 69 30 45 45 -13 25 -75 54 -38 -18 39 28 -125 113 -84 -13 134 -29 83
6926 83 5 25 161 8 26 54 -8 54 -30 109 -15 -42 32 51 17 57 18 -32 -152 -202 -165 70 -28 -28 114 131 -11
6953 -11 100 0 0 61 43 -118 61 -34 27 5 217 -6 19 -45 99 35 -28 -35 59 -33 -70 56 120 61 -85 -52 -22
6980 -22 -113 34 8 -62 -47 -10 49 -105 104 0 -100 -122 16 -22 44 -4 -16 -102 -17 37 18 -65 -52 -82 59 -31 -35
7007 -35 71 79 39 -92 -115 -12 50 32 -65 38 35 -95 54 13 -63 -44 -22 3 17 11 74 47 -1 87 101 52 40 98 66
$$ packed form
6823a89Q4J40M1j09LL5L3m9l6Mo8j9J02J50k47J76n7r2K25L1r7P1n8k31K72j17
6849bM6K0j68O3p6L2J32j09J42M6j10M7r5kK4mJ45j55P9j16n6K14l6p6m4O4j64
6876a59J32l4MJ66k39L5L1Q4l4J95k18m7P9qj46K54k41K21n6q3J33r9j07J12N2
6901B7q4J39n1J06l94M96j70l9J5%n8L8j00J29r2K0N7j1j53K38j97P1J47j63J12
6926H3p8K0J36j53J8K8o2O2q4J39j24k7P4J9l4M0l9n0j20n0L7K35r8%J42J7j42
6953a1J11j00%O1j8j61J79r5O1k2K12k23K5o4J44o4o3pR4r2l7J26O4n9j46L3L0
6980b2r1J47k6p0J5L7N9j54K09j04j00k2J38l8O6m8j2q6Q5N4j9q3J3l0J41r0m
7007c5J06Qm0j31k3J03O2j8r7J03lj30J49m1p6J9K2K5J4oO3k7m8Q8J4m9j2N8l2
$$ plain form
7036 66 -84 38 -62 -84 -97 19 -250 4 -47 9 103 -24 -130 -202 -160 -116 39 133 -104 46 -40 89 -129 -69
7060 -69 48 -52 29 46 -49 -60 11 -13 40 89 -142 -62 35 -6 -4 33 48 -63 -76 56 -66 -3 -86 -79 169 -102 17
7087 17 -33 -109 -16 187 -92 86 -133 21 21 -26 8 -122 73 117 72 92 -145 -155 146 -76 -44 -19 34 2 16 -101
7113 -101 91 -56 40 86 13 59 -2 -25 -49 19 -80 121 -25 0 -89 -48 65 -26 -34 66 1 68 54 89 -5 66 -11
7140 -11 -2 146 23 96 -12 -6 -5 -33 -3 -52 -53 164 92 92 0 33 30 66 152 44 -20 -69 42 52 -4 -41 -6 137 -39
7169 -39 -72 30 17 12 -27 16 -28 127 -35 26 135 75 30 72 118 -45 17 4 -9 74 150 13 -30 22 -104 117 116
7196 116 -23 88 43 -91 -9 164 -67 65 26 -67 74 -114 13 -16 -22 -180 23 32 100 73 -82 50 58 24 135
7221 135 30 72 55 84 172 -121 42 148 -13 -115 -36 70 113 -131 -128 152 47 61 122 -91 160 -23 41 -17
$$ packed form
7036F6j50J22j00k2j3J16k69K54n1N6R4j27j06p2M2M4J55R4k37J50q6J29k18O0
7060f9J17j00Q1J7r5j1P1k4N3M9k31Q0R7m1KL7J5j11j3J32j22O3q3PK48k71J19
7087A7n0p6R3K03k79J78k19J54%m7L4j30J95M4m5K0k37j0L01k22L2K5N3l2J4j17
7113a01J92j47R6M6p3M6o1k3k4O8r9K01j46K5q9M1J13r1qJ00o5O7j4L5r4P1p7
7140a1RJ48j23P3j08OJk8L0m9jK17p2%r2L3lL6Q6j08o4m9J11J0n6l7L5J43j76
7169c9l3J02j3nl9M3m4J55j62O1J09o0m5M2M6j63O2j3j3Q3P6j37m3N2j26K21j
7196A16j39J11m5j34Q2J73k31J32l9r3J41j88J27k9oj58K03RO8k7j55J32Ql4J11
7221A35j05M2j7K9Q8k93J63J06j61j02P9J06M3k44LK80j05J4O1k13K51j83O4n8
$$ plain form
7245 -17 106 -50 -119 127 -33 173 17 -9 -56 -95 5 -15 7 -107 27 41 -92 -60 28 -6 -46 -62 -66 -56 7 -104
7271 -104 49 -45 -52 151 -61 -83 -68 -118 -4 72 -32 -30 -21 25 113 43 99 -20 98 -53 -115 94 117 -18 -37 24
7297 24 43 -100 40 -73 23 89 72 17 -18 20 -124 -7 219 0 -70 46 -101 20 122 -6 172 -6 52
7320 52 -23 2 16 -30 191 0 152 9 168 61 -132 -21 -28 -45 -47 -172 -173 106 -134 -95 36 -57 -19 29 -65 -126
7346 -126 -152 34 -156 -135 52 42 115 -16 -160 57 -118 29 -22 50 -59 10 33 10 9 -55 -190 107 -44 7
7370 7 14 83 -27 -46 73 -168 -72 33 88 -42 -11 -75 129 22 12 -11 63 -27 -61 -71 25 121 70 53 -10 -48 -70 -24
7398 -24 45 -113 38 -67 -141 -140 36 -163 60 156 -43 54 -55 12 -188 -196 89 2 59 102 147 72 71 16 -62 120
7424 120 -7 -48 23 -38 -47 -52 66 -18 -93 -8 -17 3 -109 -61 -40 -77 -5 -30 37 -139 -10 34 -78 -34 -69 6 126 77
$$ packed form
7245a7J23j56o9K46j60K06j56k6m7l9J00k0K2j14J34J4j33L2Q8l4m0j6mJ0O3j11
7271a04J53r4pK03k12k2J5n0J14P6j04KRM6Q8p0N6j19J18j51o2K09K3j35j9O1
7297B4J9j43J40j13R6O6j7n5l5L8j44J17K26k19p0J16j47J21J02j28J78j78N8
7320E2p5K5J4m6K21j91J52j43J59j07j93J11pj7kj25jK79k40L9J31r3L8M8r4o1
7346a26k6J86j90K1J87j0P3j31j44K17j75J47n1P2j09O9K3k3jo4j35K97j51N1
7370GPO9j10j9J19k41R6J05N5j30L1o4K04j07j0k3P4r0l4j0R6R6n1j7o3l8k2M6
7398b4O9j58J51j05p4JJ76j99K23R6j99R7j09O7k00qK85q7N7M3M5p5jn5p8J82
7424A20j27m1P1o1rnJ18q4p5Q5rK0j12M8K1l7P2k5O7j76J29M4j12M4l5P5J20m9
$$ plain form
7452 77 26 -65 -54 27 -14 -14 147 164 111 -40 -65 25 -45 -36 17 -43 15 44 -110 -139 86 -67 -3 1 -36 46 -80 81
7480 81 -162 21 6 -90 -179 -89 -160 87 -32 1 133 -74 -34 21 29 -3 -122 -87 -127 8 -36 77 92 -23 -102 24
7506 24 27 46 75 65 -68 29 126 4 -83 -119 -83 112 87 0 -5 -28 -22 33 -114 25 113 34 18 62 -135 84 31 9
7534 9 27 16 6 -4 -14 1 77 6 -34 50 -54 41 49 20 56 20 -68 28 -55 -59 10 45 -135 -63 -143 -87 32 -183 -3
7563 -3 -70 5 1 -53 -7 100 -2 -133 -127 155 89 -139 46 127 -11 -64 19 -68 44 29 -148 71 40 -17 -115 0
7589 0 -22 -95 187 31 94 50 67 44 -113 44 -159 22 7 142 -3 13 168 54 13 89 -13 -102 50 39 8
7614 8 -82 56 91 -167 16 193 26 -62 -34 -69 -78 -31 16 -39 -125 70 -79 -20 91 -107 67 78 88 126 19 -14
7640 -14 6 119 2 77 2 127 -95 -25 25 -139 72 -23 -41 -14 -26 -68 38 -72 -17 -118 63 -21 123 68 -74
$$ packed form
7452G7n1r1J1Q1m1%J61J7n3j51k5R0p0RN3o0N8K9j54k9K25j53O4Ml7Q2j26J61
7480H1k43J83j5r6q9R0p1K47j19L3J32k07M0N5Ql2j19L5m0J35m4J13J5j15p9J26
7506B4LJ9K9j0j33R7R7j22q7l6L6J95k5q7nk3ON5j47J39Q8p9j6M4j97K19n3k2
7534IJ8j1j0j0j0J5P6p1m0Q4j04R5Qk9L6l6q8R6q3mO9L5j80P2q0N6J19k15J80
7563co7P5mn4M6J07j02j31OK82o6k28J85Q1j38n3Q3q7J12j5j77K19l1n7r8J15
7589@k2p3K82j56O3m4J7k3j57J57k03J81j5J35j45J6J55j14m1P6j02q9J52j1l1
7614Hr0J38L5k58J83J77j67q8K8l5rM7M7n5q6J95j49N9J11j98J74J1J0L8j07l3
7640a4K0J13j17P5p5J25k22P0N0j64K11r5j8K7j2m2J06j10N5j01J81q4J44n5j42
$$ plain form
7665 -74 28 -125 -111 -60 -77 -76 -48 32 -96 -62 65 13 8 -28 -7 -71 38 112 94 -100 53 -65 -66 11 -9 -1 -29 105
7693 105 -175 -7 26 -70 32 49 70 19 22 -116 11 5 130 -37 58 102 -107 1 -58 -35 -104 35 -100 38 -126
7718 -126 -26 -11 14 -86 -32 -97 -46 5 -107 -56 66 39 48 -153 -135 -39 -70 -23 -40 77 -82 -75 50 134 -19 147
7744 147 82 38 129 59 160 -59 102 122 -139 -95 -61 -54 3 8 -183 56 -117 25 -146 -52 0 0 29 34 7 -201 38
7771 38 -15 50 105 -80 -101 197 12 -71 -199 4 12 -93 -14 20 -18 -25 -97 -33 110 -21 90 83 -44 -91 47 65
7797 65 -84 29 -37 -70 75 75 2 -71 27 -33 118 -163 -10 -64 34 12 95 -138 154 -143 -26 -74 43 -159 -69
7822 -69 62 -66 60 -178 161 -62 101 40 159 -80 174 -29 128 -139 10 192 90 -84 -190 46 -2
7843 -2 118 -14 148 -4 27 -5 -77 22 -145 -120 25 -67 26 122 40 -64 -93 122 -109 7 127 81 54 32 188
$$ packed form
7665g4J02j53J4N1j7JK8Q0j28L4J27n2nl6K1o4J09P4j8j94J53j18jP7k0Qk8J34
7693A05k80J68L3r6J02J7K1n1Lj38J27oJ25j67R5M4k09J08n9K3o9J39j35J38j64
7718a26J00J5K5j00N4o5N1N1j12N1J22k7Rk01J8R6l1M7j7J17j59PJ25Q4j53J66
7744A47o5m4R1p0J01k19J61K0k61M4L4PN7Nj91K39j73J42j71R4N2%K9Nk7k08K39
7771C8n3O5N5j85k1K98j85q3j28K03Qj05P9L4l8pp2O4J43j31J11pj27m7J38J8
7797F5j49J13o6l3J45%p3p3R8o0J51k81J53n4R8k2Q3k33K92k97J17m8J17k02R0
7822f9J31j28J26k38L39k23J63o1J19k39K54k03J57k67J49J82j02j74j06K36m8
7843bJ20j32J62j52L1l2p2R9j67K5J45r2R3R6q2j04k9K15k31J16J20m6k7k2J56
$$ plain form
7868 188 -65 54 -57 75 -129 3 -39 20 -9 17 138 -207 -11 110 -17 69 117 57 -126 -77 -17 66 -9 38
7892 38 -83 -54 69 35 -86 -121 23 -88 96 70 -36 63 4 -197 74 47 176 120 21 -48 -58 117 43 131 -27
7917 -27 -108 88 12 -72 -65 15 76 10 -112 -6 140 22 53 121 8 -21 -31 -97 -55 -105 55 -17 -3 123 25 42 126
7944 126 -37 19 -3 27 -78 44 31 149 4 22 -56 7 -105 5 102 131 108 9 20 19 5 -41 -42 -101 38 136 -6
7971 -6 71 164 -11 162 73 22 40 224 -182 -150 -101 54 81 -47 -40 -17 -21 -57 -84 20 -57 17 -93 -92 -10 -85 29 -26
7999 -26 19 -19 173 -76 -82 41 -61 -78 -20 -106 11 49 -190 -57 110 -24 -4 17 16 87 -29 -189 39 75 -15
8024 -15 71 82 79 -8 -28 91 -83 -70 20 -36 -123 93 11 -20 23 38 9 -40 -23 -82 100 -156 120 6 3 -6 -90 16
8052 16 -123 -11 81 -109 55 85 -91 -8 100 50 -44 144 86 -7 -54 -3 -38 66 66 -120 -19 -164 -1 0 32
$$ packed form
7868A88k53J19j11J32k04J32m2N9k9K6J21l45J96J21j27Q6M8o0j83M9O0Q3p5M7
7892C8j21K9J23l4j21l5J44j11J84k6j06R9n9k01K71k7J29n6r9o9j0J75p4Q8j58
7917b7q1J96p6q4PQ0O1o6j22J06J46j18L1O8j13k9j0o6M2n0J60p2J4J26r8J7Q4
7944A26j63N6k2L0j05J22j3J18j45J8p8O3j12J10R7K9k3r9J1jj4m6jn9J39R8j42
7971fP7R3j75J73q9n1J8J84m06L2M9J55K7j28PK3ml6k7J04p7P4j10JQ2p5J14n5
7999b6M5l8J92k49oJ23j02j7N8q6J17L8k39J33J67j34K0K1jP1j16j60K28L6r0
8024a5Q6J1lq7k0J19j74J3R0n6q7K16q2l1M3J5k9m9J7n9J82k56K76j14lrq4J06
8052A6j39J12R2j90J64L0j76Q3J08n0r4J88n8r3m7N1l5J04%j86J01j45J63JL2
$$ plain form
8077 32 -90 86 -119 57 42 31 97 -94 -45 58 -6 -84 87 36 74 -84 -52 -11 48 -114 13 -26 -104 25 -44
8102 -44 88 83 35 -29 -255 -100 25 9 -119 48 -39 18 31 -152 26 126 -91 -61 -99 -4 33 117 -39 -71 75
8127 75 12 120 12 33 186 -24 -52 -44 52 -71 -210 -4 -100 24 11 3 -101 -177 46 68 15 154 22 -88 150
8152 150 -92 -156 16 -98 -141 185 52 5 56 85 -62 -15 10 86 -35 -81 -13 -160 85 51 64 14 -171 84
8176 84 28 -118 16 79 -50 -42 -32 184 124 10 -117 18 -4 68 -61
$$ packed form
8077C2j22J76k05J76j5j1O6j91M9J03o4p8J71n1L8j58L2M1N9j62J27l9p8J29o9
8102d4J32nm8o4k26J55J25j6j28J67q7N7J3j83J78J00k17L0l8R5L7Q4j56l2J46
8127G5o3J08j08K1J53k10k8QR6j23j39K06r6J24j3qj04p6K23K2n3J39j32j10K38
8152A50k42o4J72j14m3L26j33m7N1K9j47M7K5P6j21m6O8j47K45l4J3n0j85K55
8176H4n6j46J34O3j29QJ0K16o0j14j27J35k2P2j29
8191f1
$$ Imaginary data points
##PAGE= N=2
##DATA TABLE= (X++(I..I)), XYDATA
$$ plain form
0 0 0 0 0 0 0 0 0 0 0 0 0 0 0 0 8 -8 8 -8 8 -12 16 -16 23 -24 28 -32 40 -42 48 -56 64 -73 87 -96 108 -120
36 -120 136 -152 170 -191 211 -235 260 -288 320 -352 388 -428 473 -521 572 -629 695 -767 848
55 848 -941 1046 -1166 1304 -1473 1675 -1924 2244 -2663 3244 -4105 5516 -8217 15239 -73728
70 -73728 -130474 71403 85995 -20972 -57954 15661 36142 -10702 -22390 -1609 -12409 21184
82 21184 39168 -8708 -43204 -11487 38314 23198 -41005 -12099 42956 9186 -32964 -25781
94 -25781 65 21661 15201 4520 -20391 -36326 12726 35931 -13749 -24577 11410 22866
106 22866 -9566 -30862 7345 23162 -3038 11211 12344 -20850 -8773 18213 8048 -13420
118 -13420 -107 32296 1505 -37398 2322 24182 -6201 -6904 17412 12539 -32566 -33929 35313
$$ packed form
0@%%%%%%%%%%%%%%Qj6J6j6J6k0K8l2L9m7N2o0P2q2R0j04J20j37J60j83K04k28
36a20K56k88L22l61M02m46M95n48O08o72P40q16R01r94J093j201J324j462J615
55H48j789J987k212K470k777L148l599M168m907N907p349R621j3733K3456q8967
70g3728n6746K01877J4592j06967l6982P3615K0481m6844j1688K0781j0800L3593
82B1184J7984m7876l4496L1717M9801j5116o4203K8906N5055l3770m2150P183
94b5781K5846K1596o460j0681k4911j5935M9052K3205m9680j0828L5987J1456
106B2866l2432k1296L8207J5817k6200J4249J133l3194J2077K6986j0165k1468
118a3420J3313L2403l0791l8903L9720K1860l0383p03K4316m873m5105j363O9242
$$ plain form
131 35313 32362 -36425 -21996 32252 19848 -29949 -27904 24389 22808 -14387 -1785 6593 -9689
144 -9689 -3117 7442 7840 200 43 14351 -6021 -25911 7701 20346 -4731 -9280 2918 4870
158 4870 -13436 -11462 16828 3624 -16502 4236 5653 -12186 -11200 1041 11275 -165 -5598
171 -5598 8607 -4839 -14886 8010 12518 -699 -5675 1911 8206 -8105 -7192 15014 3563
184 3563 -4930 9363 295 -14793 -7738 13788 15760 -17726 -16412 20922 9698 -21771 -14177
197 -14177 13690 20560 -7462 -17030 3363 1992 -516 6827 -2319 -1440 8743 5182 -4194 -11415
211 -11415 4859 20111 -1932 -11516 3639 4394 -1306 -3843 2476 7767 -4672 -2309 5128 -11267
225 -11267 -8948 9325 6364 -4564 -10102 246 7374 -7555 -5118 8376 1595 -1268 -1635 -4283
$$ packed form
131C5313k951o8787J4429N4248j2404m9797K045N2293j581l7195J2602Q378j6282
144i689O572J0559L98p640j57J4308k0372j9890L3612J2645k5077m549J2198J952
158D870j8306J974K8290j3204k0126K0738J417j7839R86J2241J0234j1440n433
171e598J4205j3446j0047K2896M508j3217m976P586O295j6311R13K2206j1451
184C563q493J4293r068j5088P055K1526J972l3486J314L7334j1224l1469P594
197a4177K7867O870k8022r568K0393j371k508P343r146Q79J0183l561r376p221
211a1415J6274J5252k2043r584J5155P55n700k537O319N291j2439K363P437j6395
225a1267K319J8273k961j0928n538J0348P128j4929K437J3494o781k863l67k648
$$ plain form
239 -4283 708 614 5053 5747 -6585 1407 7969 -6166 -5637 5434 7858 258 -10809 235 7207
254 7207 -7708 -3417 6526 1168 -2541 -5544 -1865 1244 -5561 2615 6132 -6246 -1934 2718 -1009
269 -1009 189 -615 4783 4976 -4781 743 2417 -4108 4579 6609 341 -2166 -2885 5620 2225 -9492
285 -9492 2167 8320 -2468 -4968 -4617 1170 3227 -3412 1401 656 -5359 2281 3 -5015 1216
300 1216 2536 4186 -325 -6359 3273 3364 -2098 4176 2256 -1207 571 -1188 2688 -279 -3629 6755
316 6755 2541 -6253 -1568 -897 940 204 -3874 1749 -948 -4976 1594 -1968 -3088 3541 580 66
332 66 -1971 -3871 4110 1107 -1709 4454 306 -887 1721 -761 2288 434 -300 5785 -1275 -4749
348 -4749 1705 155 890 269 -2696 1791 -1838 -3509 1867 -2843 -1253 3139 -1605 -1211 -1879 -2305
$$ packed form
239d283M991r4M439O94j2332P992O562j4135N29J1071K424p600j1067J1044O972
254G207j4915M291R943n358l709l003L679L109o805Q176L517j2378M312M652l727
269a009J198q04N398J93r757N524J674o525Q687K030o268k507p19Q505l395j1717
285i492J1659O153j0788k500L51N787K057o639M813p45o015P640k278n018O231
300A216J320J650m511o034R632R1n462O274j920l463J778j759L876k967l350J0384
316F755m214q794M685O71J837p36m078N623k697m028O570l562j120O629k961n14
332F6k037j900P981l003k816O163m148j193K608k482L049j854p34O085p060l474
348d749O454j550P35o21k965M487l629j671N376m710J590M392m744L94o68m26
$$ plain form
364 -2305 3961 364 -1058 2776 -1714 464 2616 -1250 1867 997 1515 4598 -3551 -3035 3958 1125
380 1125 1166 -928 -3118 2346 -746 -2750 -70 -2705 1734 2588 -4899 -2438 -439 302 3167 -3066
396 -3066 -1573 3636 -949 -134 7 -1124 4243 1683 -787 1528 -2045 1319 3698 -996 744 -104
412 -104 -805 2469 -2392 -2216 1935 -1074 1051 -619 -5096 176 382 -1066 930 -2791 -481 1616
428 1616 -1868 729 -958 -1055 5006 885 -2143 -389 -529 4396 2650 -4566 796 3027 670 -186
444 -186 -3834 577 4079 -1352 -1528 -3056 -2439 3685 -726 -3971 -587 -697 2529 -529 -6534 844
460 844 4321 245 -1530 -3174 2502 3939 -2506 233 2391 835 2883 -1498 -1208 2909 -498 1080
476 1080 1920 -2381 258 117 -980 1247 -2401 -517 2212 -2981 -1839 -372 -748 1654 -1911 -434
$$ packed form
364b305O266l597j422L834m490K178K152l866L117q70N18L083q149N16O993k833
380A125M1k094k190N464l092k004K680k635M439Q54p487K461J999P41K865o233
396c066J493N209m585Q15J41j131N367k560k470K315l573L364K379m694J740q48
412a04p01L274m861J76M151l009K125j670m477N272K06j448J996l721K310K097
428A616l484K597j687r7O061m121l028J754j40M925j746p216N362K231k357q56
444a86l648M411L502n431j76j528O17O124m411l245L384j10L226l058o005P378
460H44L477m076j775j644N676J437o445K739K158j556K048m381K90M117l407J578
476A080Q40m301K639j41j097K227l648J884K729n193J142J467l76K402l565J477
$$ plain form
492 -434 3360 -2766 -1499 2879 326 788 -1158 69 5084 -622 -3245 2299 3189 2529 -2568 -3048
508 -3048 4246 587 -2441 1143 -2140 -474 2498 -2263 -2565 -1922 1306 3820 -4443 -5662 2370 2513
524 2513 -150 -4418 -2087 6967 1440 -5087 -336 1730 3473 1330 -3789 1347 2572 -511 1250
539 1250 -1586 -568 3140 129 -390 -2554 -2879 3635 332 -3736 -623 -754 2078 589 -5748 364
555 364 3870 -865 -1756 -1586 1897 2182 -3046 1690 3411 -1304 1231 966 709 1885 -2113 1297 3552
572 3552 -2267 -261 1115 -728 1296 -614 -751 -371 -2796 1901 939 -5269 -821 2244 1195 -1577
588 -1577 -5220 1828 6118 -2482 -3369 615 2159 3025 -2556 -2252 3135 2126 1940 -1171 -3315 2930
604 2930 2355 -1224 -716 -2981 1187 3488 -3588 -3361 -416 1270 3027 -3579 -5026 1421 1847 329
$$ packed form
492d34L794o126J267M378k553M62j946J227N015n706k623N544Q90o60n097m80
508c048P294l659l028L584l283J666K972m761l02O43L228K514q263j219Q032J43
524B513k663m268K331R054n527o527M751K066J743k143n119N136J225l083J761
539A250k836J018L708l011n19k164l25O514l303m068L113j31K832j489o337O112
555C64L506m735q91J70L483K85n228M736J721m715K535k65k57J176l998L410K255
572C552n819K006J376j843K024j910j37L80k425M697r62o208M448L065j049k772
588a577l643P048M290q600q87L984J544Q66n581L04N387j009j86l111k144O245
604B930n75l579N08k265M168K301p076K27K945J686J757o606j447O447M26j518
$$ plain form
620 329 -3904 -3362 4991 2276 -3252 -271 79 2191 2696 -2155 -180 1502 869 2595 -1117 -1591 2815
637 2815 1070 347 -1046 -1887 2623 48 -2716 990 -1181 -1543 957 -746 343 -1220 -2009 3021
653 3021 -147 -2959 350 787 2034 652 -2366 1569 1883 567 1977 -1589 114 3578 -577 -718
669 -718 -327 -695 2715 175 -2156 6 -1259 815 177 -3699 -500 173 -361 900 -3395 -1548 3287
686 3287 -239 -1118 -751 -588 2591 -150 -1662 1217 70 1779 1567 -2119 1101 1713 -222 935
702 935 -1375 -449 1839 -1828 -397 487 -1805 482 -345 -1122 429 -2294 -413 1627 -1655 -382
718 -382 -284 -212 2487 -654 -964 2147 124 1191 1008 -1784 1508 1691 17 1077 -1080 779 2101
735 2101 -1355 263 -93 -1357 1758 -629 -1910 246 -1272 647 545 -2805 80 377 -529 735
$$ packed form
620C29m233N42Q353k715n528K981L50K112N05m851J975J682o33J726l712m74M406
637B815j745p23j393q41M510k575k764L706k171l62K500j703J089j563p89N030
653C021l168k812L309M37J247j382l018L935L14j316J410l566J703L464m155j41
669g18L91l68L410k540k331K162j265K074o38l876L199O73n34J261m295J847M835
686C287l526q79L67J63L179k741j512K879j147J709k12l686L220O12j935J157
702I35k310R26K288l667J431Q84k292K287q27p77J551k723J881K040l282J273
718c82R8P2K699l141l10L111k023J067j83k792L292J83j674J060k157J859J322
735B101l456J618l56j264L115k387j281K156j518J919j02l350K885K97r06J264
$$ plain form
751 735 -2171 -321 2203 -626 351 56 -737 2930 441 -1077 1243 -276 1290 1080 -2093 775
767 775 619 -393 1225 -1455 -1084 1057 -1190 93 -857 -2657 1087 -132 -1624 37 -1539 797
783 797 1383 -2172 223 445 -55 1934 -886 -307 2100 -72 957 765 -881 2155 258 -739 1135
800 1135 -1300 99 1014 -1484 432 -473 -1481 1349 -954 -1279 375 -1246 608 210 -2014 888
816 888 63 -224 1684 -1325 -2 2099 -237 890 198 -563 2588 148 -449 1075 -1030 1352 1169
833 1169 -1755 403 -508 -333 1089 -2183 -1259 990 -1041 39 -1060 -1592 1516 -276 -985 504
849 504 -1328 780 1342 -1327 769 342 498 2103 -1133 99 1748 -509 1102 333 -1125 1486
865 1486 -328 -319 645 -2083 111 1051 -1691 -217 -1125 -676 1368 -1788 -925 740 -1111 1086 277
$$ packed form
751G35k906J850K524k829R77k95p93L667k489j518K320j519J566k10l173K868
767G75j56j012J618k680L71K141k247J283r50j800L744j219j492J661j576K336
783G97N86l555K395K22n00J989k820N79K407k172J029j92j646L036j897r97J874
800A135k435J399R15k498J916r05j008K830k303l25J654j621J854l98k224K902
816H88q25k87J908l009J323K101k336J127o92p61L151k440n97J524k105K382j83
833A169k924K158r11J75J422l272R24K249k031J080j099n32L108j792p09J489
849E04j832K108N62k669K096m27J56J605l236J232J649k257J611p69j458K611
865A486j814RR64k728K194R40k742J474r08M49K044l156Q63J665j851K197q09
$$ plain form
882 277 -1581 1188 466 277 957 -1234 1160 1931 -800 1129 363 -330 1726 -524 -293 720 -1121
899 -1121 1088 232 -1945 539 -138 -676 310 -1833 299 390 -2092 788 43 -1420 865 -359 59
916 59 829 -1096 1363 1281 -953 1301 199 -196 1525 -457 544 588 -937 1495 -138 -1761 846
933 846 -474 -448 341 -1920 19 472 -1357 517 -1080 -1005 1636 -899 -653 377 -336 1559 -395
950 -395 -1077 2340 111 -602 1587 30 606 208 -131 1909 -913 -1422 1763 -114 -873 -113 -800 589
968 589 -923 -1392 1321 -1579 -1553 1326 -490 -522 -710 -610 2102 -435 -1746 1502 778 754 315 -1154
986 -1154 1692 1163 -501 1136 -829 -43 2211 -773 -511 119 -689 1123 -472 -1763 104 -813 603
1003 603 248 -3057 -4 1550 -864 -593 -1208 864 1553 -1909 48 2030 -683 480 998 235 553
$$ packed form
882B77j858K769p22j89O80k191K394P71k731J929p66o93K056k250K31J013j841
899a121K209q56k177K484o77n38R86k143K132R1k482K880p45j463K285j224M18
916E9P70j925K459q2k234K254j102l95J721j982J001M4j525K432j633j623K607
933H46j320K6P89k261J939M53j829J874j597P5K641k535K46J030p13J895j954
950c95o82L417k229p13K189j557N76l98l39K040k822n09L185j877p59P60o87J389
968E89j512m69K713k900K6K879j816l2j88J00K712k537j311L248p24k4m39j469
986a154K846n29j664J637j965P86K254k984K62O30q08J812j595j291J867r17J416
1003F03l55l305L053J554k414K71o15K072O89l462J957J982k713J163N18p63L18
$$ plain form
1020 553 -935 1516 2147 -1955 -274 1497 207 128 -1467 341 1289 -2181 -129 1385 -2090 -849
1036 -849 552 -2 -505 -2435 827 2083 -1922 -777 535 186 1393 -734 -733 1830 240 596 448
1053 448 -1377 1462 1255 -659 418 -912 388 1348 -1475 -368 -382 -869 1760 -1048 -2407 557
1069 557 351 285 -1152 -2006 2081 695 -2085 489 423 30 545 -232 1566 -94 -1146 2559 556
1086 556 -1785 971 817 775 -170 -1489 1580 95 -1893 894 -199 -1237 -131 -430 627 -1319
1102 -1319 -2180 1891 109 -1749 475 -306 398 732 -858 616 426 2 2171 -434 -659 1500 270
1119 270 494 -166 -738 1704 -149 -871 791 -1138 -460 1105 -1050 -808 -690 56 1102 -1834 -1207
1136 -1207 1415 -699 -304 342 -480 639 -537 -8 1584 -1053 -50 2173 -98 -71 289 284 1347
$$ packed form
1020E53j488K451O31m102J681J771j290p9j595J808R48l470K052J514l475J241
1036h49J401n54n03j930L262J256m005J145J312l49J207k127JK563j590L56j48
1053D48j825K839k07j914J077j330J300R60k823J107j4m87K629k808j359K964
1069E57k06o6j437q54M087j386k780K574o6l93N15p77J798j660j052L705k003
1086E56k341K756j54m2r45j319L069j485j988K787j093j038J106k99J057j946
1102a319q61M071j782j858K224p81P04L34j590J474j90m24K169k605k25K159j230
1119B70K24o60n72K442j853p22J662j929O78J565k155K42J18P46J046k936O27
1136a207K622k114L95O46q22J119j176N29J592k637J003K223k271K7L60nJ063
$$ plain form
1153 1347 -673 17 1364 -1252 -38 857 -829 -417 -737 182 985 -2279 -728 1307 -1021 -595 69
1170 69 -546 466 -481 490 686 -1390 850 1768 -853 127 631 658 1179 -1025 87 1336 -696 573
1188 573 660 -1226 107 140 3 -149 -1756 495 944 -1830 -186 62 -774 410 -589 -159 182 -945
1206 -945 1184 686 -1470 667 910 502 472 -639 1011 921 -879 997 350 -1054 1051 301 -471 -340
1224 -340 -1041 1177 58 -2103 229 89 -602 87 -1035 -43 -13 -796 1099 -254 -1437 1462 761
1241 761 -352 47 -238 1300 728 -1016 898 235 -421 1360 -232 -432 200 -273 962 -823 -1817
1258 -1817 1038 -92 -822 50 -955 -117 152 -969 287 -821 -662 1601 -283 -825 529 47 1249
1275 1249 -71 -817 1423 221 -139 1371 -573 -61 879 -70 463 -883 -478 1460 -826 -975 303
$$ packed form
1153A347k020O90J347k616J214Q95j686M12l20R19Q03l264J551K035k328M26O64
1170F9o15J012r47R71J96k076K240R18k621R80N04K7N21k204J112J249k032J269
1188E73Q7j886J333L3j37j52j607K251M49k774J644K48q36J184r99M30L41j127
1206i45K129m98k156K137K43m08l0j111J650r0j800J876o47j404K105p50p72J31
1224c40p01K218j119k161K332j40o91O89j122R92L0p83J895j353j183K899p01
1241G61j113L99k85J538n72j744J914o63o56J781j592k00O32m73J235j785r94
1258a817K855j130p30Q72j005Q38K69j121J256j108J59K263j884n42J354m82J202
1275A249j320p46K240j202l60J510j944N12R40r49N33j346M05J938k286j49J278
$$ plain form
1292 303 -890 104 -272 -936 445 -918 -325 1188 -1141 -409 630 4 534 -361 -177 1685 -207
1309 -207 119 1184 -608 529 965 -178 429 -784 86 1309 -1115 -370 473 -557 281 -578 -839
1326 -839 360 -681 -68 366 -1409 104 569 -475 324 -508 -6 1234 -580 229 546 -477 1142
1343 1142 327 -547 590 -1 583 826 -1168 306 670 -755 403 -593 -676 509 -648 -206 -115 -1298
1361 -1298 670 162 -900 107 -454 247 609 -1036 296 522 -405 1065 -2 -320 926 106 711
1378 711 424 -984 768 668 -538 153 -710 37 673 -986 -270 -253 -737 639 -622 -1139 367 -316
1396 -316 232 83 -1067 485 439 -182 800 -478 161 1228 -103 432 -11 -210 1206 259 -618 508
1414 508 -110 321 438 -1150 -17 122 -435 218 -1014 -801 480 -460 -25 -531 -1034 836 211 -807
$$ packed form
1292C03j193R94l76o64J381j363N93J513k329P32J039o26N30q95J84J862j892
1309b07L26J065j792J137M36j143O07j213Q70J223k424P45Q43j030Q38q59k61
1326h39J199j041O13M34j775J513M65j044P99q32N02J240j814Q09L17j023J619
1343A142q15q74J137n91N84K43j994J474L64j425J158r96q3J185j157M42R1j183
1361a298J968n08j062J007n61P01L62j645J332K26r27J470j067l18J246q20O05
1378G11k87j408J752j00j206O91q63P47O36j659P16J7m84J376j261n17J506o83
1396c16N48j49j150J552m6o21R82j278O39J067j331N35m43j99J416r47q77J126
1414E08o18M31J17j588J133J39n57O53j232K13J281r40M35n06n03J870o25j018
$$ plain form
1432 -807 296 -145 543 905 -794 395 625 177 902 -150 -210 915 -100 439 254 -929 635 379
1450 379 -557 -30 -893 34 646 -1049 -309 -125 -493 481 -669 -556 670 -193 270 401 -632 555
1468 555 517 226 727 -556 87 1331 -65 -54 -18 -182 1176 -273 -693 429 -481 116 152 -1037 68
1487 68 -249 -401 497 -1054 -869 530 -154 -152 -502 -374 1051 80 -662 596 -190 503 625 -437 563
1506 563 294 42 1024 -365 -407 630 -216 331 -170 -1079 648 -17 -587 -144 -686 61 409 -772 61
1525 61 -334 -592 740 -261 -369 562 -150 858 624 -592 613 623 363 577 -790 308 1203 -581
1543 -581 293 66 -499 633 -79 -366 11 -1115 209 393 -1353 -164 -28 -65 283 -1052 -93 800
1561 800 -439 253 72 -245 994 -57 277 462 -619 485 1030 -411 204 108 81 604 -788 -274
$$ packed form
1432h07J103m41O88L62j699J189K30m48P25j052o0J125j015N39j85j183J564k56
1450C79r36N27q63R27O12j695P40J84l68R74j150J13J226q63M63J31j033J187
1468E55l8k91N01j283O43J244j396J1L6j64J358j449m20J122r10N97L6j189J105
1487F8l17j52Q98j551J85J399o84Kl50J28J425r71p42J258p86O93J22j062J000
1506E63k69k52R82j389m2J037q46N47n01r09J727o65n70M43n42P47L48j181Q33
1525F1l95k58J332j001j08R31p12J008k34j216J205J0k60K14j367J098Q95j784
1543e81Q74k27n65J132p12k87L77j126J324J84j746J189J36l7L48j335R59Q93
1561H00j239O92j81l17J239j051L34J85j081J104N45j441O15r6k7N23j392N14
$$ plain form
1579 -274 335 -758 277 -397 -1012 394 -272 -506 -136 -1002 10 200 -695 190 -182 -130 919 -317
1597 -317 -176 486 -162 887 181 -496 804 241 166 318 -537 237 440 -462 602 -598 -764 806 -330
1616 -330 -601 -132 -544 447 -70 -968 421 -191 -194 360 -512 -94 486 -73 888 2 -505 1043 250 132
1636 132 325 -271 863 258 -612 418 -262 -101 607 -579 -526 -40 -474 25 -496 -887 406 -321 -228
1655 -228 60 -681 250 333 -488 340 -295 6 1056 -174 -77 490 -111 802 14 -197 430 -262 164 465
1675 465 -1012 -76 358 -254 -2 -744 -552 564 -798 -477 84 -590 282 62 -358 131 -270 141 793
1694 793 -617 21 489 82 713 -186 -212 964 98 138 264 -637 503 202 -476 15 -588 -121 331 -755
1714 -755 -236 19 -526 434 -402 -651 315 -85 236 361 -695 379 563 -98 463 -172 144 621 -135
$$ packed form
1579b74O09j093J035o74o15J406o66k34L70q66J012J90q95Q85l72N2J049j236
1597c17J41O62o48J049p06o77J300n63p5J52q55P74K03r02J064j200j66J570j136
1616c30k71M69m12R91n17q98J389o12lN54q72M18N80n59R61q86n07J548p93j18
1636A32J93n96J134o05q70J030o80J61P08j186N3M86m34M99n21l91J293p27R3
1655b28K88p41R31Q3q21Q28o35L01J050j230R7N67o01R13p88k11O27o92M26L01
1675D65j477R36M34o12K52p42J92J116j362L21N61o74Q72k20m20M89m01M11O52
1694G93j410O38M68m07O31q99k6J176q66M0J26r01J140l01o78M91o03M67M52j086
1714g55N19K55n45R60q36k49R66m00L21J25j056J074J84o61N61o35L16M77p56
$$ plain form
1733 -135 231 209 -537 860 195 -489 270 -337 180 105 -845 -52 127 -578 71 -547 -364 399 -180 198
1753 198 -69 -718 603 193 -546 262 62 371 523 -404 278 429 -94 639 -192 -246 422 -257 199 -78
1773 -78 -696 436 -106 -579 -74 -546 -72 498 -799 -107 -97 -358 747 -260 -431 606 62 503 350
1792 350 -471 487 395 136 714 -288 14 790 -67 119 3 -352 647 -242 -703 163 -495 63 135 -636
1812 -636 -95 -194 -284 227 -574 -359 584 -219 82 78 -346 671 69 -178 545 -243 335 725 -588 48 212
1833 212 -120 381 -442 -43 588 -414 -97 84 -522 415 180 -507 27 -919 -352 289 -582 -46 -133 -129 645
1854 645 -329 -283 732 -314 290 521 -366 569 466 168 684 -504 -73 511 -465 -178 -369 -473 362
1873 362 -739 -102 82 -219 -249 -260 -655 225 -121 -115 313 -636 -6 396 -208 529 37 -431 838 130 18
$$ packed form
1733a35L66k2p46J397o65o84P59o07N17p5r50P93J79p05O49o18J83P63n79L78
1753A98k67o49J321m10p39Q08k00L09J52r27O82J51n23P33q31n4O68o79M56k77
1773g8o18J132n42m73N05m72M74N70j297O92J0k61J105j007j71J037n44M41j53
1792C50q21R58r2k59N78j002L02P76q57J86j16l55R99q89m61Q66o58N58P2p71
1812f36N41r9r0N11q01K15R43q03L01mm24J017o02k47P23p88N78L90j313O36J64
1833B12l32N01q23L99O31j002L17J81o06R37k35o87N34r46N67O41q71N36q7MP74
1854F45r74M6J015j046O04K31q87R35j03k98N16j188M31N84r76K87j91j04Q35
1873C62j101O37J84l01l0j1l95Q80l46OM28r49O30M02o04P37m92m68J269p08j12
$$ plain form
1894 18 356 -158 683 406 -492 456 67 -193 300 -378 -253 48 -605 229 -293 -860 396 -49 -335 137
1914 137 -601 273 348 -534 199 65 130 647 -145 -64 410 -167 586 269 -563 410 94 64 292 -538 -112
1935 -112 375 -477 170 -306 -471 474 -539 -372 1 -620 94 39 -657 141 -110 -98 554 -382 62 570
1955 570 8 405 5 -61 783 9 -28 237 -261 503 115 -442 195 -311 -212 272 -691 -348 9 -382 81
1976 81 -359 -601 356 -170 -85 157 -408 322 425 -336 413 -40 -15 711 -19 108 275 -43 654 170 -466
1997 -466 470 73 -89 124 -577 21 138 -628 115 -458 -484 399 -493 -250 -39 -425 316 227 -443 211 -57
2018 -57 253 450 -330 205 525 100 574 6 -374 426 80 76 163 -500 278 -52 -443 64 -336 -220 420
2039 420 -598 -313 -42 -414 389 -254 -514 426 -187 50 356 -465 505 417 -34 445 -129 141 693 -217
$$ packed form
1894A8L38n14Q41k77q98R48l89k60M93o78J25L01o53Q34n22n67J256m45k86M72
1914A37p38Q74P5q82P33j34O5N17p92Q1M74n77P53l17q32R73l16l0K28q30M26
1935a12M87q52O47m76j65R45j013J67L73o21P14n5o96P98k51J2O52r36M44N08
1955E70n62L97m00o6Q44p74l7K65m98P64l88n57O37n06R9M84r63L43L57l91M63
1976H1m40k42R57n26Q5K42n65P30J03p61P49m53K5P26p30J27J67l18O97m84o36
1997d66R36l97j62K13p01N98J17p66P43n73k6Q83q92K43K11l86P41q9o70O54k68
2018e7L10J97p80N35L20m25M74n68l80Q00l46mQ7o63P78l30l91N07m00J16O40
2039D20j018K85K71l72Q03o43k60R40o13K37L06q21R70q8m51M79n74K70N52r10
$$ plain form
2059 -217 85 241 -287 551 -51 -474 243 -323 -161 20 -825 -86 99 -323 249 -585 -196 431 -295 102
2079 102 66 -135 517 368 -123 328 -16 473 588 -359 129 377 -279 348 -303 -271 384 -241 78 -89 -784
2100 -784 226 -83 -424 156 -509 -93 122 -768 14 -9 -314 460 -46 -324 389 -19 535 315 -626 482
2120 482 423 57 246 -280 47 458 -337 23 -89 -414 518 -123 -391 -18 -198 232 15 -783 129 18
2140 18 -330 226 -248 -72 434 47 227 148 -236 639 155 -57 432 -215 352 428 -439 222 201 -214 520
2161 520 -296 -381 286 -274 -69 -277 -526 244 -135 -460 143 -448 73 314 -200 125 -122 -29 691 -73 -170
2182 -170 445 -47 405 199 -305 264 70 -92 400 -359 -88 436 -146 -5 -329 -271 302 -472 -468 175 -314
2203 -314 149 43 -385 158 27 -32 382 -424 -13 445 -167 346 160 111 641 48 -96 362 -308 179 376
$$ packed form
2059b17L02J56n28Q38o02m23P17n66J62J81q45P39J85m22N72q34L89O27p26L97
2079A02l6k01O52j49m91M51l44M89J15r47M88K48o56O27o51L2O55o25L19j67o95
2100g84J010l09l41N80o65M16K15q90P82k3l05P74n06k78P13m08N54k20r41J108
2120D82n9l66J89n26L27M11p95L60j12l25R32o41k68L73j80M30k17p98R12j11
2140A8l48N56m74J76N06l87J80p9l84Q75m84k12M89o47N67P6q67O61k1m15P34
2161E20q16q5O67n60K05k08k49P70l79l25O03n91N21K41n14L25k47R3P20p64r7
2182a70O15m92M52k06n04N69j94j62M92p59K71N24n82J41l24N8N73p74MO43m89
2203c14M63j06m28N43j31n9M14q06M11M58o12N13j86m9N30n93j44M58o70M87J97
$$ plain form
2224 376 -297 59 6 -36 250 -578 -244 112 -290 48 -99 -530 230 -81 -102 110 -505 278 556 -239 155
2245 155 211 94 576 -86 -71 435 18 298 145 -374 316 23 -46 68 -548 -45 306 -512 -90 -198 -509
2266 -509 267 -261 -322 -49 -376 122 50 -562 153 170 58 481 -185 160 377 -99 390 -11 -247 513 140
2287 140 -143 196 -274 317 226 -496 300 -13 -244 201 -556 -296 216 -398 83 -139 -465 514 -73 -42 261
2308 261 -191 265 331 -113 372 132 78 593 -89 -102 233 -97 318 -179 -499 445 -48 -13 65 -531 20 -40
2330 -40 -422 93 -361 -434 490 -273 -189 101 39 361 112 -260 211 44 168 382 -391 154 308 32 519
2351 519 -229 -160 300 -144 -177 28 -389 66 23 -344 -163 -285 -14 159 -517 -243 70 -340 196 -131 -181
2372 -181 482 20 167 407 -101 368 363 90 201 -174 98 518 -275 -88 255 -48 222 -45 -161 35 -199
$$ packed form
2224C76o73L56n3m2K86q28L34L56m02L38j47m31P60l11k1K12o15P83K78p95L94
2245A55N6j17M82o62J5N06m17K80j53n19O90k93o9J14o16N03L51q18M22j08l11
2266e09P76n28o1K73l27M98p2o12P15J7j12M23o66L45K17m76M89m01k36P60l73
2287A40k83L39m70N91r1p22P96l13k31M45p57K60N12o14M81k22l26R79n87L1L03
2308B61m52M56O6m44M85k40n4N15o82j3L35l30M15m97l20R44m93L5P8n96N51o0
2330d0l82N15m54p3R24p63Q4K90o2L22k49l72M71j67J24K14p73N45J54k76M87
2351E19p48O9M60m44l3K05m17M55m3l67J81j22K71J73o76K74L13m10N36l27n0
2372a81O63m62J47K40n08M69nk73J11l75K72M20p93J87L43l03K70k67j16J96k34
$$ plain form
2393 -199 -237 29 -459 -63 39 -223 155 -317 -82 332 -267 15 95 -190 553 197 -282 322 192 131 252
2414 252 -220 103 84 7 299 -253 -251 407 -325 -71 -194 -472 155 65 -450 -121 -316 65 117 -330 232 42
2436 42 -133 406 74 -189 455 99 271 214 -198 445 230 -105 304 -242 -72 150 -175 -27 -12 -245 162
2457 162 -196 -391 28 -321 143 158 -466 127 44 11 287 -295 -95 503 88 278 190 -21 440 215 -102
2478 -102 244 44 225 455 -281 23 59 -117 150 -399 -293 139 -360 -172 -172 -417 161 -108 -250 -14 -311
2499 -311 115 236 -219 144 187 -7 456 67 -42 320 41 186 127 -168 408 185 -239 147 -177 -131 167
2520 167 -189 -64 -204 -279 59 -256 -379 -42 -217 40 90 -279 275 107 45 351 -179 50 420 101 244
2541 244 -51 -55 435 123 -79 153 -95 186 222 -447 -32 -107 -75 166 -390 -354 95 -283 -19 -110 -322 195
$$ packed form
2393a99l8K66m88L96J02k62L78m72K35M14n99K82Q0k85P43l56m79O04j30o1J21
2414B52m72L23j9p7K92n52KO58p32K54j23k78O27r0n15L29j95L81N2m47N62j90
2436D2j75N39l32k63O44l56J72n7m12O43k15l35M09n46J70K22l25J48J5k33M07
2457A62l58j95M19l49M64J5o24N93q3l3K76n82K00N98m15J90q8k11M61k25l17
2478a02L46k00J81K30p36L04L6j76K67n49J06M32m99J88%k45N78k69j42K36k97
2499c11M26J21m55L63M3j94M63l89j09L62k79J45n9k95N76k23m24L86l24M6K98
2520A67l56J25j40p5L38l15j23L37j75K57N0l69N54j68o2L06n30K29L70l19J43
2541B44k95mM90l12k02K32k48K81L6o69M15p5L2K41n56L6M49l78K64r1k12N17
$$ plain form
2563 195 11 -185 198 -253 181 394 -190 35 49 188 327 -120 112 109 -509 388 52 -40 60 -323 -621
2584 -621 186 -562 -165 -23 -326 -124 -391 -296 180 -426 -37 -54 17 129 -49 -168 113 206 -15 278 -131
2605 -131 -14 497 3 364 211 7 498 -186 -59 255 -361 52 2 -283 -82 -210 172 67 -379 -243
2625 -243 54 -395 158 -50 -110 122 -52 320 80 -340 440 159 -167 478 140 150 395 -20 -44 -59 55
2646 55 213 19 -301 164 -150 -103 -111 -278 -10 -100 -195 145 -170 -222 404 -136 11 -20 -277 485 -74 -580 273
2669 273 -128 -41 986 -482 73 323 189 315 -337 -299 371 -113 -135 -99 -254 164 -134 -358 -46 -328 -209
2690 -209 146 -339 -21 70 -53 287 -170 -144 366 204 -20 207 -158 299 278 -144 211 -135 -116 227 -115
2711 -115 28 -28 -235 8 -122 -369 37 -334 -164 75 -506 90 243 -335 -111 -228 6 496 -156 169
$$ packed form
2563A95j84j96L83m51M34K13n84K25J4J39J39m47K32lo18Q97l36r2J00l83k98
2584f21Q07p48L97J42l03K02k67R5M76o06L89j7P1J12j78j19K81R3k21K93m09
2605a31J17N11m94L61j53k04M91o84J27L14o16M13n0k85K01j28L82j05m46J36
2625b43K97m49N53k08o0K32j74L72k40m20P80k81l26O45l38J0K45m15k4j5J14
2646E5J58j94l20M65l14M7qj67K68r0r5L40l15n2O26n40J47l1k57P62n59n06Q53
2669B73m01Q7J027j468N55K50j34J26o52L8O70m84k2L6j55M18k98k24L12k82J19
2690b09L55m85L18R1j23L40m57K6N10j62k24K27l65M57k1m22L55l46J9L43l42
2711a15J43n6k07K43j30k47M06l71J70K39n81N96J53n78K24j17K34M90o52L25
$$ plain form
2731 169 217 -8 282 170 -71 246 7 218 350 -319 42 195 -55 68 -275 -226 145 -228 -95 -153 -422
2752 -422 17 52 -324 140 -61 -147 295 -243 125 193 -49 269 -18 -84 408 237 322 278 -139 338 233 -139
2774 -139 -22 -44 -34 180 -367 -167 -139 -356 149 -95 -322 24 -226 69 56 -353 78 214 -77 274 -119
2795 -119 0 168 -221 131 68 -32 252 212 -144 204 -85 200 100 -380 85 53 -271 73 -315 -37 213
2816 213 -68 -4 -310 -237 225 3 -257 110 -71 55 346 -142 105 127 120 280 -91 -10 315 -41 148 199
2838 199 -347 167 179 -127 -13 -212 -92 261 -354 -166 -92 -181 289 -113 -246 167 -82 60 3 -243 189
2859 189 -37 -56 244 -87 68 372 -104 117 76 -113 418 -6 -199 48 -203 -114 60 -379 101 -227 -145
2880 -145 196 -270 -351 249 -242 44 -79 -287 459 53 -1 333 -79 211 235 -108 292 173 118 307 -105
$$ packed form
2731A69M8k25K90j12k41L17k39K11J32o69L61J53k50J23l43M9L71l73J33n8k69
2752d22M39L5l76M64k01q6M42n38L68O8k42L18k87o6M92j71Q5m4m17M77j05l72
2774a39J17k2J0K14n47K00K8k17N05k44k27L46k50K95j3m09M31J36k91L51l93
2795a19J19J68l89L52o3j00K84m0l56L48k89K85j00m80M65l2l24L44l88K78K50
2816B13k81O4l06P3M62k22k60L67j81J26K91m88K47K2pJ60l71Q1L25l56J89N1
2838A99n46N14J2l06J14j99J20L53o15J88P4q9M70m02j33M13k49J42n7k46M32
2859A89k26j9L00l31J55L04m76K21m1j89N31m24j93K47k51Q9J74m39M80l28Q2
2880a45L41m66q1O00m91K86j23k08P46m06n4L34m12K90K4l43M00j19n5J89m12
$$ plain form
2901 -105 -51 192 -74 201 22 -320 185 -144 -90 124 -417 6 91 -197 -259 -178 -72 259 -99 -18 126 -145
2923 -145 335 57 -294 376 105 73 246 -250 133 227 -166 172 -86 44 234 123 -141 -69 -194 55 102
2944 102 -363 55 -25 -121 16 -486 -83 62 -54 254 39 -128 258 0 74 290 13 227 290 -112 160
2965 160 23 -105 238 -198 -97 103 -245 265 -73 -317 127 -301 -75 -34 -412 -33 68 9 -99 -93 -171 372
2987 372 -109 -96 280 -45 272 46 -272 364 96 156 288 -74 144 125 -228 105 -262 -134 182 -293 -232
3008 -232 -52 -340 78 32 -206 103 -45 -218 124 -290 48 232 -79 403 -23 -134 287 52 117 181 -179
3029 -179 152 176 -168 -32 -103 70 276 -260 91 88 -147 173 -126 -226 16 -171 -185 13 -427 109 145 -248
3051 -248 63 -2 -20 340 -66 -34 138 -90 309 -68 -120 307 -127 57 206 -221 72 159 -190 -16 -237 -214
$$ packed form
2901a05N4K43k66K75j79l42N05l29N4K14n41M23Q5k88o2Q1J06L31l58Q1J44k71
2923a45M80k78l51O70k71l2J73m96L83R4l93L38k58J30J90j11k64P2j25K49M7
2944A02m65M18q0r6J37n02M03J45j16L08k15j67L86k58P4K16k77K14O3m02K72
2965A60j37j28L43m36J01K00l48N10l38k44M44m28K26M1l78L79J01n9j08Op8N43
2987C72m81J3L76l25L17k26l18O36k68O0J32l62K18j9l53L33l67J28L16m75O1
3008b32J80k88M18m6k38L09j48j73L42m14L38J84l11M82m26j11M21k35O5O4l60
3029a79L31K4l44J36p1J73K06n36L51lk35L20k99j00K42j87j4J98m40N36L6l93
3051b48L11o5j8L60m06L2J72k28L99l77n2M27m34J84J49m27K93Q7l49J74k21K3
$$ plain form
3073 -214 -12 -265 -14 77 -161 84 -49 -129 180 -175 4 242 -267 223 55 -35 249 33 12 183 -55
3094 -55 108 -29 -135 173 97 -264 117 -161 -150 218 -228 -108 32 -263 164 -203 -294 88 -126 -10 140
3115 140 -269 171 173 -37 225 30 110 425 13 75 32 -79 290 3 -272 128 -63 127 -18 -361 -143 20
3137 20 -145 16 -278 -250 79 -134 144 89 -140 104 98 -128 102 -25 149 285 -225 313 171 -42 285 -22
3159 -22 -210 292 4 7 72 -215 219 -61 -77 22 -218 -61 177 -446 -10 -94 -152 301 -158 -184 162 93 246
3182 246 133 -128 283 160 11 288 -161 25 451 16 52 -100 -128 190 -5 -219 54 -312 -32 -132 -361
3203 -361 -52 -217 -162 -20 -110 -157 158 -126 124 -13 -177 119 -45 2 116 -50 108 323 -55 255 41
3224 41 -31 54 -200 -33 255 -166 82 -67 -278 150 71 -251 -88 -217 26 -13 -279 39 -88 -90 353 -80
$$ packed form
3073b14K02k53K51R1k38K45j33q0L09l55J79K38n09M90j68r0K84k16k1J71k38
3094e5J63j37j06L08p6l61L81k78J1L68m46J20J40k95M27l67r1L82k14J16J50
3115A40m09M40Kk10K62j95Q0L15m12O2m3j11L69k87k75M00j91J90j45l43K18J63
3137B0j65J61k94K8L29k13K78n5k29K44ok26K30j27J74J36n10N38j42k13L27l07
3159b2j88N02k88LO5k87M34k80j6R9k40J57K38o23M36q4n8M53m59k6L46o9J53
3182B46j13k61M11j23j49K77m49J86M26m35L6j52k8L18j95k14K73l66K80j00k29
3203c61L09j65N5J42r0m7L15k84K50j37j64K96j64M7J14j66J58K15l78L10k14
3224D1p2Q5k54J67K88m21K48j49k11M28p9l22J63j29K43l9k66L18j27kM43m33
$$ plain form
3246 -80 14 210 -6 307 225 -13 180 124 -57 159 -116 94 117 -165 97 -205 -115 161 -37 -179 -90 -324
3268 -324 42 -70 -375 106 -1 36 79 -148 -40 114 73 122 120 -65 297 95 36 225 -103 150 95 -126 2
3291 2 -18 -139 117 -297 -143 157 -110 -23 -311 -435 79 -85 -157 59 -312 120 111 -152 187 -243 -18 239
3313 239 -160 22 199 -23 235 22 43 84 132 228 152 32 0 230 -223 24 -116 -5 64 -57 -62 -34 -279
3336 -279 -19 152 -204 44 -118 54 85 -72 -1 236 52 234 50 -114 362 116 -7 195 -5 126 113
3357 113 -188 137 51 -133 140 -221 -102 -89 -180 55 -154 -59 104 -154 -139 165 -272 172 106 -85 123 -99
3379 -99 11 285 -17 76 48 50 206 19 -122 284 -20 163 231 -149 24 0 -88 88 -252 -66 -5 -47 31 -51
3403 -51 -213 214 -24 -272 134 85 130 273 43 131 115 67 295 18 12 285 189 40 57 -112 59 -99 -190 -17
$$ packed form
3246h0R4J96k16L13q2k38J93n6j81K16k75K10K3k82K62l02R0K76j98j42Q9k34
3268c24L66j12l05M81j07L7M3k27J08J54m1M9kj85L62k02n9J89l28K53n5k21J28
3291Bk0j21K56m14J54L00k67Q7k88j24N14j64p2K16l71M32rk63L39m30K25K57
3313B39l99J82J77k22K58k13K1M1M8R6p6j20l2K30m53K47j40J11O9j21nK8k45
3336b79K60J71l56K48j62J72L1j57P1K37j84J82j84j64M76k46j23K02k00J31j3
3357A13l01L25q6j84K73l61J19J3r1K35k09R5J63k58J5L04m37M44o6j91K08k22
3379i9J10K74l02R3k8KJ56j87j41M06l04J83O8l80J73k4q8J76l40J86O1m2P8q2
3403e1j62M27k38k48M06m9M5J43k30Q8j6m8K28k77oK73r6j49J7j69J71j58r1J73
$$ plain form
3427 -17 -218 -69 29 -279 -133 -42 -259 186 -150 -278 140 -79 190 23 -85 36 251 -187 325 -117 146
3448 146 291 -33 59 -61 -104 120 -91 -186 58 -98 -4 -48 -267 -104 62 -127 46 -271 -155 155 -255 -183
3470 -183 25 12 240 99 -128 209 -37 99 239 94 76 208 182 253 -175 -221 210 61 109 73 -177 93
3492 93 31 -117 -58 -261 -128 -28 -192 -78 68 -181 228 52 -88 137 -66 180 110 -2 267 227 -193 128
3514 128 -169 27 128 -135 -72 46 -236 144 -124 -234 -48 -127 61 -26 -190 -53 -68 -53 61 -97 7 301
3536 301 -12 129 -72 -191 273 173 -88 -3 -11 51 85 -129 31 111 99 121 -166 -148 -47 -146 -100 -74 -265 109
3560 109 -58 -149 53 -213 45 106 -12 75 51 48 176 45 -134 230 -50 185 220 -5 288 77 -39 68
3582 68 -45 112 76 -224 -54 -89 -186 131 -13 -169 24 -189 70 -195 -209 103 -131 -47 72 -120 -31 272
$$ packed form
3427a7k01J49R8l08J46R1k17M45l36j28M18k19K69j67j08J21K15m38N12m42K63
3448A46J45l24R2j20m3K24k11r5K44j56R4m4k19J63J66j89J73l17J16L10m10P2
3470a83K08j3K28j41k27L37k46J36J40j45j8J32k6P1m28m6M31j49M8l6k50K70
3492I3o2j48N9k03J33J00j64J14J46k49M09j76j40K25k03K46p0j12K69m0m20L21
3514A28k97J96J01k63O3J18k82L80k68j10J86p9J88q7j64J37j5J5J14j58J04K94
3536C01l13J41k01j19M64j00k61Q5qO2L4k14J60Q0j2K2k87J8J01r9M6K6j91L74
3560A09j67r1K02k66K58O1j18Q7k4lJ28j31j79L64k80K35L5k25K93k11j16J07
3582F8j13J57l6l00J70l5r7L17j44j56J93k13K59k65j4L12k34Q4J19j92Q9L03
$$ plain form
3604 272 -130 22 50 -236 380 85 -45 27 -170 132 92 -55 113 -79 -127 68 -152 -46 -6 -197 57 -42
3626 -42 -195 70 -208 -49 22 -293 114 77 -83 62 40 59 170 21 -17 89 13 250 -107 -109 183 54 -38
3649 -38 101 -71 21 -6 -142 -13 -143 -233 62 -136 -146 -125 -110 -44 -92 -128 33 3 -12 207 -123 82 187 -28
3673 -28 99 42 8 169 46 68 -20 -91 125 96 -221 -105 -217 -63 156 -210 -242 8 -110 87 -43 -57 153
3696 153 -154 -27 28 -94 44 263 22 117 -63 3 126 -120 77 205 -1 217 143 -105 29 -22 35 63
3718 63 -326 109 14 -43 92 -124 -61 -15 -131 -112 177 -101 164 -44 -55 96 115 119 156 -1 36 253 113 104 157
3743 157 34 223 -107 7 -17 -76 -95 -22 -84 13 -31 -132 150 -145 -85 -8 -3 17 -152 48 130 -27 78 203
3767 203 -67 22 265 -76 113 -61 -140 61 -51 -45 -10 11 98 -79 -145 -52 -52 -102 121 -109 -3 -26 -32 291 -188
$$ packed form
3604B72m02J52K8k86O16k95j30P2j97L02m0j47J68j92m8J95k20J06M0j91K54r9
3626d2j53K65k78J59P1l15M07l7j60J45k2J9J11j49l8J06p6K37l57kK92j29r2
3649c8J39j72R2k7j36J29j30r0K95j98j0K1J5O6m8l6J61l0j5K19l30K05J05k15
3673b8J27n7l4J61j23K2q8p1K16k9l17J16j12J54K19l66l2K50j18J97j30j4K10
3696A53l07J27N5j22J38K19k41R5j80O6J23k46J97J28k06K18p4k48J34n1N7K8
3718F3l89M35r5n7J35k16O3M6j16J9K89k78K65k08j1J51J9ML7j57L7K17j40rN3
3743A57j23J89l30J14k4n9j9P3o2R7m4j01K82k95O0P7NK0j69K00Q2j57J05J25
3767B03k70Q9K43l41J89j74p9K01j12OL5K1Q7j77o6R3%n0K23k30J06k3oL23m79
$$ plain form
3792 -188 -25 177 -69 -14 97 -131 156 323 8 162 71 53 239 -69 61 42 -42 50 -162 -110 81 -72
3814 -72 -120 84 -179 -100 40 -146 -109 -134 -8 125 -159 5 76 50 144 -111 62 43 78 29 115 -141 191 71
3838 71 -110 283 -132 101 147 -1 -38 84 -79 129 -91 -221 80 -169 -58 -66 -184 106 57 27 214 -150
3860 -150 -74 199 -118 33 44 -73 195 161 -15 206 42 -18 109 -86 35 103 -12 137 -148 -61 48 -140
3882 -140 -97 -146 -165 59 51 -239 -102 -362 124 228 -106 111 109 19 286 -181 58 89 59 307 95 -154 263
3905 263 10 -113 -23 -158 61 -7 -108 -148 -21 -96 42 -48 -182 32 -193 10 98 -187 -22 -22 139 156 -29
3928 -29 96 200 45 163 -10 -70 181 -94 -39 19 -102 74 -3 -251 83 -79 -181 91 -154 -237 11 57
3950 57 -91 41 -166 199 -163 -11 72 -70 43 98 -22 86 -46 -29 178 33 -83 54 60 51 30 -271 166
$$ packed form
3792a88J63K02k46N5J11k28K87J67l15J54r1j8J86l08J30j9q4R2k12N2J91j53
3814g2m8K04k63P9J40j86L7k5J26J33k84J64P1k6R4k55J73j9L5m9Q6k56L32j20
3838G1j81L93m15K33M6j48l7J22j63K08k20j30L01k49J11qj18K90m9l0J87l64
3860a50P6K73l17J51J1j17K68l4j76K21j64o0J27j95J21O8j15J49k85Q7J09j88
3882a40M3m9j9K24qk90J37k60M86J04l34K17kr0K67m67K39L1l0K48k12k49M17
3905B63k53j23R0j35K19o8j01m0J27p5J38r0j34K14k25K03Q8k85J65%J61J7j85
3928b9J25J04j55J18j73o0K51k75N5N8j21J76p7k48L34j62j02K72k45q3K48M6
3950E7j48J32k07L65l62J52Q3j42J13N5j20J08j32J7K07j45j16J37Ork1l01M37
$$ plain form
3973 166 91 -50 -38 -50 -91 38 -156 -128 -34 -177 16 -30 -87 22 -234 134 -56 -171 247 119 97 175 -50
3996 -50 -5 70 -10 213 1 -61 136 18 -150 59 -128 121 116 -158 18 67 -154 -41 -183 -210 51 161 20
4019 20 -164 -91 139 67 -37 53 -130 97 104 59 180 4 -124 252 -88 -34 69 -32 79 57 -233 50 -16
4042 -16 -49 87 -259 108 99 -112 15 -200 19 106 -33 -25 10 11 24 89 -88 290 -11 -70 206 -128 0 103
4066 103 66 11 -6 1 145 -109 -90 -107 -197 51 55 -218 -11 41 45 25 -177 -139 4 -64 3 -5 9 193 -15 17 210
4093 210 -83 66 4 -25 71 -127 -134 279 33 10 -49 -23 116 -115 -164 9 -112 45 -39 -182 -44 30 -108 15
4117 15 -112 106 220 -41 52 -51 -24 107 31 0 73 128 -9 73 -116 77 15 -66 40 -83 -90 91 -58 -160
4141 -160 -29 -48 55 -7 -188 13 4 80 186 -154 50 -78 -168 57 -149 53 118 68 156 -20 35 121 191 -14
$$ packed form
3973A66p5j41J2j2m1J29j94K8R4j43J93m6n7J09k56L68j90j15M18j28k2P8k25
3996e0M5P5q0K23k12o2J97j18j68K09j87K49nk74J76M9k21J13j42k7K61J10j41
4019B0j84P3K30p2j04R0j83K27Pm5J21j76j28L76l40N4J03j01J11k2k90K83o6
4042a6l3J36l46L67rk11J27k15K19Q7j39QL5JJ3O5j77L78l01n9K76l34J28J03
4066A03l7n5j7PJ44k54J9j7r0K48Mk73K07N2Mk0k02L8J43o8O7qJ4J84k08L2J93
4093B10k93J49o2k9R6j98pM13k46k3n9K6J39k31m9J73j21J57q4j43J38P4j38J23
4117A5j27K18J14k61R3j03K7J31p6l1P3N5j37Q2j89J93o2q1J06j23pJ81j49j02
4141a60J31j9J03o2j81K01rP6J06l40K04j28r0K25k06K02O5n0Q8j76N5Q6P0k05
$$ plain form
4165 -14 120 -289 -5 15 81 -101 27 -22 -30 -49 -75 3 -189 -86 -162 -237 33 61 -88 96 -141 -71 65 -183
4189 -183 -30 60 10 135 -88 61 53 -74 93 21 -187 148 32 -178 -105 -24 87 -86 -146 -21 -150 -178 68
4212 68 -44 9 138 79 -120 219 -73 145 31 62 156 21 -15 61 20 87 46 -81 -13 -71 -38 -100 -163 3 -16
4237 -16 -248 -72 16 -15 84 -70 -106 179 -130 32 -152 -122 4 -50 48 -2 57 205 73 -138 -77 -4 -129 96
4261 96 183 17 93 -45 22 72 13 49 -107 -63 -1 -27 -89 102 -191 -46 -34 -137 103 -61 22 105 -196 -56 100
4286 100 -96 79 19 -87 172 73 -60 105 -106 -83 95 -111 -17 -47 -178 106 -207 -47 -48 -207 194 2
4308 2 -206 206 92 -129 -41 -180 -74 175 -69 161 60 -189 129 -144 64 44 -90 154 2 -224 209
4329 209 -33 -279 -40 -101 -58 67 -99 86 58 -36 134 44 -40 74 -9 143 124 119 290 -94 89 181 166 168 23
$$ packed form
4165a4J34m09K84K0O6j82J28m9qj9k6P8j92J03p6p5K70K8j49J84k37P0J36k48
4189a83J53R0n0J25k23J49qj27J67p2k08L35j16k10P3Q1J11j73o0J25j29k8K46
4212F8j12N3J29n9j99L39k92K18j14L1R4j35l6P6m1O7m1j27O8n8L3o2o3J66j9
4237a6k32J76Q8l1R9j54l6K85l09J62j84L0J26n4R8n0N9J48j32k11O1P3j25K25
4261I6Q7j66P6j38O7N0n9L6j56M4O2k6o2J91k93J45J2j03K40j64Q3Q3l01J40J56
4286A00j96J75o0j06K59r9j33J65k11K3J78k06R4l0j31K84l13J60jj59M01j92
4308Bk08M12j14k21Q8j39J06K49k44K30j01k49L18k73K08k0j34K44j52k26M33
4329B09k42k46K39o1M3J25j66J85k8r4J70r0q4J14q3J52j9nJ71l84J83R2j5Kj45
$$ plain form
4354 23 -52 -12 58 -104 202 -87 -89 -14 -20 -37 58 -136 116 -52 -65 46 -288 -1 -9 -174 -76 43 93 132 -154 113
4380 113 33 39 185 133 -91 3 -81 -30 121 -73 -7 -26 -91 -21 -87 -72 80 -27 -165 -126 -143 29 -106 -158 -142 -262
4406 -262 -121 137 -120 82 7 -19 1 82 15 74 103 -23 28 -21 101 206 40 42 -95 119 48 -124 28 -107
4430 -107 -141 -20 -125 -45 20 107 39 47 -241 -82 42 59 124 -148 -21 129 41 102 3 -89 308 -91 -21 -5 68
4455 68 3 -14 -133 -37 -153 -10 0 -43 -41 49 15 -1 191 -176 178 -85 -45 27 -91 -74 124 65 60 103 109 159 -70
4482 -70 53 83 50 -14 167 9 64 1 -14 -31 -112 102 52 -82 49 -199 -132 -62 24 -115 206 -31 -81 79 -162
4507 -162 61 3 48 12 7 -75 117 23 88 -55 -47 96 93 -19 92 -127 -88 -48 -96 75 -7 -103 -13 -151 -90 -50 21
4534 21 -69 -29 -123 104 133 -194 130 -10 129 175 -160 175 -108 102 167 58 31 109 45 -104 104 -27 174
$$ packed form
4354B3p5M0P0j62L06k89kP5oj7R5j94K52j68j3J11l34K87qj65R8J19N0L9k86K67
4380A13q0OJ46n2k24R4q4N1J51j94O6j9o5P0o6J5J52j07j38L9j7J72j35n2J6j20
4406b62J41K58k57K02p5k6K0Q1o7N9K9j26N1m9J22J05j66Kj37K14p1j72J52j35
4430a07l4J21j05Q0O5Q7o8Qk88J59J24J7O5k72J27J50q8O1r9r2L97l99P0J6P3
4455F8o5j7j19R6j16J43J0m3KR0l4j6J92l67L54k63M0P2j18J7J98n9nM3ON0k29
4482g0J23L0l3o4J81j58N5o3j5j7q1K14n0j34J31k48O7P0Q6j39L21k37n0J60k41
4507a62K23n8M5l6nq2J92r4O5j43QJ43lj12J11k19L9M0m8J71q2r6R0j38O1M0P1
4534B1r0M0r4K27K9l27L24j40J39M6l35L35k83K10O5j09k7P8o4j49K08j31K01
$$ plain form
4557 174 -40 -38 -24 20 -19 36 -45 -53 -99 -93 -8 -175 36 58 9 -31 96 -19 145 110 22 210 -80 59 161 -13
4583 -13 73 -33 81 32 4 -63 136 -119 8 85 -126 -60 -93 40 19 18 -129 121 36 182 38 -81 162 -12
4607 -12 150 181 -46 90 50 -12 47 53 39 217 50 94 -33 37 31 -7 -14 -50 -17 -151 -30 -153 65 -53 37 123
4633 123 -65 77 113 36 115 23 -15 -18 148 -78 150 -18 20 206 -95 -53 141 30 76 -40 -14 -70 -187 23
4657 23 -6 -36 42 -70 -181 -49 -167 -57 -82 -97 -9 62 53 22 -3 29 117 -76 61 134 -70 -29 50 -98 41 -1
4683 -1 -66 57 -106 -64 56 -68 44 -9 -89 115 -68 -30 125 -49 -94 -23 35 86 -63 -115 295 -15 -112 25
4707 25 53 38 35 156 201 -16 -102 -59 -98 -43 30 151 -89 -88 -59 -3 0 46 127 77 115 -35 -98 164 -33 82 183
4734 183 -15 131 149 -49 44 -106 80 126 -79 19 53 -131 -59 88 -79 48 -64 38 79 -15 -8 -24 79 -6
$$ packed form
4557A74k14KJ4M4l9N5q1qm6OQ5j67K11K2m9m0J27j15J64l5q8J88k90J39J02j74
4583a3Q6j06J14m9k8o7J99k55J27P7k11O6l3J33k1jj47K50q5J46j44j19K43j74
4607a2J62L1k27J36m0o2N9Oj4J78j67M4j27P0ol8pl6L3j34J21j23K18j18R0Q6
4633A23j88J42L6p7P9r2l8lJ66k26K28j68L8J86l01M2J94j11M6j16K6n6j17K10
4657B3k9l0P8j12j11J32j18J10k5j5Q8P1rl1k5L2Q8j93J37P3k04M1P9j48J39m2
4683ao5J23j63M2J20j24J12n3q0K04j83L8J55j74m5P1N8N1j49n2M10l10r7J37
4707B5K8j5lJ21M5k17q6M3l9N5P3J21k40JK9N6LM6Q1n0L8j50o3K62j97J15J01
4734A83j98J46J8j98R3j50J86M6k05R8L4j84P2J47j67J27j12J02M1r4Pj6J03q5
$$ plain form
4758 -6 -85 -53 -77 43 -16 108 9 -31 211 33 146 49 35 116 71 212 -2 77 92 -129 2 11 59 76 -10 -210
4784 -210 39 50 -21 28 -70 -92 106 67 -23 2 -41 43 68 -86 147 19 46 96 -7 205 182 -104 -149 92 47
4809 47 78 -46 -13 -122 -62 85 36 -114 75 -189 -90 -14 -106 -73 74 -143 -121 -89 -15 -13 1 131 62 29 79 148
4835 148 -29 68 47 106 195 105 65 74 -49 142 -32 36 127 -30 255 3 19 32 -110 -83 43 -147 -25 -26 -68
4860 -68 -3 78 -4 79 -48 -66 83 -180 94 115 -77 -77 146 -30 113 86 71 -18 -9 40 -125 -43 57 82 -130 -25
4886 -25 -87 -24 24 -88 -94 24 0 43 -83 -155 -47 204 30 63 18 -9 82 -40 92 3 51 29 -12 -93 -26 -154
4912 -154 -55 -93 -113 74 -78 106 -94 -245 119 29 -87 27 32 -163 237 -59 -50 33 -46 126 123 75 87 -11 83
4937 83 190 54 169 -25 68 92 -54 2 92 -44 -90 -58 -187 -164 -29 -89 104 -141 -118 335 -97 21 17 98
$$ packed form
4758fp9L2k4J20n9J24r9m0K42j78J13r7j4Q1m5J41k14P9J5k21J31RM8J7q6k00
4784b10K49J1p1M9r8k2J98l9r0K5m3Q4K5j54K33j28K7N0j03K12k3k86m5K41m5
4809D7L1j24L3j09O0J47m9j50J89k64R9P6r2L3J47k17K2L2P4KJ4J30o9l3N0O9
4835A48j77R7k1N9Q9r0m0Rj23J91j74O8R1j57K85k52J6J3j42K7J26j90J22jm2
4860f8O5Q1q2Q3j27j8J49k63K74K1j92%K23j76J43k7j5q9RM9j65Q2J00K5k12J05
4886b5o2O3M8j12oJ18k4M3j26p2J08K51j74L3m5k7R1j22J32q9M8k2m1q1O7j28
4912a54R9l8k0J87j52J84k00j51L64r0j16J14Nj95M00k96RQ3p9J72lm8J2r8R4
4937H3J07j36J15j94R3K4j46N6R0j36m6L2j29K3J35o0J93k45K3M53m32J18mQ1
$$ plain form
4961 98 -26 -64 -114 87 -35 167 25 -93 82 42 -59 92 28 16 -46 -28 -123 83 -198 36 149 -68 82
4984 82 -53 -33 58 -2 -70 -144 -18 -14 36 58 20 129 -24 42 -144 92 36 -70 -23 47 8 19 -25 -46 -11 -150 -8
5011 -8 28 53 -42 -86 -19 -74 -152 147 10 -27 169 -79 48 88 -1 -35 -45 13 73 55 91 73 67 137 -4 56 10 47
5039 47 27 107 -9 44 40 163 76 -127 -105 -16 -229 -51 140 -89 45 68 -88 78 -132 62 36 -19 -49 99
5063 99 -51 82 36 -47 152 -86 -27 -28 33 -46 18 -16 -124 -107 -74 9 -10 49 -12 -131 -67 -21 -116 97 -86 -21 87
5090 87 -47 -29 -17 53 65 58 -19 23 41 -54 -69 -84 185 68 -132 -13 -4 -63 -17 -179 -50 108 -68 42 -200 35
5116 35 -1 -120 -123 152 -23 54 61 -65 88 -86 125 -72 55 -72 77 2 71 -45 -123 19 -63 180 32 -37
5140 -37 157 -116 -67 -56 46 45 86 -11 -180 69 -84 197 30 -144 117 27 16 129 86 -3 56 -66 116 23
$$ packed form
4961I8j24l8n0K01j22K02j42j18J75m0j01J51o4j2o2J8r5K06k81K34J13k17J50
4984H2j35K0R1o0o8p4J26MN0K2l8J09j53O6j86K36n6j06M7P0l9J1m4k1L5j39J42
5011hL6K5r5m4O7n5p8K99j37l7J96k48J27M0q9l4j0N8O0j8L6j8oP0j41O0m6L7
5039D7k0Q0j16N3mJ23q7k03K2Q9k13J78J91k29J34K3j56J66k10J94k6n5l0J48
5063I9j50J33m6q3J99k38N9jO1p9O4l4j08J7L3Q3j9N9o1j19O4M6r5K13j83O5J08
5090H7j34J8J2P0J2pp7M2J8r5j5j5K69j17k00J19Rn9M6j62J29J58j76J10k42K35
5116C5l6j19lK75j75P7Pj26J53j74K11j97J27j27J49p5O9j16p8J42q2K43j48o9
5140c7J94k73M9J1J02jM1r7j69K49j53K81j67j74K61r0j1J13m3q9N9j22J82r3
$$ plain form
5164 23 124 101 -30 35 -63 -71 33 10 49 -11 38 99 -79 -79 95 63 -193 -7 -15 87 95 -39 50 77 138 125 170 9
5192 9 12 -5 71 -60 14 59 121 -19 14 56 -19 -98 122 -14 -79 -147 2 4 35 92 -85 -83 43 -1 31 3 -106 -4
5220 -4 -14 12 18 92 32 79 16 173 130 -6 -23 -198 101 112 -2 -14 -119 -195 -56 -112 67 36 84 52 83 -43 150
5247 150 -106 -148 98 -2 66 29 -45 24 -48 -21 263 -12 -12 -59 -107 151 -93 -6 -106 -171 82 -113 1 -168
5271 -168 138 -2 6 -78 -65 54 -53 86 100 87 -30 -19 -6 112 77 55 60 44 115 170 -132 185 22 -27 156
5296 156 -48 -69 -4 -8 -12 -18 -55 -38 -126 -102 91 -16 23 81 25 30 54 -150 49 -65 -33 13 -64 -5 103 32 54 4
5324 4 176 134 -32 -2 166 2 -72 76 -69 -26 -100 -21 16 41 141 -64 -52 68 -82 -179 101 72 -55 58
5348 58 -51 -49 18 -41 -20 29 -8 101 94 -14 86 -126 202 60 -116 102 80 104 71 97 -59 62 -29 19 -78 -76
$$ packed form
5164B3J01k3j31O5r8qJ04k3L9o0M9O1j78%J74l2k56J86qJ02Qj34Q9K7O1j3M5j61
5192ILj7P6j31P4M5O2j40L3M2p5p9K20j36o5o8J49KL1N7j77KJ26m4L2k8j09J02
5220dj0K6OP4o0M7o3J57m3j36j7j75K99J1j14j2j05p6J39n6J79l1M8l2L1j26J93
5247A50k56m2K46j00O8l7p4O9p2K7K84k75%m7m8K58k44Q7j00o5K53j95J14j69
5271a68L06j40Qq4J3J19j07J39J4j3j17J1J3J18l5k2Nj6P1N5l02L17j63m9J83
5296A56k04k1O5mmol7J7q8K4J93j07L9N8n6NK4k04J99j14L2M6p7N9J08p1K2n0
5324DJ72m2j66L0J68j64p4J48j45M3p4P9L7K5J00k05J2J20j50r7K80k9j27J13
5348E8j09KO7n9K1M9l7J09pj08J00k12L28j42j76K18k2K4l3K6j56J21r1M8r7K
$$ plain form
5374 -76 63 -15 -23 63 -149 -52 -14 21 15 -23 34 -61 -13 192 101 70 86 -29 -74 -51 -94 57 -152 -110 -11 64 6 -81
5402 -81 -121 -23 30 6 51 -9 -103 -105 0 22 -16 111 24 69 106 31 249 1 130 22 77 56 -133 38 60 -12 -15
5429 -15 66 -12 18 30 -79 124 -147 -38 42 -185 84 15 -139 -83 -84 29 157 -99 -161 75 100 -43 -125 53
5453 53 115 -78 72 -5 6 43 54 -53 46 -99 117 45 -87 7 83 -89 -32 -25 -92 11 -59 -150 59 -15 -133 66
5479 66 81 58 -17 114 81 -67 -59 -45 -54 150 -12 37 52 1 -137 -74 -11 -63 140 22 -56 -66 -92 -88 -57 72 -73
5506 -73 37 -25 78 149 197 29 -34 43 -279 -85 66 14 81 -22 -44 -24 -63 148 -18 73 -53 -2 -96 132 76
5531 76 111 -74 -72 107 74 -135 -21 64 102 144 -25 192 49 -82 -9 -92 29 103 -29 -58 -42 75 225 -124
5555 -124 -84 141 -40 30 -31 -112 -77 67 -48 -6 -8 -93 68 -185 -94 28 40 8 61 62 130 -20 -84 -15 41 89 -18
$$ packed form
5374g6J39p8qQ6k12R7L8L5ol8N7r5M8K05r1l1J6j15m5K3m3J51k09M2R9P5n8q7
5402h1m0R8N3k4M5o0r4kJ05K2l8J27q7M5L7p5K18k48J29j08N5k1j89J71K2p2l
5429a5Q1p8L0J2j09K03k71J09Q0k27K69o9j54N6jJ13J28k56o2K36K5j43q2J78
5453E3O2j93J50p7J1L7J1j07R9j45K16p2j32R4P6j72N7Po7J03p0r1K09p4j18J99
5479F6J5k3p5J31l3j48QJ4rK04j62M9J5n1j38O3O3n2K03j18p8j0k6ML1J29j45
5506g3J10o2J03P1M8j68o3P7l22J94J51n2O7j03k2K0l9K11j66R1j26N1r4K28n6
5531G6L5j85KJ79l3k09J14Q5L8M2j69K17j43j31P3q3J21P4j32k9J6J17J50l49
5555a24M0K25j81P0o1q1L5J44j15M2kq5J61k53R1J22J2l2N3JO8j50o4O9N6M8j07
$$ plain form
5582 -18 -32 86 129 105 37 -32 70 -49 -174 95 20 -178 -36 -91 -95 55 -93 -113 38 -73 13 -111 15 13 -162
5607 -162 -182 -46 -20 -27 -56 52 147 101 69 225 -81 111 37 -179 -11 -209 -31 -11 -10 -57 -88 30 -73 -108 -170
5632 -170 40 64 -76 58 -43 -99 -110 -83 167 -25 -71 62 -20 -137 74 120 123 16 -53 64 -53 -65 -66 57
5656 57 -27 10 -45 -131 -83 -121 105 -56 -35 3 104 -52 92 -38 113 9 -71 32 -71 30 136 3 -51 -92
5680 -92 31 108 2 31 -155 8 -102 22 17 -22 -173 -58 35 -42 59 -63 -217 42 64 57 -9 -4 -50 -43 12 82
5706 82 88 112 -31 27 -86 169 -140 53 101 -100 58 -74 -29 148 -32 -78 -43 -184 86 -34 -18 -111 62 -53
5730 -53 101 -113 -94 71 119 141 -64 104 183 21 -104 -53 9 30 101 109 115 12 -21 22 -17 76 -19 -73 15 21 -33 100
5758 100 -53 6 -19 54 -185 142 -37 -25 97 24 -41 -170 226 101 -40 25 -12 -49 33 56 8 -46 -77 -29 -55
$$ packed form
5582a8j4J18M3k4o8o9J02j19j25K69p5j98J42n5mJ50j48k0J51j11Q6j24J26kj75
5607a62k0J36K6pk9J08R5m6l2J56l06J92p4k16J68j98J78K0Jm7l1J18j03l5o2
5632a70K10K4j40J34j01n6j1K7K50j92m6J33q2j17K11M6Lj07o9J17j17j2jJ23
5656E7q4L7n5q6M8l8K26j61K1L8J01j56J44j30J51j04q0J03j03J01J06j33n4m1
5680i2J23P7j06K9j86J63j10J24nl9j51J15R3p7J01j22j54K59K2po6Nm6PN5P0
5706H2OK4j43N8j13K55l09J93M8k01J58j32M5J77j80m6L5j41K70j20J6r3J73j15
5730e3J54k14J9J65M8K2k05J68P9j62j25N1O2K1P1QOj03l3M3l9R3r5n4Q8On4J33
5758A00j53N9k5P3k39L27j79J2J22p3o5j29L96j25j41O5l7l7Q2K3m8n4l1M8k6
$$ plain form
5783 -55 10 16 62 67 37 -106 -32 -36 -130 -57 81 -65 -56 26 143 14 -132 122 132 101 -6 -254 -10 26 78 -66 91
5810 91 68 121 -121 51 -31 130 65 -90 54 -130 -45 50 56 77 -99 -44 -146 69 -89 -52 151 136 -22 162
5834 162 -86 -17 54 -42 -2 36 73 59 46 -58 24 -59 -26 63 -53 -21 -62 -108 64 -147 -105 48 -130 34 -99
5859 -99 -57 -75 99 -120 17 96 57 136 -43 119 -65 18 -20 -1 -36 125 -64 75 126 13 32 0 30 -91 -86
5884 -86 -37 -130 13 -40 -72 -47 12 -59 -167 28 -14 -10 84 -106 49 -40 -85 96 -19 124 70 27 48 68 -37 171
5910 171 87 -174 4 206 -16 62 47 -87 41 81 182 -63 -106 40 -29 183 -3 -192 28 -85 -163 37
5932 37 -57 24 -13 -113 32 -17 73 32 63 -72 140 -114 -8 -50 41 -16 -47 -96 -6 -109 4 111 -77 20 -150
5957 -150 -35 113 43 65 62 -4 211 137 63 26 123 -10 188 -83 -129 7 -70 -37 -52 -134 140 66 -71 58 -101
$$ packed form
5783e5O5OM6Nl0j43P4mr4P3J38j46RQ2J17j29j46K54J0l1j07k48K44L6N2j44J57
5810I1k3N3k42J72q2J61o5j55J44j84Q5R5OK1j76N5j02K15j58L7K03j5j58J84
5834A62k48O9P1r6M0L8L7j4j3j04Q2q3L3Q9j16L2m1m6J72k11M2J53j78J64j33
5859i9M2j8J74k19J37P9l9P9j79J62j84Q3l8J9l5J61j89J39N1j13J9l2L0j21N
5884h6M9r3J43n3l2K5N9p1j08J95m2MR4j90J55q9m5J81j15J43n4m3K1K0j05K08
5910A71q4k61J78K02k22P8j5j34J28M0J01k45m3J46o9K12j86j89K20j13p8K00
5932C7r4Q1l7j00J45m9R0m1L1j35K12k54J06m2R1n7l1m9R0j03J13J07j88R7j70
5957a50J15J48p0K2lo6K15p4p4l7R7j33J98k71m6J36p7L3j5q2K74p4j37J29j59
$$ plain form
5982 -101 -8 28 -87 -119 -111 92 -72 42 7 -43 -84 44 -90 6 73 -108 49 37 56 111 111 8 -82 105 -19
$$ packed form
5982a01R3L6j15l2QK03j64J14l5n0m1J28j34R6O7j81J57j2J9N5%j03r0J87j24
$$ [...]
8191a17
##END NTUPLES=NMR FID
##END=
