##TITLE=1H_Pr NO2
 CDCl3, 8 sc, 
 22.9.2020
##JCAMPDX= 6.0         $$ Bruker NMR JCAMP-DX V2.0
##DATA TYPE= NMR FID
##DATA CLASS= NTUPLES
##ORIGIN= UXNMR, Bruker Analytische Messtechnik GmbH
##OWNER= root
$$ XWIN-NMR		Version 3.5
$$ Tue Sep 22 11:56:04 2020 Russian Standard Time (UT+4h)  she@DPX200
##.OBSERVE FREQUENCY= 200.1315066352
##.OBSERVE NUCLEUS= ^1H
##.DELAY= (6, 6)
##.ACQUISITION MODE= SIMULTANEOUS
##.ACQUISITION SCHEME= undefined
##.AVERAGES= 8
##.DIGITISER RES= 18
##SPECTROMETER/DATA SYSTEM= spect
##.PULSE SEQUENCE= zg30
##.SOLVENT NAME= CDCl3
##.SHIFT REFERENCE= (INTERNAL, CDCl3, 0, 15.7039)
##AUDIT TRAIL= $$ (NUMBER, WHEN, WHO, WHERE, WHAT)
$$ ##TITLE= Audit trail, XWIN-NMR		Version 3.5
$$ ##JCAMPDX= 5.01
$$ ##ORIGIN= Bruker BioSpin GmbH
$$ ##OWNER= she
$$ F:/spectra/data/she/nmr/H-F/1/audita.txt
$$ ##AUDIT TRAIL=  $$ (NUMBER, WHEN, WHO, WHERE, WHAT)
(   1,<2020-09-22 11:54:27.92 +0400>,<she>,<DPX200>,
      <created by zg, POWCHK disabled, PULCHK disabled
       configuration hash MD5:
       00 E9 B6 7A A2 85 ED C7 34 08 36 98 17 FE 4E 26
       data hash MD5: 16K
       94 77 75 FE 74 83 DB AE 67 2D B8 7E 28 F5 86 56>)
$$ ##END=
$$ 
$$ hash MD5
$$ FE 9E 78 E6 FB 26 F7 05 E6 36 22 AA AD FB C4 DC
##$RELAX= 
##$RELAX= 
##$RELAX= 
##$RELAX= 
##$RELAX= 
##$RELAX= 
$$ Bruker specific parameters
$$ --------------------------
##$DU= <F:/spectra>
##$EXPNO= 1
##$NAME= <H-F>
##$PROCNO= 1
##$TYPE= <nmr>
##$USER= <she>
##$AMP= (0..31)
100 100 100 100 100 100 100 100 100 100 100 100 100 100 100 100 100 100 
100 100 100 100 100 100 100 100 100 100 100 100 100 100 
##$AQSEQ= 0
##$AQ_mod= 1
##$AUNM= <au_zg>
##$AUTOPOS= <>
##$BF1= 200.13
##$BF2= 200.13
##$BF3= 200.13
##$BF4= 200.13
##$BF5= 200.13
##$BF6= 200.13
##$BF7= 200.13
##$BF8= 200.13
##$BYTORDA= 1
##$CFDGTYP= 0
##$CFRGTYP= 5
##$CHEMSTR= <none>
##$CNST= (0..31)
1 1 145 1 1 1 1 1 1 1 1 1 1 1 1 1 1 1 1 1 1 1 1 1 1 1 1 1 1 1 1 1 
##$CPDPRG= <>
##$CPDPRG1= <>
##$CPDPRG2= <>
##$CPDPRG3= <>
##$CPDPRG4= <mlev>
##$CPDPRG5= <mlev>
##$CPDPRG6= <mlev>
##$CPDPRG7= <mlev>
##$CPDPRG8= <mlev>
##$CPDPRGB= <>
##$CPDPRGT= <>
##$D= (0..31)
0 1.2 0 0 0 0 0 0 0 0.06 0 0.03 0 0 0 0 0.0002 0 0 0 0 0 0 0 0 0 0 0 0 
0 0 0 
##$DATE= 1600761267
##$DBL= (0..7)
120 120 120 120 120 120 120 120 
##$DBP= (0..7)
150 150 150 150 150 150 150 150 
##$DBP07= 0
##$DBPNAM0= <>
##$DBPNAM1= <>
##$DBPNAM2= <>
##$DBPNAM3= <>
##$DBPNAM4= <>
##$DBPNAM5= <>
##$DBPNAM6= <>
##$DBPNAM7= <>
##$DBPOAL= (0..7)
0.5 0.5 0.5 0.5 0.5 0.5 0.5 0.5 
##$DBPOFFS= (0..7)
0 0 0 0 0 0 0 0 
##$DE= 6
##$DECBNUC= <off>
##$DECIM= 32
##$DECNUC= <off>
##$DECSTAT= 4
##$DIGMOD= 1
##$DIGTYP= 9
##$DL= (0..7)
0 120 120 120 120 120 120 120 
##$DP= (0..7)
150 150 150 150 150 150 150 150 
##$DP07= 0
##$DPNAME0= <>
##$DPNAME1= <>
##$DPNAME2= <>
##$DPNAME3= <>
##$DPNAME4= <>
##$DPNAME5= <>
##$DPNAME6= <>
##$DPNAME7= <>
##$DPOAL= (0..7)
0.5 0.5 0.5 0.5 0.5 0.5 0.5 0.5 
##$DPOFFS= (0..7)
0 0 0 0 0 0 0 0 
##$DQDMODE= 0
##$DR= 18
##$DS= 0
##$DSLIST= <SSSSSSSSSSSSSSS>
$$ [...]
##$SUBNAM2= <"">
##$SUBNAM3= <"">
##$SUBNAM4= <"">
##$SUBNAM5= <"">
##$SUBNAM6= <"">
##$SUBNAM7= <"">
##$SUBNAM8= <"">
##$SUBNAM9= <"">
##$SW= 16.880792210976
##$SWIBOX= (0..15)
0 0 2 0 0 0 0 0 0 0 0 0 0 0 0 0 
##$SW_h= 3378.37837837838
##$TD= 16384
##$TD0= 1
##$TE= 0
##$TE2= 300
##$TE3= 300
##$TEG= 300
##$TL= (0..7)
0 120 120 120 120 120 120 120 
##$TP= (0..7)
150 150 150 150 150 150 150 150 
##$TP07= 0
##$TPNAME0= <>
##$TPNAME1= <>
##$TPNAME2= <>
##$TPNAME3= <>
##$TPNAME4= <>
##$TPNAME5= <>
##$TPNAME6= <>
##$TPNAME7= <>
##$TPOAL= (0..7)
0.5 0.5 0.5 0.5 0.5 0.5 0.5 0.5 
##$TPOFFS= (0..7)
0 0 0 0 0 0 0 0 
##$TUNHIN= 0
##$TUNHOUT= 0
##$TUNXOUT= 0
##$USERA1= <user>
##$USERA2= <user>
##$USERA3= <user>
##$USERA4= <user>
##$USERA5= <user>
##$V9= 5
##$VALIST= <valist>
##$VCLIST= <CCCCCCCCCCCCCCC>
##$VD= 0
##$VDLIST= <DDDDDDDDDDDDDDD>
##$VPLIST= <PPPPPPPPPPPPPPP>
##$VTLIST= <TTTTTTTTTTTTTTT>
##$WBST= 1024
##$WBSW= 4
##$XGAIN= (0..3)
0 0 0 0 
##$XL= 0
##$YL= 0
##$YMAX_a= 411783
##$YMIN_a= -430180
##$ZGOPTNS= <>
##$ZL1= 120
##$ZL2= 120
##$ZL3= 120
##$ZL4= 120
##$ABSF1= 10
##$ABSF2= 0
##$ABSG= 5
##$ABSL= 3
##$ALPHA= 0
##$AQORDER= 0
##$ASSFAC= 0
##$ASSFACI= 0
##$ASSFACX= 0
##$ASSWID= 0
##$AUNMP= <proc_1d>
##$AZFE= 0.1
##$AZFW= 0.1
##$BCFW= 1
##$BC_mod= 2
##$BYTORDP= 1
##$COROFFS= 0
##$CY= 11.3945322036743
##$DATMOD= 1
##$DC= 2
##$DFILT= <>
##$DTYPP= 0
##$F1P= 16.9975609425685
##$F2P= -3.02152046262296
##$FCOR= 0.5
##$FTSIZE= 0
##$FT_mod= 4
##$GAMMA= 1
##$GB= 0.15
##$INTBC= 1
##$INTSCL= 1
##$ISEN= 128
##$LB= 0.24
##$LEV0= 0
##$LPBIN= 0
##$MAXI= 10000
##$MC2= 0
##$MEAN= 0
##$ME_mod= 0
##$MI= 1.114404
##$NCOEF= 0
##$NC_proc= 0
##$NLEV= 6
##$NOISF1= 3.799351
##$NOISF2= 2.8
##$NSP= 1
##$NTH_PI= 0
##$NZP= 0
##$OFFSET= 15.70392
##$PC= 1
##$PHC0= -9966.487
##$PHC1= 7.8009
##$PH_mod= 1
##$PKNL= yes
##$PPARMOD= 0
##$PSCAL= 0
##$PSIGN= 0
##$REVERSE= no
##$SF= 200.130013532006
##$SI= 16384
##$SIGF1= 3
##$SIGF2= 2
##$SINO= 400
##$SIOLD= 16384
##$SREGLST= <1H.CDCl3>
##$SSB= 0
##$STSI= 0
##$STSR= 0
##$SW_p= 3612.71676300578
##$SYMM= 0
##$S_DEV= 0
##$TDeff= 0
##$TDoff= 0
##$TI= <>
##$TILT= no
##$TM1= 0
##$TM2= 0
##$TOPLEV= 0
##$USERP1= <user>
##$USERP2= <user>
##$USERP3= <user>
##$USERP4= <user>
##$USERP5= <user>
##$WDW= 1
##$XDIM= 8192
##$YMAX_p= 0
##$YMIN_p= 0
$$ End of Bruker specific parameters
$$ ---------------------------------
##NTUPLES= NMR FID
##VAR_NAME=  TIME,          FID/REAL,        FID/IMAG
##SYMBOL=    X,             R,               I
##VAR_TYPE=  INDEPENDENT,   DEPENDENT,       DEPENDENT
##VAR_FORM=  AFFN,          ASDF,            ASDF
##VAR_DIM=   8192,          8192,            8192
##UNITS=     SECONDS,       ARBITRARY UNITS, ARBITRARY UNITS
##FACTOR=    0.000296,      1,               1
##FIRST=     0,             0,               0
##LAST=      2.424536,      0,               0
##MIN=       0,             -430180,         0
##MAX=       2.424536,      411783,          0
$$ Real data points
##PAGE= N=1
##DATA TABLE= (X++(R..R)), XYDATA
$$ [...]
2051c61k0J237r98o2j34P1J178j657n00K213p22r07j25N84J347k184m87K147q30
$$ -361 -381 856 -142 -204 -338 -267 911 -746 -1246 967 245 -662 -787 -203 1144 -1040 -1527 620 -210
2070b10m77n5O96O32j118m7J283j124l7Q87l47L26o41N82N6j298J044M65j807
$$ -210 -687 -742 -46 586 -532 -579 704 -420 -457 430 83 409 -232 350 406 -892 152 617 -1190
2089a190Q19J209o12j018j04K229r83k224K320R11j799p57J321J530j915j137
$$ -1190 -371 838 226 -792 -896 1333 350 -1874 446 1357 -442 -1199 122 1652 -263 -1400
2105a400K911m11j881R44R40l71j440Q93J403j937l31K022p55j489J020Q27p43
$$ -1400 1511 1100 -781 163 1103 732 -708 185 1588 -349 -680 1342 587 -902 118 945 202
2122B02j168J166J350k677J01K107q75j771O42J888r58k336J909J954k323p29
$$ 202 -966 200 1550 -1127 -1026 1081 206 -1565 -923 965 7 -2329 -420 1534 -789 -1518
2138a518K075O02j979q8K323m31j927J257J230j474r27J394N22j849m54K269j202
$$ -1518 557 1159 -820 -908 1415 984 -943 314 1544 70 -857 537 1059 -790 -1244 1025 -177
2155a77j427J028J106j580n79J527O06j762j5K577q82j320J375J223j172r66J907
$$ -177 -1604 -576 530 -1050 -1629 -102 504 -1258 -1273 1304 422 -898 477 1700 528 -438 1469
2172A469M34k166K71J668o22j508P18L39m67j514J430L33j392m04J810o72r66
$$ 1469 1903 -263 8 1676 1054 -454 264 603 136 -1378 52 385 -1007 -1411 399 -273 -1239
2189a239R02J169n83j030J551M26j226j26J122J22j304M50O55n43r98R34K92j117
$$ -1239 -337 832 249 -781 770 1196 -30 -156 966 1088 -216 234 889 346 -652 282 574 -543
2207e43k72L48O82j155K54P94m12o70P24N49p57j34M47N73r37mR88n13n80J81
$$ -543 -815 -467 215 -940 -686 108 -304 -974 -250 299 -458 -592 -145 428 -509 -513 475 -38 -618 -437
2227d37Q56p37l93P72L56p18o0N90M8l26o1P68l97j42M08K76o92l48M66n8k38
$$ -437 419 -318 -711 61 417 -301 -361 229 277 -49 -110 658 261 119 527 803 111 -237 229 171 -67
2248f7n22N46L0m36l14P62J27p38M85K55l6k36Q95p7k81K4M20M05r05J01O80o03
$$ -67 -589 -43 -13 -449 -763 -1 126 -612 -127 128 92 -144 751 674 393 417 837 1242 337 438 1118 515
2270E15q02K75M57q86j76J74L32j010q0J048m39m47J43J314o50p6M16Q26p25j90
$$ 515 -287 -12 445 -441 -617 -443 -111 -1121 -1201 -153 -592 -1039 -896 418 -232 -308 108 934 209 19
2290A9P18j16k61k44J032o07j115N49O35j286m19J218p2j365l2J267l64j091J069
$$ 19 737 621 360 116 1148 541 -574 -25 610 -676 -1095 123 51 -1314 -1346 -79 -443 -1534 -465
2309d65J124j060l16J050L45o78k65J345j8j452J016M75m91r35P88O66j314k32
$$ -465 659 -401 -717 333 678 0 -265 1080 1062 -390 626 1101 610 -325 463 1129 -185 -417
2327d17J033n66q07Q05J4l13p12J263M71j455L50J198n71q03R38N23n23j222J116
$$ -417 616 50 -757 48 62 -251 -963 300 771 -684 -334 864 293 -510 428 951 428 -794 322
2346C22R75j761J65J047q1j054J06R42q2j628J086Q23j383J73K75J82o09%J026
$$ 322 1297 -464 -299 748 667 -387 -281 661 579 -1049 37 860 -523 -350 -75 107 -502 -502 524
2365E24r07o82J519l83p87M27M09K79j113J12J609j173n63J095J24o35n17J044
$$ 524 -383 -1065 454 71 -716 -289 120 399 -714 -602 1007 -166 -729 366 490 -145 -662 382
2383C82M64j449O6J360q84k89m1P01q0p42Q65J35r10N72M31q07L62J18K60j25
$$ 382 846 -603 -537 823 -61 -350 -391 310 230 -512 353 488 -422 150 581 -226 136 254 514 389
2403C89j129J589l80j482J040N92m24n48l51J521p67j089J654j87k76M9j6P93
$$ 389 -740 849 469 -1013 27 619 195 -353 -704 817 50 -1039 615 428 152 201 185 978
2421I78q96k85J382j134l28O47n02Q0l66m4M85p83K87P63q90m2L42M7J19q56J097
$$ 978 82 -203 1179 45 -283 364 -138 -58 -424 -468 17 -766 -479 284 -606 -648 -306 -259 -140 -996 101
2442A01P12j539M43R11n91J34n19Q31N83j458L17N96o51J84l84J3P21j183P28
$$ 101 813 -726 -283 628 37 171 -348 483 1066 -392 -75 521 -130 54 -330 -317 404 -779 -51
2461e1m3r64J148k66n46N87j02O97l73q29J743n48o66L37M51K56p32l14J414q10
$$ -51 -94 -1058 90 -176 -722 -135 -237 460 87 -742 1001 453 -213 124 575 831 99 -215 1199 389
2481C89j077J483m78K84p43j61J340j476J04R93r86K53K03o64O78n26J49M33j056
$$ 389 -688 795 317 601 -142 -303 1037 -439 -335 658 -328 -75 128 -536 142 -384 -235 198 -858
2500h58Q29P64j435N40K00M67j32j235J404N82j621P25L90k33j83o22R17j27j474
$$ -858 -29 735 -700 -160 40 507 375 -860 544 1126 -495 230 620 387 204 -418 499 372 -1102
2519a102R37q9n21K23M8P4J97r53J227o85m19J432o65J61J68L43J54m58L45J584
$$ -1102 -165 -254 -775 -552 -504 -430 -233 -1186 41 -644 -1063 369 -296 -135 33 376 530 72 417 2001
2539B001j355n37J027n33L9r54O20O16j639J35Q53o28j93k51L80P1q90R58L89
$$ 2001 646 109 1136 603 642 -312 308 924 -715 -580 273 -355 -548 -799 -419 -348 -1238 -280 109
2558A09p60R01L12l18J72K24M85l55o50J180l58j430J028n6j37p97j68Q50p40
$$ 109 -651 250 562 244 416 640 1125 770 120 1300 942 -488 540 484 347 -450 -618 232 -508
2577e08q99J222j54p10K59O9P78o36o8J003m56k44Q34K45m31m41M07N50p28j39
$$ -508 -1407 -185 -339 -1049 -790 -721 57 -579 -647 356 -100 -344 490 735 304 -137 270 820 92 -47
2597d7P28q54k2J08j25l33m07Q38J64r41L41O63l74J1j75O55qq57J090K43o68
$$ -47 681 -173 -195 -87 -212 -545 -952 -114 50 -891 -550 113 -261 -250 -425 230 222 -635 455 698 30
2618C0K75L64l04k24m3L66L2r12P64K2k78m00M62K02n72j65Q19j64l61L70M5k27
$$ 30 305 669 365 141 98 464 496 -416 348 370 92 -308 154 356 -216 -381 438 274 -87 283 328 101
2640A01m02L08N69p39r8O00k16n26L58J46J1j22k21L87m62O5L88o6l34n2O81l42
$$ 101 -301 7 576 -163 -261 339 123 -403 -45 101 112 -10 -231 156 -306 -241 147 81 -253 -305 376 34
2662C4m05N50K22p97M1k5K48k76j18M84k27n2r1N67l42j54L56M12n27n2L28J37
$$ 34 -371 179 401 -396 -355 -380 -132 -408 -526 -42 -269 -321 -412 155 -187 -341 15 427 -100 -152 176 313
2684C13k25j33M18k15j58R3K95n80o1L83K46o04J49K45J01m83J88K75k69k83M83
$$ 313 88 -45 373 158 0 93 388 -192 -253 130 376 -228 -79 166 267 -216 -28 247 -22 -305 178
2705A78j59k12L20K04O0q41M77M77l69m95K71O36o13j11L76n8m76K53o0M2J23
$$ 178 19 -193 127 331 391 -450 27 504 135 -360 -89 547 -66 -177 199 141 -335 -82 -142 -100 23
2726B3j8N63q03J77J17j2k83J32M53n07j4p9K23l11J2K62J27l51J91K90l83K27
$$ 23 5 568 -235 -58 59 47 -236 -104 349 -158 -172 -251 -28 -339 -327 -65 62 -289 -98 192 -191 36
2748C6j98L54m66k06N88K10m51o1L97%n06K43L49k53l29J41N50l49k46N45k82
$$ 36 -162 192 -274 -480 108 318 -133 -194 203 203 -303 -60 289 36 -293 -152 398 49 -197 348 66
2769F6k68M52l30J84k59K41K72j61l61M78K05q98L98J80j11q4j20L23J81m11M71
$$ 66 -202 250 -80 104 -155 86 358 197 -164 314 519 -379 19 199 88 4 -116 207 388 -23 448
2790D48j35m56R6L75l9m26pM94m65Q1l2j47j69O2N9J74k77K5L99k18j5J29L48
$$ 448 313 -143 -47 328 289 -137 -144 350 -115 -34 -66 -213 -382 -320 -261 -87 -364 -339 60 -158 -173 -44 304
2813C04n6n98N13K55k73k54N72l12k41j66M93q9p86M36M14o53j44M56j20k09j53
$$ 304 248 -350 163 418 145 -109 463 151 -90 -256 237 148 -638 -202 212 -441 -585 -129 -249 -458 -611
2834f11O23L6k77M11J49l19K3L8M32l45j91P53p11l23O34m13L34k58M4M88q99
$$ -611 12 48 -229 182 331 12 35 73 505 160 -31 722 11 -312 322 -91 243 -15 29 517 -382
2855c82M0J008p61j05M55q4J40m87K55M85p28K08rk13n2M4L05k34q1J81j03m01
$$ -382 -342 666 -95 -200 255 171 311 -176 79 564 -164 44 35 -178 -230 -186 119 -115 -196 -15 -118 -519
2877e19O38L38n25j0q9P05j56q27O40J76o68N3K23M87p56m96Q88m64l39M25j21
$$ -519 119 457 -68 -78 -167 538 382 -445 195 371 -297 -244 -21 466 -290 -786 102 -362 -701 -276 -397
2898c97m7ol32J077n91J44O26n63K35O97k81J76l98N64l9r08L31L05o36l98J84
$$ -397 -444 -450 -782 295 -296 -152 474 -89 146 843 562 738 340 904 865 -43 288 593 -43 -441 -257
2919b57L40j3j029N14M06q29J92J54Q0L85l24O31N53o21M97j53l00N05j49j50
$$ -257 83 70 -959 -445 -39 -868 -676 -522 -442 -57 -381 250 803 182 679 526 226 731 582 432
2939D32R7m14M49m19n37R99q01j94l04o5P03q17l00J130l32j82J24L28L00k68
$$ 432 529 115 564 145 -392 607 -194 -388 -692 -757 -54 -871 -1171 -41 -373 -555 -431 -103 197 -71
2959g1l02R74m34ML88o22O22l39l59L24j25p7L4n87M07K8m97L61n50O26J19p10
$$ -71 -373 601 167 171 559 -63 559 220 -139 185 60 -17 17 -570 -163 -135 -632 -271 -821 -195 -76 -786
2981g86P59j89J6K57j62L43L5n53O67q6j52J18j24N27j34m92L36J44n90K53k11
$$ -786 -27 -216 -200 57 -105 238 273 -280 387 301 149 267 143 670 536 44 380 524 -66 187 -24
3002b4J21L28p34M75j99l80O71o17N6L28k31L8K55j99J91l97L01N23m10q8Q2J08
$$ -24 97 425 -309 166 -33 -413 258 -359 -303 25 -206 -168 87 -112 79 -318 -17 506 96 8 90 198
3024A98K28l41k06Q46p95J54n7j01M41p58K80k17k2QQ2l22O92k93k49K38k64Q05
$$ 198 426 85 -121 725 -70 84 27 -74 367 -391 -111 -328 -350 -342 -260 -582 110 -183 -432 -194 -458 347
3046C47k39n40N51K07l43k46J36N13m55M8N18l21k46K52m5j11j60r7N59n84J60
$$ 347 108 -432 119 326 -17 -263 -127 386 -69 -21 497 176 -70 182 137 26 -134 -231 328 -256 -96
3067i6N12n85O9K45j07J72m72O39J73n38J06K35l2m74P5M84j81m96M09J59l98
$$ -96 416 -169 -100 145 38 210 -262 377 550 12 118 353 321 -153 -78 406 225 -271 138 297 -101
3088a01K77k71L29j68M5J0l20J11k4K55m30L92L8p9k43KO38o35k01L74J56l43
$$ -101 176 -95 234 66 111 121 -199 -88 -112 143 -287 105 143 64 -179 -177 461 -174 -375 -1 155 -188
3110a88J43J54nm18KO28l57k64L78J60k63n6J76r7p9k8L17l27r5J86K36j35n4
$$ -188 -45 109 104 -314 -312 316 -41 -305 73 233 -30 -86 90 -7 -86 -114 203 -124 -219 -33 203 68 14
3133A4Q7q6l45J70L05l43J13jQ1k49k33P65kk54J80J99o04J65L57j66K21j83J52
$$ 14 101 15 -330 -160 145 -198 -85 -86 -5 -254 -487 278 276 22 202 401 -203 -38 319 153 374 191 343
3156C43j52N6j67K95m50J81j4j18o4k23L38k21QR3n8p9j87L07j85M9K27K4J90
$$ 343 191 247 80 375 -75 106 92 -26 -90 -313 25 -196 -188 -95 -153 -232 -419 -112 -297 -248 -21 3 193
3179A93j93K11Mj77P8L12j75l4k15o3J05K8k28N7j11k85J70J1q6J58j46M2K11
$$ 193 0 211 215 38 116 428 253 219 4 -59 46 74 -154 -97 -208 -493 -323 -312 -398 -240 -386 -344 -133
3202a33r0J21j5L87j17k6K13K49n06K97j03J85l22MK84j60m28J32J4j97l3J9j9
$$ -133 -223 -102 -117 270 153 127 340 589 83 380 277 462 140 144 428 268 -160 -28 -14 -211 -244 -225 -244
3225b44L4K47j98m7L09Q3R2j30J67J48l3j97j67L74m18n4L60k06j14Q4r9j50M2
$$ -244 -210 37 -161 -208 101 184 276 146 313 461 428 231 64 438 20 -34 326 120 6 90 -9 -159 -117
3248a17N6J02l51m7J99O6p3k28P58m24j15J64J99j86l92M63J85l21k2K42j4m51
$$ -117 -61 41 -310 -357 -158 -92 -165 -393 365 -59 -174 -10 189 3 -389 74 259 -62 -84 158 144 -307
3270c07M31K7j81j27J82J66l99P9M39k52l63K73m3k2n0K26n0l51J48N68m74k83
$$ -307 124 151 -30 -157 25 191 -208 -129 310 58 -305 -32 -75 -97 -147 79 29 -322 -174 394 -80 -363
3292c63N38r5l44J49M17J7m70L53J39m3l41J00K98m29K07J02P5n83L23J4j82l60
$$ -363 175 80 -264 -115 302 319 -151 202 341 298 -43 57 355 -74 133 235 310 -273 50 64 -118 -478
3314d78L43K79n92KP64j61m70M88k12J63k93K61L02l35l06O44k79j16p9J67L9
$$ -478 -135 144 -448 -446 318 157 -313 175 -37 126 -167 94 396 61 -245 399 120 4 -75 92 131
3335A31k22j42J91j96J02k73J28J03J89r5k61o7L63K77n31O45j43j03q3jN62p00
$$ 131 -91 -233 -42 -238 -136 -409 -281 -178 11 -84 -345 -412 -49 228 -303 342 199 96 13 12 574 -126
3357a26j75N85M1m14L14m08J67j00p6M88p70M42J20j76P8M3j10j9L1K04J04l69
$$ -126 -301 284 325 -89 225 -183 -16 -116 -192 296 -474 -32 88 -88 -10 33 -77 -96 -65 139 243 -126
3379a26L45k2k77K71r0p3J63l08J86K19m74K14J70n1M1k88J46J2k09M67o69P6
$$ -126 219 197 -80 191 101 28 191 -117 69 288 -186 28 198 147 188 -100 46 58 -151 316 -353 -277
3401b77N39l90K11m8j55K83o82L40P33q06L15j96J87K37n45Q3K52j02K88r6j88
$$ -277 262 -128 83 35 -120 163 -519 -179 554 -252 63 -133 54 291 -254 -171 81 -21 267 171 -17
3422a7J16r5J93j62M2K38l99L4L94j59k76J28n7J84m26kQ47o28k31L83k46R6k9
$$ -17 99 4 197 35 77 315 -84 -50 344 185 -91 37 -20 164 -262 -264 583 -45 -276 107 -139 -43 -72
3445g2R4M21n30K27J19m18J72L64k72J25j03n7O5m25M98J79o91K00L71j01m6n79
$$ -72 22 443 -87 140 259 -159 13 377 105 230 127 70 135 -290 208 387 -304 -104 267 166 120 -459
3467d59Q80l51n01L20L06k75k01j8L88k76m8M72n29N4L38k95l7J25j3K92l16k00
$$ -459 421 70 -431 -111 195 -80 -281 -299 89 -187 -235 237 -292 -238 100 -195 -232 -107 -120 172 -144 -344
3489c44R55o57o0K1Q9Qk96M18k3m36J37K97j03j11j47K61L1m08K87K44n56L64
$$ -344 611 -46 -106 -85 4 12 -284 134 111 -325 -188 109 6 -105 -252 9 40 -368 -81 163 -393 -29
3511b9K4j69K34JJ11l52L6N57l99P7O2%j57j47J42K41j15j23M50j38m19M09k15
$$ -29 -5 -174 60 61 172 -180 -144 413 14 91 153 153 -4 -151 -9 232 117 -6 444 306 -113 296 81
3534H1%m01K64K42m70K35J14l86l0M10k77k4r8L36J34n75M37L67n49K0J71J60
$$ 81 81 -320 -56 186 -284 -49 65 -321 -351 59 -218 -242 -340 -4 130 -445 -8 359 -190 -170 1 161
3556A61j48L4K17k81m94N47n5l76J56J08M7k64J36R6q8m1L26j37k0k07M39K61
$$ 161 13 47 264 -17 -511 36 -19 -395 -239 -131 -84 -348 -212 -116 -204 -245 81 -56 -76 -283 156 417
3578D17p61L52M47l34j6%K23j43l18K85K38m53j66O33l46k79L12m8m89N38J55
$$ 417 -344 8 455 121 105 105 328 185 -133 152 390 -63 -229 404 58 -221 91 43 -446 92 247
3599B47m05R1J77j07j70N1L02R0n87l2P69j0l00rj6p9j36R0J60k44n9L82n32R6
$$ 247 -158 -67 110 3 -167 -116 186 276 -311 -343 426 416 116 107 91 12 -124 -34 126 -118 -177 205 -327 -231
3623b31m5J51o0j21N34j42n17M07K04m38j64N23j44l5J00o7O5l86M61K29m52R9
$$ -231 -276 -125 -185 -306 228 86 -431 -24 180 -258 -422 101 -43 -78 22 -45 20 -366 95 324 -128 -29
3645b9J62j08l51K16N94o44k9J78M3m38K56K05j05l08K43J69l03n5L07M03n33
$$ -29 133 25 -326 -110 484 -160 -189 -11 32 -406 -150 55 -50 -358 -115 54 -249 -304 3 406 -127
3666a27L66J09j67j28L16k7k01n1J90K6l05J14J96k85m1p6L4j06m7M07j57l51
$$ -127 239 348 181 53 369 342 141 90 280 306 1 115 311 26 -15 -91 -57 -163 -210 197 40 -311
3688c11J24J96J16k22J76J94l64J29M49k99r2j09L95m23r2N78n41J1Km3O2r8J
$$ -311 -187 9 125 -97 79 273 -91 38 487 188 96 -13 382 -41 -133 445 -96 -85 -83 -126 -64 -162 -161
3711a61j40J02j11N07j70k20o1K56j26l3L00K32m42k9L05q2J8l49O68k77k06L80
$$ -161 -301 -199 -310 197 27 -193 -254 2 -124 -157 143 375 -67 -96 209 127 145 -204 464 187 -19 361
3733C61l09m4q4j27Q0j60P7K80k79j42N75q0j42L0L90l07p7J36K55l11p3L14k79
$$ 361 52 8 -76 -203 -123 -283 -206 74 -205 -347 228 148 6 36 426 119 42 178 433 122 49 363 84
3756H4j77j9L68m4m67L67k17r1O0K61r4k14o1L82m11l48M58lj75J49K74k7n09
$$ 84 -93 -112 256 212 -255 112 -105 -196 -136 125 31 -183 -244 138 -273 -621 -163 -166 -341 -192 82 55 -454
3779d54L00M40m59P9M16l09l05K57J51j31l26L52L1l38L3J98Ok33J02J35L6l44
$$ -454 -154 286 -173 -94 322 13 -292 -35 116 -15 -341 11 42 -296 -263 -65 -59 -292 -190 -55 -19 -363
3801c63L16J29j77J41J42k38j88M34k18J7L7K98l11j81J79J55J44n54M23J50k08
$$ -363 -47 82 -95 46 188 -50 -238 196 -22 -5 32 330 19 -162 17 172 316 -238 185 335 127
3822A27l14O52k77k27n8K8K25m12K69J77l27J25O7kn3lQ9j16o42P75j09l80J89
$$ 127 -187 465 188 -39 -97 -69 156 -256 13 190 -137 -12 55 53 0 -3 86 -30 -672 103 -6 -386 -197
3845a97J65k9j71pO10n19k78L30K51k34K42j64O7j82l07Q18m36k93L67n0oJ49
$$ -197 -32 -61 -232 -239 371 -148 -426 -96 155 -79 163 -1 66 -116 -423 395 -41 -334 33 -17 -23 126
3867A26j61J08l47M15Kj54k07M48j47j58j02J34L53m97J66L99n47K02K05k55L5
$$ 126 -35 73 -274 141 143 -11 -218 230 83 -75 -177 -43 310 -187 -21 378 -169 33 238 -17 18
3888A8p4M85n21p1K84O5n44N73m03K23l91J29N83m17l06O51l21J45mM8j69r0J93
$$ 18 -56 429 -92 -163 121 186 -358 215 -188 35 -356 -227 356 -61 -367 284 -37 108 104 152 -17 -107 86
3911H6N10p57J67P0n9L12n62K72j50R6Q5pm07L88K83n59L29l10M63k66p04N44
$$ 86 596 -161 6 76 17 329 -233 39 -111 -15 70 63 -344 44 327 -232 97 -213 250 -16 -720 -176
3933a76M03p44O25l6l95J40m3N28o06J35L07Jl58J90K43L9l08K08K7k22j12J60
$$ -176 227 -517 108 72 -323 -183 -226 302 -304 -169 138 139 -219 -29 214 253 -55 153 180 -42 -154 6
3955FL7k12J99J22L6n53N03J28o18o7O70j13l77K42M27k83l98O07o9m04R9J38
$$ 6 43 -169 30 152 188 -365 138 266 -352 -419 251 138 -239 3 430 147 -251 356 287 -117 -18 120
3977A20L2j77J01K13m82j7O11n51j84M01k4j63m08L86K82m71m2O93l33j2mN48
$$ 120 152 -25 76 289 -193 -210 401 -150 -334 67 43 -120 -528 -142 140 -331 -373 320 -13 -25 -29 519
3999E19m77l36M71M4l65L5K92m03N3R0J42k45k83P29K12q76M07R6k74r3K34l0
$$ 519 42 -294 177 221 -144 -109 183 -220 -167 -77 65 -180 -463 266 478 -398 9 105 -169 -262 -28 -58
4021e8K3k00N66k14m65L89K6J86o67J87N56q00K09P07k54k51j8R5N4k78N29k37
$$ -58 -35 -235 331 117 -348 41 67 253 -414 -227 329 -471 -262 445 191 -60 -78 17 71 -207 322 85
4043H5k05P6N75n68k38K86J04J06o51N82q5m17J47K91o2M7l41L72Mk71M85M2n71
$$ 85 -120 -44 531 -37 -275 11 115 221 -430 152 67 -350 -203 88 26 73 -268 104 108 -163 322 364 -207
4066b07Q1M30j29l66M11K88m30k66L4L14l84J54P8O6n05M01J50l17o5N3J73r5
$$ -207 -126 304 175 -191 220 508 78 -188 -154 160 -224 -70 8 74 -431 -30 120 -197 -262 -209 -36 -131
4088a31J10J80j0m62M35j67k47J79M14l38j48J71kr3j51L71j66k75M29J75k65
$$ -131 -21 159 149 -313 122 -45 -292 -113 301 -37 -185 -14 -16 -109 -260 111 -55 -330 99 274 9
4109Ij67M83j72lp9L15k57j82J04J64N7k92j5L52o50M93J16j39k18K32j01jN9
$$ 9 -158 325 153 150 71 386 129 -53 51 215 272 -20 -35 317 -333 160 276 137 -81 151 50 49 108
4132A08P9p0l75P9L66j26k53J91p3p0J42J75l10k26J26L99l19p8L93m3k68L79
$$ 108 187 117 -258 -179 187 61 -192 -1 -74 -144 -2 173 -137 -363 -237 162 -157 -235 158 115 -153 226
4154B26m8k39k38L33Q1l7j66J23j34m23L63N66n81N5K67r2j05JP8J57n37N35K6
$$ 226 178 -61 -299 34 115 78 -88 35 -99 -522 -159 407 -174 -119 148 56 -49 -48 30 187 -350 185 211
4177B11j63j24M23k27l62J64J71K5l71K54J70l94J24K16Q6k76r4N74k20o15N18
$$ 211 48 -76 347 120 -242 -78 93 118 -253 1 171 -223 -99 117 203 -73 -167 407 187 -428 90
4198I0N21o01R8J49R4o46M63J14k68k45N7L47l65l05P97m08m32M07K37m11J6N21
$$ 90 611 10 108 257 351 -295 168 282 14 -231 -174 173 -192 -497 300 -108 -540 -133 104 -307 -291 230
4220B30k2j65o1M75l06m77L86M02m84j96M01r0l51pL49j87j42O4L63l64m6L58
$$ 230 208 43 -18 457 151 -326 60 462 -22 -218 183 93 -258 -265 84 -103 -245 -181 182 -182 -228 130
4242A30q7k20J0L63k82L2L8J57k39J51K69j51l52K84K01m30PJ1N68n01m8K89J59
$$ 130 43 -177 -167 196 -86 -54 -16 141 -98 53 322 171 -181 103 304 -126 -119 -108 460 -41 -89 200 359
4265C59o71L54N5r3j10N1J01k22L0M81m55k96M39K26j17k60J38J01j92J21M39
$$ 359 -312 42 97 4 -106 -55 46 -176 -146 335 -120 -416 23 249 132 -128 10 111 -81 40 479
4286D79m44o8M5P4o2j58L21N9o98L80L95m75J15j82R2j33J05L11l46r9L63r6L6
$$ 479 35 -33 12 86 24 -134 187 246 -452 -72 323 -152 -37 -219 -127 -260 -155 156 -190 -289 74 -22 14
4309A4l27N00J02k66j2M8%l98N77k44O1l85M70k60J76p6J20l24k29M87k66J38
$$ 14 -313 187 289 23 11 59 59 -339 238 -6 55 -330 140 -120 56 -20 100 -224 -453 34 -232 -94
4331i4q4J57l0j21L89K27o16M5M30m7k33O9K59p9n16M52J50k79k3n9Q6o1j95K67
$$ -94 -178 -21 -51 -172 217 444 -172 -127 303 256 23 92 351 272 -244 208 358 79 56 -3 83 22 -173 94
4355I4l91J16K48n5k13K71J2n5l17L68L53q34J05O81K8m30lJ44K54o75K44M27
$$ 94 -297 -181 67 12 -201 70 82 27 -290 78 431 -403 -298 383 411 -19 -22 122 376 -299 -55 372
4377C72m29m0L00j15k37J2mL15o25O30k69m78L64L36k58k51K42M81m05l39P10
$$ 372 -57 -97 203 88 -149 -137 -141 174 -451 179 -90 -568 -204 132 -126 -377 -135 346 -59 -398 312
4398C12o1j76j26J84K80n53M90j00k45j80N12l19K51k40n1L89q79Q00K4o21K20
$$ 312 251 75 -51 133 413 -140 350 250 5 -175 337 18 269 29 -22 367 -512 288 312 -309 -89
4419h9J9J30l51P4N99j48n91N10K73n71lK94J90l58k72P46l27k84M17k01j39j7
$$ -89 -70 60 -291 -217 382 234 -357 153 426 -145 -148 146 336 -22 -294 452 125 -159 258 57 -82 -99
4441i9k1L16n94J29N25m24l80N17q3o9q4R1M67o52J66L99k40kJ72O7l89M5L29
$$ -99 -120 196 -398 -269 256 -168 -548 -31 -114 -183 -267 -176 291 -361 -195 204 -36 -38 134 201 -188 -143 186
4464A86M3n43M52K21l85n6Q1L07p29M9O23Mm33M74K5l00M5K25j06n58J48N79k98
$$ 186 229 -314 138 359 -26 -82 -1 306 -423 -374 249 253 -180 294 319 19 64 289 183 -375 -227 352 54
4487E4k81L97m9p8k29L07J52l68j23N42n04P8L72m2k12k87M67lm99K88L49m52
$$ 54 -227 170 121 43 -186 121 273 -95 -218 324 -180 -102 270 228 16 -271 196 193 -306 -18 331 -121
4509a21o1K34J27l10J67K39j97l12R0K72j86M2R7j56J36q5J72k57n9K37J25k53
$$ -121 -182 52 179 -131 36 275 78 -234 -144 128 -58 -16 81 -75 61 -24 148 -109 -168 69 194 -59
4531e9j71M17k26j87N1K69k64k8N49l76L5L4K21j36l13J31J45o1j10O5J63k81
$$ -59 -230 187 -39 -226 -175 94 -170 -198 351 -25 10 44 265 129 -184 -53 92 31 -79 -14 149 -132
4553a32J58pQ7l13K76K53l96J49J45j05k31J98K86o00K6M71l5n48K82K94k33k44
$$ -132 26 19 106 -207 69 322 -74 75 220 115 -116 82 368 -232 -206 265 230 -318 -36 258 25 -219
4575b19K79J05l30j24K87R8k84J39L79l99j57L25J03q4r1K43l96j03M22O4l25
$$ -219 60 165 -165 -289 -2 96 -188 -49 330 -69 -226 99 202 118 27 270 -126 -229 193 257 -68
4596f8j48L99n2l92kM16j62l08L91J54l27j41M50l3m51M0L53k09j66L36K77m37
$$ -68 -216 183 131 -261 -263 153 -9 -317 74 228 -99 -240 210 177 -274 -234 119 -90 -256 80 357 -80
4618h0j77N81j88l91L21M47n58j76M28j9m76mM89J50n35Q7M00j43l85L17O2j33
$$ -80 -257 324 136 -255 66 513 -45 -221 207 188 -288 -292 197 347 -188 -101 299 156 -229 88 150 17
4640A7l31N13K5o14L62L04k83l23M83K57o63M46J13j37n73J48P54p28J52J83j05
$$ 17 -314 199 224 -390 -28 276 -7 -330 153 410 -253 193 306 169 -404 -256 498 -230 -78 105 0
4661@K0j31L15k76k66R7N12l32j48K87k16o5k02O58k67k43J83K87j26l78M41l5
$$ 0 20 -111 204 -72 -338 -241 271 -61 -209 78 -138 -203 -405 253 -14 -257 -74 213 87 -291 150 115
4683A15j74R4K16k72k29L90o4k46K45J47k03k25J34N9r5l01K06M37k85k38M59
$$ 115 -59 35 251 -21 -250 140 76 -170 75 222 19 -206 -72 -13 -108 -409 -203 234 -51 -289 170
4704A70P6n16L61J03l13j88P02Om75o5L90k1j76j43K63k87L12j18J0j86K1K72
$$ 170 246 -270 91 194 -119 -307 395 401 -74 -139 251 230 54 -89 174 -113 199 81 91 -95 -74 198
4726A98j57j38Q1j5k60J13K59m9q2J22J57l50M2K53j84J18K8n3l77J12L33q4m49
$$ 198 41 -97 -16 -31 -291 -178 81 32 -50 72 229 -121 -79 174 -10 108 136 83 -294 -182 151 67 -382
4749c82N98k64q6QM7J01l06j25N2K69k24K13J72k40J02J81j9j69l7L46k73Q2Q4
$$ -382 216 -48 -134 -126 -79 22 -284 -409 -357 -88 -312 -99 73 -167 -65 116 97 -72 -109 237 -36 46 130
4772A30j60JN7j2J87l15L9L55m39J88J3O6j14p4R9J80l16n8J26n9J04N9J19M0
$$ 130 -30 -29 28 16 203 -112 -73 282 -157 31 44 110 -4 -78 21 201 -115 -173 -47 -106 -2 57 176 216
4796B16k02N34n25l26N54K71m76j18J18J52k32J1K76j28l03J67J68n49J95%L40
$$ 216 14 548 23 -303 251 522 46 -72 46 198 -34 -23 253 125 -178 -11 157 -392 -197 -197 143
4817A43m90J12M62l57k09K30J51j74k43M68R5q13O25J96k94j09L10k5k72O8K62
$$ 143 -347 -235 227 -130 -339 -109 42 -132 -375 93 188 -625 0 196 -98 -207 103 78 -194 -126 136
4838A36n4n10L98K92p5l78RM66k95m12O95j17l12K82n2q9j80M48l8l14m8L96L3
$$ 136 82 -428 -30 262 187 -191 -182 284 -11 -423 272 155 -157 125 73 -16 -196 252 214 -100 -148 248 281
4861B81p86R43l58K23n19N27qm88j74M02j11J77m1l6K84n45M06M8n72M21K43m97
$$ 281 -505 438 80 303 -216 311 303 -185 -359 43 -68 109 68 32 316 -229 177 225 -347 74 317 -180
4883a80K9R7K28M4r64Q06J29l95J84Q3J49m38k46Q81m01m99N59L0j51O1m6j0r0
$$ -180 -151 -54 174 218 -746 60 189 -206 -22 61 210 -228 -474 407 6 -493 66 96 -55 6 -40 -50 -140
4906a40J60K19o13K47K19j63j37J86J55O3m14J96J23j86K11q0Q4j01l4R9J35j79
$$ -140 20 239 -374 -127 92 -71 -208 -22 133 196 -218 -22 101 -85 126 46 130 29 -5 94 229 50
4928E0J94J28n44K44j06P8J8q9LJ01P3Pj48l34O38l69m7M2L09P3n24J14N18l38
$$ 50 244 372 -172 72 -34 44 62 -27 -24 77 150 157 9 -325 313 -56 -103 -61 248 321 -203 -89 429 91
4952I1j37J50k7J32q3O1j66K5j23J51l17L88N1q5j23O8K2n2j21m3M46n22J56J29
$$ 91 -46 104 77 209 126 187 21 46 -77 74 -243 145 196 111 -12 56 78 26 -95 -138 308 -214 -58 71
4976G1n0m54R0O56o2o24K70M4Q0r2J92k2j30N5J50j15l13M56J6m07P5L29o4m82
$$ 71 21 -433 -343 313 251 -373 -103 -59 21 -71 121 99 -31 24 174 59 -254 202 218 -189 -114 215 151 -331
5000c31N92K0n87L47J07m7j70j89O18q3l49K45J05o13K57K80k5m21M65ml59L6
$$ -331 261 281 -306 41 148 101 -69 -258 360 277 -72 173 278 -335 -78 202 177 -244 221 217 -142 -106
5022a06M32pn12K45K78n5m80K03K86m62P3J63J52n29J72M01n6p91N46L01m08j40
$$ -106 326 319 -193 52 330 275 -205 -2 284 -178 -105 58 210 -319 -147 254 198 -593 -47 254 -154 -294
5044b94M15J23l72j67N28K19p13M54J62m42l09N27N9k57k59N81j30k26R2O2qk13
$$ -294 121 244 -128 -295 233 452 -261 193 355 -87 -396 131 190 -67 -326 255 125 -101 -9 53 45 -168
5066a68K06K54m76QN43j82n04O09m5j36k32K28J23l03R5M33k96j93P8K94o46n8
$$ -168 38 292 -184 -176 367 185 -319 290 245 109 -123 105 228 -75 20 453 157 -36 42 336 -310 -368
5088c68O93j72l21J43P1M2j37J42M7l99J51K04m6l07K94J73o8m04J81K53j31l47
$$ -368 325 153 -168 -25 46 88 -49 93 140 -259 -108 96 50 -257 37 210 142 -262 -81 172 41 -306
5110c06M24o9r1J43n1k7l07K59j3l71K61K38j63j17P3K22k30k51M02K24l80n4
$$ -306 118 49 -42 101 50 23 -284 -25 -38 -409 -148 90 -73 -190 -117 105 -125 -376 26 250 -130 -184
5132a84K79n6k54L66j33r7J27K94l55P6o2J53j58qK5J17J45k85N8r0K3K09k57
$$ -184 95 39 -215 151 18 -79 48 342 -13 63 1 154 -4 -12 13 130 275 -10 48 -42 -19 190 -67
5155f7o8J16J40p0j25L53r2k84J38L9k34M68k47J20j7k35P7J35l28k7M29o1o1
$$ -67 -135 -19 121 51 -74 279 187 -97 41 80 -154 314 67 187 170 -65 12 147 -181 -208 221 160 99
5178I9PJ8N5m07L02K0k46qK75l49k5L78m2j13j04J55j22M1j04J47M3k81K06M74
$$ 99 106 124 179 -228 74 94 -152 -160 115 -234 -259 119 77 -36 -140 15 -107 -66 -170 -23 20 -261 -55 419
5202D19n54j85L55k01KK17j31j80j2M97J47p49L73Q8m3oj41M18l33k53M60J07
$$ 419 -135 -320 35 -166 -164 53 -78 -258 -270 227 374 -375 -2 86 43 37 -104 314 -19 -272 188 295
5224B95n88L21M0J33l31J02M49m65j39L03M0k23j1M56m6m48K87J11m29j67L97
$$ 295 -293 28 68 201 -130 -28 421 -44 -183 120 160 -63 -74 382 336 -112 175 286 -143 -310 87
5245H7K00l75L20N1J9m28r9M94n00MK15Q6l70K45J25J69q78O66J56o24K00K95
$$ 87 287 -88 232 283 302 -126 -225 269 -231 -227 -12 74 -296 -51 74 243 -635 31 187 -437 -237 58
5267E8m8m04J69P04m13o27O85n8j54j70K45M33n57j12M15j43l85N20r7K3pNJ05
$$ 58 10 -394 -225 479 66 -561 124 66 -88 -258 -13 420 -137 -249 166 23 -362 158 61 84 77 82 187
5290A87k37r3M33k37j19J32R5k74O5J53J71o22K17M61l73J51l3J85k38m6L51J41
$$ 187 -50 -143 290 53 -66 66 161 -113 -48 105 276 -346 -129 332 -41 110 77 262 24 -22 329 470
5312D70r12M99m6K9R8j91K31o9k92N00n05%K91j91J20n9L57j43m67K74P9j16j60
$$ 470 -442 57 11 40 138 -53 178 109 -183 317 -188 -188 103 -88 32 -27 330 187 -280 -6 73 -43 -203
5335b03J28K79n7n05L80P5l04Q2L66k04k69J88O9R3l00K56k69l6M33q8J8Q9k43
$$ -203 -75 204 147 -358 22 97 -207 -125 241 37 -232 -44 25 118 -182 74 -195 -231 202 114 132 221 -22
5358b2K63k25j24J25o2j15J03o7kN7N9J44j97K24k31lJ10j2j88K45L7m8P2l35
$$ -22 241 16 -108 17 -45 -160 -57 -124 -126 -69 -10 134 -63 161 -70 -73 37 25 -163 82 119 71 143 -192
5382a92L70l06P8J87j74J84o8Q0q9J02j41L38l05k12J34Q8o0Nj99L82k90LM70
$$ -192 178 -128 -50 137 -37 147 79 159 70 172 31 369 64 -148 -14 74 14 19 -180 202 -88 -85 385
5405C85p00R4L53k67J53l44M32N2n40K29O12n11j14J8M08k00m46L76J73l90J16
$$ 385 -315 -221 132 -135 18 -326 106 158 -382 -153 459 -52 -166 -148 260 60 -386 -10 163 -227 -111
5426a11K27k97J46j08K13n1m14N57j76j98R3K86L4p53N05N09m41j64P53n28n07
$$ -111 116 -181 -35 -143 70 19 -395 162 -14 -212 -119 167 201 -552 -47 462 21 -143 610 82 -425
5447d25O78m0n4m40K88J99l8n66O42J01n68M9M24k4m19L10K52n30J51K09k46j50
$$ -425 253 213 159 -281 7 206 168 -398 244 345 -223 -174 250 226 -193 117 369 -161 -10 199 -47 -197
5469a97L5M23k08l66M56J26n69K49J2K70l59J30L48m39l7J14P9m14M11J1J40l62
$$ -197 -162 261 53 -313 143 269 -300 -51 -39 231 -128 2 350 -89 -126 -12 67 -347 64 75 215 -147
5491a47R0M37n98J8M49j20l68K2M43k75l70L21N90p56k04O25lk37J4Q4L3k50K98
$$ -147 -57 380 -218 -200 249 129 -239 -217 226 -49 -419 -98 492 -264 -468 157 154 -83 -69 15 48 -202 96
5514I6o3j97j40J99L78m81O2L47o1k86L0K81n7kj35N3r7M3K85n8k23l4K05k68
$$ 96 33 -164 -304 -105 273 -208 -146 201 140 -146 -116 165 108 106 -29 24 -73 -30 255 197 -26 -60 145 -123
5538a23J31k01K75j01l9M0lm2on6j06R0K20n5K4k99K16J5j44M4J24Lm2M8j56K1
$$ -123 8 -193 82 -19 -58 -18 -21 -63 -69 -125 -231 -141 79 24 48 -251 -35 -20 -164 -120 4 7 -35 13 -143 -122
5564a22K61l26mL35k0k0M0j96n8J2K1L29m27K63J17k36p8J92j44k5K8M21l71L9
$$ -122 139 -187 -191 144 124 104 144 -52 -110 -98 -77 252 -175 88 205 -31 -109 83 -61 -86 -58 363 -8 31
5588C1J6J31O2l35L12j45j31k96L90o7J9oK08R0n56R3M5K49k07k5L94n30J95L61
$$ 31 47 178 240 -95 217 72 -59 -355 35 -32 -13 -19 189 279 -277 -184 -139 110 -97 -122 272 -258 -63 298
5612B98l62O3q3K66j55j03K14j6k94K01N4o4k19J74J86k44N5j2M8l59K60M20n18
$$ 298 -64 -1 -84 182 27 -76 138 122 -172 29 83 19 -200 -26 160 -84 -29 -41 7 -352 -92 328 -190
5635a90n6J23K52o3m84O24k01o5R8Pk07l2K16J84j16l49J50K19k77N7L02k20j68
$$ -190 -246 -123 129 66 -418 206 5 -60 38 45 -162 -194 22 206 90 -259 -109 110 -167 -110 192 -28 -196
5658a96J97K04l27P5L3K20n69K25L65k11j75J75L1j04j69L43J29l93J55M7O3l79
$$ -196 1 205 -122 -47 -14 206 -363 -138 227 16 -159 16 47 -57 -226 117 246 -147 8 55 118 -261
5680b61K08L55k71p8K34R2o03M43J73j50k20J26K1k56J06J16M2p7J17J63L1o66
$$ -261 -53 302 31 -47 187 279 -324 119 292 142 -78 48 69 -187 -81 35 77 0 117 280 311 -355
5702c55J52L58k96k05M39l03K5J35J18k20j42M07Q7k61n0J83n1l7k81M48o1j87
$$ -355 -203 155 -141 -346 93 -210 -185 -50 68 -152 -294 113 200 -61 -111 72 21 -16 -297 151 90 -97
5724i7N5J01j10k26M06J7j74p2J25k36J13M02k10l21J81R5j93J08O5O6j49k8K30
$$ -97 -42 59 -51 -277 129 146 -28 -100 25 -211 -98 304 94 -227 -46 49 -144 -36 29 95 -54 -82 148
5747A48q5j42k6J49o8j4P3R3j68J29O9l18L55l10M4J72l80K92r1J41k65M4K20
$$ 148 63 -79 -105 44 -24 -38 35 128 -40 89 158 -160 195 -115 -71 101 -279 13 -78 63 -202 -158 62
5770F2j2k33M40m35K28l20L39m74N34l70L60m8L1j5K1j30J64k07k72M86p6j4j96
$$ 62 50 -183 257 -178 50 -270 69 -405 129 -241 119 71 102 87 108 -22 142 -65 -337 149 73 59 -137
5793a37M4L05l36M4J01k28J66N5j2j18OJ30j04L5J63j24j35L8j28K99j30M5M52
$$ -137 -93 212 -124 -80 21 -207 -41 14 2 -116 -110 20 -84 -49 114 -10 -145 -107 -235 64 -66 -21 431
5816D31o83J26K85r3l45L11R0p2j10J64K64l48k88M36M7m22J85J56o2n19O74k8
$$ 431 -252 -126 159 66 -279 32 122 50 -60 104 368 20 -268 168 215 -207 -22 134 72 -447 227 199
5838A99m26J51K66k31k08K73J10j31l18M31P3n59L44R9J56l75r1O33k62l19M2
$$ 199 -227 -76 190 -41 -249 24 134 3 -315 116 189 -370 -26 73 229 -146 -237 396 134 -185 -143
5859a43K90l54j7K73J59k63l22P85n36j61J66M5n4L9J34J01k96J63K41m36j82
$$ -143 147 -207 -224 49 208 -55 -377 408 -128 -289 -123 -78 -132 -93 41 142 -154 9 250 -186 -368
5880c68L35J79j24k90L26J24o3Q1L3n3l76M33Q3l43j45K74N4k33J8J51p7r2n5
$$ -368 -33 146 22 -268 58 182 119 200 233 180 -196 237 320 -23 -168 106 160 -73 -55 96 19 -73 -128
5903a28L01k69j06L90N9j19o5K50l01k03J26L38m14q3J83J7P4Oj34K46l64L34
$$ -128 173 -96 -202 188 247 128 63 313 12 -191 -65 273 -141 -224 -41 -24 50 56 -78 168 -196 138
5925A38K4m06J67J41j53O0NJ42q2k04J66rj86Q2K59j56J2r7Q3K06n62N98k00k1
$$ 138 162 -244 -77 64 -89 -29 -24 118 36 -168 -2 -11 -197 -115 144 -12 0 -97 -14 192 -370 228 28 7
5949Gk97J79K96j93m55N92k86pJ73j67K28l84J74J84J4p1K16k28R7j38M8K00l0
$$ 7 -290 -111 185 -8 -463 129 -157 -164 9 -158 70 -314 -140 44 58 -13 203 -25 72 -66 -18 182 152
5972A52m6n5j30R3p3J19K85m13K36k96P9J70j16Q7q5j67J03M7j75L08j81M3K39
$$ 152 106 51 -79 14 -59 60 345 -68 168 -128 -49 121 5 92 7 -160 -57 -10 -185 123 -58 -15 224
5995B24l77L08l63J25n6L37n4k51qJ47j62j54L17o6j96M6L58k87K4j54J90m3q
$$ 224 -153 155 -208 -83 -139 198 144 -107 -115 32 -130 -284 33 -33 -229 -183 175 -112 -88 -242 -52 -95 -103
6018a03J15k51J20jK24q4j56L85n3k51j30J31R7L8J2L9J2k60K37J25j00p2J62
$$ -103 12 -239 -119 -120 104 20 -136 249 196 -55 -185 -54 43 81 93 132 144 -116 121 246 146 74 236
6041B36j60j90M8M31l75J41P2l71QM0K33L4j37K2J95j61q1K06J94m19N1J47q4
$$ 236 76 -114 -66 365 -10 131 203 -168 -160 -120 113 147 10 32 227 66 -15 191 385 -34 17 164 80
6064H0k89K98R4k74J00O7P5n20J02K81K43m35J07Kk28J15K42Q4j51QM34l85j37
$$ 80 -209 89 183 -91 9 76 151 -369 -267 14 257 -178 -71 -69 -297 -182 60 144 -7 1 435 50 -87
6087h7J04L22k73l32N30j67j53M4K55j02l78R9K86k06k62L19K8r5k64M67k83j01
$$ -87 17 339 66 -266 264 97 -56 -12 243 141 -237 -138 148 -58 -320 -1 27 -68 -332 135 -148 -249
6109b49Q9M98l12l64M41j31O7k77O77l42j54J72l6k34J21J78k26pq7L79j70m66
$$ -249 -160 338 26 -338 103 -28 39 -238 439 97 -57 115 79 -155 -34 144 -82 -89 -176 203 33 -433
6131d33K89M05n15R4L17j59P8k95K48j18R1L30l33J30l58K26K74k20k01N5L4j1
$$ -433 -144 261 -254 -160 157 -2 76 -219 29 -89 2 332 -1 129 -229 -3 271 51 -150 -95 -61 -72
6153g2Q4l0k43J35K56K4l69K7Q1K17k11j65M94j69j48L6K34m83M00O7j36N4l5
$$ -72 12 -18 -261 -126 130 154 -215 -188 -107 110 -101 -266 228 59 -89 -53 181 -302 98 165 29 83 48
6176D8J83k60Lr4K08J66m81J48Q2Q3M3k1j83rK31l20M4n9K7L9n4J62P8j1L8p1
$$ 48 231 -29 -26 -120 88 254 -227 -79 3 86 129 108 -75 -84 147 -173 -129 -188 -161 -122 -176 -14 64 53 91 20
6202B0J70L5j94R8l12K39Q7l00rN27k73m1K2m2q1j2J31k52N5J32M6l7K6J85k31
$$ 20 190 225 31 129 -183 56 143 -157 -166 361 88 47 69 27 -54 -66 65 -187 -132 0 46 9 35 220 -11
6227a1k14kL48l07J04K50k36m3N2L0J5k60J23N22m73K55kj76P2j97K60o7l30O5
$$ -11 -225 -227 121 -186 -82 168 -68 -111 -59 -29 -14 -274 -151 371 -102 153 151 -25 47 -150 110 43 -287 -222
6251b22K55r6j17l8J54K92k74J14j32k31J60K87R6n32K62M62m93j44M53j62k26
$$ -222 33 -63 -180 -218 -64 228 -46 68 -64 -295 -135 152 248 -284 -22 440 -53 -197 256 94 -132
6272a32J7J29J24l78J59%L62m39K58J8NJ29J5m36K11K40j13l34o1M25j51j53L05
$$ -132 -115 14 138 -240 -81 -81 281 -158 100 118 123 252 267 -169 42 282 169 -165 -226 199 48 -105 200
6295B00j56o2m76L21L02o7j85L0L02l30O7M06k71k41J69J42j80J50j67L09n79
$$ 200 44 -18 -494 -173 129 62 -123 -93 209 -121 -54 352 81 -160 9 151 -29 121 -46 263 -316
6316c16R6K00J78n10M25n3O3j59J52J30l21Q6L24m09QK91k54L2N2O6p7j89J40
$$ -316 -220 -20 158 -352 73 20 83 -76 76 206 -115 -29 295 -114 -106 185 -69 -37 15 81 4 -185 -45
6339d5J33j92M2K18j11J93l76K6M32n11J12L78m08J20L66k60J94q16N28N0j54
$$ -45 88 -104 -62 156 45 238 -138 -112 320 -191 -79 299 -109 11 377 117 311 -505 23 73 -81
6360h1J02L30k35k24K14J70k42j74M33n03J18K35j32P2Qm05L49J26k15l9K33k30
$$ -81 21 351 116 -108 106 276 34 -140 293 -210 -92 143 11 83 91 -314 35 161 -54 -93 140 -90
6382i0J08l01K75k78L79j56Ql8K12j95N3j51L43j37L2j98Q4K2k39J90o2K21l45
$$ -90 18 -283 -8 -286 93 -63 -55 -93 119 -76 -23 -174 169 32 64 -134 -50 -28 -267 -77 -139 82 -263
6405b63Q2K86O9k80Q1j6J8J20j3n4j71K94j2l42J66K51j9j89j26L08K3j80J8J01
$$ -263 -181 105 174 -106 -25 -41 -23 97 84 30 -141 153 141 -201 -35 216 197 8 -118 190 213 33 51 152
6429A52K39l17K94l06j85k04R3M41k16n8j17O73o04R4L2pO3j06J18j21m6J83j58
$$ 152 391 74 368 62 -123 -327 -234 207 -9 -67 -184 489 -115 -21 11 4 67 -39 79 -42 -88 95 -63
6452f3K3j52K76K3j37j30K18q9N7j20j17J13R6P3n6o5k00K96j40n6J58J26q9j14
$$ -63 -40 -192 84 107 -30 -160 58 -31 26 -94 -211 -98 -2 71 15 -50 -250 46 -94 -150 8 134 45 -69
6476f9J10m9j62K2L40k92lJ67N1k03N4J10nj44J54J14J2l91J29L27k76J0j2L3
$$ -69 41 -8 -170 -148 192 -100 -103 64 115 -88 -34 76 71 -73 81 195 207 -184 -55 272 -4 6 -6 27
6500B7o1P9J45K0l21K18j76J17j38L05j39k14M3L14r5k03J36O9k26r7K10J08j20
$$ 27 -34 45 190 210 -111 107 -69 48 -90 215 76 -138 -95 219 124 -79 57 126 -100 -197 13 121 1
6523Al42M23j63p1K17J91k62k85L67l8p1J66j46j9o4L7J47o1l40M80o8k18j09
$$ 1 -341 82 -81 -152 65 256 -6 -291 76 38 -33 133 -13 -32 -96 -59 88 27 -313 167 99 -119 -228
6546b28K72M3p9j42L28j25j17k04L72j65R7P9k95J11J22N0j5j63N0k01Q8J26m4
$$ -228 44 87 8 -134 194 69 -48 -252 120 -45 52 131 -164 -53 69 119 104 -59 -9 -210 -122 4 -40
6569d0J65k80L08j59n2j2J67j02J07m54L63J0k10J99o8J18j1Q5N3q0j49r5L02
$$ -40 125 -155 153 -6 -58 -70 97 -5 102 -352 11 21 -189 10 -58 60 49 134 187 107 -42 -137 165
6592A65j10k6M0J68k94J15j04k36L02k2K19j39k07J44j43j43J46L95k49j22N4
$$ 165 55 29 69 237 -57 58 -46 -282 20 -2 217 78 -129 15 -128 -271 -125 270 21 -101 -47
6613d7J47k12Q1L63k22o9l02K03p5Q4K12N4j36K2j21M2j61J98r1J32j33l8J93
$$ -47 100 -112 -31 332 110 41 -261 -58 -133 -49 163 217 81 103 -18 24 -137 61 -30 102 -31 -69 124
6636A24J41k84N8m7M26n59K36k46J12P2j38L08j64M0j77J14pj12J55k7k55K77
$$ 124 265 -19 39 -8 418 -141 95 -151 -39 33 -105 203 39 79 -98 16 9 -103 52 25 -230 47
6658D7J43O2m40r2M24l36J30J6J81n8m3J51j40j53J25P7k4k4j58K59j10J27K80
$$ 47 190 252 -188 -280 144 -192 -62 -46 135 77 34 185 45 -108 17 94 70 46 -112 147 37 164 444
6681D44l44k88J98J01l19j67N05m2j74Q1J09k74j64J37L57j85k58N03l83J46q6
$$ 444 100 -188 10 111 -208 -375 130 88 -86 -5 104 -170 -334 -197 160 -25 -283 220 -163 -17 -103
6702a03J09j22K33j1k4j65J04M3j13j78l9M39j42p5J75QJ76l60M7jj42K26mj94
$$ -103 6 -116 117 106 82 -83 21 64 -49 -227 -266 173 31 -44 131 139 315 -45 2 1 -141 85 81 -113
6726a13j0j4n5L44k17J07L4l0J63J10j6n26K20K33k92r1L49J08k69o4K00j53l44
$$ -113 -123 -137 -192 152 -65 42 76 46 209 319 303 -223 -3 230 -62 -153 196 304 35 -29 171 18 -326
6749c26J45N3J08j67K02J3j51p2J03J4q2K24J15l66J07J16J90k26j8Q0r5MPO0
$$ -326 -181 -128 -20 -187 15 28 -123 -195 -92 -78 -160 64 179 -187 -80 36 226 0 -18 62 -33 -29 -22 38
6773C8j06K35j89J43k19J40K3K61j39j23j63j55K33k2J07j51r3O4K33l96L98j68
$$ 38 -68 167 -22 121 -98 42 65 326 187 64 -99 -254 -21 -43 64 -87 -180 -116 117 -279 119 -49
6795d9K62j84L0J52p4k2k8k16L4J26j06nL1k2N3m9k0K41j43J0j33K78K9k61J85
$$ -49 213 29 59 211 137 115 87 -129 -95 31 -75 -80 -49 -71 -18 -67 -87 154 11 21 -112 166 195 -66 119
6820A19j22K2n3k86M02n6j04K23K7j96p9J19K4r3M8k58K08k0k2J50l82J32j18
$$ 119 -3 19 -34 -320 82 26 -78 145 172 -24 -103 16 40 -53 -5 -263 -55 -75 -97 53 -329 -197 -315
6843c15L49m6j66J67K65j29K8j73J01N2o4j51J32l6P1J12k44k08K30q5m2K76j92
$$ -315 34 -12 -178 -11 254 125 153 -20 81 133 69 -82 50 14 85 197 -47 -255 -25 -110 -152 124 -68
6866f8L1j12J35J00j23J15k43L39l12P0L12k64j06K17j68K08k77j39M37j21J55
$$ -68 -37 -149 -14 86 -37 78 -165 174 -138 -68 244 -20 -126 91 -77 131 -146 -285 152 31 186
6887A86j63k24J14J57n7j02m9O4R6j20RM40k83k18j35L92k95L0K34p4r2J29j03
$$ 186 23 -201 -87 70 13 -89 -138 -74 22 -98 -89 351 68 -150 -285 107 -188 -158 76 2 -90 39 -64
6910f4J71k21j26K46k04J50K84r1j18r7J13L8n3q3J83n9k94K50J40J70j44j98
$$ -64 107 -114 -240 6 -198 -48 236 145 27 -70 43 81 28 -55 128 69 -225 25 165 335 191 -7
6932gN3j23J65j58K38l40%J62J08j58K76j48l33M63j13j41o6K58L7l13K08K02
$$ -7 46 -77 88 -70 168 -172 -172 -10 98 -60 216 68 -265 198 85 -56 -122 136 173 -140 68 270
6954B70j75j34J15Q6l91J80R1J84lk78R7o8lj2L56j69m14K15K36J33k22j73j33
$$ 270 95 -39 76 162 -229 -49 42 226 223 -55 42 -26 -29 -41 315 146 -268 -53 183 316 94 -79 -212
6977b12J77r5J48J27j26n6J16p1L9Q8j48k4n8N5J79m37K17J75j84J31K09m66Q0
$$ -212 -35 -130 18 145 19 -37 79 8 47 135 -13 -37 -95 -40 139 -298 -81 94 -90 41 250 -216 -136
7000a36n6K66L6j1k10r0P6J41J33p5j85J63j08J66k79J32n0K07K17m97K70j0k24
$$ -136 -192 74 110 99 -111 -201 -125 16 149 74 -111 52 -56 110 -169 -37 -87 120 337 -160 110 100 -124
7023a24J69K52k33q6q0Q9O7m47K72Q1q5j06K46j48K18j08J52K0r8J17m9l51K52
$$ -124 45 297 64 -22 -102 -13 54 -393 -121 -40 -125 -231 15 -133 85 -23 129 149 51 168 119 -232 20
7046B0M9j46l6O5J48j4l09J40K19m6j26M2j28K3NQ7J69l9k92J69J51j82J5J78
$$ 20 69 -77 -113 -48 100 86 -223 -83 136 90 -36 6 -122 -99 -94 -7 162 123 -169 0 151 -31 -16 162
7070A62J68l25o4J40j03JqR1j17n0K52k43J74O1k42J36j3j68K82k03j00M86k23
$$ 162 330 5 -59 81 -22 -21 -29 62 -55 -105 147 -96 78 139 -103 33 20 -148 134 -69 -169 317 94
7093I4P7k65M6K12j10M1K86l47m8J78l07J37J6J9k58M30l00Q7K0oL5j10l3J41
$$ 94 171 -94 -48 164 54 95 381 34 -14 164 -143 -6 10 29 -229 201 -99 -12 8 2 37 -73 -106 35
7117C5J78j28Oq6J14k63J53j4P0l1m0N7j82kM0N2q6Q5j52J51j98L97l50J95k05
$$ 35 213 85 91 5 119 -144 9 -5 65 34 -6 51 -131 -133 -93 -41 -127 -42 -194 -43 -241 156 -194 1 -204
7142b04K64j50J48j31N9l0l2J20j04L41m81J63j28K31k01J86M0j67K11l45L87
$$ -204 60 -90 58 -73 -14 -44 -76 44 -60 281 -200 -37 -165 66 -135 51 91 -76 135 -210 177
7163A77p7m0M3p2M1O6N7k44N4J16m4j53M1P4M9PJ03l57J23L3o6J31j93K64J01
$$ 177 100 60 103 31 72 138 195 -49 5 121 77 -76 -35 39 88 95 198 -159 -36 -3 -69 62 -131 133 234
7188B34l57Q9L21j02P8n33K49n0j33K25j10k76L28K02j93J34m83L83Ko8M5Q8p
$$ 234 -123 -34 287 185 263 -270 -21 -71 -204 21 -89 -365 -37 165 -28 106 -377 6 8 -60 -15 73 66
7211F6k7j8q7J09J34l21J39R1l8j72M2M4j50J85K4M1j48J24P8J19j77j63LPP2
$$ 66 39 21 -66 43 177 -144 -5 86 48 -124 -82 -38 -188 -3 21 62 -86 38 116 235 58 -105 -102 -95 -23
7236b3J20j04j87K09jp6J14j05R6rJ63k00j48J71j7K01j3k30L5j4K72j0l61r1
$$ -23 97 -7 -194 15 14 -62 52 -53 43 34 197 -3 -151 20 3 204 191 -39 -4 -18 254 244 -117 -208
7260b08k3J17K74n8K07n41J13N4J88m5j26N3l05J26K82j79L01k03k21L64k19L1
$$ -208 -231 -114 160 102 309 -232 -119 -65 123 78 -48 5 -300 -174 108 -71 230 27 -194 170 -49 -18
7282a8o7o5K93j57M5J88k37j36J35L2j10P4K6K28k12K33l09M3j37K29k61L97K2
$$ -18 -85 -150 143 -14 31 219 -18 -154 -19 13 -97 -23 3 231 19 252 -57 -14 -151 78 -183 214 236
7305B36l43K47j19P7J07j17l22N4J69J29j95K3K89n8j84N2j7k06L05Q8k08r9K33
$$ 236 -107 140 21 98 205 88 -234 -180 -11 118 -77 -54 235 177 -7 45 28 -178 127 215 7 -92 141
7328A41J83n8M0k77r4j7K19j37Q2NJ30k70L2J15p6R9k22j49M11r3k8N9k52K46
$$ 141 324 266 306 29 -65 -82 137 0 82 87 217 -53 -21 94 18 117 -105 -254 157 64 36 95 -157 89
7352H9j92Q6k7j23L21k52Rj05J95M7j40K64k81M10n88J76K25k10J44j76K66k66
$$ 89 -103 -17 -44 -167 154 -98 -89 -194 1 48 -92 172 -109 301 -287 -111 114 -96 48 -128 138 -128
7374a28n3J80j48L09j67o5J14q8j09L49m6k41K41l15Q8Q2j71J50rJ37m08K83J1
$$ -128 -181 -1 -149 160 -7 -72 42 -46 -155 194 148 -93 148 -167 -79 3 -168 -18 -27 110 -298 -15 -4
7397dl8K93m25J04K5J28j07P9K94j61n9r4k5J83m27j03P95m94pJ86j10j4k37M23
$$ -4 -42 251 -174 -70 -45 83 -24 55 349 188 129 35 10 193 -234 -337 458 -36 -43 143 33 19 -218 205
7421B05l28O5r8J25j15J08P4j84kL11k0j92K87l22kq4J88O2j66N1K03k36k8N2
$$ 205 -123 -58 -156 -31 -146 -38 36 -148 -150 161 141 -51 236 -86 -88 -172 16 78 -88 -37 166 -70 -98 -46
7445d6R9k28L56l60K64j76k00L39j1m1Q7j8r1pl3k00N64q9k35J89j69j00J14n6
$$ -46 53 -175 181 -179 85 -91 -291 48 37 -4 83 65 -26 -33 -66 -266 298 209 -26 163 -6 -106 8 -48
7469d8J79l20RL09l14K32J16k47j69J75J5Q8j02K52m03J83k1J98kj43O9J42o0
$$ -48 131 -189 -180 129 -185 47 163 -84 -253 -78 -63 25 -77 175 -228 -45 -66 132 130 -13 56 198 138
7492A38n4O2j80O4j40L22m5k42j02L01k69R8J83k9o8R8j59K65l31k8K18l45L67
$$ 138 84 146 -34 30 -110 212 167 -75 -177 124 -145 -47 136 107 39 137 -22 243 -88 -116 102 -243 124
7515A24l17L58P0m09J09J21m0k17L30p0m5j37J32n9n0K02j49l2J28j13K2J3J15
$$ 124 -193 165 235 -174 -65 56 16 -201 129 59 14 -123 9 -50 -100 102 -47 -79 49 -64 -42 -29 86
7538H6m58N32k49l8J11j51J01l5J19J23k06L7J64j81L4k07K37J01k71K52k76r5
$$ 86 -372 160 -89 -127 -16 -167 -66 -101 18 141 -65 -28 136 -45 -11 -218 19 120 -151 101 -175 -270
7560b70N76l40jj01J73J18j63j4J55j78J08R4j29L7j38J25k32O2M1N0j27J53j79
$$ -270 306 -34 -35 -136 37 155 -8 -22 133 -45 63 157 28 65 -73 52 -180 -118 -77 -27 -154 -1 -180
7583a80J13L0J16r6j82J72J01P2j5k16K1O5J35N1k23N6O0pl5j06J37l5K2o5L44
$$ -180 -67 -37 79 -17 -199 -27 74 146 131 -85 -64 1 136 187 -36 20 80 73 38 -68 69 34 56 -9 335
7608C35n8l08Pl9J05J6m1J62k24K52j73o0J02l95L19J0J80j60m8K6N6j18q7Q2
$$ 335 277 -31 -24 -63 42 58 17 179 -45 207 34 -26 76 -319 0 10 190 30 -18 8 64 -54 -141 -59
7632e9j75J19J88p2l6m7J24r1J51j36J58k0j36K9J12j86j1M1J18q1r8K49N9l73
$$ -59 -234 -115 73 1 -35 -82 42 -49 102 -34 124 104 -32 -3 109 -77 -88 -47 71 -10 -108 141 200 -173
7656a73j6k5R9J19k8J61k41J91q8j13N8j11J94K14j25k39P3P5j95J33J33M7j71
$$ -173 -189 -214 -115 4 -24 137 -104 87 -1 -114 -56 -167 27 241 116 -123 -50 25 -170 -37 96 143 -28
7679b8j09O9K74j53j10M11n20M10j68j87J57J28k13r6K01J96m00qj1K59L3j71
$$ -28 -137 -68 206 53 -57 354 -166 244 76 -111 46 174 -39 -135 66 262 -138 -146 -157 102 135 -36
7701c6J24l74L61r2R2J3N5k19Pk3P0p1l3P5R8j19J7n2o7J34p3J75r6l2K52j37
$$ -36 88 -286 75 -17 75 88 143 -76 -69 -92 -22 -93 -126 -51 47 -72 -55 -107 -174 -40 -113 62 -34 -66 186 49
7727D9k2q7NL5r4L8J76j09r8m3KRK42p6L3k04K09j18r5m5K18k94J55K17lP2k16
$$ 49 27 -60 -55 -20 -114 -76 100 -9 -107 -150 -148 -139 103 27 60 -144 65 -53 -148 -193 25 -269 -114 103 100 172 -44
7754d4M34m13K68j85j11J84k37J61o8R8k06P3J47l56L00o6R2q2Q6N6K6M9k51Q9
$$ -44 390 -23 245 60 -51 133 -104 57 -11 87 -119 -46 101 -255 45 -21 71 -11 75 131 157 206 -45 44
7778D4L46n14J21J99k3J94m17J59j36N0K52k75N0k26J79N9j19J7n3K60j24n6O1
$$ 44 390 -124 -3 196 173 367 -50 109 -27 23 275 0 50 -176 3 62 -57 -40 -93 167 43 -13 48
7801D8M1k27L21l75K85o3PLK03j84k46R1K96k61K81k77k6L1NJ09l3O8k31K51n8
$$ 48 89 -138 183 -192 93 30 37 40 243 59 -187 -96 200 -61 220 -57 -83 -52 -47 62 29 97 -134 117 59
7826E9Q9p8J7J14m2j80l0m1P8J60j3j14m5j24lK79j04J35j39OK23k17p0j36j1
$$ 59 148 70 87 201 159 -21 -51 -92 -14 146 133 19 -26 -150 -153 126 22 157 18 24 247 30 -40 -176 -187
7851a87L80k82J69L4N5k30Q7n2J40k05Q9J39j57K8Q3k27J59l5N3J78l70K13J19
$$ -187 193 -89 80 114 169 -61 26 -26 114 -91 -2 137 -20 8 91 -136 23 -12 41 219 -151 62 181
7874A81nm09K94j28J49j8j49l06N33j85l6J41r1J15j96J7l4Q1R7o1L9j76K40n0
$$ 181 176 -233 61 -67 82 64 -85 -391 142 -43 -79 62 -29 86 -110 -93 -127 -46 51 -10 29 -147 93 43
7898D3k44K08j6M8L1p6j43J20j25J58n5J82k95j1L64j75j10R6J19m5QJ77k58O9
$$ 43 -201 7 -9 39 70 -6 -149 -29 -154 4 -51 131 -164 -175 189 14 -96 0 119 74 82 259 1 70
7922G0j56K22l51K87p0M4pq6L31l12q5K75k7m33L39k2K5q3J69%N6m88K60o7L26
$$ 70 -86 136 -215 72 2 46 39 -47 284 -28 -113 162 135 -298 41 19 44 -39 130 130 186 -302 -42 -109 217
7947B17l30J03j15J93j20J96k88j0R5K63k85K59k99J32p9kn5K20j0j19R8o7QJ84
$$ 217 -113 -10 -125 68 -52 144 -144 -154 -59 204 -81 178 -121 11 -68 -70 -125 95 85 -34 64 -3 5 189
7971A89k8k91L21k01L3J08rR6j7k92q7J47n8L40j78k2L6j78J53j71L36l41Q3m
$$ 189 161 -130 191 -10 23 131 122 218 201 -91 -178 -31 -89 251 73 51 87 -91 62 -109 227 -114 -31 -35
7995c5P8O0j94R9n2N2M5l17L23R0n9O0k27J5J03r9K3Q4J91l16Q4j48K74j50j79
$$ -35 43 103 -91 8 -44 8 53 -264 59 149 90 150 -77 -62 41 -58 -35 49 240 -76 8 -140 134 -16 -195
8020a95M15m37J76q9J49k53K56q7J29P9MN8L2j91j40N6o8P6M3K82m61K74j0q8
$$ -195 220 -217 -41 -130 19 -234 22 -65 64 143 147 205 237 46 -94 -38 -106 -30 13 295 -166 108 98 10
8044A0J04r9lJ75j70Pj05R4L2J0k10K78O7qk37m3J25n1L11l78k7K9P2mq4J56K9
$$ 10 114 15 12 187 17 24 -81 13 45 55 -155 123 190 182 -55 -98 27 -24 287 -91 -118 -89 -17 -21 -105 51 80
8071H0J53j68K6pq8J70j8m0M4K1j18Rj88r7K02k0J43o5J45o5n7k48qJ96K06l53
$$ 80 233 65 91 84 -4 166 148 108 152 173 55 64 -124 -221 -19 -39 104 39 184 119 62 -186 -194 2 208 -145
8097a45J95R2j50J63k34K44m68M44k48K5J35j16p1J01K12l88R3M60m21Q3j34J75
$$ -145 50 142 -8 155 -79 165 -303 141 -107 -82 53 -63 -134 -33 179 -209 -116 344 -77 6 -128 47
8119D7j31J77n7k54K12l7k45M05j48k01K70l10M05m5M0j16j3j70L08k29J59j61
$$ 47 -84 93 36 -218 -6 -43 -288 117 -31 -232 38 -272 133 88 128 12 -1 -171 137 -92 67 -94
8141i4j93K93J1K7J6J60n23K93j70L53p4j17K14j76J18m9k19K21r5o7K79JK3k60
$$ -94 -287 6 17 44 60 220 -303 -10 -180 173 99 -18 196 20 138 89 -130 91 -4 -71 208 209 232 -28
8165b8K96n97L78l3J00J15j38j70O4l2j36N66m38l5P3k32L37j80K52j58M0K5j59
$$ -28 268 -329 49 16 116 231 93 -77 -13 -45 -181 385 -53 -88 -15 -247 90 -90 162 4 44 69 -90
8188i0L23n11J55
$$ -90 233 -278 -123
8191a23
$$ Imaginary data points
##PAGE= N=2
##DATA TABLE= (X++(I..I)), XYDATA
0@%%%%%%%%%JrJ6j6K4l2M0n6O7p5R6j20J39j63J92k25K65l12L60m12M72n43O21
$$ 0 0 0 0 0 0 0 0 0 0 1 -8 8 -8 16 -16 24 -32 35 -40 56 -64 75 -88 104 -121 144 -168 192 -220 252 -291 330
32C30p03P94q98J014j141J279j428J593j776J975k191K426k683K965l273L610
$$ 330 -373 421 -477 537 -604 675 -753 840 -936 1039 -1152 1274 -1409 1556 -1717 1893
48A893l979M384m828N318n861O466p142P903q768R757j0903J2252j3864J5830
$$ 1893 -2086 2298 -2530 2788 -3073 3393 -3749 4154 -4614 5143 -5760 6492 -7372 8458
62H458j8295K1482k5783L1942m1533N8642r8206L52111J22965o92940K49241M12276
$$ 8458 -9837 11645 -14138 17804 -23729 34913 -63293 288818 411783 -281157 -31916 380360
74C80360j78780m51272J37592K68956j63829k38179J03864M7089m090l9010m1089
$$ 380360 201580 -249692 -112100 156856 -6973 -245152 -141288 -94199 -98289 -137299 -178388
85a78388N5409O9838K5931j5559k0159J28016O7867p3774j0202Q8152O7864o5527
$$ -178388 -122979 -53141 -27210 -42769 -62928 65088 132955 59181 48979 137131 204995 139468
97A39468j45666J36605J08883k38168j16089J97853N3839k78835j04404K84326
$$ 139468 -6198 130407 239290 1122 -114967 82886 136725 -142110 -246514 37812
107C7812K0016l30636M5031K71362n8117j81803N6672K08854k4184j30243P7459
$$ 37812 57828 -272808 -227777 43585 -14532 -196335 -139663 69191 45007 -85236 -7777
118g777J05972l078m2366l5920P4011N2425j07287l4904N2901J7865o0927p6598
$$ -7777 98195 95117 52751 16831 90842 143267 35980 1076 53977 71842 10915 -65683
130f5683N1807L0521o7870j8898J0243J5549L6693m7292k7178P4104M0370l5876
$$ -65683 -13876 16645 -51225 -70123 -59880 -44331 -7638 -54930 -82108 -8004 32366 -3510
142c510n0981P3082P4843p9692l7122P4595K1642m3172l9397K2241N3909n7934
$$ -3510 -54491 18591 93434 13742 -23380 51215 72857 29685 -9712 12529 66438 8504
154H504n1039M7934K9620m5291n7159O2511O0259j00548l6722J23343N418j05402
$$ 8504 -42535 5399 35019 -10272 -67431 -4920 55339 -45209 -81931 41412 46830 -58572
166e8572P006J04815l377j11068L6616Q8170m7757m8872L0445K7480r900k7978
$$ -58572 -51566 53249 49872 -61196 -24580 63590 15833 -33039 -2594 24886 14986 -12992
178a2992M635K0779j0239M018j2059n841K6827o635j5468l292P380K1517j6560
$$ -12992 -8357 12422 2183 6201 -5858 -11699 15128 8493 -6975 -10267 -2887 18630 2070
191B070m0877L1620L5394l7616m1938L6035N4847n8634m2710P1063K2976o0155
$$ 2070 -38807 -7187 28207 -9409 -51347 -15312 39535 -19099 -61809 9254 32230 -27925
203b7925N80M9591l307l0207J4438K9785k6674l129K4864j3728o277M224r145
$$ -27925 -27345 22246 18939 -11268 3170 32955 6281 3152 28016 14288 8011 12235 3090
216C090L220J1638k6754j9310L2363K2723n7344k5043P7084O867p2723L23P1457
$$ 3090 6310 17948 -8806 -28116 4247 26970 -30374 -55417 21667 28534 -44189 -43866 27591
229B7591Q91n8236N382N3423j839l7317Q262K0201M118j7459l682J3574p317p350
$$ 27591 28482 -29754 -24372 29051 27212 -10105 -1843 18358 22476 5017 1335 14909 7592 242
243B42Q516k314k1152J3777J9051k6410k2711M1584J6715o3526O103O9911k5836
$$ 242 8758 6444 -14708 -931 18120 -8290 -31001 10583 27298 -36228 -30125 39786 13950
256A3950p5686N2620P0837p6624n7904R2931M1298j07349j3274J02329o184r1930
$$ 13950 -61736 -9116 61721 -14903 -72807 20124 61422 -45927 -59201 43128 36944 -54986
268e4986K3886P9098l8158n3341M3387L9283m6990j5345M6010O98l9980R994L9975
$$ -54986 -31100 47998 9840 -43501 -114 39169 -7821 -23166 22844 23542 -16438 -6444 33531
281C3531k6684l2136L1590K7555m5631k1384N5033M914o0017M754O6542k5925
$$ 33531 6847 -25289 6301 33856 -11775 -33159 21874 26788 -33229 -28475 38067 12142
293A2142o1699M2262N4300n6523m0508P0982J7437o8076n7O7313j9755n5809L7688
$$ 12142 -49557 -7295 47005 -9518 -50026 20956 38393 -29683 -29740 37573 17818 -37991 -303
306c03L8384m3637k1969N1008K748m3135J0592L9413j7937l2437K8749J9985k8816
$$ -303 38081 -5556 -27525 23483 26231 -16904 -6312 33101 15164 -17273 11476 31461 2645
319B645j6486K9055L830l1544l124K3945o476l1635J1710J9965j9528j8479K5139
$$ 2645 -13841 15214 19044 -12500 -15624 8321 1845 -29790 -18080 1885 -17643 -36122 -10983
332a0983J1393k8121M988L2245n584k5941K8862K5286k8666p394L7275L176l7927
$$ -10983 410 -27711 -22723 9522 3938 -22003 6859 32145 3479 -3915 33360 36536 -1391
345a391R993K8914j9832l0664J9140J0865l0121r214J4201k632j8593L945R606
$$ -1391 8602 37516 17684 -12980 6160 17025 -13096 -22310 -8109 -10741 -29334 -25389 -15783
358a5783n373k681J1961M856k832J0234P320M665q18N195R794l705o679M505M812
$$ -15783 -21156 -23837 -11876 -7020 -9852 382 7702 12367 11549 16744 26538 22833 16154 20659 25471
373B5471j2045r543K649L994j8152r551J4179n329j3371K045J1527j041o661O359
$$ 25471 13426 3883 6532 10526 -7626 -17177 -2998 -8327 -21698 -19653 -8126 -9167 -15828 -9469
387i469J3014j370q13O934K165Q723o336o299J0495k23j4226n068Q472m503j8755
$$ -9469 3545 2175 1362 8296 10461 19184 12848 6549 17044 16821 2595 -2473 5999 1496 -17259
402a7259J159J6654k0372r507K3740m48j7156O364K7103m623k1289K1997K5999
$$ -17259 -16100 554 -19818 -29325 -5585 -6033 -23189 -16825 10278 5655 -15634 6363 32362
415C2362k4728r023K6009J903j9868q359K0059o429k8702J0114J0650k2710r236
$$ 32362 7634 -1389 24620 26523 6655 -1704 18355 11926 -16776 -6662 3988 -18722 -27958
428b7958J6114L556j8829m429L6343m778l1487K9225L0012k0578j9801L3510K6680
$$ -27958 -11844 -8288 -27117 -31546 4797 19 -31468 -2243 27769 7191 -12610 20900 47580
441D7580l9272j7074N1538m816n0986J3486K9643j9913l9916K0383K7681m2211
$$ 47580 8308 -8766 42772 37956 -13030 456 30099 10186 -29730 -9347 18334 -23877
453b3877j4338L9721n358k9237J6248K2900p678k0046K8874K0742l5137Q216L3452
$$ -23877 -38215 1506 -3852 -33089 -16841 6059 -1619 -21665 7209 27951 -7186 1030 34482
466C4482j3901k3981J4252K3566k2518l4033L3806J6247n1276l090L3230k424
$$ 34482 20581 -3400 10852 34418 11900 -22133 11673 27920 -23356 -26446 6784 4360
478D360l6896o95M4507j3894l9165L4222K5614l0334l423K5825J1177k6816N41
$$ 4360 -32536 -33231 11276 -2618 -41783 -7561 18053 -12281 -15704 10121 21298 -5518 -4977
491d977L7922k2950k1776L1064Q69k8274K149J9970n999l3567J5415L2845m1107
$$ -4977 32945 9995 -11781 19283 20152 -8122 -5973 13997 7998 -25569 -10154 22691 -18416
504a8416j3139L7873K946k9071n508L7404M388m2244J5728L8413k6612j4258J9646
$$ -18416 -31555 6318 9264 -19807 -25315 12089 16477 -25767 -10039 28374 1762 -12496 7150
517G150J2660j5036j7269L0970O99l3307J7576J9077k2925r180J5372J2202k2165
$$ 7150 19810 4774 -12495 18475 19174 -14133 3443 22520 -405 -9585 5787 17989 -4176
530d176j4656L7788r194l1101J9927J3582j4698j4682J2552J9001k5448j2606
$$ -4176 -18832 18956 9762 -21339 -1412 12170 -2528 -17210 -4658 14343 -11105 -23711
542b3711L4187p416j9549J0075J0743K097j8189Q875K1586j9695m384K1241n835
$$ -23711 10476 3060 -16489 -6414 4329 6426 -11763 -2888 18698 -997 -5381 15860 10025
555A0025q636J259Q865K558k4290J1149J4072k4200j379J0570l016q559o138J3814
$$ 10025 1389 2648 11513 14071 -10219 930 15002 -9198 -10577 -7 -3023 -11582 -17720 -3906
569c906J735k1865J4840J1496j1294K058p45J3304M758j5343O143J1683J595l942
$$ -3906 -2171 -24036 -9196 2300 -8994 -6936 -7681 5623 10381 -4962 1181 12864 14459 10517
583A0517j5027J3671J6820k4914n827J0078M002m209j6907O501R308r460J477
$$ 10517 -4510 9161 25981 1067 -4760 5318 9320 5111 -11796 -5295 4013 -5447 -3970
596c970m556m946J9368m815j4082N862J1860Q122k0539k913K9006o190k1294R442
$$ -3970 -8526 -13472 5896 1081 -13001 -7139 4721 12843 -7696 -10609 18397 12207 -9087 355
610C55J3898j860k0668J989K8085j7414k1064J7169J3013j1380k0176J2546K3197
$$ 355 14253 12393 -8275 -6286 21799 4385 -16679 490 13503 2123 -18053 -5507 17690
623A7690k1692j5038K2460K566r487l387N022N578q038O189J27j3702J4655R709
$$ 17690 -4002 -19040 3420 5986 -3501 -6888 -1866 3712 -4326 1863 1990 -11712 2943 12652
637A2652k3409j410K1176J407k3003l773L4006q989l2468J9376K3146j8354j9160
$$ 12652 -10757 -12167 9009 10416 -12587 -16360 17646 8657 -23811 -4435 18711 357 -18803
650a8803J6089K0865j7825j8271K2695P755j3637k217K407P740j105m410j728
$$ -18803 -2714 18151 326 -17945 4750 12505 -1132 -3349 -942 6798 5693 1283 -445
663d45k130R653M730k0297j202K1140l115j7592m770K2321J277k6732P335K1184
$$ -445 -2575 7078 11808 -8489 -9691 11449 8334 -9258 -14028 8293 9570 -17162 -9827 11357
677A1357j1243j4699J4460J2418j4467j0711K5437M686k7470Q019K3028q497k1142
$$ 11357 114 -14585 -125 12293 -2174 -12885 12552 17238 -10232 -2213 20815 12318 -8824
690h824J0694J8009j7000j4796J8453J162k0986P494R497j3403j0261J8865N360
$$ -8824 1870 19879 2879 -11917 6536 7698 -13288 -5794 3703 -9700 -19961 -1096 4264
703D264k7211N763L0541j1859k6371K4095K5503k3507k0156L2748J9136l8213
$$ 4264 -22947 -17184 13357 1498 -24873 -778 24725 1218 -18938 13810 32946 -5267
715e267p748L6579J231l7138J131L0403r471l0809R449K1430j8337j3783J4744
$$ -5267 -13015 23564 24795 -12343 -11212 19191 9720 -21089 -11640 9790 -8547 -22330 -7586
728g586P579j5150o38J9236m009j2875J4403J5527j5330m979K0525M364k0000
$$ -7586 -7 -15157 -15795 3441 -568 -13443 960 16487 1157 -3822 16703 21067 1067
741A067J580K2556j2477k1224J4874J4760k5883j5593K6262O319l2417o454L3355
$$ 1067 2647 25203 12726 -8498 6376 21136 -4747 -20340 5922 12241 -20176 -26630 6725
754F725j212l0064N089K8194l844k0163J0115J7083m763q099Q461L911m256J201
$$ 6725 5513 -24551 -19462 8732 4888 -15275 -5160 11923 7160 -939 7522 11433 7177 8378
768H378J660l505l888M387j897o710k403K999j563n818J6K320r9m375L174M317
$$ 8378 10038 6533 2645 7032 5135 -1575 -3978 -979 -2542 -8360 -8344 -6024 -6123 -10498 -7324 -3007
784c007k124l273N598P368n959m543Q319Q095q905n805R509O031r256o562R981
$$ -3007 -5131 -8404 -2806 4562 -1397 -5940 2379 10474 1569 -4236 5273 11304 2048 -4514 5467
799E467L505r025m717Q467J911q766j377P155P11r366J170Q019k080r095K821
$$ 5467 8972 -53 -4770 3697 5608 -3158 -4535 2620 3331 -6035 -4865 3154 1074 -8021 -5200
814e200R045n297o280N411N569o586m20P001j444m904O613N982j0171j21J2796
$$ -5200 3845 -1452 -7732 -2321 3248 -3338 -3758 3243 1799 -3105 3508 9490 -681 -802 11994
829A1994j031j4280M645J3913q736j3181Q988R713j5787o263J2770q2j4716J123
$$ 11994 10963 -3317 1328 15241 6505 -6676 2312 12025 -3762 -10025 2745 2663 -12053 -10930
843a0930J3938o959j2059J0320J0404j1503m234J3496L640r847J214J3618n183
$$ -10930 3008 -3951 -16010 -5690 4714 -6789 -11023 2473 6113 -3734 -2520 11098 5915
856E915q612R303N981j2321k986J2308k218j4595J754J4475j0584j3179J1661
$$ 5915 -2697 6606 12587 266 -2720 9588 7370 -7225 -5471 9004 -1580 -14759 -3098
869c098P354j3021n283J5084K047j5198L962J8003r415j1106J4288Q926j2711
$$ -3098 4256 -8765 -14048 1036 3083 -12115 -8153 9850 435 -10671 3617 12543 -168
882a68o996J7874J755j7863M134J5114j0743j1365J1582O450j4014o430J8761
$$ -168 -7164 10710 12465 -5398 -1264 13850 3107 -8258 3324 9774 -4240 -10670 8091
895H091j365k0161Q454J5938j0439j3146J2696J2033j4338q522J8806J040j6703
$$ 8091 6726 -13435 -4981 10957 518 -12628 68 12101 -2237 -10759 8047 9087 -7616
908g616N869J0509n663j1056Q942R214j4913m276J7002l380j5000P012J0791n461
$$ -7616 -1747 8762 3099 -7957 985 10199 -4714 -8990 8012 4632 -10368 -3356 7435 1974
922A974j3971J1216J2356j7066l842J5279K83j2614R36J2057j869j4739Q465J0920
$$ 1974 -11997 -781 11575 -5491 -9333 5946 6229 -6385 -5449 6608 4739 -10000 -1535 9385
936I385j3735j596Q493J082q009j417J0541l029j0386Q988M830j0232J949N191
$$ 9385 -4350 -5946 2547 3629 -4380 -5797 4744 1715 -8671 317 5147 -5085 -3136 2055
950B055J93o359M58J0914p537o693J1597J027q683J666N352K034q816K05J1634
$$ 2055 2248 -4111 -3653 7261 -276 -6969 4628 5655 -3028 -1362 3990 6024 -2792 -2587 9047
965I047q465l992O458l99k287k817L012K761p563K293N776q103K015L618j980
$$ 9047 582 -3410 3048 2649 362 -2455 557 3318 -4245 -1952 3824 -4279 -2264 1354 -626
980f26L74k207N527m92n916O505J645o297M216P57j561o84k339O465n901n067
$$ -626 -252 -2459 3068 2576 -3340 3165 4810 -1487 2729 3486 1925 1241 -1098 5367 -534 -5601
996e601Q845l231n445J653K176J883n789k124J0494l895l960M259r7M600l611
$$ -5601 3244 13 -5432 -3779 -1603 280 -5509 -7633 2861 -1034 -4994 -735 -832 3768 157
1011A57k809O890l74k319m21k629O735j749q868N664M79j043k440l678P104q62
$$ 157 -2652 4238 3864 1545 1124 -1505 5230 3481 -5387 277 756 -287 -2727 -6405 699 -163
1027a63n621M240j43Q09K927n117M052K394j715J907m582M579M286r860J269O582
$$ -163 -5784 -1544 -1687 -878 2049 -3068 984 3378 1663 3570 -1012 3567 7853 -2007 -738 5844
1043E844l686m072j661P608k26j4462R354Q809j1120l808Q493O723q823q024J5730
$$ 5844 2158 -1914 -3575 4033 3807 -10655 -1301 7508 -3612 -7420 1073 7796 -1027 -9051 6679
1058F679L967j6807M266R439k724p308o17R614o255p382R350k355q215O929K647
$$ 6679 10646 -6161 -1895 7544 4820 -2488 -3105 6509 254 -7128 2222 -133 -8348 -1419 1228
1073A228n929l463P805Q361j6491k18K0271n196j5094P107J5014n560j8042J0243
$$ 1228 -4701 -8164 -359 8002 -8489 -8707 11564 6368 -8726 -1619 13395 7835 -10207 36
1087C6J7233j9181r562J5745L347j4295o351J6032J005j8589O093J4188j0042
$$ 36 17269 -1912 -11474 4271 7618 -6677 -13028 3004 4009 -14580 -8487 5701 -4341
1100d341n504R146N366o107l848J3712j356j1350J0257O271j0756k544J0058J450
$$ -4341 -9845 -699 4667 -1440 -5288 8424 7068 -4282 5975 12246 1490 -1054 9004 10454
1114A0454j3945k057J7547q303j7297J1087J0093j0352j2088J1653J1608j4679
$$ 10454 -3491 -5548 11999 3696 -13601 -2514 7579 -2773 -14861 -3208 8400 -6279
1126f279p322J7501J888j1782K048R144J437r334L945P692q091p06P228m246n104
$$ -6279 -13601 3900 5788 -5994 -3946 5198 6635 -2699 1246 8938 847 141 7369 3123 -1981
1141a981M319K937n570o509R489J834j2557K626Q341k897p826K988Q152m318p567
$$ -1981 2338 5275 -295 -6804 2685 4519 -8038 -5412 2929 32 -7794 -4806 3346 -972 -8539
1156h539Q130M435q043N89M729J178n133M76O459l077l800N079Q72m169J289K171
$$ -8539 -409 4026 -4017 -3428 1301 2479 -2654 -2178 4281 1204 -2596 2483 3355 -814 475 2646
1172B646N34m624J310N090n170k168M036k13l375m40K874q35l863K752K771n369
$$ 2646 3180 -1444 -134 4956 -214 -2382 1654 1441 -1934 -2374 500 -335 -4198 -1446 1325 -4044
1188d044L98M726k90l338O68N612p47m303K971M033l136p03J149J390j761j479
$$ -4044 -3646 1080 790 -2548 -1880 3732 2985 -1318 1653 5686 2550 1847 2996 4386 2625 1146
1204A146J682j580j551L93k80j555m40p10N96M84k344R84J319J049j267l83L299
$$ 1146 2828 1248 -303 90 -190 -1745 -2185 -2895 -2299 -1815 -4159 -3175 -1856 -807 -2074 -2457 842
1221H42P73k024M86L061j131j064O26J666k045j527K499j206k814K16K504k209
$$ 842 1615 -409 77 3138 2007 943 1569 3235 1190 -337 2162 956 -1858 -1642 862 -1347
1237a347k982K481K067l541j324M855k79l755J161N469j912n046M603M933m728
$$ -1347 -4329 -1848 219 -3322 -4646 209 -70 -3825 -2664 2805 893 -4153 450 5383 655
1252F55m746P152L370p325k622Q080N33q826J772P731l813q042O323N916p601
$$ 655 -4091 3061 6431 -894 -3516 4564 5097 -3729 -1957 5774 1961 -6081 242 6158 -1443
1267a443m196Q387K356r511P21Q036k363o592M960M458o702j155P434j522q331
$$ -1443 -5639 2748 5104 -4407 -3686 4350 1987 -4605 355 4813 -1889 -3044 4390 2868 -5463
1282e463N371P678p483p046R044O087j1116l732J0734K142j1007k16R718j808
$$ -5463 -92 7586 103 -6943 2101 8188 -2928 -6660 4074 6216 -4791 -5007 4711 2903
1296B903r140L568P880o288m866O537L623o812j787P328o99o030K406N079m857
$$ 2903 -6237 -2669 5211 -1077 -5943 594 4217 -2595 -4382 2946 2247 -3783 -1377 3702 -1155
1311a155k392N457K62o131J053P588n162o160O377N735q340l496R091J640q268
$$ -1155 -3547 1910 2172 -3959 -2906 4682 -480 -6640 -263 5472 -2868 -6364 2727 4367 -3901
1326c901O2R515k957o616N234M819n640l134O727L74o541K59O307l853m628L766
$$ -3901 -3839 5676 2719 -3897 1337 6156 516 -2618 4109 4483 -2058 -1799 4508 655 -3973 -207
1342b07J517l675j083M451j643m096M046M415n523j797P218P93m683j476P992
$$ -207 1310 -2365 -3448 1003 -640 -4736 -690 3725 -1798 -3595 3623 4416 -267 -1743 6249
1357F249o27p479L403M710m001m607L767K293n636l384O750q13p783K456N296
$$ 6249 5622 -1857 1546 6256 2255 -2352 1415 3708 -1928 -5312 1438 625 -7158 -4702 594
1372E94k317n151L224N420l889k350O337N9l394L387K140j942k667M538K190p658
$$ 594 -1723 -6874 -3650 1770 -2119 -4469 1868 1927 -1467 1920 4060 2118 -549 3989 6179 -1479
1388a479K99O399l183n728J918L606k168n870L737M152o123n09M114Q93k502j062
$$ -1479 -1180 5219 2036 -3692 -1774 1832 -336 -6206 -2469 1683 -4440 -4949 -835 58 -2444 -3506
1404c506M703J609m698J894L638j415o61q40K684L03l973K416N65k582N22j19
$$ -3506 1197 2806 -1892 2 3640 2225 1564 724 3408 3711 -262 2154 2719 137 659 540
1420E40M1m95k059L291q60l360K942p3p70k84k11K649j952k182L642m28k368J814
$$ 540 581 86 -1973 1318 458 -2902 40 -33 -803 -1087 -1298 1351 -601 -2783 859 431 -1937 -123
1438a23N08J420l438q6N722k877l789L536K201j463l165J689M724n625k129N999
$$ -123 385 1805 -1633 -1719 4003 1126 -2663 873 3074 1611 -1554 135 4859 -766 -2895 3104
1454C104k199l796N86L054o58o484L434N900p368k044P064J82l470j934O874J434
$$ 3104 905 -2891 -2305 749 91 -6393 -2959 2941 -4427 -6471 593 775 -2695 -4629 2245 3679
1470C679p519M332N428n122o50L586R59l284k629O528k028p700N540K283n793
$$ 3679 -3840 492 5920 798 148 3734 4693 1409 -1220 5308 3280 -4420 1120 3403 -2390
1485b390k009L702K674o367k523J0101k607p706O084M382k201m986M273P237p410
$$ -2390 -4399 -697 1977 -4390 -6913 3188 581 -7125 -1041 3341 1140 -3846 427 7664 254
1500B54l093Q809o92n640J164L198k80n870K038M537p565K4N299l491l007J973
$$ 254 -2839 5970 5278 -362 802 4000 3720 -2150 -112 4425 -3140 -3116 2183 -1308 -4315 -2342
1516b342L473k463n452P215L191q968K381O212j552m666M71P802l070p617P022
$$ -2342 1131 -1332 -6784 431 3622 -5346 -2965 3247 1695 -2971 -2500 5302 2232 -5385 1637
1531A637L434o705j55K957J685m315j438O134l022l687M774k31l126P61K191M46
$$ 1637 5071 -1634 -1789 1168 2853 -1462 -2900 3234 212 -3475 1299 1068 -2058 -1297 894 1340
1547A340m721J630N850o405j642N850n09l807m69N086P27o844K704O587n071k395
$$ 1340 -3381 -1751 4099 -2306 -3948 1902 1393 -2414 -2883 2203 2930 -3914 -1210 5377 306 -2089
1563b089L939J893j916l718N143J042n620J803K632l032j141Q24J215k205k541
$$ -2089 1850 3743 1827 -1891 3252 4294 -1326 477 3109 77 -1064 -240 975 -1230 -3771
1578c771N080k042l938M087Q91j741j338K387K823l282j376N697j011l269J948
$$ -3771 1309 -733 -4671 -584 307 -1434 -2772 -385 2438 -844 -2220 3477 2466 -803 1145
1593A145J580K47l480O34L200l338j865K709j192j364k24J87J305k790J089K013
$$ 1145 2725 2972 -508 126 3326 -12 -1877 832 -360 -1724 -1948 -1761 -456 -3246 -2157 -144
1609a44k395R76J022j92L85r2J211O38j947J865J211j936N52m67R34l02k198J416
$$ -144 -2539 -1563 -541 -733 -348 -440 771 1409 -538 1327 2538 602 1154 687 1621 1319 -879 537
1627E37O03j246p28J16J072Q0k758J947J326j933L81J28J538m36j383J616O19
$$ 537 1140 -106 -834 -718 354 434 -2324 -377 949 -984 -603 -475 1063 627 -756 860 1479
1644A479j776J448K53j383L65J38P40j987j45K645j647k008K005J367j638j558
$$ 1479 -297 1151 1404 21 386 524 1264 -723 -868 1777 130 -1878 127 1494 -144 -1702
1660a702J719K359l564r89L619k39k468q2K962r76k528J240K491k720q50K551
$$ -1702 17 2376 -1188 -2177 1442 1203 -1265 -1347 1615 639 -1889 -649 1842 -878 -1728 823
1676H23l15k035K62K633j303k891K821J818l131r22L861m21l012N71L616j844
$$ 823 508 -1527 -1265 1368 65 -2826 -5 1813 -1318 -2240 1621 1200 -1812 -1241 2375 531
1692E31l353L463J689l444j091M267j41l676N82L984j890l711L222K235k963j894
$$ 531 -2822 641 2330 -1114 -2205 2062 1921 -1755 -1173 2811 921 -2790 432 2667 -296 -2190
1708b190L249R51m017P78L436j850k877K798K012l098j158M108o0m155J784L734
$$ -2190 1059 2010 -2007 -1229 2207 357 -2520 278 2290 -808 -1966 2142 2082 -2073 -289 3445
1724C445k115l488L549K151l856j707M302L01n119J018M031k021m503K970K707
$$ 3445 1330 -2158 1391 3542 -314 -2021 2281 2582 -2537 -1519 2512 491 -4012 -1042 1665
1739A665l306k118L935J283m612R60M072j403k974K510L060l338j071L387O65
$$ 1665 -1641 -3759 176 1459 -3153 -2193 1879 476 -2498 12 3072 -266 -1337 2050 2715
1754B715m078P61L536j930l351K217K580l775j966L705P92m213L08L879j105l127
$$ 2715 -1363 -602 2934 1004 -2347 -130 2450 -1325 -3291 414 1206 -3007 -2699 1180 75 -3052
1770c052J629L094k286j445K804J360k880Q4L286q66k240J139K242k300j256K449
$$ -3052 -1423 1671 -615 -2060 744 2104 -776 -692 2594 1728 -512 627 2869 569 -687 1762
1786A762L07k262m93K448q12k532Q80K042j590j662J508Q74j374r17K238l36j451
$$ 1762 2069 -193 -686 1762 950 -1582 -702 1340 -250 -1912 -404 470 -904 -1821 417 81 -1370
1803a370O68J235n06j294J828P13j326j47J784k89j144O47O63p3j633R09N24j530
$$ -1370 -702 533 27 -1267 561 1274 -52 -199 1585 1296 152 799 1462 1389 -244 665 1189 -341
1821c41m25N54k40o23m01K0M8r35L74N24j25K40j67R61O23j71L75J019k40M21
$$ -341 -766 -212 -452 -1075 -1476 -1456 -1408 -2343 -1969 -1445 -1570 -1330 -1497 -536 87 -84 291 1310 1070 1491
1841A491K06N17o1j349J065k57j454L72j19n91q40m35Q69j076j013J556k43r99
$$ 1491 1697 2214 2153 804 1869 1612 158 530 411 -180 -1020 -1455 -586 -1662 -2675 -1119 -1362 -2361
1859b361J229N26O66r06J070K049j338j018K766N29j571n02J027J222l096n10
$$ -2361 -1132 -606 60 -846 224 2273 935 -83 2683 3212 1641 1139 2166 3388 292 -218
1875b18K384j782j578O81L01r34j545J122J480k813P32K619j356n46O79K250j059
$$ -218 2166 384 -1194 -513 -212 -1146 -2691 -1569 -89 -2902 -2170 449 -907 -1453 -774 1476 417
1892D17j548K854N23l581J637K214j665j976J119K970l128k903M607L71m410M47
$$ 417 -1131 1723 2246 -1335 302 2516 851 -1125 -6 2964 -164 -3067 1540 1911 -2499 -2052
1908b052K610K20l127J08M250k613k478L693Q3j636j30J735Q26l075P09L393l131
$$ -2052 558 778 -2349 -2241 2009 -604 -3082 611 694 -942 -1072 663 1489 -1586 -877 2516 -615
1925f15j049L110o8j703q38L378J26m290J997L788l335k087K756J285j967l058
$$ -615 -1664 1446 1378 -325 -1163 2215 2341 -1949 48 3836 501 -1586 1170 2455 488 -2570
1941b570M070Q48m775J186K091j177j597K95K503j373k409L707L13l086K113J368
$$ -2570 1500 2348 -2427 -1241 850 -327 -1924 -1629 874 -499 -2908 799 1112 -1974 139 1507
1957A507m50j454P17K766k531j313L361j310k431J639L32j63k904Q84K926l867
$$ 1507 1057 -397 320 3086 555 -758 2603 1293 -1138 501 833 670 -2234 -1350 1576 -2291
1973b291k05K393p26p78k09J037J545k521J047K056j967J236M80l35N2q89J841
$$ -2291 -2496 -103 -829 -1607 -1816 -779 766 -1755 -708 1348 -619 617 1097 762 814 -75 1766
1990A766j98k319J473P21k346P66q0L37m69j370K036n82j354J588j00n33N22j7
$$ 1766 1568 -751 722 1443 -903 -137 -217 120 -349 -1719 317 -265 -1619 -31 -131 -664 -142 -159
2008a59J012n19p63K108j564J14J227j183K23M6J24Q10j996K26J630j916L08L83
$$ -159 853 334 -429 1679 115 229 1456 273 496 542 666 1476 -520 -294 1336 -580 -272 111
2026A11k71R10j551K70R73j185P34L48r95R39o74J89P41j389J035J19q07Q97p60
$$ 111 -160 750 -801 -531 442 -743 -9 339 -656 283 -391 -202 539 -850 185 304 -503 394 -366
2045c66L8N55p53N08m3j202J902j104l70R06l80R11j171q32K003j41r68K41J00
$$ -366 -328 227 -526 -18 -61 -1263 639 -465 -835 71 -309 602 -569 -1401 602 461 -507 -266 -166
2064a66R08r29j134K206l00j140J83O70N73j116n48J582m75r12R43j97j79J44
$$ -166 742 -187 -1321 885 585 -555 -372 298 871 -245 -793 789 314 -598 345 148 -31 113
2082A13k41N66r48Q54O45j598L60J624o14q80R3J557m33k654K015J532k417o74
$$ 113 -128 438 -510 344 989 -609 -249 1375 761 -119 -26 1531 1098 -1556 459 1991 -426 -1100
2100a100J408R37j642j372K319M50k891J140J510r75q20L98J748j441j253K627
$$ -1100 308 1245 -397 -1769 550 1000 -1891 -751 759 -216 -1036 -638 1110 -331 -1584 1043
2116A043k58j768J229J205j155r46R84J191k252o07K610o43k341M75J960o34k251
$$ 1043 785 -983 246 1451 296 -650 334 1525 -727 -1334 1276 633 -1708 -1233 727 93 -2158
2133b158J243K675k563j316K626K26j886K0K334j46k141Q64K064j563j224J834
$$ -2158 -915 1760 -803 -2119 507 733 -1153 -1133 1201 1055 -1086 -222 1842 279 -945 889
2149H89J79j286l89J670j28k020J145J137j378o06J242O54j462n48K078m37k059
$$ 889 1068 -218 -607 1063 935 -1085 60 1197 -181 -787 455 1109 -353 -901 1177 740 -1319
2166a319J369J062j111j174J374J090j848l68J993k67j667O98J123m39j507J284
$$ -1319 50 1112 1 -1173 201 1291 -557 -925 1068 801 -866 -168 955 516 -991 293
2182B93R50j289m02J242J78j494Q89M01n62j002O64O09j584q6Q07L64j444J06
$$ 293 1243 -46 -448 794 972 -522 367 768 206 -796 -132 477 -1107 -1193 -386 -22 -1466 -1360
2200a360J294n97p07P54R19o37k57J156L09j032J78J118Kr11L69O07r75n28N83
$$ -1360 -66 -663 -1370 -616 303 -334 -591 565 874 -158 20 1138 1140 229 598 1205 230 -298 285
2219B85p8q15k30P36m42o78J70J028n33n29R23L92j03n45J375j44k71q4N80J20
$$ 285 207 -608 -838 -102 -544 -1222 -1052 -24 -557 -1086 -163 229 126 -419 956 812 541 457 1037 1157
2239A157m20L00J21l29n38J37J45o67m59L42P4q83J32K35K33m31K65O52k43j24
$$ 1157 737 1037 1158 829 291 428 573 -94 -553 -211 -137 -1020 -888 -653 -420 -851 -586 66 -177 -301
2259c01M79N37p20L25M59o2m85k53O74k69o59M56L38r39l66M19M61o69k72Q23
$$ -301 178 715 -5 320 779 717 232 -21 653 384 -275 181 519 -420 -786 -367 94 -575 -847 -24
2279b4k28o67M43R26n74o48N84O94n16o40R82P9o27j25Q06q0q25O06P40p81o03
$$ -24 -252 -919 -476 450 -124 -772 -188 506 -10 -650 332 411 -216 -341 465 385 -440 166 906 125 -478
2300d78J180q2q16M3J006j40j462J051R32j075n50P03J96q77r2R06J46j586R71
$$ -478 702 620 -196 -153 853 713 -749 302 1234 159 -391 312 508 -369 -461 445 591 -995 -24
2319b4O70p05l22M4J130p65o04J360J26j353O60O30l86n95L58Q17j685RJ393p33
$$ -24 646 -59 -381 -337 793 28 -576 784 910 -443 217 847 461 -134 224 1041 -644 -635 758 25
2339B5r98M35N79k75n85M58J100j635J12J043J95j091J10J356m97j243Q30R71
$$ 25 -973 -538 41 -234 -819 -361 739 -896 -784 259 454 -637 -527 829 332 -911 -81 890
2357H90j200J67O57l04j95o51J005k25j238J454K89j189R4Q42J46r88l20J732
$$ 890 -310 -143 514 210 15 -636 369 144 -1094 360 649 -540 -446 396 542 -446 -766 966
2375I66r14j078J604J21p22k90P00P91j688m9J722j040o15Q05o0L74q89N18O85
$$ 966 52 -1026 578 699 -23 -313 387 1178 -510 -559 1163 123 -492 313 253 627 -262 256 941
2394I41j307L23R14q33j04N37k52k3r89J472N9j702Q93P52q21o87K71Q52j42j444
$$ 941 -366 -43 871 38 -66 471 219 196 -793 679 738 -964 -71 681 -140 -827 -556 296 154 -1290
2414a290J383L78j223N81j72O41k74p42R40Q5r22R02O1n93K00k46P79q12j89J242
$$ -1290 93 471 -752 -171 -343 298 24 -718 222 307 -615 287 348 -245 -45 -291 488 -324 -513 729
2434G29j033l36R54q5l64n36K65J413j562l78J443n34m41L8L84M34p90j37J306
$$ 729 -304 -640 314 229 -135 -671 -406 1007 -555 -933 510 -24 -465 -427 -43 391 -399 -536 770
2453G70o38PK47k03N69q11K89O20j032J022j25o90J25K3r6J82r07O46K86j764
$$ 770 132 139 386 183 752 -59 230 850 -182 840 715 25 150 173 77 259 -648 -2 284 -1480
2473a480J282M0j60j71j58J253k29j147J193R6o79N85k96R76o44p20J292m63o74
$$ -1480 -198 -158 -318 -489 -647 606 377 -770 423 519 -160 425 129 1105 461 -259 1033 570 -104
2492a04K52k04n7m14k1L68j208M55R50j168O8P92J1Q8q17Q61J162j250J50J283
$$ -104 148 -56 -113 -527 -548 -180 -1388 -933 17 -1151 -1083 -291 -280 -192 -1009 -148 1014 -236 -86 1197
2512A197r75J16J54K67O22j900Q99K87j062L43no8o2o34L23N29j412J420j87n51
$$ 1197 222 338 492 759 1381 -519 380 667 -395 -52 -57 -125 -187 -821 -498 31 -1381 39 -148 -699
2532f99N78M83P0m95j03J510r96q60J562l03m94l44K89P66j262J19P98m65p15
$$ -699 -121 362 432 -63 -166 1344 348 -512 1050 747 253 -91 198 964 -298 -179 619 154 -561
2551e61M32M32j36p26Q8P99q88K82N04o41J55J62J44j65n14P55M18j365O22P84
$$ -561 -129 303 167 -559 -471 328 -560 -278 226 -415 -260 -98 46 -119 -633 122 540 -825 -203 581
2571E81n57l17L9J013k06j411J350L50j065J7L25K6l98l00R86m74j122J090N4
$$ 581 24 -293 -254 759 553 -858 492 842 -223 -206 119 145 -253 -553 433 -41 -1163 -73 -19
2590a9k03k77L03K58n82k45J112m57k08N60r6K36j29L35L76n57k63R65m38o62
$$ -19 -222 -499 -196 62 -520 -765 347 -110 -318 242 146 382 253 588 964 407 144 1109 671 9
2610IM44Q7j95q31K14L58o86m3M79r5j59q8M43J25q13O49Q45q88L03L17K03l74
$$ 9 453 540 345 -486 -272 86 -600 -643 -164 -259 -418 -506 -63 62 -751 -102 743 -145 158 475 678 304
2632C04j92P65k49q73N49L84p94k14q0L28n12m39O35p1j31L3L07%L8l48Q24l79
$$ 304 112 877 628 -245 304 688 -106 -320 -400 -72 -584 -1023 -388 -459 -590 -557 -250 -250 -212 -560 264 -115
2654a15l39P74j47j72J57M00m06k44J6O33l99n81L78J04k15l66O62k6m97j8N88
$$ -115 -454 320 173 1 158 558 152 -92 -76 557 158 -423 -45 59 -156 -522 140 114 -383 -401 187
2675A87j68k28K92J14j77k40L09K68k24J50k03K95k94j10K40l36J52L24l4l45
$$ 187 19 -209 83 197 20 -220 89 357 133 283 80 375 81 -29 211 -125 27 351 317 -28
2695b8KL39k94k42L72O6l81l4KN42m42n3M22l33j93pM93m35j22K79L00n30j70
$$ -28 -26 313 19 -223 149 215 -166 -200 -198 344 -98 -151 271 -62 -255 -262 231 -204 -326 -47 253 -277 -447
2718d47M27K44n17m8M85j09k67R8J89k71m8J59n2l30L07K51j34j84M17K49k85
$$ -447 -20 224 -293 -341 144 35 -232 -134 55 -216 -264 -105 -157 -487 -180 71 -63 -247 170 419 134
2739A34k54L71j34k24K03L21k72l74L36o5Qk80K88j34P9m63Q22j40m43J25M54
$$ 134 -120 251 117 -107 96 417 145 -229 107 42 50 -230 58 -76 3 -460 362 222 -221 -96 358
2760C58j76k03L12J32k77M3J77r0l24J9L41k81k50K99k4k25r5oM44n87L18K53
$$ 358 182 -21 291 423 146 189 366 276 -48 -29 312 31 -219 80 56 -169 -264 -270 174 -413 -95 158
2782A58j41k80K6M28k39j13L55k6j20l0o4L44n73J5L77R9m69J90p7K8k8O6r4L35
$$ 158 17 -263 -237 191 -48 -161 194 168 48 18 -46 298 -275 -260 117 216 -253 -63 -140 -112 -140 -74 -168 167
2806A67l31O10p24J65P5R5Rm28L63J17m90j61Q80m81oK6M13K3q49M72N75l05k43
$$ 167 -164 446 -278 -113 -38 57 66 -362 1 118 -372 -533 347 -134 -140 -114 299 322 -527 -55 520 215 -28
2829b8M86r3N1m06M64M9p37K86K76p70L49L3O2m50J6N28j92o46O86K62m08R9j3
$$ -28 458 365 416 10 474 523 -214 72 348 -422 -73 -40 22 -428 -412 116 -76 -722 -36 226 -182 -83 -96
2852i6Q05o81R4M42r4m22L60O7o7l28j79L66q47j08N71l70j15j57M7M30l43kP29
$$ -96 709 28 122 564 470 48 408 475 408 80 -99 267 -580 -688 -117 -487 -602 -759 -712 -282 -625 -627 102
2875A02r86N44Q28m83J01O1N12Rp86Q22Q5p94j34M22J06j92r29Q91l87o16O61
$$ 102 -884 -340 488 5 106 167 679 688 -98 724 809 15 -119 303 409 217 -712 179 -208 -824 -163
2896a63L9k37OK2L01J20o29Q85k37k12P18l04mL3O1N11r72K20N10k18m71K19N7
$$ -163 -124 -361 -355 -333 -32 88 -541 344 107 -105 613 309 305 338 399 910 -62 158 668 450 -21 198 255
2919B55K49j108N00P39q88Q9J9N5K27o34J37P03o73L74J06n31L37J44k77N00n52
$$ 255 504 -604 -104 635 -253 -164 -145 -90 137 -497 -360 343 -330 44 150 -381 -44 100 -177 323 -229
2940b29M33ro90Q77p0o07N16l19M83m37o26J185l38o11M60mO4l25k82L52N1m65
$$ -229 204 195 -495 382 312 -295 221 -98 385 -52 -678 507 169 -442 18 14 78 -247 -529 -177 -126 -591
2962e91K70l28N36ll28N90j8k16N52j63L0M93n46J90J21m01O32r01O58j89m05
$$ -591 -321 -649 -113 -116 -444 146 128 -88 464 301 331 824 278 468 589 188 820 -81 577 388 -17
2983a7m16K68R5L9q20K67Q43p62N3J72Q9L16k94M13M42p88M82M4j24L77o31M46
$$ -17 -433 -165 -70 -31 -851 -584 259 -503 -450 -278 -189 127 -167 246 688 -100 382 426 302 679 48 494
3005D94P2o58M01m75j02Q3m7n37L98M3K31l00k48O89l25l06M21j45M74l02l2Q31
$$ 494 566 -92 309 -166 -268 -185 -232 -769 -371 -328 -97 -397 -645 44 -281 -587 -166 -311 163 -139 -171 660
3027F60j83o25N35j63J83m26l6L15n38L31K23m97k08L75l66K76p5J04K12o21M75
$$ 660 477 -148 387 224 407 -19 -55 260 -278 53 276 -221 -429 -54 -420 -144 -219 -115 97 -524 -49
3048d9K70p11M11K66jMk74N43J93q74N47R5k27k1j23K77l30J40K64n20L9M56k85
$$ -49 221 -490 -79 187 186 190 -84 459 652 -222 325 420 193 172 49 326 -4 136 400 -120 -81 375 90
3071I0k78j03J44O11q11Q5O37o32r9K49J63J55l85K29L58p00K44J11k55J99l71
$$ 90 -188 -291 -147 464 -347 -262 375 -257 -356 -107 56 211 -174 55 413 -287 -43 68 -187 12 -359
3092c59L85m09K1K46Q2m51O07n8j63j48J8M84m54J31J88O3n17J53L41k60j43L5
$$ -359 26 -383 -362 -116 -34 -485 122 64 -99 -247 -229 255 -199 -68 120 183 -334 -181 160 -100 -243 -208
3114b08M94l81l33N55k20P1q1J90N2j38R3J76l94R0M68k61Rk87O36k44l71O9L36
$$ -208 286 -95 -428 127 -93 -22 -103 87 139 1 94 270 -124 -34 434 173 182 -105 531 287 -84 -15 321
3137C21k80l3n8j84K23l06K35K47m27J21J82r3j56N3J70k1k22L05J71MJ16k89
$$ 321 41 8 -50 -234 -11 -317 -82 165 -262 -141 41 -52 -208 -155 15 -6 -228 77 248 252 368 79
3159G9J07j65K10j08k46K16k23J50k60J10j20j90K05k54K17K6J07N2j48J31K89
$$ 79 186 21 231 123 -123 93 -130 20 -240 -130 -250 -440 -235 -489 -272 -246 -139 -87 -235 -104 185
3180A85j40l6J19j00Q7K24j45Qq0Q1O9j01j33L11j59m10L2K73j10l15M17nR8m56
$$ 185 45 9 128 28 115 339 194 202 122 203 272 171 38 349 190 -220 -188 85 -25 -340 77 72 170 -286
3204b86J97P6m5J79l2j00J28J1q7J43k04K91j4q8M4p0O1j3J47O0k24j34l4R0l65
$$ -286 -89 -13 -58 121 89 -11 117 128 41 184 -20 271 257 169 213 143 204 191 338 398 174 40 6 96 -269
3229b69L60k05mk91L10j90n6mJ34j61l91Q62j34j91J8O23j11l94J87K75K6n29
$$ -269 91 -114 -118 -409 -99 -289 -345 -349 -215 -376 -767 95 -39 -230 -212 411 300 -94 93 368 394 -135
3251a35O18k25l08K2M44n25m0R3j88n2Q5j16N3o6N2K55j43j86P27n2k5k81L58
$$ -135 483 258 -50 -28 416 -109 -149 -56 -244 -296 -211 -327 -274 -340 -288 -33 -176 -362 365 313 288 7 365
3274C65M5j81J89K16k62m22N58j39r7m76K78L7n45L79J57k71k99K59J41m3l46
$$ 365 410 229 418 634 372 -50 508 369 272 -204 74 111 -434 -55 102 -169 -468 -209 -68 -111 -457
3295d57M72L51p08L87K55k75J6ML52p4k94J23L77p46J72J77q4J03l75L44j57j77
$$ -457 15 366 -342 45 300 25 41 45 397 323 29 152 529 -217 -45 132 48 151 -224 120 -37 -214
3317b14R5k25j52L18L77m19j48J07N19m49n1O44k93k94L62j5j46l3jK54k78J52
$$ -214 -119 -344 -496 -178 199 -220 -368 -261 258 -191 -242 402 109 -185 177 162 16 -17 -18 236 -42 110
3339A10M2k75N1l49O70l8m56O39j96n94M39L35l53o2P8M05n04k10L82J14k59J11
$$ 110 152 -123 -72 -421 249 211 -245 394 198 -396 43 378 25 -37 41 446 -58 -268 114 228 -31 80
3361H0O1k06J52j12K15o5k49M86l92P8J16J02m0k84J45M12r49N29N21p78l31L30
$$ 80 141 -65 87 -25 190 125 -124 362 -30 48 164 266 226 -58 87 499 -450 79 600 -178 -509 -179
3383a79J61J59m06K68L06o02Q7K89j10K83l25k30L76k32L33k71k80P35j53l84
$$ -179 -18 141 -265 3 309 -293 -206 83 -27 256 -69 -299 77 -155 178 -93 -373 362 209 -175
3403a75K61j97O5l88J5P94o27N0J76k08K24J8j22M84o78J86L14l34K43mL8R5k54
$$ -175 86 -111 -46 -434 -419 375 -252 -202 -26 -234 -10 8 -114 370 -308 -122 192 -142 101 97 135 230 -24
3426b4K73j36l65L48J33m95L07R3p6J02o72R60j69n25M64J23l19j19qK39k41l50
$$ -24 249 113 -252 96 229 -266 41 134 58 160 -512 448 279 -246 218 341 22 -97 -105 134 -107 -457
3448d57P65l18j93M23m12K3J59j1J93l36K95L55q61K74M64n34L8m16O14J12m84
$$ -457 308 -10 -203 220 -192 -169 -10 -21 172 -164 131 486 -375 -101 363 -171 -133 -549 65 177 -307
3469c07K02M14n00J92j62L22Oo17M10P6k61L16j27k65K05r9K93j69o0M45l23m52
$$ -307 -105 309 -191 1 -161 161 167 -450 -40 36 -225 91 -36 -301 -96 -195 98 -71 -131 314 -9 -461
3491d61O61k54M8M7K09J68o40k9Q32n25k47M03k94K56j70P1K65n66L31L38o80
$$ -461 200 -54 -6 41 250 418 -222 -251 581 56 -191 212 -82 174 4 75 340 -226 105 443 -237
3512b37%K38k1j78j85O83j40p24N80J62j57k45N62j71o3j38N53l24m53N54L1k12
$$ -237 -237 1 -20 -198 -383 300 160 -564 16 178 21 -224 338 167 104 -34 519 195 -258 296 327 115
3534A15k56p4Q8l3N2n6J3k81L24j15J90j90K02K12p61M12M52o17J29K16L41j71
$$ 115 -141 -215 -127 -160 -108 -164 -151 -432 -108 -223 -33 -223 -21 191 -570 -158 294 -323 -194 22 363 192
3556A92l24K00L7j77Q7L72m70R2K73n9k98j4K83j41J8kQk13K51j12J09n08N67
$$ 192 -132 68 105 -72 15 387 -83 9 282 223 -75 -89 194 53 71 69 77 -136 115 3 112 -396 171
3579A71P4k42j99N12j46k64K52o3O9l53K32J91k34J33M7o9j76J03Q7j9n17M76
$$ 171 245 3 -196 316 170 -94 158 95 164 -189 43 234 0 133 180 111 -65 38 125 106 -411 65
3601F5N6o23L05m4Q6j8k80N04m20L99l9J52j46l34M19K20m11J54K42o5j38O4j0
$$ 65 121 -502 -197 -241 -155 -173 -453 51 -369 30 -9 143 -3 -337 82 302 -109 45 287 222 84 148 138
3624A38n5j80J22p6j66j8L27l32k93M38j3n8k20J84J16j40K03J95j79KL60J06
$$ 138 83 -97 25 -51 -217 -235 92 -240 -533 -95 -108 -166 -386 -202 -86 -226 -23 172 -7 -5 355 461
3646D61k63oJ63k72r7L09J25m61J77J18k60j87J32J68n04p2M82l5k39J82J85m38
$$ 461 198 192 355 83 -14 295 420 -41 136 254 -6 -193 -61 107 -397 -469 13 -22 -261 -79 106 -332
3668c32m2L67K68k08K1K12j18Nj86K90j65j73J10L11m98j69N67l7m04j46K84j48
$$ -332 -374 -7 261 53 74 286 168 173 -13 277 112 -61 49 360 -138 -307 260 223 -181 -327 -43 -191
3690a91k68M11O6k95j75N78k72q8N4M18l85j03L15J90l36L3J26n5j42J07K69l20
$$ -191 -459 -48 18 -277 -452 126 -146 -234 -180 238 -147 -250 65 255 -81 -48 78 23 -119 -12 257 -63
3712f3j82J12J53n19M79j58K38j32J02p1l00R6M82k32q8J78J62k84k07M48J43
$$ -63 -245 -133 20 -499 -20 -178 60 -72 30 -41 -341 -245 237 5 -83 95 257 -27 -234 214 357
3733C57m33J17K44J07m33J60J54k18n14P07j47k71j84L70M3m93L20j45J10K3P1
$$ 357 -76 41 285 392 -41 119 273 55 -459 248 101 -170 -354 16 59 -434 -114 -259 -149 -126 -55
3754e5K01l63q2M07j03k70N07j45q5j7L3j0j2j71J42J71m71K55K47l89J03j1J04
$$ -55 146 -217 -299 108 5 -265 242 97 12 -5 28 18 6 -165 -23 148 -323 -68 179 -210 -107 -118 -14
3777a4j89k3O90o42j5J62P9l36K20K28j0l84L74K49m26K4J26N7l24J32J16j6j69
$$ -14 -203 -226 464 -178 -193 -31 48 -288 -68 160 150 -234 140 389 -37 -13 113 170 -154 -22 94 78 -91
3800i1J33K85m04p7N42l16J13j73L30k71r4J55Q9l25r6M05j25n85N57L62k70o6
$$ -91 42 327 -77 -154 388 72 185 12 342 71 -23 132 221 -104 -200 205 80 -505 52 414 144 78
3822G8L69k73m34M12m6P2m59J42K41l19J27K69k33j10P4K27n8n02L73K21o35N58
$$ 78 447 174 -260 152 106 178 -281 -139 102 -217 -90 179 -54 -164 -90 137 79 -423 -50 171 -464 94
3844I4M2j84j17j73K02L67o76N53Q0n16J97n6J84L4m12O29j68k74M40k0l46L48
$$ 94 136 -48 -165 -338 -136 231 -445 108 188 -328 -131 -187 -3 31 -381 248 80 -194 246 226 -120 228
3866B28j64r2j04R9O14n56l55O79k34m45K64K51N2m27L7N00o31J92K37j52L41
$$ 228 64 -28 -132 -33 581 25 -330 349 115 -330 -66 185 237 -190 -153 347 -284 -92 145 -7 334
3887C34m75L29J04n32L74J67p50O22J82l12j19j2L75m57L9L92L5p54L20K58k64
$$ 334 -141 188 292 -240 134 301 -449 173 355 43 -76 -88 287 -170 -131 261 296 -458 -138 120 -144
3908a44j94J1M11l47RN11l69K22m4j07q1J0J64M09q26J52P47p22K94j60K27k04
$$ -144 -338 -327 84 -263 -254 257 -112 110 66 -41 -122 -112 52 461 -365 -213 534 -188 106 -54 173 -31
3930c1o27Q06J77n83J78K67l13j2q8L35j64k10P60k88k77K46q6k89L15K34k82
$$ -31 -658 148 325 -258 -80 187 -126 -138 -226 109 -55 -265 495 207 -70 176 90 -199 116 350 68
3951F8j34K42K07n64J67K20J50k14n03K71L67o09R0K51j13n1N0M5M22o58L83k1
$$ 68 -66 176 383 -181 -14 206 356 142 -361 -90 277 -332 -242 9 -104 -155 -105 -60 362 -296 87 66
3973F6l71K17K64l51J28J85j21m8k68O79l77l31N43p5m7n86L05N26l05n27P11
$$ 66 -305 -88 176 -175 -47 138 17 -31 -299 380 3 -328 215 140 93 -493 -188 338 33 -494 217
3994B17k57j35O8N9Km32N50O6k67l6K26k24KL31J24j85k91L69J57o07L16L63l36
$$ 217 -40 -175 -107 -48 -46 -478 72 138 -129 -165 61 -163 -161 170 294 109 -182 187 344 -263 53 416 80
4017H0k44L29J96j79m91M95k8l63J30J77k68j5K88K25l00m00R33m37k18K54J16
$$ 80 -164 165 361 182 -309 186 158 -205 -75 102 -166 -181 107 332 32 -368 565 128 -90 164 280
4038B80k0l57K21L8l77k31M84K53n06L32J56j39m22K52K27n22N03n6j3m73K51
$$ 280 260 -97 124 162 -215 -446 38 291 -215 117 273 134 -288 -36 191 -331 172 116 103 -370 -119
4059a19L0K0k75J84O5o7J01M2K4k07L42oj26j36K90r1k72K02K31l44J8K06j42
$$ -119 -89 -69 -344 -160 -95 -162 -61 -19 5 -202 140 134 8 -128 162 71 -201 1 232 -112 -94 112 -30
4082c0J1k05J33k36m0K52j5R4l69K27O50p04K98Q3J4p9l0K45j80j37J32J31m36
$$ -30 -19 -224 -91 -327 -367 -115 -130 -36 -405 -178 472 -232 66 149 163 84 54 299 119 -18 114 245 -191
4105a91K84K40r3j93o6L46k18p3jR7m97M28r8p9k13J43K52j43p7K39j08j08j5
$$ -191 93 333 240 47 -19 327 109 36 35 132 -365 63 -35 -114 -327 -184 68 -75 -152 87 -21 -129 -144
4128a44J11j37K12J35q0j87j58K99j92j14O9J61j69QJ75J41k74M9K54k66J98K2
$$ -144 -33 -170 42 177 97 -90 -248 51 -141 -255 -186 -25 -194 -186 -11 130 -144 -95 159 -107 91 113
4150A13J54l60r0N32l87j50P8J33j8j85K64l5j23K70J12m54R9J98Q9m04J45L70
$$ 113 267 -93 -183 349 -38 -188 -110 23 5 -180 84 49 -74 196 308 -146 -47 151 240 -164 -19 351
4172C51j96m10L51J71l62l1M66J69o62J05L05j45o50N31J37m85MM03r4k61L3N89
$$ 351 155 -255 96 267 -95 -126 340 509 -153 -48 257 112 -538 -7 130 -355 -351 52 -42 -303 -270 319
4194C19N1p43O05k06j31j79L72m7l03J76M72m31k40N33j03k59j00L69k99k72J86
$$ 319 370 -373 232 26 -105 -284 88 41 -262 -86 386 -45 -285 248 145 -114 -214 155 -144 -416 -230
4215b30L16k9l68L29L47o51j40M02J78m25M22J13l21k73L81o2j14k10R77o39k79
$$ -230 86 57 -311 18 365 -286 -426 -24 154 -271 151 264 -57 -330 51 -11 -125 -335 642 3 -276
4236b76L27N81n06l16K06K92k21m58O96j52m20L66j62k6j58L69L8n62L83K94k99
$$ -276 51 632 126 -190 16 308 87 -371 325 173 -247 119 -43 -69 -227 142 180 -382 1 295 -4
4257dJJ45J00M3n23N55N0o83M61K27k55l95K77p2j67j4L01O1m49K77j67K9l6J03
$$ -4 -3 142 242 285 -238 317 367 -316 145 372 117 -278 -1 -73 -240 -254 47 108 -341 -64 -231 -202 -238 -135
4281a35K10l72k35R20n30k34L62P9J14n09L15K83n07L43J94j86j31o1J35l5k28
$$ -135 75 -297 -532 388 -142 -376 -14 65 179 -330 -15 268 -239 104 298 112 -19 -80 55 20 -208
4302b08m5K02j80K70j39p4R9J94L2j58j77M69k9n95P09j89j33J19k25K78k74l94
$$ -208 -253 -51 -231 39 -100 -174 -75 119 151 -7 -184 285 256 -339 370 181 48 167 -58 220 -54 -448
4324d48N14M15n04J64L0k78K14p4K15l78j2J12k42k3L72k22o6rM41M6n33M02J32
$$ -448 66 481 -23 141 171 -107 107 33 248 -130 -142 -30 -272 -295 77 -145 -211 -220 221 267 -266 136 268
4347B68m13J1L58k64J80k36K80n1m53N03m2l20L0K48j26l07K63K54o01o5O83J68
$$ 268 -145 -134 224 -40 140 -96 184 133 -320 183 141 -179 -149 99 -27 -334 -71 183 -418 -483 200 368
4369C68o44R7J63K78n31J75N74m31O8j01P9j3mp2K95m03M20j48m45L29K24k94
$$ 368 -276 -179 -16 262 -269 -94 480 49 117 16 95 82 78 6 301 -102 318 170 -275 54 278 -16
4391a6p1MK47m24j56P07p9n32L10q0L81l50P4O16n58k75L31l7nk2J50k0n93N63
$$ -16 -87 -83 164 -260 -416 291 212 -320 -10 -90 291 -59 15 631 73 -202 129 92 87 65 215 195 -398 165
4415A65R8n54k6N97j52l33O6L36n3m42J26N28o49o2M38J95l08k71O17j47l59K1
$$ 165 263 -291 -317 280 128 -205 -139 197 144 -298 -172 356 -293 -355 83 278 -30 -301 316 169 -190 -169
4437a69M87o96J79L45mj14l05Q11n49l48M21K27p06J38L67K75n52L3P23o95pJ40
$$ -169 318 -378 -199 146 142 28 -277 534 -15 -363 58 285 -421 -283 84 359 -193 -160 563 -132 -139 1
4459AJ9j73k00L51L64n42J23P01n14m40L08L50l94k69N82p6n73L84M21l24l86
$$ 1 20 -153 -353 -2 362 -180 -57 644 130 -310 -2 348 -46 -315 267 191 -382 2 423 99 -287
4480b87L96j2l08r5N83k65k97M82n7m16J18K75K36m01r5K84k39k52N62m4k25k18
$$ -287 109 97 -211 -306 277 12 -285 197 140 -276 -158 117 353 -48 -143 141 -98 -350 212 168 -57 -275
4502b75L01L45o30j1M12o68M44N4J2jk07K27j31j40J51L77l06K5r4N4o9k56O55
$$ -275 26 371 -259 -270 142 -526 -82 -28 -16 -17 -224 3 -128 -268 -117 260 -46 -21 -115 -61 -130 -386 269
4525B69k19k61M38j60k50L12j56nj77L6L62l07l1M65k29j79J55J87l1k07J65r9
$$ 269 50 -211 227 67 -183 129 -27 -32 -209 -173 189 -118 -149 316 87 -92 63 250 219 12 177 78
4547G8k37K79J07j43k09K81M9j02j96J61Kl06L46J73j68l57L67J45k46K9J77j40
$$ 78 -159 120 227 84 -125 156 205 103 -93 68 70 -236 110 283 115 -242 125 270 24 53 230 90
4569I0j99K86J4k73OK13J2l82j29M62j68j97P2J75k51k47M63L47m60j07L10j35
$$ 90 -109 177 191 -82 -76 137 149 -233 -362 100 -68 -265 -193 -18 -269 -516 -53 294 -166 -273 37 -98
4591i8k12L02J65k26k54L17L00m81K0O19l56j14L3L47l50pJ21J62p50L60K87M5
$$ -98 -310 -8 157 -69 -323 -6 294 -187 -167 452 96 -18 15 362 12 5 126 288 -462 -102 185 230
4613B30m45R5L87l63o8M26J33l24j29K20k06j91M70j5k85K0L48n4r5k24K97j22
$$ 230 -215 -120 267 -96 -164 262 395 71 -58 162 -44 -235 235 220 -65 -45 303 249 154 -70 227 105
4635A05n38L46M07m75n1L68k57j18P5M47m63k14K26Mj03O1L08J48m59R2L77l49
$$ 105 -433 -87 320 -155 -206 162 -95 -213 -138 309 -154 -368 -142 -138 -241 -180 128 276 -183 -91 286 -63
4657f3j13K76J79l34j26M44o0n66K84K86j35l64K22L03n02m4L42R4l36R2K43j80
$$ -63 -176 100 279 -55 -181 263 203 -363 -79 207 72 -292 -70 233 -269 -313 29 123 -213 -121 122 -58
4679e8j79L41J70k67j26N54k37l24J70K67k13j08K30J87n70K54J16k44j41M71
$$ -58 -237 104 274 7 -119 435 198 -126 44 311 98 -10 220 407 -163 91 207 -37 -178 293
4699B93k31j70k33N74O9k31j72L74k55j13K40k07r7J89J88k77k88L39K99j26k75
$$ 293 62 -108 -341 233 302 71 -101 273 18 -95 145 -62 -159 30 218 -59 -347 -8 291 165 -110
4720a10K36L1k23qK75j29j84l6J40k64K13j3J5n9M6K40l00N7L06q4l26J8K89k66
$$ -110 126 157 -66 -74 201 72 -112 -148 -8 -272 -59 -72 -57 -116 -70 170 -130 -73 233 149 -177 -159 130 -136
4744a36j22L08J04j13k51N98k79p1R8J55j37m52L30K21o77M63Q4l27j93M36j5
$$ -136 -258 50 154 41 -210 388 109 38 136 291 154 -298 32 253 -424 39 123 -204 -397 39 24
4765B4j5j80K58k6j01J07p9j61L5L54J11l68j06M38j09n16L77K30k87q7K48J33
$$ 24 9 -171 87 61 -40 67 -12 -173 -138 216 327 -41 -147 291 182 -334 43 273 -14 -101 147 280
4787B80n76K56K89j67k61j7L69l06j95N09j29l47J82J82k42J04L06J68k57m51
$$ 280 -296 -40 249 82 -179 -196 173 -133 -328 181 52 -295 -113 69 -173 -69 237 405 148 -303
4807c03N01p8n26L31M92l56l11K01K35j77n24P71n2l25p1K51N1l00L77j02k80
$$ -303 198 120 -406 -75 417 61 -250 -49 186 9 -515 256 204 -121 -192 59 110 -190 187 85 -195
4828a95j15P29m7o06J72M14n08k01M89K80p24J43M89l02j87J00L46j9o65O64K3
$$ -195 -310 419 372 -234 -62 352 -156 -357 132 412 -312 -169 320 18 -169 -69 277 258 -407 257 280
4849B80n42M71j54n5k9K44nk58k72O43j48n02K94L18l44Jk02O23k96j07M23k21
$$ 280 -262 209 55 0 -29 215 210 -48 -320 323 175 -327 -33 285 -59 -58 -260 363 67 -40 383 162
4871A62m56L51K25j15l94J81L60k88j29K89m39J55kK55j73l19L88K47p48N29m
$$ 162 -294 57 282 167 -227 -46 314 26 -103 186 -253 -98 -100 155 -18 -337 51 298 -450 79 75
4892G5N7j39o8K37j67j38J14J97l12R8J03L23k84k46L62M2m11L42j84j80J89J6
$$ 75 132 -7 -75 162 -5 -143 -29 168 -144 -46 57 380 96 -150 212 254 -157 185 1 -179 10 26
4914B6qm6KL75m19jM03k95K49k97L03j55n82N45M4k52J6J51p0J94m95J66J42J47
$$ 26 18 -28 -26 349 -70 -71 332 37 286 -11 292 137 -445 100 144 -108 -92 59 -11 183 -312 -146 -4 143
4938A43j28J98m68J76K40k31l0K05p9l2rL22k96r1r1J65P7n6o4k56J78j4L11m03
$$ 143 15 213 -255 -79 161 -70 -100 105 26 -6 -15 307 11 -80 -171 -6 71 15 -49 -305 -127 -141 170 -233
4962b33J85J0kK6Kk1ok18N36q3l08J88kOM0j62J64l52r6N09rq7j74J76r4m6k30
$$ -233 -48 -38 -40 -14 -12 -33 -39 -257 279 196 -112 76 74 80 120 -42 122 -230 -326 183 174 87 -87 89 -5 -51 -281
4989b81N11j71j05K43J31j84j86R9K76n09K39N2j27r8M37M5n36j37M79j66k82
$$ -281 230 59 -46 197 328 144 -42 57 333 -176 63 115 -12 -110 327 372 -164 -301 178 12 -270
5010b70O0L77j65j30K52j01K1l31N68j11m69L47N5k72J24M36o4l95N5K45n18K9
$$ -270 -210 167 2 -128 124 23 44 -287 281 170 -299 48 103 -169 -45 391 327 -68 -13 232 -286 -257
5032b57J86K24l43L5K19k79m2j2L34k86o3L17Qk16l35O59k03m35L03N21l08k47
$$ -257 -71 153 -190 -155 64 -215 -257 -269 65 -221 -284 33 41 -175 -510 149 -54 -489 -186 335 27 -220
5054b20N93j22m03j25O47o9o70K86M52m77j49N28P8l64k61N63l36m51O89J63m44
$$ -220 373 251 -152 -277 370 301 -369 -83 369 -108 -257 271 349 -15 -276 287 -49 -500 189 352 -92
5075i2K9J62J24k49j58N35J03n95N1K96k46k14J09K24j12j6M49n88j53L25k9k05
$$ -92 -63 99 223 -26 -184 351 454 -141 -90 206 -40 -254 -145 79 -33 -49 400 -188 -341 -16 -45 -250
5097b50J13J17J80m57J79P4q9k54M85J76m66o1K71K01l50J52J60l77K4N10j62
$$ -250 -137 -20 160 -297 -118 -44 -133 -387 98 274 -192 -253 18 219 -131 21 181 -196 -172 338 176
5118A76m84j6M19j06n4k5K86k16k46L24K80n08R6K64j03k12L07l8j24j44J84R0
$$ 176 -308 -324 95 -11 -65 -90 196 -20 -266 58 338 -170 -74 190 87 -125 182 144 20 -124 60 150
5140A50l19K04J89j21J9J3J35m19L64k03k02n7L05j5jr4RJ64j63j61L93k62J76
$$ 150 -169 35 224 103 122 135 270 -149 215 12 -190 -247 58 43 42 -52 -43 121 -42 -203 190 -72 104
5163A04n1l5l8M0j77J64k01Q9kr9P3L95j66k52M24j46k08m5N6L7m9j75L42J68
$$ 104 53 18 -20 20 -157 7 -194 -105 -107 -206 -133 262 96 -156 268 122 -86 -131 -75 -38 -87 -262 80 248
5187B48m57P8L59j92k87M87Lk23L2K03m5l42J57q3j02J60J66J17n35J40M14k47
$$ 248 -209 -131 228 36 -251 236 239 16 48 251 206 -136 21 -62 -164 -4 162 279 -256 -116 298 51
5209E1k09K16J12l35K44K13l68j18L74J57j9n94L15N17q95M16N5P3j52K09O6m81
$$ 51 -158 58 170 -165 79 292 -76 -194 180 337 318 -276 39 556 -339 77 132 205 53 262 328 -153
5231a53r4J45K71l37L33J20j68m10M5N74n43l63N91L25p06K93O18n10k53J85L08
$$ -153 -247 -102 169 -168 165 285 117 -293 -248 326 -217 -580 11 336 -370 -77 541 31 -222 -37 271
5252B71n26NJ30k5N8k07M79l5n03K09M55m45k07L02Q3l63R4M66j92l84L91J29
$$ 271 -255 -250 -120 -145 -87 -294 185 150 -353 -144 311 -134 -341 -39 44 -319 -225 241 49 -335 56 185
$$ [...]
8191B9
##END NTUPLES=NMR FID
##END=
