##TITLE=1H_Pr NO2-Pr
 CDCl3, 8 sc, 
 23.9.2020
##JCAMPDX= 6.0         $$ Bruker NMR JCAMP-DX V2.0
##DATA TYPE= NMR FID
##DATA CLASS= NTUPLES
##ORIGIN= UXNMR, Bruker Analytische Messtechnik GmbH
##OWNER= root
$$ XWIN-NMR		Version 3.5
$$ Wed Sep 23 11:37:01 2020 Russian Standard Time (UT+4h)  she@DPX200
##.OBSERVE FREQUENCY= 200.1315066352
##.OBSERVE NUCLEUS= ^1H
##.DELAY= (6, 6)
##.ACQUISITION MODE= SIMULTANEOUS
##.ACQUISITION SCHEME= undefined
##.AVERAGES= 8
##.DIGITISER RES= 18
##SPECTROMETER/DATA SYSTEM= spect
##.PULSE SEQUENCE= zg30
##.SOLVENT NAME= CDCl3
##.SHIFT REFERENCE= (INTERNAL, CDCl3, 0, 15.7039)
##AUDIT TRAIL= $$ (NUMBER, WHEN, WHO, WHERE, WHAT)
$$ ##TITLE= Audit trail, XWIN-NMR		Version 3.5
$$ ##JCAMPDX= 5.01
$$ ##ORIGIN= Bruker BioSpin GmbH
$$ ##OWNER= she
$$ F:/spectra/data/she/nmr/H-F/1/audita.txt
$$ ##AUDIT TRAIL=  $$ (NUMBER, WHEN, WHO, WHERE, WHAT)
(   1,<2020-09-23 11:35:46.60 +0400>,<she>,<DPX200>,
      <created by zg, POWCHK disabled, PULCHK disabled
       configuration hash MD5:
       00 E9 B6 7A A2 85 ED C7 34 08 36 98 17 FE 4E 26
       data hash MD5: 16K
       B8 25 CD C6 F3 C1 A1 B8 A3 2B 62 1B FE CB 9A 16>)
$$ ##END=
$$ 
$$ hash MD5
$$ CF 18 A0 82 51 FA 0B 27 BE 5E 7C 8B 83 D1 02 96
##$RELAX= 
##$RELAX= 
##$RELAX= 
##$RELAX= 
##$RELAX= 
##$RELAX= 
$$ Bruker specific parameters
$$ --------------------------
##$DU= <F:/spectra>
##$EXPNO= 1
##$NAME= <H-F>
##$PROCNO= 1
##$TYPE= <nmr>
##$USER= <she>
##$AMP= (0..31)
100 100 100 100 100 100 100 100 100 100 100 100 100 100 100 100 100 100 
100 100 100 100 100 100 100 100 100 100 100 100 100 100 
##$AQSEQ= 0
##$AQ_mod= 1
##$AUNM= <au_zg>
##$AUTOPOS= <>
##$BF1= 200.13
##$BF2= 200.13
##$BF3= 200.13
##$BF4= 200.13
##$BF5= 200.13
##$BF6= 200.13
##$BF7= 200.13
##$BF8= 200.13
##$BYTORDA= 1
##$CFDGTYP= 0
##$CFRGTYP= 5
##$CHEMSTR= <none>
##$CNST= (0..31)
1 1 145 1 1 1 1 1 1 1 1 1 1 1 1 1 1 1 1 1 1 1 1 1 1 1 1 1 1 1 1 1 
##$CPDPRG= <>
##$CPDPRG1= <>
##$CPDPRG2= <>
##$CPDPRG3= <>
##$CPDPRG4= <mlev>
##$CPDPRG5= <mlev>
##$CPDPRG6= <mlev>
##$CPDPRG7= <mlev>
##$CPDPRG8= <mlev>
##$CPDPRGB= <>
##$CPDPRGT= <>
##$D= (0..31)
0 1.2 0 0 0 0 0 0 0 0.06 0 0.03 0 0 0 0 0.0002 0 0 0 0 0 0 0 0 0 0 0 0 
0 0 0 
##$DATE= 1600846546
##$DBL= (0..7)
120 120 120 120 120 120 120 120 
##$DBP= (0..7)
150 150 150 150 150 150 150 150 
##$DBP07= 0
##$DBPNAM0= <>
##$DBPNAM1= <>
##$DBPNAM2= <>
##$DBPNAM3= <>
##$DBPNAM4= <>
##$DBPNAM5= <>
##$DBPNAM6= <>
##$DBPNAM7= <>
##$DBPOAL= (0..7)
0.5 0.5 0.5 0.5 0.5 0.5 0.5 0.5 
##$DBPOFFS= (0..7)
0 0 0 0 0 0 0 0 
##$DE= 6
##$DECBNUC= <off>
##$DECIM= 32
##$DECNUC= <off>
##$DECSTAT= 4
##$DIGMOD= 1
##$DIGTYP= 9
##$DL= (0..7)
0 120 120 120 120 120 120 120 
##$DP= (0..7)
150 150 150 150 150 150 150 150 
##$DP07= 0
##$DPNAME0= <>
##$DPNAME1= <>
##$DPNAME2= <>
##$DPNAME3= <>
##$DPNAME4= <>
##$DPNAME5= <>
##$DPNAME6= <>
##$DPNAME7= <>
##$DPOAL= (0..7)
0.5 0.5 0.5 0.5 0.5 0.5 0.5 0.5 
##$DPOFFS= (0..7)
0 0 0 0 0 0 0 0 
##$DQDMODE= 0
##$DR= 18
##$DS= 0
##$DSLIST= <SSSSSSSSSSSSSSS>
$$ [...]
##$SUBNAM2= <"">
##$SUBNAM3= <"">
##$SUBNAM4= <"">
##$SUBNAM5= <"">
##$SUBNAM6= <"">
##$SUBNAM7= <"">
##$SUBNAM8= <"">
##$SUBNAM9= <"">
##$SW= 16.880792210976
##$SWIBOX= (0..15)
0 0 2 0 0 0 0 0 0 0 0 0 0 0 0 0 
##$SW_h= 3378.37837837838
##$TD= 16384
##$TD0= 1
##$TE= 0
##$TE2= 300
##$TE3= 300
##$TEG= 300
##$TL= (0..7)
0 120 120 120 120 120 120 120 
##$TP= (0..7)
150 150 150 150 150 150 150 150 
##$TP07= 0
##$TPNAME0= <>
##$TPNAME1= <>
##$TPNAME2= <>
##$TPNAME3= <>
##$TPNAME4= <>
##$TPNAME5= <>
##$TPNAME6= <>
##$TPNAME7= <>
##$TPOAL= (0..7)
0.5 0.5 0.5 0.5 0.5 0.5 0.5 0.5 
##$TPOFFS= (0..7)
0 0 0 0 0 0 0 0 
##$TUNHIN= 0
##$TUNHOUT= 0
##$TUNXOUT= 0
##$USERA1= <user>
##$USERA2= <user>
##$USERA3= <user>
##$USERA4= <user>
##$USERA5= <user>
##$V9= 5
##$VALIST= <valist>
##$VCLIST= <CCCCCCCCCCCCCCC>
##$VD= 0
##$VDLIST= <DDDDDDDDDDDDDDD>
##$VPLIST= <PPPPPPPPPPPPPPP>
##$VTLIST= <TTTTTTTTTTTTTTT>
##$WBST= 1024
##$WBSW= 4
##$XGAIN= (0..3)
0 0 0 0 
##$XL= 0
##$YL= 0
##$YMAX_a= 745310
##$YMIN_a= -901761
##$ZGOPTNS= <>
##$ZL1= 120
##$ZL2= 120
##$ZL3= 120
##$ZL4= 120
##$ABSF1= 10
##$ABSF2= 0
##$ABSG= 5
##$ABSL= 3
##$ALPHA= 0
##$AQORDER= 0
##$ASSFAC= 0
##$ASSFACI= 0
##$ASSFACX= 0
##$ASSWID= 0
##$AUNMP= <proc_1d>
##$AZFE= 0.1
##$AZFW= 0.1
##$BCFW= 1
##$BC_mod= 2
##$BYTORDP= 1
##$COROFFS= 0
##$CY= 11.3945322036743
##$DATMOD= 1
##$DC= 2
##$DFILT= <>
##$DTYPP= 0
##$F1P= 16.9975609425685
##$F2P= -3.02152046262296
##$FCOR= 0.5
##$FTSIZE= 0
##$FT_mod= 4
##$GAMMA= 1
##$GB= 0.15
##$INTBC= 1
##$INTSCL= 1
##$ISEN= 128
##$LB= 0.24
##$LEV0= 0
##$LPBIN= 0
##$MAXI= 10000
##$MC2= 0
##$MEAN= 0
##$ME_mod= 0
##$MI= 1.114404
##$NCOEF= 0
##$NC_proc= 0
##$NLEV= 6
##$NOISF1= 3.799351
##$NOISF2= 2.8
##$NSP= 1
##$NTH_PI= 0
##$NZP= 0
##$OFFSET= 15.70392
##$PC= 1
##$PHC0= -9971.158
##$PHC1= 12.0009
##$PH_mod= 1
##$PKNL= yes
##$PPARMOD= 0
##$PSCAL= 0
##$PSIGN= 0
##$REVERSE= no
##$SF= 200.130013532006
##$SI= 16384
##$SIGF1= 3
##$SIGF2= 2
##$SINO= 400
##$SIOLD= 16384
##$SREGLST= <1H.CDCl3>
##$SSB= 0
##$STSI= 0
##$STSR= 0
##$SW_p= 3612.71676300578
##$SYMM= 0
##$S_DEV= 0
##$TDeff= 0
##$TDoff= 0
##$TI= <>
##$TILT= no
##$TM1= 0
##$TM2= 0
##$TOPLEV= 0
##$USERP1= <user>
##$USERP2= <user>
##$USERP3= <user>
##$USERP4= <user>
##$USERP5= <user>
##$WDW= 1
##$XDIM= 8192
##$YMAX_p= 0
##$YMIN_p= 0
$$ End of Bruker specific parameters
$$ ---------------------------------
##NTUPLES= NMR FID
##VAR_NAME=  TIME,          FID/REAL,        FID/IMAG
##SYMBOL=    X,             R,               I
##VAR_TYPE=  INDEPENDENT,   DEPENDENT,       DEPENDENT
##VAR_FORM=  AFFN,          ASDF,            ASDF
##VAR_DIM=   8192,          8192,            8192
##UNITS=     SECONDS,       ARBITRARY UNITS, ARBITRARY UNITS
##FACTOR=    0.000296,      1,               1
##FIRST=     0,             0,               0
##LAST=      2.424536,      0,               0
##MIN=       0,             -901761,         0
##MAX=       2.424536,      745310,          0
$$ Real data points
##PAGE= N=1
##DATA TABLE= (X++(R..R)), XYDATA
$$ [...]
2079A399j5l387R23L020j057k875K034K578k444j522K479J285k927j74L402o91
2095B028l191J605L081k601k300L730J304m531n98M869m50m902J330M959l198
2110A135l806L524L204m895k054N141N12n191M47M923k169m282L291K964m568
2125a824j557M936N1n438J330N326l013m750M113L499m753k921O031J048o112
2140d034M54O136j868n378L456M216m343k793N254J423n572M34N493j757m717
2155c596L361M024m225k585N096J331n549Q97N074j806m874L168M193m013k991
2170b495M505J949m878m01M798j020m097J893L169k558k602L410J326l696p33
2185a430L624k97l577J493K881k667k150K648J585l602p92L132L87l321J75K904
$$ y = [1399, 1384, -2003, -1080, 1940, 883, -1992, 42, 2620, 176, -1346, 1133, 2418, -509, -683, 2719, 2028, -1163, 442, 3523, 922, -1378, 2352, 3656, -875, -1473, 3396, 2946, -1956, -626, 4333, 1135, -2671, 853, 4057, -838, -2892, 2249, 2761, -2430, -1983, 2940, 771, -3511, -220, 2744, -1824, -3381, 1555, 1606, -3832, -2502, 2824, -189, -4939, -826, 2673, -2080, -5001, 1030, 2078, -4034, -3580, 2556, 688, -4690, -1234, 2982, -1361, -4154, 1100, 2523, -3049, -2615, 2878, 1121, -3596, -235, 3789, -436, -3021, 2075, 3406, -2143, -1246, 3828, 2022, -2852, 316, 4509, 496, -2495, 2010, 3959, -919, -1320, 3478, 2458, -1639, 254, 3423, 865, -1737, 1673, 2999, -697, -1430, 2194, 1897, -1680, -187, 2694, 27, -2123, 525, 2110, -1492, -2284, 848, 1235, -2086, -1911, 993]
2201I93j141k787J736J924j682j714J971J359k389o02K149J47j846L93J781o99
2217d07j353R49J321j495p75J625J029j998l59K140L06k103K2K477o32k167J202
2234b18K231j447j557K200J076k311n36K780m3k960Q69K793j370k863K472J852
2250B968k688j331K940O31l469K73L471j512k795J950K649l313k196M097M51l805
2266a679%L804j344l790K363K814k867k488L582J390m021m27M068q72m342K474
2282a335L357k962k991L673J930m067m56M042l44m002J534L472k488k701L955
2297F17J672m037o06M405n36l991J668L404k245k576L279J506l317p17L922m40
2313B008l708J539L480k189k787K846K069l444q89L313K35l407Q44K917j580k549
$$ y = [993, -148, -2935, -1199, 725, -957, -2671, -700, 659, -1730, -2332, -183, -36, -1882, -1489, 292, -407, -1760, -811, 510, -985, -1760, -135, 894, -1104, -1463, 677, 983, -1120, -1098, 1379, 747, -1420, -218, 2013, 566, -991, 1209, 2285, -26, -562, 2218, 2175, -785, 84, 2877, 1507, -1356, 1116, 2968, 280, -1051, 1889, 2520, -949, -676, 2795, 1283, -1512, 438, 3087, -226, -2422, 1675, 2126, -1679, -1679, 2125, 781, -3009, -646, 2168, -699, -3187, 395, 1785, -2236, -2663, 1405, 533, -3809, -1335, 2022, -940, -3931, -258, 1672, -2395, -2851, 1191, 847, -3155, -1621, 1851, -637, -3338, 617, 2289, -1748, -2354, 2051, 1515, -2476, -808, 2596, 351, -2225, 1054, 2560, -757, -1474, 2448, 2008, -1700, -161, 3319, 1130, -1657, 1189, 3258, -186, -1075, 2238, 2473, -934, -90, 2827, 1247, -1302]
2329a302K054J978k772j058K780J37k755q3K481n53k370J118J523j552j681K201
2345A46P85k261l33J767j15j866P74J619q92j757J155J466j610j030J972L97j821
2362a604l21K001j45j550L34J783o70j432J232R71j195q98J872P55j948J7K281
2379A483n69j852P93J864j077j487J642J337j831p86K024M02k526P62K370j246
2395A303j962J376J705k017r36K093M77k770O62K022p95k158J264K006j976j800
2411a506K358P02k597l33K973r07k283M55K573k001j827K228J011k604q4K291
2427D49o64k205J211K218j834j834K035J521k389j074L015O6k947P98K592j045
2443h7j991J412K042k052j200K465O70k328L07K267r48j380J337J553j808j054
$$ y = [-1302, 752, 2730, -42, -1100, 1680, 1817, -938, -1021, 1460, 907, -1463, -345, 1178, -374, -2055, 146, 931, -1330, -1663, 104, -11, -1877, -1103, 516, -376, -2133, -978, 488, -1122, -2152, -180, 217, -1604, -1925, 76, -69, -1619, -1285, 498, -172, -1604, -372, 599, -596, -1494, 378, 1133, -815, -798, 1483, 914, -938, -145, 1719, 642, -845, 797, 2134, 303, -483, 1541, 1943, -583, 179, 2549, 1303, -659, 717, 2422, 405, -531, 1562, 2039, -731, -69, 1953, 1158, -1000, 264, 2270, 294, -1506, 852, 1554, -1043, -1376, 1597, 690, -1593, -1138, 1435, -566, -2393, -165, 846, -1758, -1842, 449, -215, -2420, -1209, 1009, -825, -2659, -624, 897, -1492, -2566, 449, 515, -2432, -1634, 958, -87, -2078, -666, 1376, -676, -1876, 589, 1259, -1069, -762, 1505, 557, -823, 514, 2067, 259, -795]
2459g95J930N98k179K24K333q97k131J277J797j191j796J791J302k034n23J719
2475A425M45k236K27J760p28j631J040Q78j238o83J177N70j594m09J919p68j731
2492a577J203J173j153j373J584O72j804n64J758Q0j824K35K182o82j999J056
2508a033J515j287j131J484R11k063J29J837l14j427O73J448j119j010J945N86
2524A144j762j82K052m50k002J211J888j169j929J791J570j728j040K050K96j897
2540a57K4K177r33j671J179J222j207j033J621N41k138J26J949j071j651J248
2556B26J236j619r98J969J81k025k23K232m19k239Q17J589q15j904J735J052j745
2573i50n37J455P2j371K84J163o39q92P03J055j665k77J742l20j628O71J560o58
$$ y = [-795, 1135, 1733, -446, -222, 2111, 1214, -917, 360, 2157, 966, -830, 961, 2263, 229, -294, 1425, 1870, -366, -139, 1621, 893, -738, 302, 1180, -58, -741, 436, 1006, -588, -997, 922, 154, -1577, -374, 799, -354, -1727, -143, 529, -1275, -1839, -81, -1, -1825, -1590, 592, -90, -2089, -1033, 482, -805, -1936, -452, 459, -1604, -1475, 362, 48, -1379, -706, 742, -377, -1387, 558, 1144, -618, -800, 1252, 802, -1200, 11, 1899, 730, -1199, 592, 2162, 434, -606, 1444, 1740, -157, -133, 2044, 1111, -560, 619, 1841, 634, -399, 1222, 1763, -375, -249, 1700, 629, -1022, 226, 1462, -157, -1155, 814, 995, -1030, -1253, 979, 560, -1679, -862, 727, -88, -1992, -257, 795, -950, -1487, -32, 40, -1331, -1047, 116, -523, -1415, -712, 343, -1322, -1599, 143, -177, -1805, -1134, 426, -232]
2591b32j443J465J056j065j031J346P30j140k53J167K82j318N92R34o16o39O36
2608D71N71j010J27Q68J13j181J11J597q11j089Q53J073q65r93J302N33j722k49
2626c01J506j92j380k4J511o16q66L76Q61r90j017J568q8j321K3J397n93j212
2644a358O37J189j212o62J047P11j656k45J692l71j181K97J517r03j202J379Q66
2661E45j368p67J688J11j405M62J614q66j087J467O40j327p17J948J85j713K67
2678c23J573k77j569J102J148j305q72J595M30j875L35J645m45j318Q15J079j184
2695E54q37J253M08j711M04J089n41j178O18J272j213r92J280M38j247m79J556
2712F74k63j429K64J253r61o76Q25O14j084o36J308J49j187K39O96m38q11N59
$$ y = [-232, -1675, -210, 846, -219, -1250, 96, 826, -314, -567, 600, 882, -436, 156, 1090, 474, -165, 471, 1042, 32, 159, 1027, 1140, -41, 70, 1667, 856, -233, 620, 1693, 828, -165, 1137, 1670, -52, -301, 1205, 1013, -367, -391, 1120, 504, -362, 14, 875, -115, -1132, 436, 348, -973, -950, 447, -146, -1358, -721, 468, -744, -1406, -359, 352, -1304, -1549, 143, -228, -1409, -1112, 405, -498, -1700, -321, 545, -823, -1590, 98, 209, -1196, -734, 880, 14, -1073, 394, 1034, -293, -1010, 938, 1123, -590, -323, 1250, 973, -596, 506, 1654, 349, -523, 1072, 1502, -373, -38, 1607, 1162, -156, 659, 1738, 554, -283, 970, 1378, -333, 71, 1160, 619, -559, 59, 1331, 118, -874, 406, 844, -403, -882, 674, 411, -1018, -754, 499, -462, -1138, -313, 301, -783, -1419, -111, 38, -1149, -910, -214, -652, -1463, -904]
2730i04J006j040r0Q49K80j198K44J032j75p54L74J006n93n69N78M95o96m11J184
2749F18l5o48k74R05K51r36L73M84q4n01N64L45n55k98O08r0m63o3R71o09o77
2770a14N19R14q13p33O67O06j076j79R15N3j535K02J405j001p55R05M22q09n85
2789i92J223j7j358J17J385o67r01K84J507j334m46R68K61j664P10J290o07j226
2807a467R61R43j078n92J420L28j547L56J457n47j196P50Q51r20m34J308J42j141
2825d06K25J380l42j454P46J176r47o97J234O79j611J74J336o34r64N97J101j254
2843C39l61P21L72j069k38J472o42r69O67N80q48o21J266k01r42q9R66m20p65
2862g82L23Q41o02p31P33J69q48l0Q03j89o68J97O31l62k87L71O4j70l46N66M6
$$ y = [-904, 102, -938, -1028, -179, 101, -1097, -853, 179, 4, -750, -376, 630, 37, -532, 46, 541, -155, -566, 618, 583, -65, -339, 566, 817, -119, 254, 738, 654, 153, 717, 1062, 507, 209, 817, 727, 264, 201, 1172, 563, -114, 405, 1319, 506, -227, 440, 1046, -30, -209, 706, 759, -776, -574, 831, -170, -925, -20, 402, -407, -992, 231, 214, -1144, -1027, 358, -309, -1210, -926, 581, -753, -1199, -231, 30, -1634, -924, 366, -241, -1467, -506, 437, -641, -1233, 187, 515, -1032, -676, 781, 234, -962, -212, 639, -281, -715, 593, 735, -406, -181, 1199, 857, -597, 149, 1325, 378, -319, 915, 1594, -17, 157, 1493, 859, -105, 492, 1593, 339, -22, 699, 1071, 2, -236, 1236, 594, -375, 292, 872, 24, -597, 669, 468, -474, -563, 403, -17, -782, -459, 382, -220, -951, -218, -49, -897, -927, -124, -313, -981, -784, -153, -515, -802, -431, -367, -537, -883, -317, -271]
2883b71l03J09K08l4k22L02Q7k08L10J89k40J60q3pM25l44j95O20O1j77k53M67
2905F01Lj6m00N55J20m66r0L56P7q23M87M16k50n76Q85j59o70K57M62m84q40J002
2927D47J20q86j31P64J51j089q7J310n55j292J084O36j048n88J118q3j039K82
2945h86J105p36r19Q63O40q62l43J220K06j813Q58J203n49j555J488Q18j231n86
2963a079J576k26j310O77J044l35j134J159L90r85k96J433K9j318N03J189r39
2980C78o29J012N21j308m65J871m24j477Q47J100q57r93J114M60j124l81J148
2997G93l60p67M83O00r47k12Q56q3p65j00P89n70o83O95L79n15m66R15o8p56%
3018g82N76k43n41M90L32m19l59O72p2l61M60r8k95K27J80L07o84J27N03m7o23
$$ y = [-271, -574, -465, -257, -291, -513, -211, -124, -332, -22, 167, -73, 87, 4, -3, 422, 78, -117, 503, 564, 387, 134, 601, 604, 588, 188, 743, 863, 397, 307, 663, 740, -83, 404, 820, 570, -6, 879, 720, 50, 307, 769, 285, -555, 447, 567, -319, -450, 314, 465, -624, -711, 599, 44, -1248, -164, 472, -576, -1164, -46, -129, -1168, -886, 219, -517, -1436, -573, 67, -795, -1138, 82, 288, -1525, -667, 536, -13, -1568, -80, 738, -493, -1079, 497, 271, -1039, -362, 682, 347, -787, 372, 762, -223, -519, 914, 943, -375, 128, 1317, 378, -251, 761, 1282, -26, -491, 1380, 956, -521, 326, 1426, 569, -424, 690, 1150, 26, -355, 793, 433, -334, 149, 749, -198, -410, 446, 363, -402, -502, 287, -283, -966, -271, 108, -407, -873, 42, -26, -782, -782, -206, -449, -990, -500, -168, -587, -946, -274, -346, -707, -247, -345, -640, -413, -233, 74, -610, -483, 20, -27, -650]
3039f50O74L06l47k10N98l95P4K36L28q3k04J22p6k31O97l12m61J29Q70n60m61
3060D4M80M83q54j18O51k56l75K3Q36p22k50O23k02n49K54N98q58n50N59Q19j156
3081e20j34R15q4j101K51J310o92j191R21P49j270k19R50O4r16L3J225q84o70
3100a263J048J89j131K92J161m31j226P74J104j187m62J434O24j754K29J303k79
3117D25q17L91Q97p09m64R10L88j105K5J126p00p83R83M77p29n06J108l8j249
3136c70N67J083n76j141Q45P99j278o6Q25q0q64L19P32o43n36O87J99p60j33Q11
3156D20n96o64P40M16r32j66P49m8q96K78Q19o15n49P12J32n76J66L74O4o70M40
3177d02J90k51k61O45K8m94J52O69o75k70P98J57n35M29L28m74j88N79k9j71J30
$$ y = [-650, 24, 330, -17, -227, 371, -24, 50, 286, 614, 531, 327, 449, 373, 142, 839, 527, 66, 195, 1065, 505, 44, 524, 1007, 153, 35, 686, 430, 55, 78, 914, 192, -58, 565, 363, -186, 68, 666, -192, -742, -183, 636, -520, -654, 261, 177, -924, -673, 637, -55, -1246, -325, 424, -846, -1065, -115, -51, -967, -934, 291, -593, -1263, -215, -26, -1157, -865, 296, -135, -1361, -587, 517, -670, -1132, 302, 926, -828, -599, 704, 425, -392, -1, 896, 187, -277, 633, 1021, -84, -59, 1067, 367, -416, 567, 1044, 315, -191, 917, 879, -370, 197, 1280, 704, -437, 408, 1207, -71, -137, 688, 608, -256, 63, 795, 152, -384, 303, 502, -258, -391, 420, -176, -840, -100, 316, -616, -782, -33, -81, -977, -699, 120, -495, -1044, -332, -200, -776, -610, -236, -172, -842, -402, -212, -463, -724, -79, -51, -545, -393, 276, -399, -669, 129, 286, -249, 180, 508, 34, -154, 425, 396, 225, 355]
3198C55L47%o66M86L87p39PP62n17l56J89P69l55p70R45l98j88j5O21m09r01J029
3220E83N5o11n07R58j08q65L87N56n38n63O36L87r69P6P97m17q57O83O37p33o79
3241a092Q84J50r16K98R91o31o69N37M97p10l86J254j31j238N52P91l37o93R77
3260A28L63p67l96J296n6j058L64P11j44q43Q40K34p30k61J381l35j073R42N39
3279A135r47m68J058L85j250L14O57m91n56N91J62n00j23P40M0r72L49P07q23
3298Hm23Q10K50r57j25O42j11r73J024J61j050J25O56O3p30j21R00m09p25N00
3318d85M20q45J65R59n49m30M85K70m73j38P00k68o00M70N43n47n34Q76N67r15
3338c29P6Q10l55o69N84N71q50j6R02m1o05R2P97n53l12N73J22p62Q6Q56m21p47
$$ y = [355, 702, 702, 36, 522, 909, 170, 177, 939, 422, 66, 255, 1024, 669, -101, 844, 446, 258, 243, 864, 455, -446, 583, 638, 27, -480, 478, 370, -495, -108, 448, -90, -653, -17, 370, -599, -523, 274, -143, -1000, -317, 320, -413, -1092, -208, -58, -974, -676, 315, -316, -985, -448, 49, -661, -1047, 207, 76, -1162, -610, 181, -156, -849, 128, 491, -276, -672, 624, 568, -490, -126, 585, 441, -402, 438, 672, -58, -319, 1062, 727, -346, 596, 1135, 188, -280, 778, 1163, -87, 227, 884, 393, -163, 428, 590, 90, -33, 707, 747, -225, 124, 831, 8, -415, 395, 645, -312, -437, 205, 94, -879, 145, 306, -744, -619, 37, 100, -630, -751, 149, -260, -985, -485, -65, -910, -745, 214, -335, -765, -280, -10, -483, -621, 79, -189, -789, -319, 224, -323, -857, 19, 586, -329, -253, 557, 202, -467, 117, 688, -162, -178, 724, 683, 78, 170, 967, 414, 102, 675, 797, 35, 121, 977, 556, -191]
3360a91P84N67j133m42J143m4j123L32R53n13p41M33K81m80r9N79n5r99N60N92
3380D04q63o2P71l63o67J85J043p27o24O60N33j002m39J289j08q75J75Q12n11
3399c69m50M96M19r35M26O06q4j035P38P83p52l04Q80J18j116M29Q91m60p64O45
3419A62P14q92l94J113j33o33J70Q28l56p70P63K62r60K66O85j99j028Q30N07
3438I35q83m79J193%j168K18R66n64o92K51J073r89l81Q25j80n18J06N52n47k19
3458e01M07M03r74J28O77l60q03P99M22r73J99Q33l98p49K89O40k62n74N51L58
3478A12n85j58Q49l6r52R74L02q73k9P99Rp43R7O87j78o87P09N57p87k22Q64J09
3500H18p40K40M46l08l62O42o2r05M16O91l47q45Q11M83j022m78J067Q0q73K92
$$ y = [-191, 593, 1160, 27, -415, 728, 684, -439, -107, 846, 333, -408, 25, 306, -174, -273, 306, 251, -748, -188, 404, -459, -521, 250, -113, -780, -595, 448, -279, -903, -243, 290, -712, -1151, 138, 30, -845, -670, 142, -369, -819, -323, 96, -839, -413, 193, 109, -926, -188, 595, -157, -461, 419, 537, -579, -150, 741, 281, -483, 162, 876, -16, -410, 703, 570, -63, 107, 935, 579, -191, 572, 834, -126, 140, 825, 626, -402, 428, 935, 52, -427, 766, 766, -402, -184, 782, 218, -474, -223, 850, -139, -520, 305, 125, -393, -287, 265, -282, -501, -94, 309, -665, -537, 140, -220, -1023, -224, 198, -775, -576, 257, -141, -890, -601, 39, -223, -797, -246, 112, -473, -631, 218, 182, -770, 204, 506, -367, -396, 403, 412, -331, -234, 453, 275, -412, 297, 854, 67, -155, 709, 818, 78, 318, 764, 456, 94, 736, 674, -231, 185, 876, 529, -316, 495, 978, -44, -522, 545, 625, -248, 44]
3520D4O77m85o07O90J75p19j24N85K5q19L34N86o09m59M03L50o83J61M29j87p59
3541i92N75N82p31k36R30j81q75M80M92k28o50R29L5p88M89N62l86o72P58K74
3561C67p06j27R19J10j253P59P09p34m11R58J05l74m78P96o0o59N26K30l79m17
3581a19Q15N0q18K38O03o85o20J025L78q72m72R63l07o61M22Q02q11n06J033l37
3601A21m90J40O89p37k05L27M72q10k30Q29p7q22M81L62m26k59P39N7j032L04
3621e67O52j97p82L44O50l77j52N02L15p82K31O28m74l81O66j03n81J90Q14j61
3641D35p70O74N74n82q53J197j17n43j6O55m12m43M26N79q54k5R06l52p05K28
3661BN97l98p19Q90Oo04L9N05j36n09L74M70p82j89O73Qm69j77N95j75o10N14
$$ y = [44, 721, 236, -371, 319, 494, -225, -349, 236, 261, -558, -224, 362, -247, -706, -303, 47, -636, -475, -46, -233, -992, -417, 165, -566, -802, 128, -53, -928, -448, 44, -184, -834, 95, 130, -658, -169, 393, 7, -665, 93, 367, -339, -466, 453, 563, -690, 69, 778, 44, -367, 591, 696, 322, -156, 640, 580, -79, 447, 677, 298, -119, 696, 746, -72, 166, 769, 84, -536, 489, 867, -5, -477, 486, 179, -482, -60, 742, -69, -575, 458, 121, -369, -229, 460, -277, -482, -155, 317, -493, -723, 106, 29, -793, -312, 50, -376, -635, 104, 161, -871, -567, 85, -112, -894, -550, 100, -277, -429, 73, 388, -394, -163, 465, -9, -390, 276, 173, -408, -218, 596, 435, -335, 339, 913, 331, -522, 675, 558, 15, -1, 654, 242, -201, 225, 804, -50, -75, 831, 479, -226, 2, 599, 201, -518, 372, 378, -226, -187, 318, 182, -327, 47, 517, -265, -454, 219, 227, -242, -419, 176, 1, -609, -95]
3683i5J69m42j85O36m15n63N53O35n78l73N51K70q66M03L55j85k60L89K47p53
3703e07j71O86K97o69R7O42k77m80P30R2p59J29P39l66j72Q1O58p64k42R00k21
3724D23n61M51K93n50k49O10J21m90O2N20j60o61N55J07n06j20P65j00p12J60
3744d2M31o8n74M41J46q78L11O88l25n94M31N24p11m77O93J19p03K02N97l86o00
3765g75P36K97n69j61O03r4o95K82P76p24l75P90L04o83l2O69k99n51O26L37o76
3786b14L5P58k49p78L14N13k19m46O84M8l97k28O27k7n20K99K69j66m69Q29k2
3807F41p15L3Q30n64m57K27M82m18r9K55K81o00J67K01q7o75N68o3k45j07P78
3828D33k51m27lM45l23n20O94j09n50J64N33l65l22M05L36o41R8Q36l50n79M08
$$ y = [-95, 74, -368, -553, 83, -332, -895, -342, 293, -285, -658, -107, 163, -703, -300, 55, -130, -390, -1, 246, -507, -678, 8, 305, -364, -267, 375, 98, -382, 348, 440, -319, -190, 549, 183, 11, 92, 750, -14, -256, 644, 423, -138, 313, 606, 56, -193, 417, 538, 48, 110, 630, 470, -191, 364, 471, -35, -155, 610, 510, -202, -42, 389, 321, -253, 188, 334, -544, -233, 455, 130, -464, -33, 491, -220, -697, -4, 115, -588, -386, 211, -175, -775, -39, 258, -311, -472, 131, 37, -658, -376, 400, -324, -699, 91, 395, -288, -320, 349, 50, -501, 125, 462, -214, -179, 579, 330, -448, -134, 379, 160, -286, 398, 446, 49, -179, 448, 421, -99, 200, 469, 303, -166, 663, 641, -74, -41, 789, 225, -232, -5, 477, 59, -40, 215, 496, -104, 63, 264, 177, -498, 70, 7, -238, -345, 433, 182, -245, -248, 197, -126, -646, 48, -61, -611, -447, 86, -279, -601, -196, 140, -501, -403, 433, 83, -496, -88]
3849h8L91n97k67O25J16l99j87Q09k52k95M43k3l88Q6P34m93n95P75K31n12j16
3870bM13J30o37n1P11l15n10M38N40n47k77M59j91l02M27K23n87k65P34j64o02
3891c75K86N52k82n84O22J03o04n46J133qn10O0L39l58n06P35J91q37J19O35j95
3912c0n98K9R05r12J70N78R5p08j16Q46k05m60Q7O67n52l40P48k07k99J19N98
3933D15l72m28P18O2m92k75Q47j71m70K19M18m76j64N52Nl29l21R26m55n49N33
3954A93N79q13J6N64k47l31O4L81l08l41O57qo40L1M56k57k26K64L61m43k78N39
3976B13J91n48j02M25l8l14J81j0l03K4O3j48j4L53J11j51l62M53p4m73J69L90
3998C6j46l70J99L86k73j78L45qN3L0K79k55j41L9K35l61R7M36k92j22L06o1m10
$$ y = [-88, 303, -294, -561, 64, 180, -219, -406, 403, 151, -144, 299, 276, -112, -26, 708, 215, -380, 395, 626, 114, -2, 411, 541, -96, -147, 564, 249, -261, 177, 717, 170, -107, 352, 161, -141, 286, 509, -78, -343, 391, 227, -375, -89, 463, 181, -403, 219, 322, -282, -828, 305, 297, -213, -153, 186, -172, -678, 57, 248, -589, -470, 165, -30, -628, -599, 306, -606, -436, 142, 237, -471, -587, 259, 54, -406, -319, 348, -204, -544, 204, -3, -302, -183, 415, 43, -385, 333, 395, -97, -372, 475, 304, -166, 53, 471, -5, -169, 383, 388, 59, -262, 664, 209, -340, 193, 772, -41, -25, 539, 292, -39, 25, 406, 98, -243, 414, 406, -234, -203, 253, -4, -230, 34, 395, -48, -326, 213, 404, -144, -246, 179, 141, -173, 8, -2, -305, -281, -218, -366, -380, -27, 84, -67, -429, 24, -50, -523, -354, 36, -110, -480, -281, 105, -168, -346, -1, -9, 44, 74, 353, 98, -43, -4, 231, -130, -33, 403, 111, -11, 295, 234, -176]
4021a76K81L33m5o00L37M99o93k5L56k04p8j2L32k13j78K08J55l37k32O82j29
4042B61n06K52J77n01l43K80N72n91P1N50k29m11K58M30l73k85O01j23n42PP87
4063C42m85m04M71M84p73J21L70j37k83o8O67j39m85L08J13k46P5M90n36j35M78
4084B28J62l83O6L8J88m44J3N74k86%J34K77o07PL44K22o14R9Q1J9l55L24K34
4107C21k49k85L90O9l67L23M0j72l14K96L42n21M7J47L5m47L46J76n65K37K81
4128A30k56l0rL06K5m86L18o1j60r0L51j3l28M00P2l56Q9J87pl25L49l5k50p7
4152b56L26n3k43M05k43R9n6K30j39k66J80J03k73K74N9Pl28K30L27j60l58J95
4174F0K56k76R1J18o7k65J06K08q0l99J9L96k16l9K57J60o24J46L71j32k94L69
$$ y = [-176, 105, 438, 393, -207, 130, 629, -64, -89, 267, 63, -15, -27, 305, 92, -86, 122, 277, -60, -292, 390, 261, -245, 7, 184, -317, -660, -380, 192, -399, -328, 222, -7, -418, -160, 270, -103, -388, 213, 90, -452, -445, 342, -143, -547, -76, 408, -365, -244, 126, -11, -294, -362, 305, 166, -319, -11, 102, -144, -69, 421, -115, -250, 228, 390, 7, 73, 111, 299, -145, -132, 442, 156, 156, 290, 567, -40, -33, 311, 533, -81, 18, 99, 118, -237, 87, 321, 72, -213, 177, 246, -121, 202, 242, 70, -244, 52, 394, -127, -80, 67, 102, -345, 1, 177, -388, -151, 130, -126, -156, -165, 141, 166, -320, -2, -63, -223, -313, 38, 25, -303, 97, 169, -187, -98, 89, 82, -243, 106, 71, -179, -256, 70, 17, -226, 179, -64, 35, -21, 209, 70, -196, -16, 87, -186, 88, 147, 154, -174, 56, 383, 223, -135, 60, 316, 40, 131, 249, 182, -83, 23, 231, 151, -248, -229, 167, -49, -88, 169, 329, -295, -149, 222, 90, -204, 165]
4196A65k0k51P4J18j86l32K66M91m26j96L41Q3m15j39O10J7l74J6K04n5k84L76
4218H3J32l93j69N42l83r6K74K39j55k31J99J7k54M8L59j46k56K22K54k76l24
4239c14M60J55l58K71K18l30N4K5J50j97j56K28j62j17J09K02j66Q4LN7k87J36
4261F5L02k43j46j39J89r0k77O57l42j78J15J06q7j19R6n5K71j63R6k9k50n0K50
4284b1j58L5K09k28j72K50K98k67j33L4L17l81K66o4j73O3J68K22k68L2O4Q9m89
4307c07M07J02k32K07M0j03p4j76J71j47J34J74l98K79J0L33l64m77N44m0k68
4328a85m4N36j39k77J49J39Lj06j86K79k32p5K33m8r3J4J87O3l35K71J80k83k35
4351a84K50k22j18L78j52l8K4Q0Mj51l0K07p5r8K15M3j12l19L15On3j0Q6j07K30
$$ y = [165, 145, -106, -32, 86, -100, -432, -166, 325, -101, -297, 44, 127, -288, -427, 183, 200, -174, -158, 46, -9, -293, 83, 215, -178, -347, 195, -188, -284, -10, 229, 74, -157, 42, 59, -195, -147, 212, 66, -190, 32, 286, 10, -314, 146, 301, -57, 214, 432, 102, 156, 181, 331, 134, -22, 206, 44, -73, 36, 238, 72, 156, 159, 216, -71, 65, 367, 124, -22, -161, 28, -62, -339, 318, -24, -202, -87, 19, -68, -187, -91, -146, 125, -38, 58, 29, -221, -271, -21, -179, -144, 65, -163, -335, -85, 213, -54, -187, -153, 164, -217, 49, -15, -188, -125, 43, 265, -3, 29, 93, 182, -307, 100, 202, -30, 177, 217, 114, 40, -136, 35, -112, 22, 196, -202, 77, 87, 420, 56, -421, 123, 83, -185, -229, 307, 168, -109, 40, 179, 182, 76, -110, 169, -63, -138, 95, 47, -46, -32, 155, 218, -117, 154, 334, 51, -184, 66, -156, -274, 104, -48, -86, -62, 18, 22, -129, -159, 48, -27, -125, 90, 133, 21, -298, 17, 23, -30, -40, 46, -61, 169]
4376A69J4l25l6N2K38k24KK39j92J62l3M7j94Nk7K09k3j58J37j0mk75M07k08j11
4401a39K45Lj25J29r8K2J52q9Kj84K10K00k14l90K26N7o8R8k93N8K40q4l8L0k41
4426b91N3K78j45o5Q3J68Q7k21k08K62j25K72j18r8K64j27J90m35K52n1p7J70
4448A18k49J14J01j01J19Q3m5j24k9q9L4K64k26j16K10K20j2l84P1J18j29J75
4470A23j72l3P2J99j84k43J81p0J06j25J27J55k19k45L46j41J59o8j59J13k6J81
4492G7J8l2l39M37j62j81l1K84J60k47l3j45J92J46M7j41p2j51J15J62m1j13Q2
4515C2J18m35K73J30q1MJ57j57L26j92J31m74J36J35l7K8j97J18J87k70K23l38
4537a83L32j47k8j52K14j15mL11j3j73q2J80J6p3q6Jj73K22l3k29J28M3Q1n8K30
$$ y = [169, 183, -142, -178, -126, 112, -112, -110, 129, -63, 99, 66, 113, -81, -76, -103, 106, 83, -75, 62, 52, 48, -227, 180, -28, -139, 106, 109, -16, 113, 15, 37, 189, 100, 102, -82, 128, 328, 114, -276, -50, 7, -61, 37, -256, -198, 42, -42, -80, -50, -291, -238, 40, -105, -170, -87, 81, 168, -53, -261, 1, -124, 148, 30, -68, 196, 69, 259, -176, 76, 25, -52, 118, -131, -17, 84, -17, 102, 185, 140, 16, -13, -102, -68, 196, -30, -146, 64, 284, 272, -112, -41, 77, -52, 123, -49, -82, -10, 189, 5, -238, -57, -127, -21, -146, -19, 136, -83, -328, 18, -123, 36, -32, -191, -78, -104, 77, 95, 63, -276, 161, -1, -182, -213, 71, 231, -16, -49, -194, -2, 144, 191, 50, -22, -173, -58, 104, 63, -50, 32, 150, -285, -12, 118, 37, 41, 198, 41, 367, 175, 306, -168, -32, 103, 66, 94, -103, 15, 202, -68, 155, -183, 149, 2, -26, -178, 36, -79, -83, 228, 215, 42, -40, 140, 156, 83, -3, -2, -175, 47, 14, -215, -87, -44, 37, -21, 209]
4562B09l78K29K88l00J3k78J73M5k28M81m37l5K82J6k56R6RJ13k06L38k94m7K43
4585G6k43J85r8J31J27j19j62N9K82r1qj9j28l4j45L10M1q7o0K10l16p8L10k36
4609i3l4J62j10K36L4j82J65l36J20O2j07l2K43q8j8N9j23R7l01K31j4J17j23
4632c5q6Q2J21L2k0k06K10Ll73L4L67r0lm1N3j67L4J1J91q2j66J40J54k63P8R0
4658F8R3q1j34J56k15n8K5J63L9J18K35k65q3N2j70JL0K4K1j83L69R9k95j18K04
4683I5L5l78M74r0m56K23J30j8R4J4j14N2P2j98k1Qk64L80Q9l8k22K30k20N2P7
4708Fn7K0K15k91J48j82j76M06m0j58K10k8n5j03K63j66k90M47P5l21k34L91L1
4731A11k48J71O6J3k44J21J99r5m51L58j71R7J89m5q1K6N6m6j05J08R4j56N2J30
$$ y = [209, -169, 60, 348, 48, 61, -217, -44, 1, -227, 254, -183, -218, 64, 80, -176, -80, -71, 42, -164, 174, -120, -167, 76, -167, 18, -80, 51, 178, 59, -103, -44, 238, 147, 139, 120, -8, -42, -187, 123, 164, 77, 17, 227, -89, -167, 143, -93, -127, 35, -75, 161, 195, 13, 178, -158, -38, 24, -83, -115, 128, 40, 22, 81, -42, 55, -246, -15, -29, 88, -35, -121, -39, 82, 114, 94, -112, 98, 101, -272, -238, 129, 39, 36, -5, 48, -119, -85, -74, 117, 35, -131, 9, 163, -100, -22, 68, 161, 80, -54, 102, -113, -171, -146, 17, 56, 174, 409, 144, 61, 113, -57, -56, -26, -2, 19, -164, 205, 304, 9, -109, 95, 130, -248, 226, 136, -320, -97, 33, 15, 109, 123, 9, 61, 133, -65, -86, -78, -342, 38, 127, 89, -133, 97, -123, -71, 6, -51, -31, 184, -107, 41, -141, -317, 89, 49, -109, 101, 73, 18, -85, 178, 12, -278, 169, 244, -77, -311, 80, 111, -137, 34, 100, 113, -131, -10, 189, 94, -357, 1, -170, -73, 116, 71, -10, 16, 72, 26, -79, 29, 123, -33, 19, 149]
4755A49J88n00L03o0J03j95P4r7p3Q7k9J24k27OJ86k8q0J06j74O8p6M80j58o3
4779A14l07J35kM2n5K11n41L00PJ92p3n7N3j04J96n5j26J34j25J48N7j78j8K13
4803A61j13l13J95J23n5p4L09j92n0N2K54m80K23l38M33k09K04R6l50kK85R2k63
4826a2k5k14M25l83M75j57o0J3K8J09l92K68J15j56k33K27J26j42K1q2n9q5L79
4849A86k73J09l15K24J99l3q8j87K02l90K93k1o6J04J86Qn2j53L37k60o7M1K0
4872Dp0m21M51J31Nl71L76p3lK23k67q0m5L77m8Q0m37K45k0r4J83O8k81K2J27
4897H2j4k55L65pk09J67k80L33l03R4K22l67K40o8j9L7j40K89k34J8J30O8k71
4920a22K37J3k39l9L98k00k75J98j65L23k02J2L45l27J17mM8k29J75j16m3n8J84
$$ y = [149, 337, -163, 140, 80, 183, -12, 62, -35, -108, -21, -50, 74, -153, -147, 39, 11, -69, 37, -137, -69, -145, 335, 177, 114, -193, -58, -60, -18, -73, 138, -403, -103, -96, 96, 23, -34, 19, -85, 111, 56, -70, 64, -61, 87, 144, -34, -52, 161, 48, -265, -70, 53, -2, -76, 233, 41, -9, 43, 297, -183, 40, -298, 135, -74, 130, 226, -124, -126, 159, 251, -12, -37, -251, 174, -209, 266, 109, 49, 62, 90, 199, -193, 75, 190, 34, -199, 28, 154, 12, 33, -49, -108, -193, 186, -87, 22, -293, -69, 130, 97, 9, -178, 24, -366, -73, -94, -160, -56, 130, 138, 86, -67, 270, 10, -57, -16, 4, -66, -487, -36, 95, 100, -271, 105, 32, 29, 252, -15, -95, -140, 237, 189, 269, -168, 77, 57, -37, 146, 214, -67, -45, 82, 68, -187, 178, 171, -38, 129, -151, 182, -121, -27, 195, -172, 68, 0, -19, 18, -122, 167, -67, -49, 81, 149, -122, 115, 128, -111, -150, 248, 48, -227, -29, -194, 129, -73, -61, 284, -43, 74, 70, 118, -111, 64, -52, -95, -153, 31]
4943C1j7J56j96j62pJ23K12q9r6o1M3M2p4J0L85l2m03K40Q8l67J44L71l68L9k39
4968b27K39J7m70O47m1R7j90O8l2l66L69L73n79l5K41j25J2j92L72l3m40L71j07
4991c1j26O0L80j56k48o5O5K23q6K01r7l16j14K56n4J4l8K72k68k1RK58j77J47
5015H8Q2j03k53L07r0j52J3L11k85k7J4R6O2k85N5j23K69J50N0O5l16J30Q4p1
5039G1J46p5R8O2k50J30Q5k87L07k09M2L1M2R3l46J93J4k50j2K56r1k25K65J32
5063B22l32L0j8M0J50j08J11J07j82k25M2rP8K03k12n7M1J61p1j58J04L45n45
5086b83K63j43J20k8L0J41j16j46J22K15k92J5M39l78n5J81P7j84nK12K15m89
5108h9j10L68J82l33p4K86j56KJ65o8l24K50K44m00j6J42k6k67K18M1j5j82j97
$$ y = [31, 14, 170, -26, -188, -195, -72, 140, 51, -45, -106, -63, -21, -95, -85, 300, 268, -135, 105, 193, -174, -30, 341, -27, 12, -227, 12, 29, -441, 206, 165, 262, 72, 140, 108, -258, 111, 484, -95, -130, 111, -14, -2, -194, 178, 145, -295, 76, -31, -157, -97, 283, 127, -121, -186, -121, 102, 16, 217, 120, -196, -310, -54, -108, -94, -132, 140, -128, -149, -140, 118, -59, 88, 170, 67, -186, 121, 31, -121, -108, 203, -82, -109, -95, 1, 63, -222, -167, -290, -21, 129, 179, 244, -72, 58, 142, 71, 217, 142, 240, 302, 52, 182, 267, -20, 287, 78, 120, 151, 193, 286, -60, 133, 147, -103, -115, 141, 50, -175, 90, 222, -110, -80, -98, -58, 92, -16, 95, 202, 20, -205, -163, -172, -94, 109, -103, -160, -119, 42, -29, -187, -83, 262, -283, -20, -163, -43, -71, -41, 100, -16, -162, -40, 175, -117, -102, 337, -41, -96, 85, 162, -22, -27, 185, 400, -89, -199, 169, 351, 18, -56, 230, 74, 76, 241, 173, -151, 99, 343, -57, -73, 69, 43, -224, -6, 35, 20, -162, -359]
5131c59N11k64j89J46L59k21k7K60k12k21M43j77k02K6J18Q6n2n6Q9J8m31N90
5153B35k82j04j60L54m0j40R2J18m5k11K29o3k29K24Pj1p4r4L10j86j07J34L42
5176B99k16J32k87r3L39k7j75k8k1K47l42LR6N48m41N8J41k62K34k14L44p5k73
5199a3m9J02j57o3K20J12l62L43j11j58M6k8N3J3j49K20r0j35K51P3k05M6J22
5222H1M4l24J84J38k51O0L54m19j19K50p2jm4K26j54l56J10L60j61o9K60Q2l06
5245a27J14m6J92k15O4J36m0j49Q9K31k19k60J77l8m6J46L08l22n2J06K50l09
5267a0o0K95o5n35L52K80l81J05M7J35m35L48On7k95K15Nk8j19K98J02k24j43
5290a64L36k56k81L34O6m4l61M46J2j25Q5P4j2l57L13l41K85o8j24j5P6j7j0J07
$$ y = [-359, 152, -112, -301, -155, 204, -17, -44, 216, 4, -217, 226, 49, -153, -127, -9, 77, 25, -31, 58, 76, -355, 235, -47, -151, -311, 43, 3, -137, -45, 73, 28, -183, 46, -17, -246, -22, -15, -26, -100, -194, 116, -70, -177, -43, 299, 83, 215, -72, -165, 174, 147, -28, -56, -77, 170, -172, -169, -73, 475, 34, 92, 233, -29, 205, -9, 335, 260, -13, -62, 40, -117, -180, 40, 152, -210, 133, 22, -136, -90, -118, -65, -52, -201, 19, -71, -206, 45, 118, -87, -41, 81, 125, -199, -15, 123, -128, -68, 286, -133, -252, -2, -74, -75, -119, 107, -47, -403, -293, 67, -94, -163, 97, 179, -127, -13, -59, 133, -82, -18, 118, 78, -71, 18, 249, 30, -230, -53, -91, -137, 9, 317, -5, -57, 49, 299, -10, -70, 225, 160, -375, -23, 257, -124, -19, 28, 163, -272, 76, 82, 25, -270, -55, -50, -78, -197, 101, 203, -21, -164, 172, -84, -365, -31, 35, -9, -370, 76, 88, -37, 48, 122, 110, -247, 66, -275, 10, -58, -182, -197, -121, -138, -148, -41]
5314d1n9M65m33k66L00j18L54l75K16p3r5J83M0J86l02J50j73J22n0K59l26N3
5336A7K88j50q4R8j78R6j63JmL3J46J87j13j29OQ6O7m61L43K72j74j87k4NJ22
5361A00q9J35j49j05J26o8J6J27l8Q7k71O3J03q7m3J45o8k33K08p0j17J07M1J00
5385B0j36r8K74K3j80J78k5o9j79K62Nj33K5K41l6l42L67L3j27k75J90K11j58
5408G1k42M82l26l63M05L4m8N7J14m0j78J44L8o8q7J74J12l62j23K78L29o75M75
5431B01M7k24j51J94K67m72J44nJ32l94M26j4j68q5K58j63j02J74r1K61m09L15
5453A41l1N1m04L50Q2l69J83m0j01p4M39k66o2n2L13k93J39p6J92r0RN7R6k15
5477b1K58k66k5OJ11L8J50k02L6o5j24K54q6P1j41l2j08L45j43j6j09K18K1j91
$$ y = [-41, -100, 365, -68, -334, -34, -152, 202, -173, 43, -30, -125, 58, 98, 284, -18, 132, -41, 81, 31, 290, -36, 17, 305, 155, 71, 169, -9, 87, -76, -75, -79, -46, 100, 287, 174, 45, 51, 137, 204, -257, 86, 358, 184, -3, -27, -22, 100, 11, 146, -3, -108, 18, -50, -34, 93, 55, 142, -129, -66, 37, -50, -93, 52, -16, -249, -41, -111, -228, -121, -80, 20, -116, -214, 60, 83, -97, 81, 56, -13, -192, 70, 75, -58, -33, 208, 172, -170, 197, 230, 103, -172, 18, 229, 71, -171, 311, -15, -378, 27, 61, 13, 70, 184, 144, -34, 110, 148, 80, -7, 167, 279, -83, -206, 72, 401, -274, 201, 248, 24, -127, 67, 334, -138, 6, 1, 133, -261, 165, 151, -17, -102, 156, -7, -109, 65, -26, 235, -174, 141, 110, 161, -243, 107, 189, -180, 3, -37, -138, -212, 227, -39, -101, -153, 160, -133, 6, -70, 122, 32, 41, 98, 194, -21, 237, -29, -54, -48, 63, 101, 251, 49, 85, 20, -104, 150, 64, 135, -6, -38, -146, 199, 56, 40, -69, 149, 170, -21]
5501b1k32J98J22o3J8J21R1m11J21R3k07j4K39R0l65Q1J64k9o4r1J96j70J28m6
5525e1j3o6j80K26pk22J07K56K3k03J67Lk63R2J48k3k31L41K24l04p3J88L3k69
5549i7j98N61j9m72L85L85p21K09QJ35l45K06L13l46Q7M80n89j06lMJ10p4L59
5572B72J32j88k11k7J18Q7k68L33l6k72OM17k56k04O4K7k82K15k1j53K17m1K66
5595A95j12k61J73J11l49l6jL53L1M8J40l37l51J63J80n9O3J40L8j54RK03k40
5618e3J49K97l79k66J89J85l9m43L28L73m15J78O2j83N0l6q4N0j50L75k05J2L90
5641C85k31r0K69j32j89jj27K66j80j00K86j1j92j70K76r1j4j1j06K63k26k6J13
5664c9m1j1J90j44q4J37p7J27l9j4k9k63K63k23j70K62Q5mq0J10J84l04p8M49
$$ y = [-21, -253, -55, 67, 4, 22, 143, 234, -177, -56, 37, -170, -184, 55, 145, -220, -139, 25, -4, -68, -159, 37, -133, -5, -51, -64, -130, -310, -84, -91, -313, -206, 50, 73, -130, 37, 40, -223, -131, 17, -6, -237, 104, 328, 24, -49, 139, 172, -97, -295, 266, 247, -225, 160, 545, -176, 33, 41, 176, -169, 37, 350, 4, 91, 571, -18, -124, -127, -123, -13, -87, 272, 404, 216, 5, -22, 96, 183, -85, 248, 212, -60, -54, 363, 107, -97, -33, -6, -288, -73, -94, -247, -30, -71, 195, 83, -178, -5, 106, -243, -279, -280, 73, 104, 152, 292, -45, -396, -233, -53, -112, -49, 91, 129, -25, -16, 187, -53, 96, 393, 14, -252, -63, 122, 83, -360, -32, 341, -74, 104, 166, -17, 33, -3, -87, -37, -187, 188, -17, -5, 385, 154, 64, 333, 201, 12, 11, -116, 150, -30, -130, 156, 145, -47, -217, 59, -32, -46, -57, -163, 100, -126, -152, -39, -80, -91, 99, -45, -129, 8, -69, 58, 19, 5, -24, -287, -24, -247, -417, -155, -70, -74, -154, -44, 140, -164, -242, 207]
5688B07k30l1K4o2J10r5P4J63k85K8KL91m92J29K35k90K30l4K16k36k8J18Q3j84
5712D3J17j74J03j8oM68o36P5M8J73j08p3M08k45j3q4J76m60LL15R4m11K34J85
5736B14k37M8n4R1q4jk6l21k9L04J95j25k35L19q5m4R1k33K57J15m51J34J57K1
5760B1Q7K0l05J73n1O9m5NP8K3mJ02J00l12k5J76q5R6Q9j00j43J12J5K2jj7j3
5787H7j11P2K41k42K12k98j46O8O9J13r5Q4J56k2n07M75Oj87q1K0K40j34lJ6j39
5812a06J93J30m5k49j92M40j44J2qM3j88p7o1M71k70l4P0J11k84j46L76j20J43
5835F5K06k48k26J35J3J13j61m7k9J97l04K44J77j11m5L43p4l66JM67m20J36j19
5858e3J45Po1O2R4j14k13M23m61J60J10n6J01k1k4l5l6J04j25R2l38L76n5j57
$$ y = [207, -23, -54, -30, -92, 18, -77, -3, 160, -125, -97, -95, 296, -196, -67, 168, -122, 108, 74, 290, 54, 26, 144, 227, 43, 160, -14, 89, 71, 65, 533, -103, -28, 20, 193, 85, 12, 420, 175, 162, 78, 254, -206, -203, 112, 206, -205, 29, 214, -23, 25, -29, 62, -22, -23, -49, -370, -399, -95, 100, -25, -260, 59, -26, -70, 21, -212, 45, 160, -291, -157, 0, 21, 108, 128, -177, -4, -55, 14, -31, -26, 52, 75, 71, 173, 273, -39, -64, 112, 27, 123, 212, 112, -31, 81, 96, 118, 117, 100, 87, -24, 48, 289, 47, 259, -39, -185, -117, -48, 65, -30, 54, 210, 188, -319, 156, 162, -25, -106, -86, 154, 20, 17, 33, -106, 87, 217, 172, -77, -269, 171, 27, 39, 31, 74, -114, -191, -252, 219, -51, -85, -15, 96, -188, -334, 42, -78, 65, 271, 23, -203, -68, -55, 58, -103, -150, -179, 18, -286, -42, 135, 24, -21, 322, 248, -118, -117, 350, -70, 66, -53, 92, 99, 38, 100, 194, 80, -133, 290, -171, -11, 99, 43, 144, 123, 99, 64, 28, 132, 7, 99, -239, 137, 82, -75]
5882g5n1K54k75K58j62J43j01j19K39l19J55J02K14k53k70K48J98m0l52K60r3
5903c9o0Q2J08l21K15K03k18j27L31p5l22J40J01m8K55j78n9J70j09r8n1k0K87
5926A67l79J23J01k72N75j70k00K4K09n8j25N4N0m1j07Jj31J64K36J13k89j59
5948a14L24m36K06J34m5k70K79j11J02j62J56j71J62M4Ll09lL35m77L77m2k25
5970b43J20LK3nQ3J06r8L68n46O4K78m26J48K81j53k89K08p7K55r0J42r3j54J98
5994A03j75J05k3j26K14RK2k27M9N7l8l58J13K72k4J32M4j41j42O5J43L8lj35
6018b6j79J60J64oj06Jj05K34k37K47j20R2k8k6k25j70M58o4j62PK01k3k12k73
6042c98N16p5j50j2J82j07J51k21J62j49M9J51j09n9M8k23J08J24K49k10l8K25
$$ y = [-75, -126, 128, -147, 111, -51, 92, -9, -128, 111, -208, -53, 49, 263, 10, -260, -12, 186, 146, -206, 54, -39, -99, -17, 91, -230, -15, 188, -30, -157, 174, 99, -223, -83, 18, -30, 225, 47, -12, 158, 49, -49, -100, -120, 167, -212, -89, 12, -260, 315, 145, -55, -31, 178, 120, -5, 49, 99, 58, -49, -48, -179, -15, 221, 334, 45, -114, 210, -226, -20, 114, 69, -201, 78, -33, 69, -93, 63, -108, 54, 98, 101, -208, -211, 124, -353, 24, -18, -243, -123, -120, -97, -102, -19, 87, -11, 357, -189, -125, 153, -273, -125, 156, 3, -286, -78, -155, 100, 10, 152, 59, -95, 103, -72, 33, 10, -116, 98, 107, 129, -98, -49, 8, -30, -388, -275, -3, -27, 105, 149, 8, -134, -69, 74, 112, 109, -26, -205, -45, 119, 113, 7, 8, -97, 137, -100, 147, 27, 119, 91, 65, -160, -330, 128, 64, -98, -91, 110, 87, -125, -398, 118, 43, -107, -119, 63, -44, 107, -114, 48, -101, -52, 99, -10, -69, -21, -244, -136, -12, 237, 27, -11, 214]
6064B14j78K08k57r7j92L22N9j85K39O9j87k58L23N7p1p0lJ32j54J55k74L56l20
6087a12M3J51l7j97J84o4J35M7j97k7p5O2K87j02l13K07oJ63l3p7o9J49k47O9
6111e9N6K8j02r9K53j96K60k68J70m58J47J31J71p1R4K9l00L09R5l49r3L93j48
6134go9r8J56n5R6p7K01k29J99jj22j06K15r0J45m9J19k08P3m8M5l05J72L09m33
6159a67J08N7K46j15m2J21Qk3j6j70J75k87L4K55o5n2j69K07p8j49K91k97Lq7
6183b12K35j1Nj55J76k9J01K1k31j32K62k6K25n48J32K19r6J76j44O1k09M2N9
6206g9J63j05Pm7J02j73N0j78L07j56J9J5J97L9j13L7J12k41J25m2j13J63j19
6229c0K10j15J39m2K3m14L45k03N9j32k7K35R1k45LJ31N5n7r5k27M08R1l1J8j3
$$ y = [214, 36, 244, -13, -110, -302, 20, 79, -106, 133, 202, 15, -243, 80, 137, 66, -4, -7, 125, -29, 126, -148, 208, -112, -69, 82, 45, -152, 32, -32, 103, 150, -47, -74, -149, -87, 200, 98, -215, -8, -14, 149, 116, 39, -30, 119, -128, -59, -3, 25, -77, -176, 77, -119, 141, -127, 43, -415, -268, -137, 34, -37, 57, 86, -214, 95, 190, -159, -252, 141, -7, -76, -174, -18, -73, 23, -54, 147, -82, 117, 116, -6, -112, 103, 13, 158, 109, 228, 20, 93, 45, 90, -215, -43, 266, -167, -59, -2, 244, 129, 87, 208, 216, 193, 177, 7, 182, -105, -71, 184, 119, 67, -102, 105, 27, -122, 169, -128, -125, -212, 23, 12, 17, -138, 38, 9, 110, 131, -100, -232, 30, 4, 229, -319, -187, 32, -64, 112, -32, 29, -180, -138, -79, 84, -21, -14, -61, 41, -132, -82, -260, 47, -109, -90, -75, 122, 161, 48, 85, 197, -44, 81, 39, -74, 89, -30, 180, 65, 204, 162, 185, -229, 116, -87, -28, -160, -187, 48, 139, -106, -103, 28, 83, 26, -69, -296, 112, 203, 172, 190, 177]
6254A77j79J24n9j26O2K8k08J58qJ99l60J00J48J65j0l5j0j84P6k0j88j3P2J29
6278C8L1k13J27j03K98j54N4j56p6P4K23J9m00N14J4k58m6J28kp3o3J06j21J01
6302F2j15J27NN6k59M1J36n4O0j48OJ19j72L72l51J71L1L7k9q6J85j16j00k23
6326b45M67k49J22j27j45J43Jj6K99O0m65K6K7N5m27L51J69l27L00K49k06l1J58
6349A89k51j04J66Nk0j74J77K03Q3k45k32J90l2j05p8J20K03k00K91l92J04Q0
6371b2J02m02l8K30J03j30N3J86k01K34j48L69j79R1j37jl18N80l85L6l9J67l3
6394A18j97K79j26r7Q4j79K43k99J81O3n2J7k60K48l4k03L88k95j2K10j54J62
6416H5Q0k7l27J31k09J76LP4J04k2l5Q3r6k3L0k58L01m1mQ1j40n5L48r2o2j53
$$ y = [177, -2, 122, 63, -63, -1, 27, -181, -23, -31, 168, -192, -92, 56, 221, 211, 176, 166, -18, 58, 38, -150, -163, -91, 38, 69, -144, -17, -120, 178, 24, 78, -78, -154, -80, 143, 162, -238, 276, 290, 32, -14, 114, 112, 39, -24, 82, -39, 62, -53, 74, 79, 135, -124, -83, 53, -1, 59, -89, -83, 36, -136, 236, -115, 56, 87, 124, 95, 9, 194, 78, -22, -245, 222, -27, 95, -32, -177, -34, -33, -49, 250, 310, -155, -129, -102, -47, -474, -123, 46, -281, 19, 268, 62, 31, 189, -62, -166, 0, 5, -15, -189, -12, 191, 274, 29, -203, -13, -45, -150, -228, -108, 95, -105, 186, -206, -102, -22, 80, -322, -360, -130, -27, -157, -104, 82, -119, 115, -33, 336, 157, 248, 111, 110, -208, 372, -13, 23, -16, 151, 118, -79, 200, 74, -23, 61, -118, 125, -174, 7, 70, 18, 35, -225, 23, -11, -214, 174, -121, -133, 77, -77, 85, 165, 138, -189, -58, -267, -91, -88, -14, 90, 68, 33, 116, 20, -3, 27, -231, 70, 29, 25, 106, -34, -89, 259, 167, 105, -48]
6442d8O0j4L9J38l46K51j07O2N0r2J3J62j91p7J76o1j85L65n5j22q4J57j33l5
6466g7K09j5n0j45J34k08J22j77J26J6J76j72J64k39J96kp0P5L5p0j55j7K30k19
6490a33L66j49j05m5R9M3o0j2Q7l77K48n0J73l9k77j01L41J44j41r2j45L5J62
6513b8O2qj04Q1j60r3J97R6q3k50M47j29M6L5J5r2q5J02j07R0J43K6P5j56j87
6538f7K94J3k5k06J81p9rJ11m29K45k24L16p8k80K03n7m8J5K19j36J96r9j95R9
6562d0l0p9J76m6p6J36p7q6m2K56j41J3K85k27p3K83q0l77J82k89N73m4j09m1
6586D7j47P3J80k34J40K06j17r0p8M9r3J19j2r2mQ2J36l5k92pM5J11o6J62o3m0
6612b0nJ08r4p8k18K30J06mn3j44L70k93L46l64K12M0j47J0k35K28k95J12L9K5
$$ y = [-48, 12, -2, 37, 175, -171, 80, -27, 35, 85, -7, 6, 168, -23, -100, 76, 15, -170, 195, 140, 18, -66, 91, -42, -77, 132, 117, 67, -78, 56, -152, -30, -207, -81, -65, 111, -61, 103, -136, 60, 58, -12, 63, 98, 28, -127, -144, 86, -133, 233, 84, -21, -66, 33, 76, 16, 4, 91, -286, -38, -88, 85, 46, -231, -332, 9, 153, 12, -80, -225, -190, -28, 34, 26, -78, 3, -157, -250, -53, 43, -40, -290, 157, 28, 74, 109, 124, 32, -53, 49, -58, 32, 175, 201, 276, 120, -67, 227, 240, 215, 9, 190, 111, 102, 213, -216, 29, -195, 121, 43, -237, -34, -91, -139, -124, 95, -41, 155, 56, -139, -40, -70, -149, 27, -19, -95, 41, -36, -122, -164, 92, -49, -36, 249, 22, -51, 232, 152, -225, -43, -332, 241, 197, 88, 47, -100, -27, 153, -81, 59, 265, 148, 58, -20, 29, -64, 55, 43, -49, -53, 29, 165, 130, -162, -169, -124, -13, -79, 83, 20, -20, -25, 83, -11, -89, -307, -77, 29, 25, -28, -172, 198, -95, 251, -113, 99, 139, -8, 2, -233, -5, -300, -188, -149, -124]
6636a24K3J69J15l54K32j45J73m1o3J26k76Q3R4mj25m2Q0l2J48J90m05j01M25
6659A46Q6j34k6P6k28M5n5J48q5o4J44Mk6o6j07O5J20P7j79O8O0l34M32R0k81
6684b4k3n9Q8O6r9L31k70P3k46L9R2L4M7k36m7K65j12R8k25L13r7j05J52j06r4
6709a45J33R2j28R6L6J7n3k45QR9pJ60m7k57J50J77P0k20K4j59M34l59p2K28m
6734B8k10K54j4R9j82J48j26J05M7k75m1J75N3q8J78o8J0j02M6j08O3L3kJ4L71
6759D08l07j8j9K29n32L89k60K06k04Q0j24J05m6L58k80j06o0J56l4r1K55j66
6781f1J80k15J57j54P7l0P4m0J9r5R0j67K87j37l0J3j5L9J14P7j92J81l17Q2K4
6806c9J14L2j50l5K65m55M1J98j11M75m00K94l95K34qj8J8n4J8R9J9j19P0J0j54
$$ y = [-124, -101, 68, 183, -171, 61, -84, 89, 48, -15, 111, -165, -82, 12, 8, -117, -159, -79, -111, 37, 227, -178, -279, 146, 232, 98, 72, 148, -80, -35, -90, 58, -27, -91, 53, 57, 31, -35, -142, -77, 43, 120, -59, 9, 69, -265, 167, 257, -24, -47, -106, -18, 48, -51, 280, 10, 83, -163, -124, -32, 2, 49, -187, -234, 31, -81, 17, -208, 105, 8, -97, 55, -51, -145, -12, 80, -48, 48, 84, 101, 48, -197, -189, -90, -97, 63, 16, -241, -91, 86, 156, -64, -40, -199, 235, -124, -196, 32, 28, -182, 72, 58, 157, -25, 123, -3, 102, 149, -126, -167, 8, 61, -27, 151, 83, 93, -9, 37, -71, -8, 25, 23, 37, 408, 101, 83, 64, 293, -239, 150, -110, 96, -108, -28, -152, -47, -93, 265, -15, -121, -181, -25, -59, -150, 105, -61, 119, -96, 61, -93, -16, -46, 28, -12, 7, -88, 2, -165, 122, -15, -45, -32, -47, -8, 106, 183, -9, 172, -145, -63, -39, 75, 107, -43, -78, 187, -268, -227, -29, -140, 335, -65, 229, -166, 68, 60, 42, 60, 6, 24, 123, 142, 23, 93, 103, -51]
6831e1j39J38J21q2Q3m2l98J89r2K49QJ46k53J18q9L13n94L59p8J10k74N8K52
6854E2j73N5J04N6j21j50J99lK0q2P5k43J60K08l42Q8l24P90m99J54j19J4k65
6877c46N69j95Q1k3r5K0L9j3j15J86k29L79q1J12k37p4n5j03R7J62m3j25L17k2
6901B06k55L1j96K08j30K38l86M34j87K5P7rK1QjO3j22j03J04N1M5l10K50l9j91
6926a68M0%J35j27O0k8j28K08K2K6j39r5pL0K4K5P2j3k4P8j32k1K15j46J0L1k6
6953g8J42N4k08L51k71m7J62o5J59k74J78K9j82l8Q8K15k18p9J23Q2J5J5l68K00
6977a5L13j24j35j97J43O1J09k48J76j91J49r4R4m26N16j83j12K69k95K95j35
6998c0j67L82l73Q1L62k32j47J07J27j36j42N6K68j63m0Q4k4J01m7m0J86l10N6
$$ y = [-51, -190, -52, 69, -13, 70, 28, -370, -181, -273, -24, -16, 130, -123, -5, -94, 219, -375, -16, -94, 16, -258, -200, 52, -121, -66, 38, 94, -27, -177, 22, 19, 39, -43, 32, -211, -51, 157, -185, -97, -421, 369, -130, 24, -95, -81, -346, 223, 28, 109, 86, -9, 11, 50, 37, -78, 108, -121, 258, 177, 289, 52, -22, -77, -180, -83, 79, 36, -89, 228, 206, -49, -18, -214, -6, -136, 102, -284, 150, -37, -12, 65, 56, 77, 85, 84, 147, 25, -78, 26, 77, 122, -188, 62, 23, -168, -128, -128, 7, -120, -60, -88, -216, -8, 14, 40, -99, -194, -201, -171, -147, -122, -50, -63, -87, -9, -141, -162, 53, -93, -83, -52, -78, 64, 118, -90, 261, -10, -57, 105, 40, 199, -75, 103, 132, -50, -88, 0, 215, -3, -82, 41, 123, 138, 153, -215, -15, 298, 174, 39, -158, -15, 46, 155, -93, 83, -108, 41, -53, 41, -385, 131, -52, -164, 105, -190, 105, -30, -197, 185, -188, -107, 255, 23, -124, -17, 110, -26, -168, -112, 156, -7, -47, 37, 13, 114, 67, 27, 213, -97, -41]
7021d1J62m43M42n8p4J01k77K71n4k0j08j2J91k51L6Q7j46J35L82k52m9M2j29
7044f5mK66j66j32J09j70O1K82l05L36j36r3J36j60L21j52j48J88P1j92j67K33
7066A13l35K46j17M24l43j73K22j79J25m4Q3j11J3J06o0J90k19R9k40L19L3l2
7088A20n1p1K18m67L62j67K49k90N0rJ27j93J94Oj29Q0k41M53j15j33M9J83j99
7111B6o7K5K72l10r9K44l0P1j63k65K72Nj39J09J68k20l2L66l11q7M07l43RL07
7135B15l23J74K8M4q3j32J48j39K30k14Q4j55K0O5K51j04l6Rm9k32J17O7j18l3
7159a66J8m3J69K34k97m1j43K92k4j13p7J0l7K00j33N4K73k84j98L64j67K65k08
7182e2K7n6P8O6j21K7N9Q0p4Mj53K22q4o8J37Q9l11K6j09L07l02L42r1j48J82
$$ y = [-41, 121, -322, 120, 62, -12, 89, -188, 83, 29, 9, -99, -111, 80, -171, -135, -48, -194, -59, 323, 71, 22, 64, -65, -69, 197, 31, -101, 8, -162, -101, 181, -124, 212, 76, -17, 119, -41, 280, 128, -20, 168, 239, 47, -120, 113, -222, 24, -93, 331, -12, -185, 37, -142, -17, -61, 22, -89, -76, 30, -30, 160, -59, 40, -200, 119, 152, 120, 69, -2, 216, -251, 111, -56, 193, -97, -47, -56, 71, -122, 72, 78, -51, 29, -212, 241, 126, -7, 42, 225, 26, -41, -16, 256, -54, -153, 91, 61, 132, -31, -296, -24, -19, -158, -49, 119, -101, -133, 233, -78, -165, 242, -101, -92, 215, -108, 66, 94, 138, 55, -77, 71, -68, 162, -52, 32, -123, -103, -38, 213, 109, 73, 82, 33, -199, -82, -15, -133, -166, -148, -191, -22, 212, -85, -126, -269, 23, -1, -114, -191, -181, -218, -18, -151, -97, 176, -108, -306, 58, -109, 156, -52, -25, -81, -3, 63, -58, -31, 28, 108, 34, 38, -115, 107, 23, -45, 92, 181, -130, -104, -213, 94, -208, 134, 43, -105, 77]
7207G7j44J09J35k82L22m34K20K3L7k9p3J2J14K15k16k06k6K4rL90k60K89l85
7230i7n3P9m3Mj32oJ08Q9K44l0j03J22k08k32M76k59r5K46k30j73J92j4m5J88
7254B8L2q0j4m1M0R3j20L42r5l5j27M4%j44L47j70J14k33j16J36K15l06j45L27
7278I2l4k6j91K18R3l93J45j43L46k76K41K5j84L9J7k03L79q9j39K75k86J23k45
7301b16J88OJ65M6k83q0K54k84Q2L6K06k25O9J55m10N23l23K32r4k65R7K01J2
7324I2q6l03N46k72R2k20J02k5M8R5k23K59o9j44J84j53Q2J56j42P1L71n74L8
7347g5J44l1N8J07j65L0j64K95k94L6J28r9J83r9J39%k22J30k87J69J28j76p2
7370a37J32k22j8J06L81j47m15M11j17K4P3k0k25K61j82O5k93O42k67k77J85J5
$$ y = [77, -67, 42, 177, -105, 217, -217, 3, 26, 63, 34, -39, -27, 87, 302, 86, -120, -146, -122, -131, 259, -1, 288, -97, -150, -71, -114, -110, -242, -248, -140, -51, 193, 163, 60, 182, -26, -258, 218, -41, -136, 110, -120, -293, -101, -115, -160, 28, 60, -20, -34, -75, -35, 58, -62, 280, 185, 150, 23, 67, 67, -77, 270, 100, 214, -19, -135, 1, 216, -90, -235, 92, 58, 32, -159, 59, 152, -241, -96, -239, 107, -169, 72, 97, -87, -48, -31, -234, 145, 56, -83, 192, -94, 29, -216, -28, -22, 143, 189, -94, -174, 80, -204, -122, -86, 120, -105, -36, 119, -291, 232, -91, 141, 47, -218, -121, 80, 92, 6, -297, 249, -23, 69, -151, -49, -74, -26, 69, -154, 105, 36, -108, 76, -77, 5, 161, 19, 90, 461, -113, -75, 69, 38, 96, 203, 38, 68, -96, 199, -95, -59, 69, -30, 153, 54, 193, 193, -29, 101, -186, -17, 111, -65, -137, -5, -227, -245, -139, 242, 95, -320, 91, -26, -2, 71, 51, -174, 87, -95, -30, -323, 319, 52, -225, -40, -25]
7392b5p7N8m8K34k00j8J22k3J85j96o0J48J33l08J09r0N5J3k2q0J66j37N5R1j23
7417c8n5L69P0l72J74j50J41j86P8J63k27J96j63L0j49J18r5M3l9m3L37j85n5
7440c8O6j33Q2K31k42j11O5P3j16J84%p9M8k69M3P4q3N04n30J16q4L33j65M7j09
7465i3J0J23j05l0N8l3j86N15m37J61q1j69K39J70m7Qj44O5J57k50J35o9K8K18
7489B43k10j69K80m4q4J69k25K47k19J43k7j0M4j6NJ84l63K1k17K75J05j13L0
7512D9R5j57J17m8ok42%L64k93K62o5j11q2J36J98n48L08p6K65n20J50K10L4k83
7536b43L22rj8J92m20K13J37k24j07J44j94J49J73k98R8J10k36K50J39k93J20
7557El06L69Ql6k8n5K95l51K37k05J30M9j44n9J38o9j8j12K60l98N37k14j13J46
$$ y = [-25, -102, -44, -92, 142, -58, -76, 46, 23, 208, 12, -48, 100, 233, -75, 34, -56, -1, 12, -10, -90, 76, -61, -6, 85, -38, -93, 276, 346, -26, 148, -2, 139, -47, 31, 194, -33, 163, 0, 30, -119, -1, -96, -53, -92, -135, 202, 17, -38, 28, -105, -23, 208, -34, -145, -80, -7, -123, 61, 61, -18, 30, -239, -196, -122, -205, 299, -231, -115, -199, 134, -31, 16, -93, -83, 40, -65, -95, -37, -70, -256, 259, -178, -17, -98, -267, -28, 142, 95, 103, -41, 24, 181, -69, 66, -3, 25, 243, 33, -136, 144, 100, 16, 185, -40, 207, -12, 131, 104, 94, 138, 122, 127, 311, -52, -31, -248, 27, 132, 19, 49, 144, -13, 104, 56, 50, -192, -192, 172, -121, 141, 76, -35, -117, 19, 217, -331, -23, -99, 166, -354, -204, 6, 40, -243, 79, 70, 52, 244, -176, 37, 174, -50, -157, -13, -207, -58, 115, -183, -85, 25, -211, 39, 178, -115, 5, -301, 68, 76, 40, 12, -43, 252, -99, 138, -67, 63, 112, -32, -91, 47, -22, -40, -152, 108, -290, 247, 33, -80, 66]
7581F6j10o6l8J72j11K10n1pL5q1mM9k62J37q0J03p7l5J67K0r8J73K48k09k77
7606a26J95j64oj04J54J62j55Q8R2l49Q8K44k54J69QL8j32j50L20p2m9PK21k17
7630Hk56M62r4L9j93L48j39p9L5j83M19k89K57k73O1k62K36j52j18L35m25M83
7652B20j67K63j78l45K6L31Rk9k99L25j12j06RP8J75m52L22j62K76j47R6k91J55
7675cm7LJ5KJ9j42O9MJ34j83P0Oj14O7l6M1m6P1K2QO2j24M3j90L01m5O2J5j43
7704e9O4L16k53o4n0N0m4R8p2J86r3k0M6l0j68K21P9m20L36j17J43k52J5L73l22
7729c7j2J88k05M4O1J6m2k6R6MLJ99k24k33K8P2k9N7j84K5J46K83l28N2J32j59
7755g3n4Pq9K8J22Q2p2l5JJ66k67k8K4J28M9k2R3p5J48k35j33J55J17r2q8L42
$$ y = [66, -44, -110, -148, 24, -87, 123, 72, 65, 100, 19, 15, 64, -198, -61, -141, -38, -115, -150, 17, 37, -61, 112, 360, 151, -126, 69, -95, -101, -205, -51, 111, -44, 44, 136, -213, -125, 119, -135, 34, 42, 80, -52, -202, 118, 46, -3, 4, 225, 8, -248, 214, 120, 159, -34, 314, 175, 96, 131, -52, 367, 78, 335, 62, 123, -139, 97, -55, -173, 162, -263, 220, 53, 316, 138, -207, -181, 150, 159, 130, -169, 156, 44, -62, -53, 25, 200, -252, 70, -92, 184, 37, 133, -158, -3, -50, -47, -32, -30, -11, -153, -84, -80, 54, -129, -59, -53, -167, -100, -136, -95, -141, -70, -48, -40, 22, -102, -59, -249, 52, 7, 69, 84, -59, 5, 321, 68, 4, -46, 4, -40, 58, -14, 172, 79, 59, 105, 75, -93, 128, 207, -213, 123, 6, 149, -103, -88, 285, -37, -49, 139, -66, -22, 39, 55, 13, -13, 83, 87, 90, 289, 65, -168, -140, -68, -97, -40, -224, -199, -53, 230, -98, -46, 86, -73, -127, -120, -209, -181, -59, 23, -49, -84, -83, 83, -184, -212, -188, -60, -11, -33, 60, -15, 133, -102, -235, -80, 37, -55, -143, 199]
7781A99k68L21j19k07J35J31j50m8K44k29N4K08j07k0Q5J84k65l6J65l83O1J06
7803F1J01j91K8K97k81K01n3k44m2J49n9J74p6J45l15l8J83p4k58L68l16R8ML8
7827a00K37m43K13jq3j9L56l39L79k03J60m40L26k8J61m60R5K22O6J38j52M1j94
7850f8j44J80JK20q8k79K08J99o3m7j06p0l2j8L49m1R8j67J07m28J76j01j31M69
7874B24n6k25M1K22m54L79j37j41K96mO4j99o2r7Q5J2J49j39o1j5L06j2l00J55
7898C1m00K80K28j90m7J36l4m3R1j95p%L17j99j59J68j50J75K03l44%K84j12R0
7922A23j14k76K86k9n4l3L10j09Qj66m2J7j7L78m49Q9j03J14R5j68K60j47j09
7945a36J83J26kk87J46r1K14L7l00K61j05j60L93k39O0o0k5J20J2k47J20l9L6
$$ y = [199, -69, 252, 133, -74, 61, 192, 42, -6, 238, 9, 63, 271, 164, 144, 229, 413, 148, 112, 277, -106, -45, 61, 162, -29, -1, 296, 15, 216, 163, -81, -123, 26, -33, 141, 65, 210, -105, -143, 40, -34, -292, 76, -240, -142, -138, -100, 137, -306, -93, -94, -177, -196, 160, -179, 200, -3, 157, -283, 43, 15, 176, -284, -189, 33, 99, 237, 85, 126, -68, -212, -32, -31, 189, 101, -178, 30, 229, 166, 119, 13, -57, -89, -107, 242, 201, 299, 132, 239, -189, -13, -114, -245, 224, 168, -57, -16, 206, -248, 131, -6, -147, 149, 145, 209, 10, -52, -149, -64, -52, 97, -42, -103, -118, 188, 176, -124, 31, -369, -89, 139, -51, -98, 38, 4, -39, 52, -143, -150, -150, 167, -32, -191, -23, -173, 2, 205, -139, -139, 145, 33, 123, 9, -267, 19, -10, -64, -97, 213, 104, 112, -54, -96, -79, -96, 282, -167, -78, -181, -67, 28, -140, 120, -27, -136, 47, 173, 171, -116, 30, -61, 153, 190, -110, 151, 46, -114, 279, 40, 100, 40, 15, 135, 147, -100, 20, -19, 17]
7968A7k5r5L10m5k83J61k33L52l06J55M0k33K4K41j2k03J67K9j4l50K14J88r5
7991Dj44OJ60n5O7n3j89O2K72k12l9N45m18j39K18Oj47j1j7J31k82J53OK50J17
8016B91k55o8J36j60J71K8L4j70j02k2J35j54J77Mk64N78j23l28jJ72J12j52J16
8039A55m27J84l8K14j91K83l19J37k1n8K3M8j77K93Q4k29N4k14J89l37N16l79
8061b10M14l04K20k77P5J21J4L70p13J85N3J58k10J59m4l1Q9M5j40J16J64j99
8083E5o8J29jk25K16R8p8P0q9l0J1p7j5J81m2r7J40N8j96l1r8L00j37o6J99j27
8109H0j52J70k36q9L89j31j22K40k25N1J79l69R3J86l04J93K13k24J80j17M6J32
8131A83l50n3J09O2k0J56j88Q4N4j57K40k53K9n4J84j18K84l1l16j7K03k08L16
$$ y = [17, -8, -103, 207, 162, -121, 40, -193, 159, -147, 8, 48, -185, -161, 80, 68, -135, 32, 61, 47, -303, -89, 99, 4, -140, -134, 26, -29, 38, -15, -204, -142, 130, -82, -121, 424, 6, -133, 85, 91, -56, -67, -84, 47, -235, -82, -76, 174, 291, 36, -32, 104, -56, 115, 143, 177, 7, -95, -117, 18, -136, 41, 45, -219, 359, 236, -92, -93, 79, 191, 39, 155, -272, -88, -126, 88, -103, 180, -139, -2, -23, -81, -58, -10, -187, 106, 190, -39, 15, -199, -10, -347, 169, -210, 204, -100, 120, -157, -82, 39, 53, 423, -290, -105, -52, 106, -104, 55, 11, -20, 69, 114, -26, 90, 254, 55, -13, 116, 115, -110, 106, 204, 126, 196, 107, 77, 88, 11, -4, 177, 135, 38, 178, 236, 40, 9, -89, 211, 74, 8, 207, 80, -72, 98, -138, -227, 162, 31, -91, 149, -76, -25, 154, -215, -122, 64, -240, -47, 166, -58, 122, 5, 51, 183, -167, -220, -111, -49, -69, 87, -101, -17, 37, -120, 120, -133, -104, -158, 26, -92, 192, 161, -155, -172, 31, -177, 139]
8154A39j42n6K98k90O0J35l22R7P4k01L44j52R2r9N1j53K14j11m4K29l81j4L70
8177A38p9M7kR7k03j44L56k30J2L10j78j96k0N1
$$ y = [139, -3, -59, 239, -51, 9, 144, -178, -81, -7, -208, 136, -16, 76, -23, 28, -125, 89, -22, -66, 163, -218, -232, 138, 59, 106, 104, 201, -2, -146, 210, -20, -8, 302, 124, -72, -92, -41]
8191d1
$$ Imaginary data points
##PAGE= N=2
##DATA TABLE= (X++(I..I)), XYDATA
0@%%%%%%qJ6j6J6k4L2l4M2n6P2q8J11j35J62k02K40k80L31l90M59n31O13p10Q17
30D37r36J065j211J375j553J748j964K203k464K750l061L402l778M185m627N115
46B686n648O228o862P559q329R178j0113J1151j2319J3634j5124J6831j8807K1128
60A1193k3902K7283l1511L6977m4350N4880p1235J00255j66716N82216Q5706j213063
72f52267O53218P44359o48512p25093Q15874L61704r39165r2976R32498l42032
82A07608p26661N33362N54283o80094l48173Q12438K00649q76049J18028Q84943
92E80334l46575p16820N76168N27791o41636l59339P08257J57159p67290J8106
102b63845P09799k73710o27804L72808M13015m87811k77911M88841Q5652m93678
$$ y = [0, 0, 0, 0, 0, 0, 0, -8, 8, -8, 8, -16, 16, -18, 24, -32, 40, -48, 63, -72, 90, -112, 128, -152, 179, -211, 248, -283, 330, -380, 437, -499, 566, -645, 730, -823, 925, -1039, 1164, -1300, 1450, -1611, 1791, -1987, 2198, -2429, 2686, -2962, 3266, -3596, 3963, -4366, 4812, -5301, 5850, -6469, 7165, -7959, 8872, -9935, 11193, -12709, 14574, -16937, 20040, -24310, 30570, -40665, 59590, -107126, 475090, 560796, -652267, 951, 745310, 96798, -628295, 187579, 549283, -389882, -482858, 449640, 107608, -619053, -85691, 468592, -211502, -559675, 252763, 453412, -422637, -304609, 580334, 233759, -483061, 93107, 620898, -20738, -380077, 328180, 485339, -281951, -263845, 445954, 172244, -455560, -82752, 330263, -157548, -435459, 53382, 139034, -354644]
112c54644O0835M51759j95443l58037L57892K52924l92000p1755M27595k211l54489
123a77574J03225L55346j55848k94790K40623J92235k57980r7599K00684R345
133A17667j71507p041J09153m2698j02800N7538K4687o7779K7794K5926l9221
144f8281L6617L4746l7051J6982O7068L843n4979O0238Q2484r2654k6294J44528
156A67247k5795j56742R0338J34780j71639j32686K12906N6592k96681j9702K95536
167A54154r1267l32867J68890K76218k72367k11580L35502J19570l68842K917
177b19672M03459r7059l72884K50952L38380l40584k16174M32865J07192m60616
187a74141K6812M60167j64535m45937K93111L46506m38812k43481M89554P9640
$$ y = [-354644, -293809, 157950, -37493, -395530, -37638, 215286, -176714, -248469, 179126, 176915, -177574, -74349, 280997, 125149, -169641, 70982, 263217, 5237, -92362, 108322, 117667, -53840, -60881, 48272, 5574, -97226, -39688, -15001, -82780, -54986, -29060, -68281, -31664, 3082, -33969, -16987, 50081, 53924, -1055, 59183, 141667, 49013, 22719, 167247, 141452, -15290, 75048, 209828, 38189, -94497, 118409, 175001, -121680, -141382, 154154, 62887, -269980, -101090, 175128, -97239, -308819, 26683, 146253, -222589, -219672, 183787, 86728, -286156, -35204, 303176, -37408, -253582, 179283, 286475, -174141, -147329, 312838, 148303, -297634, -4523, 341983, -96829, -340310, 149244, 228884]
197B28884n44943M6295N24645k04281m89615L49175L95013m55196k39144N39236
207A50069J07047n39970Q7513N46357k20404m54050L90365L63727m86658k06592
217b62596N56375N2531n79938J02817N32517k68260m71252L70127L33067m81664
227a16276k09960N06447L9964n24612J09925M72097k50718l82314L62744K86421
237B93718m25417j43328M79584K4548m59036J28675M21151k30562l28354L15816
247G6795K32179l79512j23406L92495j1707l97408J05504L26730k14806k73853
257b66989K54185J74866l07615q8714L04697j1668k79807R7978K40656j51098
267c3509j65331K05650J20651k08357l0608K20857j2534j76600O9417J51421r3269
$$ y = [228884, -316059, -269764, 254881, 50600, -439015, -89840, 305173, -150023, -389167, 150069, 257116, -282854, -195341, 351016, 130612, -323438, 66927, 430654, -56004, -262596, 293779, 346310, -233628, -130811, 401706, 133446, -337806, 32321, 365388, -116276, -326236, 180211, 220175, -304437, -194512, 277585, 26867, -355447, 7297, 293718, -131699, -275027, 204557, 229105, -229931, -101256, 319895, 89333, -239021, 76795, 308974, -70538, -193944, 198551, 186844, -210564, -105060, 221670, 6864, -266989, -12804, 162062, -145553, -234267, 70430, 58762, -221045, -123067, 117589, -33509, -198840, 6810, 127461, -80896, -111504, 109353, 96819, -79781, -10364, 141057, 47788]
278D7788j02307J05427N4881j11666k1373Q1968k1560p0777J9299L7136l9497
289b0681k3689K2649M81p163Q273j2990M336M4453j0098l7782M3283O1904n4394
302A8582l8745J01587K6677j14859J6980J30967o3532j28431R8510J02212j59793
313i845q5505J83192J0707k23419K9790K07772j12492k01612J63263J56221k23886
324a05814r5793K69736K2051k73392P0286K80142j39282k32882K30429J89624
334B15105k80559j01389L27522R954l33277Q2048L12396j85359k75993K59931
344C0379J87329l36790j06463L60655j2297l72653J10348L44225k14290k84929
354b94486L07280K03209l52810q7168L95883j0905l73440J38228L52888k27933
$$ y = [47788, -54519, 50908, 105789, -5877, -27250, 54718, 33158, -37619, -18320, 18816, -20681, -44370, -21721, -21240, -28403, -20130, -33120, -28784, 15669, 5571, -32211, 11072, 72976, 18582, -20163, 81424, 108101, -6758, 10222, 141189, 77657, -50774, 47736, 149948, -9845, -95350, 87842, 98549, -124870, -95080, 112692, 200, -201412, -38149, 118072, -105814, -201607, 68129, 90180, -183212, -112926, 167216, 27934, -204948, 25481, 215105, -65454, -166843, 160679, 170633, -162644, -80596, 231800, 46441, -229552, 30379, 217708, -119082, -225545, 135110, 122813, -249840, -139492, 204733, -9557, -294486, 12794, 216003, -136807, -223975, 171908, 161003, -212437, -74209, 278679, 50746]
364E0746k72142L22118J83275l65919p7089L86161l7617l79009J36638L23623
374B70785k41565k62391K99891J54084l49455o4888L53696m6184l40700J42583
384h4144K91510k20374k16821K84714J37780l04557l8584L19438m6876k87946
394a65860J39956K40864k02329j75679K46974R4798k74451k4963K63168o3122
404G9356k48437J15427J87552j71583j42200J90746P0050k03213q266J90794m7954
415A2272j56979J01451J24492j17482p1082J47513L8794j34634J5616J28882l7692
426E1151r7758O3251O8956o9771m4773O5870R922o2879K728L3426k0357k4354
438b4588J3741K06j0498R153j877j4254K3390J9186l4700M554N4025r904m6999
$$ y = [50746, -221396, 100722, 283997, -81922, -159011, 227150, 189533, -189476, -52838, 270785, 29220, -233171, 66720, 220804, -128651, -193539, 160157, 113973, -226727, -84144, 207366, -13008, -229829, 54885, 192665, -111892, -150476, 168962, 122086, -165860, -25904, 214960, 12631, -163048, 83926, 178724, -95727, -120690, 142478, 79356, -169081, -53654, 133898, -37685, -179885, 10861, 80911, -122302, -130568, 60226, 12272, -144707, -43256, 81236, -36246, -107328, 40185, 78979, -55655, -40039, 88843, 51151, -46607, 16644, 85600, 15829, -28944, 36926, 46848, -16031, -13303, 20123, -234, -24588, -10847, -10641, -21139, -11986, -13863, -28117, -4727, 14459, -20241, -15687, 38338, 28434, -18565]
451a8565M3264N1725n7932k7684Q3298L555r7845L1884R2968p5951r3256J02950
463C8411O0510j49350l8338J58356j5540j78285N5515J60246j06504j40560J47854
474g685J02958j80782m1799K03029j1037j96028Q3404J87084j35152j45323J92724
485E1393R8885k27916k9404K41450m1929k41299J08861K10117j82738j70370K28438
496D5488R9980k70642k9024K74943n0803k64380J25970K31288j89984j67480K45281
507E0637J01803k65058q324K76303o4611k47585J50447K14339k10697j46069K57421
518A08606P5238k79249K247K72783q3560k53539J46112K00694k10609j43255K36172
529G1640O6524k55937K774K46138p7174k17246J39109J73249j83261j08317K13387
$$ y = [-18565, 24699, 76424, 18492, -9192, 74106, 77661, -20184, 11700, 104668, 28717, -64539, 38411, 98921, -50429, -88767, 69589, 54049, -124236, -68721, 91525, -14979, -155539, -7685, 95273, -85509, -127308, 75721, 64684, -131344, -47940, 139144, 3992, -141331, 51393, 150278, -77638, -107042, 134408, 92479, -148820, -39959, 170158, -12580, -182950, 45488, 145468, -125174, -154198, 120745, 69942, -194438, -68468, 162820, -27164, -194644, 50637, 152440, -112618, -120942, 155361, 90750, -156835, -6388, 207951, -2746, -148815, 108606, 183844, -95405, -93158, 179625, 96065, -157474, -11362, 189332, -21277, -164532, 71640, 138164, -117773, -114999, 131139, 53965, -163281, -24172, 149077, -34184, -142501, 70886]
540G0886M8878k17172K3300K10102q4030j76034J36565J33248j75412q2584J90079
551G7826K3436j98914K2498J78331p7983j54755J04173J10145j30931o9353J34209
562A8682K3604j28295K0228J14092n1978p9400P9959N6963q5501j8776R5455m095
574D0938q1750L1959P1278m5498m8798N0281K9959n1771j5774M2062k765l1614
586a1493L208J3610o538j362l633r747J4606J6365k4844j4675M3484R922m6447
599a7544Q042N4196k0708m4094M2272L4325n5506j4845O9812j6321p4552M3196
611H273O3953p7362n6209R8258K6111j23913k611J29651l9736j30286P1205J12786
623H0120j04846q9169J32715N3937j46707q249J55327l6284j39875Q5857J19444
$$ y = [70886, 119764, -97408, -74108, 135994, 51964, -124070, 12495, 145743, -29669, -112253, 77826, 101262, -97652, -75154, 103177, 25194, -129561, -25388, 84757, -46174, -115527, 18682, 42286, -86009, -65781, 48311, -3667, -83067, -3108, 53855, -31646, -50422, 45033, 40938, -40812, -8853, 62425, 16927, -31871, 18410, 48369, -3402, -19176, 22886, 20121, -11493, -8285, 5325, -1213, -2575, -6208, -15955, -1349, 15016, -9828, -24503, 18981, 28903, -17544, -9502, 44694, 23986, -20108, 22164, 56489, 983, -13862, 55950, 39629, -34923, 8273, 72226, -5136, -61345, 36913, 63024, -60889, -63500, 66151, 26415, -103871, -32666, 80120, -24726, -113895, 18820, 72757, -73950, -82199, 73128, 36844, -103031, -17174, 102270]
634A02270j21633q2009J56220L6252j72828J6264J73738p1698j60870J18846J27767
645A22319j62526r0863J90857L4116k04680K0359J98378p4438j76412J25824J40886
656A23820j59491q7935J89419L4218j89140L0578J83894q0440j54813J34749J17541
667A42400j67884o8008J89653J1691j94368L8803J78451r1379j57353J29763J11236
678A23005j62536o7643J74014J2875j75142L5525J59783p9178j32620J18348R4533
689A00964j38114m7358J49592M533j43748M1490J27897p8188j02118J06707O4356
700H6013j25066l1530J26017q389j25260L7788J03299o7062q3467Q1437N2425
711D6205r0048k4288Q8507J69p9095K6935O5801l7719m3640N1705K8786m8883
$$ y = [102270, -19363, -101372, 54848, 91100, -81728, -65464, 108274, 36576, -124294, -5448, 122319, -40207, -131070, 59787, 93903, -110777, -90418, 107960, 33522, -142890, -17066, 123820, -35671, -123606, 65813, 100031, -89109, -58531, 125363, 44923, -109890, 24859, 142400, -25484, -93492, 96161, 107852, -86516, -47713, 130738, 39359, -117994, 11769, 123005, -39531, -107174, 66840, 79715, -95427, -59902, 99881, 20703, -111917, 6431, 100964, -37150, -84508, 65084, 69617, -74131, -32641, 95256, 17068, -85050, 21657, 86013, -39053, -70583, 55434, 47045, -78215, -40427, 62872, -4190, -87657, -6220, 46205, -43843, -68131, 20376, 20545, -58550, -31615, 34186, -3533, -47173, 4532, 33318, -15565]
723a5565o538M8649m262l9057J9071K7226k2093j6241K1888N531k0577k0J1487
736I499l841p753J349k118M579M254j3063l226K1586K112k9585R372L7220j7726
750A2659l6001L4635L4069m5429k1211N6232Q379o4192J1741O3328l4612o0466
762d0868N2447M4364p5113k8842Q2276J629r3629K2183Q7312n3042p7591P6303
774b571N7124r7240k9817J11159Q79j14889L6555J11217o6751r1399R6492O9450
786H0209j17193l4532J29252k707j30672M1775J18369p9864r7554J07491O5766
797H0340j31797k8487J40448j3074j37880N3571J24318q8021r6188J17763O6405
808H7398j34115k2395J43636j5905j34338N7551J20025q9867r1219J15642N8427
$$ y = [-15565, -22103, 26546, 22284, -16773, 2298, 29524, 7431, -8810, 13078, 18609, -1968, -1988, 9499, 5658, -2095, -746, -2864, 1715, 5969, -7094, -10320, 11266, 13378, -16207, -6835, 30385, 12659, -23342, 11293, 45362, -67, -21278, 34954, 43333, -20859, -9118, 54210, 19598, -40868, 11579, 55943, -19170, -48012, 34264, 35893, -57736, -35553, 51759, -1283, -78874, -2571, 54553, -42687, -72504, 38655, 39534, -75355, -38800, 72417, 5666, -85733, 10759, 80209, -36984, -71516, 57736, 55029, -75643, -33868, 84501, 4637, -92917, 14574, 80340, -51457, -79944, 60504, 47430, -90450, -36879, 87439, -582, -96770, 20993, 87398, -46717, -69112, 74524, 58619, -75719, -18168, 101857, 11990, -79229, 36413, 94840]
819I4840j32301j9859J34137k0565j27630N3466J07632q6960q2431J06645M7812
830G4786j20871j2783J20893k3529j12093N4386R5345q0558o8714R8301L8849
841F4012j04880o927J03372k3439r2407M8325P4659p0452n2144Q0357K5332q6273
853d0465k809Q0876k1913p2413L7938N6241n1746l7902N6889J8818n6085p01N3258
866A9986j3484m2008K6474L3354l0938j7847L4679Q869k9335J030K6749o887j8080
879g438J0629J1214j0377n530P666M94m011q13p18J410L985o682n967J3119M757
894A1738j8686j124K6458n441k8048J4684L0740k3999k5872L4835J8175m1470
906h010p589M7140q134m8813K2283M3202m0055l6952N2047J9554o3734n654O7107
$$ y = [94840, -37461, -57320, 76817, 56252, -71378, -17912, 89720, 2760, -79671, 26974, 74786, -46085, -58868, 62025, 38496, -73597, -19211, 76134, -4424, -73138, 25163, 64012, -40868, -47795, 55577, 32138, -60269, -11944, 62715, -7737, -59881, 20476, 45808, -40465, -43274, 37602, 15689, -56724, -18786, 37455, -14291, -52193, 4696, 23514, -32571, -33272, 19986, 6502, -35506, -9032, 24322, -6616, -24463, 10216, 19085, -10250, -9220, 17529, 10642, -7438, 3191, 14405, 4028, -1502, 6164, 6658, 2647, 1834, 1116, 2526, 6511, -171, -6138, 6981, 11738, -6948, -8072, 18386, 12945, -15103, -419, 30321, 6322, -19550, 15285, 33460, -8010, -15599, 31541, 23407, -25406, -3123, 40079, 24, -36928, 15119, 34673, -29061, -34715, 32392]
919C2392j6826o8186L6126N9767n6443m6981P2556K7667q1682n231Q8011j8519
931B2651q3466M4142P3144o4260n4482Q2153L0964r1060l421R3438k6034q7424
943f3655N4063P1611p7181n1658R4991K4495j03653L868J04984l1780r6191O0013
955a0093P9678p8427n5670R5390K9183r9714K141R9085k9446q7847N7768O9811
967G1859p6747m6736R0942J9185r7077Q410R3083l6483q3778N8870O4163p7489
979a1798m3767Q7485J7122r2018P893Q5666l1490p4974N0973N7267o4856l6010
991d8507P2608J2759p3030J0640O6569l0194n6201M6487M0316n8324k3824O2219
1003B1518N448o3740J0263N5949k4155m7700L3458L4113l9535k0654M0802Q194
$$ y = [32392, 15566, -52620, -16494, 43273, -13170, -60151, 12405, 40072, -41610, -46841, 41170, 22651, -60815, -16673, 56471, -7789, -62271, 19882, 50846, -40214, -43635, 49803, 23769, -63655, -9592, 62019, -15162, -66820, 28171, 52666, -50987, -47119, 57865, 26085, -70106, -10093, 69585, -8842, -64512, 30878, 60061, -39653, -37512, 61573, 32127, -55720, 2048, 71859, -4888, -51624, 39318, 58503, -38574, -30164, 62919, 26436, -57342, 1528, 65691, -11798, -55565, 31920, 49042, -42976, -35083, 50583, 19093, -55881, -4908, 52359, -12497, -48507, 24101, 36860, -36170, -25530, 41039, 10845, -45356, 1131, 41447, -16877, -40701, 21518, 26966, -36774, -26511, 29438, 5283, -42417, -8959, 25154, -14381, -35035, 5767, 13961]
1015A3961l8082M996L3241j2291k4417K0715J7462k1008o887K1987J904j8436
1027f855N427J5098p378r822Q413O211p608l451M269K656k530l557j437O172K680
1042H288j0925k377J5666O36j9993M590K2573r286k2327J5999K1482k3372j5246
1055a4292K8955P537l3782K952L3098j4691l2841K5377K5714l8072j7418M3631
1067A6168M459n0231Q518M9837k4783m6044L8276L6907n1542k3365N9696P781
1079B5677o3545J0613O2776k8105n4774M4821M3219n7075k5740O4896P101o7687
1091c7823J4300O4157l4739n4212N2344L9926o5370k1494P3565J875p5095J9490
1103b3076P1602l8508n9472N5048M5925o5940k5915P3330N821p2153J5741O7306
$$ y = [13961, -24121, -19125, 14116, 1825, -22592, -1877, 15585, -5423, -12310, 9677, 11581, -6855, -1428, 13670, 6292, -3530, 4883, 11094, 3486, 35, 4304, 6960, 4430, 873, -564, 5608, 8288, -2637, -5014, 10652, 11288, -8705, -4115, 18458, 9172, -13155, 2844, 24326, 954, -14292, 14663, 22200, -11582, -8630, 24468, 9777, -23064, 2313, 28027, -10045, -27463, 16168, 20627, -29604, -21086, 28751, 3968, -42076, -3800, 33107, -18435, -41800, 17896, 25677, -37868, -27255, 35521, 7416, -47358, -2537, 40682, -16393, -42133, 22763, 29864, -37823, -23523, 40634, 5895, -48317, 4027, 43953, -21417, -42911, 30654, 32529, -42566, -23076, 48526, 10018, -49454, 5594, 51519, -14421, -40336, 32994, 38815, -33338, -17597, 49709]
1115D9709l4942n4183N0171L8377o1421j9327O6176j787o6373K0503N9511l9540
1127F874m8877N1898L3493o2227j6791O5640k411o3408J7982N6772l2739m5018
1139c8812M2753L0833m8959j4697N0110j879m6311J4693M0036k7929l0861L5778
1151D755J8256m1395p416M1494m875l8518J2677L3246k0897k5310K5345J6849
1163A4211k6398p727K6534Q81k1904N813J8855q902j2330J2142P974j0305l269
1176d425J0189M63p089J129N428j391l315Q50J891R23k719k067L754L766o861
1191E26l982J0605L012j3962o38J7601m067j8066Q551J8578j4459j6501K0171
1204G369J1550k4850n902K7985l154k9244J1498K6690k0894k3517K8581J4803
$$ y = [49709, 14767, -39416, 10755, 49132, -12289, -31616, 34560, 32773, -33600, -13097, 46414, 6874, -42003, 9895, 43388, -18839, -35630, 30010, 27599, -35809, -17827, 38945, 6206, -38812, 3941, 34774, -14185, -28882, 21228, 19349, -26962, -12269, 27767, -162, -31023, 4755, 23011, -18384, -25800, 15694, 10819, -27699, -15022, 18224, -2673, -27983, -2638, 14211, -12187, -19914, 6620, 7501, -14403, -8590, 10265, 1363, -10967, 1175, 9149, -1156, -4425, 5764, 6227, -862, 267, 5695, 4304, 989, 1839, 3730, 4653, 1934, -133, 3621, 7387, 526, -3456, 7149, 10161, -3801, -4439, 13162, 9095, -8971, -420, 18158, 3699, -12802, 7369, 18919, -5931, -11833, 16152, 12998, -16246, -4748, 21942, 1048, -22469, 6112, 20915]
1216B0915l5310o740L8379n532l9343J6390L5314k7784k9203L7699J8274m4162
1228b1103o201M7693p089m6781K1043M1932l2897l3068M3637K0525m8730o164
1240b7203N1374q459m9067K3870M2681l6153l1939M6547J8803n2024l477N3841
1252B8794j0609n0976K6211M3512l7200l2369M7038J9261n0980m103N2316j0201
1264B0694m8859K5022M0519l5643l0059M4043J6517m8180k586M7310j1592m3866
1276b6680K4107L4594l4114k5023M0443J2385m4276J38M2195j1945l8766K2039
1288d903L0605k9581k2041L3974J1399l5919p15L3245q673k9317J6282K2482k2164
1301e326j5306K4796P543k5910nK3614o178k0261J1227J5695j4729r949J6392
$$ y = [20915, -14395, -21135, 17244, 11712, -27631, -11241, 24073, -3711, -32914, 4785, 23059, -21103, -27304, 20389, 13300, -33481, -12438, 29494, -3403, -36471, 7166, 27691, -21039, -27203, 24171, 15712, -33355, -9485, 33196, -2957, -34896, 11651, 30454, -21570, -25047, 28794, 18185, -32791, -6580, 36932, -268, -32637, 14401, 33662, -17318, -21421, 30895, 20694, -28165, -3143, 37376, 1733, -28326, 15717, 32234, -15946, -18532, 28778, 17186, -26680, -2573, 32021, -2093, -27116, 13327, 25712, -18564, -18426, 23769, 11824, -26942, -4903, 25702, -3879, -25920, 8054, 19453, -16466, -17181, 16064, 7391, -21926, -5644, 16838, -5326, -20632, 4164, 11707, -14203, -14208, 9406, 3228, -17033, -5806, 9889, -4840, -14789, 1603]
1314A603N186j5763J5J4217k339j1515N376R963o025n937N845M922m326k796L177
1329A603L180j620k733J195L283n25m857K153N298l586n879O386M739q855l232
1344c450J1374R96j4263L162J4857p696j4580J2106J2228j6407q992J9427L739
1357A2501k2424K393K2424r704k1527J5541J7929k2840j2371K6166N383k9664
1369a6193K335K9336j1673k6812J9204K2224k7341j4181L1867N371l4343M954
1381a5252L4140j4458l0419K3140K5053l0606j5808L5759N778l6968N113L5976
1393B1448j5787l0770K4471K4822l2390j5070L7398N098l8320O079L7166j5987
1405H158l1470K5052K5143l1666j5047L6056M823l6328N810L4826j5732k9487
$$ y = [1603, 6789, -8974, -8959, 5258, 2919, -8596, -3220, 6743, 718, -5219, 626, 5548, 1222, -1574, 1603, 4783, 3163, 430, 1625, 4908, 4383, -474, 1679, 6977, 3391, -2488, 3898, 8637, -218, -3450, 7924, 8920, -5343, -2181, 12676, 4980, -9600, 2506, 14734, -1673, -10665, 8762, 12501, -9923, -7530, 14894, 5190, -16337, -796, 17133, -5707, -18078, 8088, 13471, -16193, -13858, 15478, 3805, -23007, -3803, 18421, -8920, -23101, 8766, 14137, -20206, -15252, 18888, 4430, -25989, -2849, 22204, -8402, -24210, 11549, 17327, -19641, -14528, 21448, 5661, -25109, -638, 24184, -8206, -23276, 14122, 19220, -19100, -13021, 24145, 8158, -23312, 1740, 26883, -4783, -19830, 16226, 21049, -15279, -9469, 25357, 9625, -19862]
1417a9862K3644K2367l0271j3520L3163L295l3534N664L0701j5191k6283K1826
1429A999J8888k7839j0596K9617K026l0225N854K8117j3976k3390J8709J7028
1441A6212k2048j0542K3747K825k2912L110K0847r425j6906J3343J1804j6175
1453f120p032J7394J340j6807L079J5198o536j2599R676Q861j0156o005J1419
1466A712L126j0088j99R082n22p164K068O009j579m282K243L116j162k232Q03
1481I31K560m73k356J082K714k129k276K708K407m747j850P034L89q755J171J0110
1497H520l800j0936O429J0454r476r590J2235O643j4656m064J6107q89j6505M652
1511d876J5083r749j2863J3365Q623j6880m006J8515k011j9219Q487J7176j3933
$$ y = [-19862, 3782, 26149, -4122, -17642, 15521, 18816, -14718, -9054, 21647, 6456, -19827, 1999, 20887, -6952, -17548, 12069, 14095, -16130, -10276, 17841, 3865, -19525, -816, 16212, -5836, -16378, 7369, 10194, -12718, -9608, 11239, 1814, -15092, -1749, 10055, -6120, -13152, 4242, 5582, -11225, -8146, 7052, 516, -12083, -2407, 6454, -3702, -9707, 1712, 4838, -5250, -5449, 3633, 3111, -4053, -1985, 4024, 2445, -1837, 406, 3522, 2360, 128, 931, 3491, 3018, 662, 1744, 4458, 2329, 53, 2761, 5168, 421, -1429, 5605, 5994, -2761, -1590, 8520, 4720, -6216, 213, 10667, 1191, -8399, 3836, 10479, -4177, -8241, 7866, 6977, -9528, -4876, 10207, 458, -12405, 960, 9583, -7297, -11303, 7212, 5201, -14018, -5531, 11645, -2288]
1524b288j4160J9055R390k2581l985K4867k675k4982R468K2743j4771j9064K0227
1537A244J2846k2483o434K4276m22k3923Q603K1279j4655j6374K0632J0776k3786
1550h421l669K5738k821k5001J0635K2538j6016j8240K1242J2499k4150n766K5148
1563A3716j095k4778Q277K1531j4148j6989J8272J1166k1641m431K1680k161k0892
1576a1493Q092J7816j3677j4173J7493Q552k0135k876K0085k470j9438O937J6770
1589A1483j1252j3053J3464Q858j5495m358J5100O1j4414M096J1993p453r341
1602a0311R454O116j0530k834J0523J97r930K914Q460m403o380O024M882o252
1616b070k977O633J744n991j82N821j20m772P61M384m47l561N88L587k67l729
$$ y = [-2288, -16448, 2607, 11997, -10584, -14569, 10298, 7623, -17359, -7891, 14852, 81, -18983, 1244, 14090, -8393, -14827, 9449, 9027, -14896, -6293, 14986, 331, -16043, 4589, 15365, -8421, -12090, 13648, 10827, -14174, -3539, 18999, 2983, -15257, 5985, 18484, -5666, -11432, 13716, 12621, -12157, -3880, 17651, 3503, -13486, 4786, 15952, -5689, -10120, 11560, 9399, -11493, -3401, 14415, 738, -13435, 4058, 12610, -7525, -10401, 9684, 7214, -12224, -5287, 11483, 231, -12822, 642, 9500, -5995, -10353, 4747, 4808, -9606, -5510, 6483, -970, -10311, -857, 5259, -5271, -8105, 2418, 2615, -7315, -4401, 4059, -344, -6724, -700, 4182, -2070, -5047, 1586, 3330, -2661, -2843, 2978, 2858, -1914, -1153, 3231, 2784, -777, -189, 3398, 3131, -598]
1632e98J058L661j260l493K288L353l077l404M549K247o036p05O650m73q266K735
1648g71Q013n319p596O967O373r548m702J1038J628j2345J314J2359n029j1573
1662i191P927R220j1048o327J2889K642j4574J565J4164o036j2897R887J0401
1675H622j3642o646J5872K530j7328K538J7136o899j5547J1474J2791j4804q110
1688a2013J6908M119j7744J418J7446o241j5115J0800J2141j4064p692J6909L311
1701A0183j7843J959J7644p002j4815J0988J2113j4665p721J6835L175j7444J926
1714d667J6368o647j4327J0366J1360j3521p221J4808K622j5183J266J4425o309
1727C340j1789Q603Q889j1319n851J2653J561j2977J482J2028n137j0432P220
$$ y = [-598, 460, 4121, 2861, -632, 1656, 5009, 1932, -1472, 3077, 5324, -712, -1417, 5233, 4760, -3506, -771, 7242, 1923, -5673, 1294, 7667, -1881, -6583, 4455, 6083, -6262, -4948, 7411, 2382, -9191, -1264, 7956, -3092, -9419, 3470, 6112, -8462, -6897, 7267, 1231, -11666, -1779, 8622, -5020, -11666, 4206, 6736, -10592, -8054, 9082, 2183, -13364, -1890, 10901, -3903, -12013, 4895, 9014, -8730, -7312, 10134, 3893, -11222, -422, 11719, -2345, -10037, 6872, 10183, -7660, -5701, 11943, 4941, -9874, 1114, 13227, -1438, -9159, 7676, 10851, -6593, -4667, 11701, 5054, -9273, 1093, 12453, -1068, -8289, 6519, 9141, -6042, -4776, 9649, 3340, -8449, 154, 9043, -2276, -8127, 4526, 6087, -6890, -5408, 6620, 1483, -8949, -1729]
1740a729Q092r248n308J0432J430r657M32R541l112p948M962N666n748m149O614
1755B70K424o644l08O116r67m821K061L907k280l039L353J991k789j163K838J259
1771B208k823k14K844N15l008k9K940K21k665K83L043q28l103Q24M076k487l315
1788a518L134L112m207k619N301J189o070O1O586j978o650L301N811n290m831
1803d668O654K685p864j190Q730k085q875M412P679o989o243Q983L895j0720j347
1818f943J1012j855j0469M772R531p650p463J0268M299j0968j443J2026j932j1714
1832h529N704J0092q130q104J0788N339j1823j865J2573j644j2027N457J0636
1845H467q058q136J0590N233j1743j735J2256j300j2110N478J0280p900p797J0120
$$ y = [-1729, 6363, -2885, -8193, 2239, 3669, -5988, -5556, 3985, 873, -7075, -2113, 3553, -2195, -6344, 270, 2694, -3950, -4258, 1858, 891, -3930, -1869, 2038, -242, -3281, 72, 2063, -726, -1889, 949, 2208, -615, -829, 2015, 2530, -478, -507, 2433, 2654, -11, 272, 3315, 2487, -616, 208, 4284, 1797, -1518, 1616, 4728, 521, -2098, 3203, 4392, -1678, -1617, 4969, 2991, -3659, -358, 5453, 163, -4668, 1986, 4671, -3193, -4383, 4347, 2262, -6613, -2201, 5478, -1511, -7754, 1229, 5124, -5596, -6943, 4069, 2214, -8255, -3483, 6048, -1602, -9065, 1203, 5502, -5466, -6909, 5117, 3185, -8529, -2825, 7267, -863, -8967, 1821, 7160, -4663, -6528, 6045, 4401, -7626, -2169, 8467, 409, -7727, 2863, 8096, -3647, -5382, 6874, 5574, -6536, -1058, 9222, 1322, -6475, 3645]
1859C645M971j1522j300J1487j329j1506M731R404p154p635Q838M857j0510j286
1873d309R575j245r725M125P656o123o134P739L762r245j168R046j255q593L130
1888b764P420n337n624O009M158o806k155O238O05o259J161N620k734m317L498
1903a287L266l929j677M244O52m173P11L929j305k844J839K546k076j846K475
1918E25J732k485j304K942J055k668o32L036M40k944j99L043J30l049N79K920
1934C121j024l023K132K340k629j867L283Q92m157P8M014j043m359K218L811l531
1950B56l642M476K493n849j145N970o12o481K125O089m117n181N177M191o983
1965c233j997O809R09p453J547O731l609n566N301M164o558k187P540J63q092
$$ y = [3645, 8616, -2906, -4206, 7281, 5952, -5554, -823, 8581, 1427, -6208, 2630, 7487, -3023, -4309, 5266, 4021, -5704, -1579, 6077, -46, -6180, 1559, 5321, -3924, -5092, 3954, 2699, -5894, -2764, 4656, -681, -6305, -296, 3862, -2944, -5099, 1139, 1744, -4515, -3354, 2266, -468, -4785, -1287, 1979, -1950, -3627, 617, 1269, -2904, -2193, 1736, 431, -2413, -574, 1972, -104, -1950, 525, 2257, -228, -1532, 1410, 2465, -203, -835, 2201, 2641, -303, -502, 2541, 2671, -378, 201, 3121, 2097, -926, 1206, 3546, 917, -950, 2333, 3225, -932, -854, 3160, 2117, -2242, -24, 3787, 256, -3386, 1090, 3583, -2266, -3411, 2559, 1947, -4534, -2409, 3680, -437, -5618, -441, 3750, -3233, -5230, 1579, 2488, -4965, -3418, 3313, -296, -5862, -561, 3603, -2955, -5142, 2398, 2561, -5531]
1980e531K690P241m294o437O309N190p574l001Q404J305q664J532Q128l240o974
1995d916N317N922p236l187P709J307p769J253P451l489o212N414M855o854l045
2010c480Q021M00q203J428P814l655o805M730N443n791m403O842J826o454l88
2025b675O150j879n439L128M148m535k906N294P57n439L40N632k078n190L091
2040a601M442m484l194M913J978m624j235M856j01m188Q84L723j502k954K123
2055i64K233k420r73K648J64k291O39K350q56j902J323K291j740j865K501J448
2071B586k633j140L249Q58l173m79L290M4l076L08K938l90l351J599K314j791
2087A153k167K362J242k684q83L203m52l648J315L421k623k468K916J756l916
$$ y = [-5531, -2841, 4400, 106, -6331, -22, 5168, -2406, -5407, 2997, 4302, -4362, -2830, 5298, 2058, -4916, 401, 6323, -913, -4100, 3609, 4916, -2853, -1600, 5851, 2362, -3850, 1564, 6419, -435, -3480, 4541, 4941, -3262, -1834, 5980, 2325, -4480, 250, 5693, -98, -4501, 2341, 4167, -2287, -2675, 3475, 1596, -3843, -715, 3433, -1102, -4008, 1286, 2043, -3396, -3056, 2576, 498, -4692, -1601, 2841, -1643, -4837, 76, 2054, -2570, -3805, 1051, 950, -3238, -2354, 1369, -133, -3087, -964, 1269, -1151, -2124, 524, 688, -1603, -964, 1386, 530, -1372, -49, 2242, 502, -1363, 1138, 2586, -47, -1187, 2062, 2920, -253, -732, 2558, 2602, -474, -166, 2772, 2382, -969, 630, 2944, 1153, -1014, 1348, 2590, -94, -977, 2226, 1774, -1874, -559, 2862, 239, -2229, 687, 2443, -1473]
2102a473j214M585m38m615R78M712k467m422L403L317l849k590M602J183n370
2117c658M25M940j428m733L134L574l872k433M774J248n528P09N684k199n014
2132d377L815M176m412l309N550K118n960j30O114j273n533K860M730l999l149
2147b779M965J752n225m28N411j098n203K901M342m089k873M395J931n164l27
2162a489N055j067m760K081M293l666l320M203K156m802j226M394j33m561J374
2177a468M083k590k996K901J780l693o65L608l43l554Q97L495k037k920K574K139
2193A211l109r36K971P09l423N13K698q24k330J347K302j731j489K189J035j865
2209g32o00K164N26j930J32K030p28j324R19J549j480r96J751P83j676q05K166
$$ y = [-1473, -2687, 1898, 1460, -3155, -2177, 2535, 68, -4354, -951, 2366, -1483, -4073, 529, 1712, -3658, -3233, 1707, 279, -4454, -1320, 2254, -1618, -4051, 723, 1971, -3557, -2848, 2836, 637, -4377, -562, 3614, -798, -4107, 1443, 3561, -2399, -2529, 3585, 2312, -3221, -361, 4369, 370, -2779, 2186, 3938, -1287, -1715, 3696, 2598, -2605, 296, 4638, 549, -2324, 2071, 4002, -1162, -1489, 3566, 2499, -2261, -180, 4113, 447, -2873, 1330, 3486, -1316, -2542, 1852, 1719, -2842, -1468, 2615, 25, -2971, -70, 1710, -1983, -2648, 960, 617, -2937, -2040, 1455, -582, -3502, -928, 1211, -1898, -2834, 137, 846, -2577, -2064, 634, -190, -2520, -1173, 1129, -602, -2091, 98, 1133, -732, -1332, 832, 1358, -572, -440, 1590, 862, -462, 457, 2006, 526, -470, 1281, 2064, 388, -417, 1749]
2226A749K51k053j42K330n08k209Q26K087j088k036J795J319k315r64K743K66
2242B051l058M02K629j231k633J483K423k565k049L222J041l791O9L357p59l770
2258c179J996K718k786k299L314J628m123l64M030l39m250J886L509k552k451
2273c262L204J865l827n18M055l94m056J931L975k939k885L431K436m241j117
2288b342M627K6m296J465L636j992l343L295K375l946j028M164j10l610N41L902
2304C364j812l324K933K169l311j558L927J5l738O81L452j688l106K350K395l428
2320f79j581L509M05l303K09K842q94l049J654K174k161j804K659Q95k997q6K655
2337D48l27k602J148K066j194j961J745J395k227o39K046N85j942L56K064r73
$$ y = [1749, 2000, -53, -195, 2135, 1627, -582, 244, 2331, 1243, -793, 1002, 2321, 6, -958, 1785, 2051, -1007, -605, 2024, 793, -1840, -357, 2066, -499, -2548, 674, 1715, -2076, -2007, 1350, 591, -3179, -1183, 1535, -1251, -3550, -236, 1392, -2731, -3095, 935, 596, -3654, -1768, 1741, -811, -3262, -58, 1807, -2020, -2538, 1517, 1123, -2933, -1002, 2973, 34, -2851, 580, 3016, -1225, -2342, 2285, 2311, -1985, -520, 3116, 1124, -2219, 1076, 3451, -495, -1523, 2641, 2531, -1079, -538, 3364, 1552, -1772, 1161, 3330, 19, -1539, 2388, 2403, -1335, -654, 2798, 1110, -1996, 354, 2749, -679, -2260, 1249, 1654, -1649, -1440, 1402, 508, -2541, -887, 1287, -874, -2678, -19, 876, -2121, -2207, 448, 121, -2481, -1333, 733, -461, -2422, -677, 718, -1509, -2148, -102, 483, -1459, -1103, 961, -12]
2353a2j688J387J320r64j570J775R09j576l04J705K50j738L71J810o50j455J246
2370H16J220j546q56J573Q15j933k34J881j4k191Q42J721r98j663J261J464j912
2387B46j241K178L50k229J98K220o83k592J641J590j887j624K226O20k285m42
2403a714K664p45k520J234K045j409k248K427J292k628q77K965k36k374O16K336
2419H28j180k046K141Q27j618j022K923K8k722P26K752j623k050K073J880k475
2435e58j002L042L15k784L76K683p63k523J690J785j751j379K297O95k320n4K069
2452A818l13k187J337J272j422j244J909O64k417L6K030l24k362R86J674j209
2468B48j744J617J306j956j154K093N82k227m9J822m01j857P43J468j132j273
$$ y = [-12, -1700, -313, 1007, 43, -1527, 248, 1157, -419, -723, 982, 1232, -506, -135, 1675, 1025, -430, 816, 2036, 490, -366, 1207, 2022, 89, -145, 1736, 1722, -469, 373, 2094, 1096, -567, 694, 2158, 246, -995, 1183, 1533, -696, -498, 1722, 1039, -1553, 88, 1678, -209, -1833, 393, 1013, -1272, -1714, 950, 205, -2315, -1081, 964, -445, -2693, -266, 1026, -1602, -2479, 486, 250, -2124, -1508, 828, -352, -2398, -257, 570, -1048, -2070, 853, 881, -1841, -1115, 1637, 14, -2036, 37, 1917, -558, -1560, 1482, 1797, -987, -611, 2072, 1309, -1214, 476, 2261, 510, -869, 1428, 2123, -197, -251, 1818, 1505, -682, 655, 1927, 505, -739, 1170, 1834, -583, -547, 1483, 1159, -1203, -217, 1457, 248, -1496, 121, 1427, -529, -1683, 410, 992, -1235, -1284, 538, 137, -1720, -977, 491, -641, -1914]
2484a914J490O00j703o1J778l30j664O83J719j151j288J493J193j721q56K174
2500D42K62k093J67K271n78j871J006J870j297j459J741J028j610n40J954J28
2516A421j952J133J143j047r69J425Q86j957l74K459m43k187O25J998j213j990
2532a042J519J578k039j245J967P63k080k94K076n04j888P78J460j090j623K073
2548D09K71k038K54J946r09j861J233J354j662q14J784M83k020n60K451k23k000
2565a902O79J784o04k041J345J510j463j010J609P14j639L59J427o45j246J036
2581h7J203j500j83J780j6j845M50J666n37j232O70J614j417j108J482P22j311
2598C51m82J188L55j258j04J372o57q74M42R71j095k72P17J50j342N3J447o12
$$ y = [-1914, -424, 176, -1527, -1588, 190, -140, -1804, -1121, 598, -553, -1841, -348, 845, -876, -1732, 442, 704, -1389, -1222, 1049, 471, -1400, -394, 1476, 179, -1280, 461, 1489, -121, -661, 1293, 1421, -531, 602, 1745, 698, -271, 1154, 2040, 83, -291, 2168, 1725, -462, 163, 2161, 948, -1042, 477, 2055, 16, -1229, 738, 1501, -579, -873, 1203, 699, -1189, -411, 1049, -41, -1664, 409, 680, -1358, -1104, 842, -67, -1928, -695, 659, -1003, -1817, -33, 450, -1570, -2130, 321, 98, -1902, -1223, 561, -43, -2084, -739, 771, -692, -1702, -93, 621, -1018, -659, 768, 123, -1123, -87, 1116, -384, -567, 1213, 1197, -648, -198, 1468, 931, -301, 369, 1983, 566, -542, 940, 1662, 351, -131, 1057, 1412, 154, 50, 1422, 765, -109, 333, 1304, 209, -63, 654, 804, -538, -485, 962, 350]
2616C50j333Q68P23r56q27J403O63j818m40J342L39j610M1J356j10j389P00Q12
2634A14p95r26J345K13r56l02J839n72j549J049J028p16j361J604N91j217m93
2651a104J550K78j766M07J834j057r19J094J028j287n90J216P49j578Q6J660n91
2668A010j482J131R72j168r85J673M27j801K21J560n64j596P20J748j413j310
2684h57J612N34j653k00J626n47j452N60J120r14p90Q43O88j500k37J310j64j289
2702a310N17Q66p74p39J021P75j601l75J587k04j256L95J603q10j166Q00J014
2719C43q88m67J314j01r09K66Q30j82q68L05Q96l41l66M89N89j017L3Q82r1p21
2739dK11P43J0p85M50L09n07k94Q97J31r71j06J056j33r21L46N54l05r04M23N33
$$ y = [350, -983, -115, 608, -348, -1175, 228, 891, -927, -1367, -25, 314, -1296, -1255, 101, -9, -1398, -698, 114, -681, -1607, -262, -49, -1005, -1307, 532, -40, -1589, -540, 488, -228, -1589, 15, 606, -611, -1104, 446, 724, -1042, -635, 1199, 142, -777, 317, 1345, 58, -532, 684, 1433, -145, -59, 1601, 1010, -472, 659, 1631, 463, -522, 1151, 1578, -223, -2, 1558, 994, -602, 118, 1866, 453, -857, 755, 1289, -364, -564, 1062, 515, -937, -377, 743, -171, -961, -118, 570, -930, -1167, 143, -21, -1310, -793, 73, -701, -1440, -419, 356, -1245, -1620, -33, -237, -1493, -1098, 505, -305, -1471, -671, 343, -545, -1012, 302, 201, -708, -442, 388, 206, -662, -357, 539, 198, -168, 321, 910, -107, -74, 808, 717, -4, 207, 950, 960, 175, 625, 934, 427, 133, 1030, 1161, 190, 84, 1140, 1007, 86, 432, 986, 681, -223, 200, 733]
2760G33m09o10N23L29r70p0Q73n75p74O66M75r04n19R69M52q23o58J198J28j223
2780a189L2J156n72j000R86J054j232m46Q06P13j394L4J502n41j103J010P43r03
2798c44m31J062N28j319j99J797q21r58R14R65r37r17J318P31j425R7J244j88
2816A117j269N13J145r20q20J000P15j407m9J198k41j210M39Q01q29p36Q62Q27
2834A136j349n60J627k31j480L84R99p33j013J038O24j313JR34j03j101L63R86
2852B09q09m98O49O56j150J0J082m61r62N65P37n37p02R10K88n84mO75k14m04
2872e44J33P17m01k48N34M70p06K94J01J05m28K14M48j05k45L19K05k08k45J91
2892F01P8j64l16N35j17j27r8J18K28o97m5N75K2k97m63N12J8o23m3M70J8n41
$$ y = [733, 324, -286, 237, 566, -404, -474, 399, -176, -950, -284, 191, -713, -1232, -263, 189, -634, -1292, -94, 34, -1189, -1157, -1, -573, -1573, -587, 467, -765, -1211, -405, 308, -1086, -1052, 450, -91, -1194, -184, 559, -344, -775, 287, 815, -504, -703, 1094, 273, -685, 229, 1194, 257, -660, 658, 1389, -36, 61, 1305, 1117, -152, 361, 1506, 586, -234, 766, 1481, 74, 25, 1223, 982, -228, 211, 1012, 183, -553, 309, 1136, -213, -773, 854, 623, -857, -473, 526, -207, -1220, -182, 442, -871, -870, 64, -39, -1140, -777, 209, -600, -1098, -449, 207, -943, -933, 149, -312, -1274, -709, 28, -509, -1211, -301, -13, -597, -601, 74, -140, -544, -411, 306, -95, -343, 191, 661, -45, 249, 350, 455, 27, 241, 689, 584, 339, 658, 863, 655, 410, 601, 679, 515, 199, 734, 617, 490, 392, 510, 738, 41, -4, 571, 593, 296, -167, 345, 363, -260, -303, 167, 185, -356]
2914c56L46O3k68m51P27k68m36O7N35j82r38Q67M09q23n22P12O09j112J09Q32
2934h0o0j220O84J057p51p43R46M18j357L93J202n54q97P73Q90r22k82J020J73
2953F90j509M15J796p88j215J142P93j396k51J475J80j289K5J204k63j116N10
2970D03J046j003p66J315J13j474L08J217r90r31J089O59j490j60J587m97j327
2987i01K66J438q64j167R34Q21r98m19J157k02r67J05Q15m63p13Q49K47j102N62
3006f02P62p24q09J030N35p72n50R08L35q94K24Q72j81p29M72K79l89p4N83J28
3026D04m79K42L13l17j1M43J96l45M4J96j07m33M72K65l67j7J63l4r5L2R3l35
3048C23j33N49n80k9L61j39l67J99K10l41n09N78K77k77o12O81j76n56N6O09n17
$$ y = [-356, -10, 53, -215, -666, 61, -207, -643, -576, -41, -223, -1161, -294, 115, -708, -1230, -518, 91, -1021, -912, -80, -140, -1360, -676, 381, -370, -1113, -167, 251, -1106, -713, 489, -65, -962, -189, 701, -221, -503, 517, 690, -819, -404, 1392, 604, -611, 531, 1324, -72, -323, 1152, 1332, 43, 68, 1272, 1009, -107, 403, 1449, 446, -320, 995, 1108, -366, -58, 1159, 169, -762, 327, 986, -504, -664, 923, 426, -901, -635, 803, -61, -1228, -294, 527, -471, -890, 267, 65, -902, -797, 18, -445, -1158, -309, -62, -1164, -602, 160, -564, -1373, -343, 192, -580, -1130, -222, 113, -781, -557, 315, 134, -595, -123, 156, -233, -307, 276, 404, -75, 167, 480, 163, 152, 595, 791, 446, 490, 686, 579, 146, 618, 883, 516, 499, 662, 628, 533, 565, 658, 323, 190, 739, 159, 130, 491, 352, -15, 184, 394, 53, -456, 122, 399, 122, -490, 191, 15, -541, -485, 124, -393]
3069c93k46L46K31n90k26Q51l98o64N27M79o43m33J211K08j522L31J395p51q23
3088a110O81J090j179k27J010Q1j005L28R20n02m65O33O54j072k13J161p4j178
3106d67P18R95r29o72J312N07j424j74J183j78j124L95J348q96r51J280R4j372
3124c55K74J163o72r23R03M11q40q22J285K42j369M95R38q14q87Q87O30j198n02
3143a154J356l13q84L75O95m69n38L81L77q18J06R42l91r23J012M69o01m46Q55
3162C1r4n83J19Q21k10m01M00K09j66m91P26j45k52J35L18l74j70N69j66k96M80
3183D60K94l08k82M64J85o30L32L35m3p20K98L45p33K99J62N1m47jO61m82l60
3204a20P13p2q24M0O22l42n14N16K69q62J04P52m02p47N82K71o10l92P72J16q53
$$ y = [-393, -639, -293, -62, -652, -878, -27, -425, -1089, -562, -83, -726, -1159, 52, 260, -1262, -931, 464, -287, -1110, -429, 661, -518, -745, 265, 346, -659, -331, 589, 87, -378, 255, 909, -163, -376, 785, 711, -467, 251, 1246, 317, -355, 957, 1464, 40, -134, 1049, 871, -253, 142, 1490, 594, -357, 923, 1017, -355, -81, 1082, 410, -513, 390, 801, -39, -861, 424, 666, -703, -208, 730, -84, -971, -84, 546, -652, -1154, 202, -111, -995, -620, 75, -394, -932, -551, -174, -992, -886, 56, -335, -1258, -246, 223, -378, -824, 31, -63, -646, -527, 294, 84, -317, 83, 292, 126, -365, 361, 216, -36, 99, 417, 43, -127, 442, 276, -20, 460, 754, 446, 164, 628, 813, 183, 515, 850, 807, 87, 385, 730, -3, 296, 458, 509, 62, 61, 722, 240, -120, 593, 521, -303, -263, 359, 17, -497, 19, 288, -574, -470, 282, -120, -867, -285, -14, -624, -1016, -244, -128, -981]
3225i81K16P11n13n67O52P00r08k35R10J10r08K61R53p85n95J095J28j005J79
3244e82J153k55j114P84Q71j342j14J212J37j041K54Q79l13j035J051O64j120
3261H9l66J184M9j260M89Q98p46l56O00M71r96k66J240o30p98N32R09j120l96
3280d73Q77J55j088J89Q22j77j068O05M16q27l79R99J76j079J80P46n76m93O36
3299c59J24m48k29J090k13j028O07M48n56n49J097K55j029N54M97k61p68P32M97
3318D61o60k32O88J45n70K79M98n32k35N43L06p11K44P83m10r32R65K87p43j74
3338@R98l16q39K67O57n26m13O55J71p55l2P78k99n72P10R1p36j96R69m23n59
3359c70K04P04p59p49Q06M81q78QQ85n95o58K07J032q69m64Q17K14p23K15N54
$$ y = [-981, -765, -54, -567, -1134, -482, 218, -690, -925, -15, 95, -813, -552, 401, -384, -979, 116, 244, -761, -582, 571, 316, -798, -14, 857, -485, -599, 613, 750, -291, -37, 842, 529, -506, 545, 1209, 89, -277, 907, 956, -304, 185, 1083, 337, -19, 581, 1052, 56, -210, 1030, 400, -398, 134, 1043, -77, -473, 404, 559, -529, -340, 482, 305, -763, -158, 258, -569, -948, 51, 227, -852, -672, 74, -502, -995, -359, -235, -683, -912, 178, -35, -1063, -456, -8, -564, -1113, -16, 239, -790, -236, 261, 0, -768, -36, 461, -199, -431, 257, 402, -168, 111, 609, 77, -158, 385, 691, -20, 224, 1007, 597, -335, 630, 917, 174, 0, 998, 682, -157, 110, 767, 241, -172, 483, 654, -101, -133, 645, 346, -226, 484, 575, -161, -357, 612, 189, -370, -166, 538, -221, -970, -164, 317, -561, -553, 332, -263, -921, -714, 318, -551, -1015, -198, 16, -707, -492, 62]
3379F2n76m11P88L43r49K77P31k58q43O47O89r84MP92K36r80J99P67l57m71M41
3400A47O12o54j33O67Lp97K48J012q33m95J067R4j105R6J013o10n10O94N38r99
3420E5m28Q61K06o44j71R71o23o78M61N82r62j53R23k68r53P43N87o23o40Q16
3440F2J04q84J62P02l75p90M51Q38q15k26P32m9n85Q7P14n00n96R15K94j014J27
3461f46Q12n8p36L67N66l98n15Q27J38p23J43Q70l3n90L67M79j011j45J179j96
3481F97p86N79M69p31l64O22K57p04k8O08k80n00K72P79o65m14O55J48r60R2R26
3502F72o54j71K47K12o88j17O25J33j224R15P97j096k50O55O7p36K66O55m88p12
3522h92N70K91o17j18O07n9p15L80P91o90k53O96J33q20L39R17n57o34P03N15
$$ y = [62, -514, -925, -137, 206, -743, -466, 265, 7, -836, -189, 500, -484, -480, 312, 548, -432, -233, 534, 177, -294, 147, 759, 105, -28, 639, 642, -155, 93, 1105, 272, -223, 844, 938, -167, -71, 942, 332, -178, 516, 1054, 55, -373, 488, 694, 50, -121, 850, 227, -451, 10, 592, -370, -523, 400, 132, -821, -78, 509, -114, -754, 62, 166, -718, -556, 146, -229, -1019, -568, 270, -545, -771, -39, -88, -673, -586, 128, -372, -968, -53, 241, -773, -646, 166, 108, -628, -261, 305, -93, -608, 219, 357, -366, -223, 647, 614, 24, 391, 870, -141, -286, 893, 697, -89, 490, 959, 228, -136, 486, 743, 39, 11, 619, 339, -161, 111, 890, 225, -189, 466, 614, -346, -254, 672, 18, -153, 94, 306, -382, -499, 126, 259, -965, -50, 747, -349, -599, 56, 123, -613, -347, 308, -180, -892, -322, -31, -648, -766, -159, -218, -933, -553, 238, -452, -705, -9, 124, -696, -357, 560, 3, -631, 72, 587]
3542E87q69JN40J66n68J67N46k20n78N82K58l62j64O03m36m44O11L37p49j45R14
3563G77j16n60p3Q72o64l82L21N75j053J95P22o9q30J51N45p55J19M80j32o88
3583e65L63N40m98l96M70K27n81j08O14n2o27K14O60p28k60O16K37n23j41J38
3603d00L16o50N45M20n94k45Q98j64p20K03O73m29k66N53K78q03J96O40q3o87
3623c19M20O45q53q6N23J52n99j22R17l55m66M60M47q96n2R00k41p45N04N87p48
3644G3l78Q17J15q35K96L02j16n57M33K58n82m38P77J83q37J63N71l07o26N01
3664a87N28q62q3J005n77o08M09L96k93n23O82L48p97J25N59m20m51L94O49n17
3684b23k3M46o7n76N67M08l60p16Q74M4o22J00N12l02l02J48M90r4k67M39m6n44
$$ y = [587, -282, -281, 259, 425, -143, 24, 570, 350, -228, 354, 612, 250, 86, 689, 253, -191, 420, 757, 8, -137, 777, 661, 101, 28, 900, 236, -146, 175, 750, -303, -108, 614, 545, -285, -134, 411, -344, -225, 255, 123, -565, -202, 338, -160, -556, -86, 141, -440, -548, 66, 14, -613, -399, 261, -467, -727, -111, 126, -397, -538, -400, -84, -734, -189, 231, -363, -608, 290, 126, -594, -391, 282, -147, -413, 140, 418, -385, -189, 451, 368, -319, 101, 746, -107, -193, 330, 482, -117, -239, 678, 323, -143, 317, 764, -132, -184, 716, 475, -270, 234, 821, 73, -305, 512, 627, -208, 88, 390, 274, -283, 150, 408, -174, -612, 165, 348, -489, -326, 245, -62, -688, -187, 341, -521, -604, 401, -176, -784, -375, 21, -272, -795, -113, 235, -562, -437, 122, -298, -749, -355, 294, -223, -246, 200, 133, -443, 124, 532, 172, -544, 330, 374, -248, -148, 364, 62, -240, -92, 398, 304, 37, 476, 430, -114]
3706a14K00M35l05k17M41K51o91K2N21j63n75K57O08o56l51O94K91j027L80P04
3726G05m08r74Q54M82q85K4O36l20p36N82M15p71k54O94r5o23K93O59m16m26J29
3747d35O15q06j19J017k84o69K28Q47n46n70Q67J36n63j43Q01k53p84R00J1o14
3767c64j46R51N3r06K24Q29n02j51M99M65j070j4J066n69n97L71N60p74k32O77
3787C70L20r40L07N71n33m78O31L78o51P5M60O0q55O4N45n11k85N52L70p99k93
3808f42R63k21n94K23N07n32l53O06j57n27L77O80m73o26O97J99n05r2L63K43
3828A36p06L83M73o21LL09L01n35K12L50j4p67L25O81m73l57N30K33n76K50K00
3849C37j29l96N86J86n59k12N60n6j90K59P6n02j8O35l02k98j3O00n69j08M05
$$ y = [-114, 86, 521, 216, -1, 440, 691, 0, 22, 543, 380, -195, 62, 670, 14, -337, 357, 648, -379, 1, 705, 297, -677, 177, 659, -226, -202, 434, 114, -622, -40, 375, -396, -650, 44, -51, -674, -381, 278, -138, -564, -435, 180, -626, -745, 272, -12, -681, -453, 394, -152, -722, 145, 281, -282, -425, 376, 123, -661, 239, 250, -364, -510, 441, 494, -412, -188, 641, 139, -12, 487, 952, -118, -132, 934, 365, -232, 139, 699, -75, -307, 370, 690, -250, 57, 628, 95, -383, 248, 626, -25, 50, 510, 570, -285, -221, 324, -187, -472, 80, 450, -349, -642, 321, 100, -494, -271, 236, -296, -649, -43, -200, -727, -350, 330, -143, -769, -72, 127, -378, -470, -107, 136, -570, -187, 286, -335, -332, -23, 278, -257, -45, 305, 291, -476, -151, 530, 57, -300, 230, 463, -113, 137, 337, 208, -188, 398, 584, 25, -187, 373, 317, 127, 386, 462, -40, -58, 577, 275, -23, -36, 564, -5, -113, 292]
3870B92j26q9N0K07j74m35K95N68p20pK91J23o45N05K65o74k55N72J56q77L07
3891c71O54l64l83L86J73n19m8M56J08o53K30M42k05m99O44L45n72k17N41J21
3911B69p02N37M37r38J22N86Jm43rN75P6n77K72M61p58k20O78J48o68J19Q34o10
3933A90m35M15L24o23k5M25J13o44L35M34m67m34O91J17l94k03M75k64n65N44
3953IK72n20j53O31j96m84N7O10l12j78J89K6k64J41J94J78q31L65L49l20j37
3974c74Q1M59n91L9M48j05k34L54p1M4k56J16J24l42J28M49k77l43L82K75m56
3995a50J22N17k29m81K29L82l73J17K49j66M4j54L25l18j39K77J61n51K64L34
4015D60j61k21Qm2K30m89L56M2n55J00M88l29j94N77k08j38k25M26j50k57P9N11
$$ y = [292, 166, 77, 127, 334, 160, -275, 20, 588, -132, -139, 152, 275, -370, 135, 400, -274, -529, 43, 199, -678, -371, 283, -81, -464, -78, 95, -424, -472, -16, 92, -561, -331, 111, -94, -593, 51, 396, -176, -393, 148, 269, -433, 104, 541, -397, -275, 311, 312, -131, -140, 435, 511, -66, 206, 667, -91, -311, 367, 515, -153, -34, 800, 190, -245, 170, 494, -129, -154, 271, 384, -260, 75, 509, 42, -392, 299, 416, 22, -181, 294, 30, -535, 9, 281, -239, -392, 239, 43, -441, -384, 226, -86, -264, -75, -49, -313, -172, 22, 200, -631, -266, 83, -237, -374, -293, 166, -425, -386, 62, -43, -277, 77, 6, 50, -206, -90, 34, -308, -180, 269, -8, -351, 31, 306, -150, -28, 489, 260, -221, 8, 390, 17, 134, 383, 217, 261, 107, 432, 114, -25, 252, 413, -138, 126, 460, 299, 78, 86, 44, 274, -215, 141, 183, -372, -272, 216, -113, -307, 270, 62, -76, -301, 125, -25, -282, -203, 308]
4037C08n16j8L73K1n66J20M95k65k00M96j51m15o0O26k68m65K30L45j10j72J89
4058cP1m46j15P59k34n23M68L05m34k88R99l35l34j2O00l40k95M05J47k82l73
4079b60R48m27n50J39M86k50kJ92R7o09P8O73m08k52J11K61l44j49M84P8n26J06
4101a24J0M0j37K05K97o79N9K26J77k52q3M47k91l87N09j8j10l73M56q5k82L36
4123e9J00j88R6R4n0m33K90L66p5m8k05K37j19RJ84j59n9L66j86K3k27M06k8p04
4147c69L25L42l70J26n8L56l68n0P5K4r1J04J44r2K1J75J10n33L12J59l89L6K60
4170B49r2m67P1M11k30j96J23P7k14m1K91J89n57L48J18k32k63N96P6p00K65K42
4192F4k18o9J46J95r1j15K29j21k88N8J98J65m68M37J55k12j24r4M14m78J29L12
$$ y = [308, -208, -226, 147, 168, -398, -278, 217, -48, -248, 248, 97, -318, -378, 248, -20, -485, -255, 90, -20, -192, -3, 68, -378, -493, 266, 32, -491, -23, 282, -152, -440, 559, 224, -110, -122, 478, 138, -157, 248, 395, 113, -260, 688, 261, -289, -150, 336, 86, 84, 276, 373, -236, -158, 515, 107, -145, -34, 227, -117, -266, 218, 296, -230, -124, -114, -74, -211, -6, 291, -388, -329, -103, 74, -178, -261, 186, -105, -492, 17, -1, -111, -484, -28, -113, -395, -59, 41, -147, -51, 43, -7, -440, -150, 216, 141, 93, -112, 125, 6, 15, 199, 40, -19, 347, 161, 184, -43, 363, 335, -369, -44, 298, -72, 54, -4, 352, -16, -66, 9, 33, -58, 46, 190, 98, 119, 294, 404, -129, 183, 342, -47, -11, 249, 157, -310, -239, 172, -58, -254, -131, -54, -268, -309, -18, 171, -386, -38, 80, -152, -415, 181, 257, -443, -178, 64, -154, -223, -77, 118, 27, -88, 141, 20, -268, -210, -12, 153, -315, 122, 277, 65, -59, -153, 261, -217, -88, 224]
4214B24J1n17N55j17k13r3P90n58l05K78O4j13l37R05l18l01R6K73k81Q7j01M38
4236D67l88j56L98o5l23lK60M2n00J42M71l09k44J65J97k94j57L88j60j52qK54
4258B5k43P6J55j5l0QJ31k36J6j18K25l66J91J63R2l20K31K85k91k16K90k85N5
4281a77J25J41j26Q8j05R5k1KL0N3p3N32n69k09L3L88l71K76M6%k37K41ll82K85
4306F2M8K83n71K76L2l46PJ77L3J92l54J33J5J0j35L95k89q5n7L87m17j81M58
4329G3l21J63j57L20o2j74K20j71k11L26N2j02j35j08J43q2N9k9K89m23L46n7
4351d1K39j56pJ45n1p0J61K0l61KJ05p3k2K12j10J44k08L9J51j81LJ23P6m18L13
4376C5l1r6mQ3J08m42M72j37mk51K68k1L9j2N5P7l20J14K49j91n9l0M8j27l5M17
$$ y = [224, 235, -282, 273, 156, -57, -150, 640, 82, -223, 55, 119, 6, -331, 574, 256, -45, 51, 324, 43, 130, 29, 467, 79, -77, 321, 256, -67, -70, 190, 232, -268, -126, 345, 36, -208, -43, 154, -140, -297, 91, -69, -221, -229, 25, -218, -142, 13, -2, -32, -24, 107, -129, -113, -231, -6, -372, -181, -18, 74, -246, -15, 270, -21, -237, 53, -232, -177, -52, 89, -37, 51, -54, 41, 20, 22, 52, 105, 32, 564, -5, -214, -181, 207, -164, 112, 158, 158, -79, 162, 159, -223, 62, 110, 393, -178, 98, 130, -216, -209, -32, 1, 193, -161, -28, -13, -3, -138, 257, -32, -117, -174, 213, -204, -385, 73, -248, -85, -242, 78, 16, -158, 62, -109, -320, 6, 58, -44, -179, -287, -144, -226, -167, -196, 93, -330, 16, -41, 198, 42, 35, 180, 129, 59, 220, 240, -121, -119, -14, -87, -109, 103, -7, 137, -71, -32, 119, -62, -59, 64, 140, -278, 35, 4, -92, -96, -13, 95, -347, 125, -12, -16, -267, 1, -20, 19, 7, 62, 139, -181, -67, 182, -9, -68, -98, -50, -177, -212, 205]
4402B05j52p5j3K15j54k64M57l11J24r3K15j34j33rJ76j81J83K1N0l40J35K0p9
4425a37KJ35o9q7K9J7L08l11J77q7J38j71k12O2J81K42k67pJ01rj59K36j42l5
4449f5J15J7o3j35J07rK20j18o6%J11n9J14j92j61J58Po6O0k20M21k29m9K33j25
4474Fj12l1J86M0r1j99K05j97Q4L85k85J0J8j72J93k52L11J6N8r2p1j19P9L2J14
4499A16Kj21r6L12k54J10p4J73j63P5L12l39j09J32O4n4r6L62l06j26L0J50j00
4522@m0MK63k43j24K17J5L2l48J77J23j16k57J90J27q8r6P3jJ16k01J45J17j73
4546h8P8J03k83l7K03O3k45P6K35j94J58J9M6j23J2k73N30k6r4Q8l25L6P2n6O9
$$ y = [205, 53, -22, -35, 180, 26, -238, 219, -92, 32, -61, 154, 20, -113, -122, 54, -127, 56, 77, 127, -213, -78, -58, -137, -135, 0, -69, -156, -127, -110, 198, -113, 64, -23, 115, -56, -268, -206, -25, 217, -50, -57, 44, 35, -124, 112, -30, -65, 50, 67, 4, -131, -24, -33, 187, 69, 3, 3, 114, 55, 169, -23, -184, -26, -19, -85, -25, -245, 176, -53, -102, 131, 6, -106, -137, 49, 89, -2, -201, 4, -193, -109, 276, -9, 1, 19, -153, 40, -212, 99, 115, 173, 81, 10, -109, -30, 2, 116, 118, -3, -99, 213, -41, 69, -5, 168, 5, 80, 392, 53, -56, 76, 140, 86, -10, 352, 46, -80, -50, 100, 0, -40, -36, 227, -16, -140, 77, 92, 124, -224, -47, 76, -40, -297, -107, 20, -68, -164, -91, -92, 24, -177, -32, 85, -88, -10, 93, -190, -227, -24, 39, -206, -130, 105, -89, 69, 88, 134, 11, 23, -250, 280, 254, 160, 248, -77, -41, 31, -25, 44]
$$ [...]
8191f1
##END NTUPLES=NMR FID
##END=
