##TITLE=1H_Pr NMAE
 200.13Hz,CDCl3.
 8 sc
 
13.3.2026
##JCAMPDX= 6.0         $$ Bruker NMR JCAMP-DX V2.0
##DATA TYPE= NMR FID
##DATA CLASS= NTUPLES
##ORIGIN= UXNMR, Bruker Analytische Messtechnik GmbH
##OWNER= pz
$$ XWIN-NMR		Version 3.5
$$ Fri Mar 13 15:42:54 2026 Russian Standard Time (UT+4h)  she@DPX200
##.OBSERVE FREQUENCY= 200.1313
##.OBSERVE NUCLEUS= ^1H
##.DELAY= (6, 6)
##.ACQUISITION MODE= SIMULTANEOUS
##.ACQUISITION SCHEME= undefined
##.AVERAGES= 8
##.DIGITISER RES= 18
##SPECTROMETER/DATA SYSTEM= spect
##.PULSE SEQUENCE= zg30
##.SOLVENT NAME= CDCl3
##.SHIFT REFERENCE= (INTERNAL, CDCl3, 0, 14.3821)
##AUDIT TRAIL= $$ (NUMBER, WHEN, WHO, WHERE, WHAT)
$$ ##TITLE= Audit trail, XWIN-NMR		Version 3.5
$$ ##JCAMPDX= 5.01
$$ ##ORIGIN= Bruker BioSpin GmbH
$$ ##OWNER= she
$$ F:/spectra/data/she/nmr/H-C/1/audita.txt
$$ ##AUDIT TRAIL=  $$ (NUMBER, WHEN, WHO, WHERE, WHAT)
(   1,<2026-03-13 15:41:06.54 +0400>,<she>,<DPX200>,
      <created by zg, POWCHK disabled, PULCHK disabled
       configuration hash MD5:
       00 E9 B6 7A A2 85 ED C7 34 08 36 98 17 FE 4E 26
       data hash MD5: 16K
       8B AE C8 CC 92 81 94 B7 67 79 F3 9B 68 FD FF 06>)
$$ ##END=
$$ 
$$ hash MD5
$$ 15 BD 03 AA 8F 02 E4 02 6D C5 5B 26 96 29 AE 47
##$RELAX= 
##$RELAX= 
##$RELAX= 
##$RELAX= 
##$RELAX= 
##$RELAX= 
$$ Bruker specific parameters
$$ --------------------------
##$DU= <F:/spectra>
##$EXPNO= 1
##$NAME= <H-C>
##$PROCNO= 1
##$TYPE= <nmr>
##$USER= <she>
##$AMP= (0..31)
100 100 100 100 100 100 100 100 100 100 100 100 100 100 100 100 100 100 
100 100 100 100 100 100 100 100 100 100 100 100 100 100 
##$AQSEQ= 0
##$AQ_mod= 1
##$AUNM= <au_zg>
##$AUTOPOS= <>
##$BF1= 200.13
##$BF2= 200.13
##$BF3= 200.13
##$BF4= 200.13
##$BF5= 200.13
##$BF6= 200.13
##$BF7= 200.13
##$BF8= 200.13
##$BYTORDA= 1
##$CFDGTYP= 0
##$CFRGTYP= 5
##$CHEMSTR= <none>
##$CNST= (0..31)
1 1 145 1 1 1 1 1 1 1 1 1 1 1 1 1 1 1 1 1 1 1 1 1 1 1 1 1 1 1 1 1 
##$CPDPRG= <>
##$CPDPRG1= <>
##$CPDPRG2= <>
##$CPDPRG3= <>
##$CPDPRG4= <mlev>
##$CPDPRG5= <mlev>
##$CPDPRG6= <mlev>
##$CPDPRG7= <mlev>
##$CPDPRG8= <mlev>
##$CPDPRGB= <>
##$CPDPRGT= <>
##$D= (0..31)
0 0.7 0 0 0 0 0 0 0 0 0 0.03 0 0 0 0 0 0 0 0 0 0 0 0 0 0 0 0 0 0 0 0 
##$DATE= 1773402065
##$DBL= (0..7)
120 120 120 120 120 120 120 120 
##$DBP= (0..7)
150 150 150 150 150 150 150 150 
##$DBP07= 0
##$DBPNAM0= <>
##$DBPNAM1= <>
##$DBPNAM2= <>
##$DBPNAM3= <>
##$DBPNAM4= <>
##$DBPNAM5= <>
##$DBPNAM6= <>
##$DBPNAM7= <>
##$DBPOAL= (0..7)
0.5 0.5 0.5 0.5 0.5 0.5 0.5 0.5 
##$DBPOFFS= (0..7)
0 0 0 0 0 0 0 0 
##$DE= 6
##$DECBNUC= <off>
##$DECIM= 32
##$DECNUC= <off>
##$DECSTAT= 4
##$DIGMOD= 1
##$DIGTYP= 9
##$DL= (0..7)
0 120 120 120 120 120 120 120 
##$DP= (0..7)
150 150 150 150 150 150 150 150 
##$DP07= 0
##$DPNAME0= <>
##$DPNAME1= <>
##$DPNAME2= <>
##$DPNAME3= <>
##$DPNAME4= <>
##$DPNAME5= <>
##$DPNAME6= <>
##$DPNAME7= <>
##$DPOAL= (0..7)
0.5 0.5 0.5 0.5 0.5 0.5 0.5 0.5 
##$DPOFFS= (0..7)
0 0 0 0 0 0 0 0 
##$DQDMODE= 0
##$DR= 18
##$DS= 0
##$DSLIST= <SSSSSSSSSSSSSSS>
$$ [...]
##$SUBNAM0= <"">
##$SUBNAM1= <"">
##$SUBNAM2= <"">
##$SUBNAM3= <"">
##$SUBNAM4= <"">
##$SUBNAM5= <"">
##$SUBNAM6= <"">
##$SUBNAM7= <"">
##$SUBNAM8= <"">
##$SUBNAM9= <"">
##$SW= 18.0517328524113
##$SWIBOX= (0..15)
0 0 2 0 0 0 0 0 0 0 0 0 0 0 0 0 
##$SW_h= 3612.71676300578
##$TD= 16384
##$TD0= 1
##$TE= 0
##$TE2= 300
##$TE3= 300
##$TEG= 300
##$TL= (0..7)
0 120 120 120 120 120 120 120 
##$TP= (0..7)
150 150 150 150 150 150 150 150 
##$TP07= 0
##$TPNAME0= <>
##$TPNAME1= <>
##$TPNAME2= <>
##$TPNAME3= <>
##$TPNAME4= <>
##$TPNAME5= <>
##$TPNAME6= <>
##$TPNAME7= <>
##$TPOAL= (0..7)
0.5 0.5 0.5 0.5 0.5 0.5 0.5 0.5 
##$TPOFFS= (0..7)
0 0 0 0 0 0 0 0 
##$TUNHIN= 0
##$TUNHOUT= 0
##$TUNXOUT= 0
##$USERA1= <user>
##$USERA2= <user>
##$USERA3= <user>
##$USERA4= <user>
##$USERA5= <user>
##$V9= 5
##$VALIST= <valist>
##$VCLIST= <CCCCCCCCCCCCCCC>
##$VD= 0
##$VDLIST= <DDDDDDDDDDDDDDD>
##$VPLIST= <PPPPPPPPPPPPPPP>
##$VTLIST= <TTTTTTTTTTTTTTT>
##$WBST= 1024
##$WBSW= 4
##$XGAIN= (0..3)
0 0 0 0 
##$XL= 0
##$YL= 0
##$YMAX_a= 372951
##$YMIN_a= -445601
##$ZGOPTNS= <>
##$ZL1= 120
##$ZL2= 120
##$ZL3= 120
##$ZL4= 120
##$ABSF1= 10
##$ABSF2= 0
##$ABSG= 5
##$ABSL= 3
##$ALPHA= 0
##$AQORDER= 0
##$ASSFAC= 0
##$ASSFACI= 0
##$ASSFACX= 0
##$ASSWID= 0
##$AUNMP= <proc_1d>
##$AZFE= 0.1
##$AZFW= 0.1
##$BCFW= 1
##$BC_mod= 2
##$BYTORDP= 1
##$COROFFS= 0
##$CY= -3
##$DATMOD= 1
##$DC= 2
##$DFILT= <>
##$DTYPP= 0
##$F1P= 0
##$F2P= 0
##$FCOR= 0.5
##$FTSIZE= 0
##$FT_mod= 4
##$GAMMA= 1
##$GB= 0.15
##$INTBC= 1
##$INTSCL= 1
##$ISEN= 128
##$LB= 0.25
##$LEV0= 0
##$LPBIN= 0
##$MAXI= 10000
##$MC2= 0
##$MEAN= 0
##$ME_mod= 0
##$MI= 1.114404
##$NCOEF= 0
##$NC_proc= 0
##$NLEV= 6
##$NOISF1= 3.799351
##$NOISF2= 2.8
##$NSP= 1
##$NTH_PI= 0
##$NZP= 0
##$OFFSET= 14.38212
##$PC= 1
##$PHC0= -3698.646
##$PHC1= 0.1923003
##$PH_mod= 1
##$PKNL= yes
##$PPARMOD= 0
##$PSCAL= 0
##$PSIGN= 0
##$REVERSE= no
##$SF= 200.129724274929
##$SI= 16384
##$SIGF1= 3
##$SIGF2= 2
##$SINO= 400
##$SIOLD= 16384
##$SREGLST= <1H.CDCl3>
##$SSB= 0
##$STSI= 0
##$STSR= 0
##$SW_p= 3205.1282051282
##$SYMM= 0
##$S_DEV= 0
##$TDeff= 0
##$TDoff= 0
##$TI= <>
##$TILT= no
##$TM1= 0
##$TM2= 0
##$TOPLEV= 0
##$USERP1= <user>
##$USERP2= <user>
##$USERP3= <user>
##$USERP4= <user>
##$USERP5= <user>
##$WDW= 1
##$XDIM= 8192
##$YMAX_p= 0
##$YMIN_p= 0
$$ End of Bruker specific parameters
$$ ---------------------------------
##NTUPLES= NMR FID
##VAR_NAME=  TIME,          FID/REAL,        FID/IMAG
##SYMBOL=    X,             R,               I
##VAR_TYPE=  INDEPENDENT,   DEPENDENT,       DEPENDENT
##VAR_FORM=  AFFN,          ASDF,            ASDF
##VAR_DIM=   8192,          8192,            8192
##UNITS=     SECONDS,       ARBITRARY UNITS, ARBITRARY UNITS
##FACTOR=    0.0002768,     1,               1
##FIRST=     0,             0,               0
##LAST=      2.2672688,     0,               0
##MIN=       0,             -445601,         0
##MAX=       2.2672688,     372951,          0
$$ Real data points
##PAGE= N=1
##DATA TABLE= (X++(R..R)), XYDATA
$$ plain form
0 0 0 0 0 0 0 0 0 0 0 0 0 0 0 0 0 0 0 -8 7 -8 8 -8 8 -11 14 -16 16 -19 22 -25 28 -33 36 -41 44 -51 56 -63 71 -77
40 -77 86 -97 106 -116 127 -142 156 -171 187 -208 228 -250 278 -309 341 -380 426 -479 542 -619
60 -619 718 -843 1008 -1241 1589 -2148 3167 -5411 12417 -79319 -445601 -271555 206299 345934
74 345934 58382 -181684 -101665 32883 -22268 -70347 84110 230299 59930 -271343 -287553
85 -287553 81095 347082 176973 -178149 -272786 -60126 132920 129014 51167 -1942 -66761
96 -66761 -131612 -78389 106872 205513 59541 -151699 -170136 -7594 115528 90081 21106
107 21106 -14225 -71649 -123877 -42773 143169 194753 -14605 -234718 -149483 126874 209046
118 209046 13597 -147247 -56338 84822 25929 -94467 -18699 152129 104527 -150503 -223988
$$ packed form
0@%%%%%%%%%%%%%%%%%qJ5j5J6j6J6j9K5l0L2l5M1m7N3o1O9p7Q5r5J07j19J34j48
40g7J63j83K03k22K43k69K98l27L58l95M36m78N28n87O50p21Q06r05J021j161
60f19J337j561J851k249K830l737N315q578J7828r1736l66282J74046M77854J39635
74C45934k87552k40066Q0019J34548n5151m8079J54457J46189j70369l31273j6210
85b87553L68648K65987j70109l55122r4637K12660J93046l906p7847n3109o4819
96f6761o4851N3223J85261R8641j45972k11240j8437J62542J23122k5447o8975
107B1106l5331n7424n2228Q1104J85942N1584k09358k20113Q5235K76357Q2172
118B09046j95449j60844R0909J41160n8893j20396P5768J70828m7602k55030p3485
$$ plain form
129 -223988 41946 265660 105504 -203501 -208765 81268 216727 13723 -175153 -61874
139 -61874 138046 92016 -114095 -124109 87077 165605 -22342 -176577 -53788 151808 115083
150 115083 -98437 -146282 30400 142635 28124 -120368 -74818 70820 82645 -23162
160 -23162 -59196 5882 35008 -20845 -36979 42386 75743 -17284 -99260 -37912 79977 77643
172 77643 -28545 -63192 -1984 16693 -31209 -21148 76469 92150 -63827 -176688 -41297
183 -41297 178015 165321 -73914 -200982 -43788 140370 91932 -59333 -58175 56177 40500
194 40500 -106896 -106180 104770 208406 5957 -241559 -170136 135927 244305 26036 -181127
205 -181127 -116353 63431 85620 -15435 -13959 72605 32614 -121317 -138002 65438 219567
$$ packed form
129b23988K65934K23714j60156l09005n264K90033J35459k03004j88876J13279
139f1874J99920m6030k06111j0014K11186P8528j87947j54235J22789K05596l6725
150A15083k13520m7845J76682J12235j14511j48492M5550J45638J1825j05807
160b3162l6034O5078K9126n5853j6134P9365L3357r3027q1976O1348J17889k334
172G7643j06188l4647O1208J8677m7902J0061R7617J5681j55977j12861J35391
183d1297K19312j2694k39235j27068J57194J84158m8438j51265J158J14352j5677
194D0500j47396P16K10950J03636k02449k47516P1423L06063J08378k18269k07163
205a81127O4774J79784K2189j01055J476Q6564l9991j53931j6685K03440J54129
$$ plain form
216 219567 81823 -168971 -190821 16577 160022 86990 -45759 -62857 -25542 -36800 -27511
227 -27511 67284 131331 26582 -149411 -147894 49304 176690 81964 -80807 -108188 -20898
238 -20898 26018 18928 48525 72242 -14602 -141550 -113052 86743 196728 46948 -159105
249 -159105 -144850 42572 132171 35299 -53713 -10620 27301 -42760 -84161 31594 161497
260 161497 73605 -151829 -187511 35301 205768 92518 -127534 -143504 24746 99600 9937
271 9937 -48757 19074 61485 -36589 -118151 -9212 149195 106790 -93331 -165876 -8665
282 -8665 143129 81653 -65486 -82340 7126 34831 -18742 -16955 58110 51468 -65687 -112784
294 -112784 8672 135483 74470 -89038 -113620 17138 95320 29116 -47687 -16037 33936
$$ packed form
216B19567j37744k50794k1850K07398J43445p3032j32749j7098L7315j1258R289
227b7511R4795O4047j04749j75993J517J97198J27386r4726j62771k7381Q7290
238b0898M6916p090K9597K3717q6844j26948K8498J99795J09985j49780k06053
249a59105J4255J87422Q9599r6872q9012M3093L7921p0061m1401J15755J29903
260A61497q7892k25434l5682K22812J70467j13250k20052j5970J68250P4854q9663
271I937n8694O7831M2411r8074q1562J08939J58407m2405k00121p2545J57211
282h665J51794o1476j47139j6854Q9466K7705n3573J787P5065o642j17155m7097
294a12784J21456J26811o1013j63508k4582J30758P8182o6204p6803L1650M9973
$$ plain form
305 33936 -12663 -66545 451 101484 59850 -94039 -131696 22089 143649 58900 -94474
316 -94474 -96837 29182 78034 -1103 -41179 22547 49019 -36397 -94342 4220 131011 73418
328 73418 -103236 -138908 16932 136264 56876 -82352 -74707 26327 40527 -24664 -22304
339 -22304 58096 58796 -63841 -118150 10199 143649 81720 -92110 -130490 9459 107607
350 107607 40838 -50065 -31876 23734 -3528 -58946 -6304 96197 65764 -80880 -131341
361 -131341 2866 137086 79159 -73783 -98179 6962 64405 12784 -26438 20455 41181
372 41181 -40273 -93254 -1815 119005 80320 -83129 -135487 -1955 115423 61918 -55217
383 -55217 -62781 16377 29219 -27301 -17167 61639 61505 -52518 -115648 -8321 125884 84645
$$ packed form
305C3936m6599n3882O6996J01033m1634j53889l7657J53785J21560q4749j53374
316i4474k363J26019M8852p9137m0076O3726K6472q5416n7945R8562J26791n7593
328G3418j76654l5672J55840J19332p9388j39228P645J01034J4200o5191K360
339b2304Q0400P00j22637n4309J28349J33450o1929j73830l8380J39949R8148
350A07607o6769r0903J8189N5610k7262n5418N2642J02501l0433j46644n0461
361a31341J34207J34220n7927j52942k4396J05141N7443n1621l9222M6893K0726
372D1181q1454n2981R1439J20820l8685j63449n2358J33532J17378n3505j17135
383e5217p564P9158J2842n6520J0134P8806j34j14023o3130J07327J34205m1239
$$ plain form
395 84645 -70440 -116824 -7104 84086 38548 -37688 -20579 23054 -9013 -56764 -7986 88165
407 88165 68977 -66128 -118338 -1957 116339 71755 -59286 -83871 7261 51130 1085
418 1085 -24795 24362 43230 -37259 -96074 -8631 114807 82183 -72360 -129880 -8202 111177
430 111177 64917 -50034 -60038 13079 30382 -22087 -21458 53938 61562 -45931 -111814 -18941
442 -18941 113209 89901 -57470 -114978 -18393 73370 44802 -23498 -18069 18772 -11177 -56256
454 -56256 -6607 87251 73759 -55843 -120997 -17240 106833 79059 -42302 -82717 -11402
465 -11402 39287 5807 -14966 27067 38717 -35501 -90925 -16258 104774 89121 -50881 -116276
477 -116276 -24343 84298 64986 -25491 -42106 5289 7035 -31805 -13511 60795 64015 -45829
$$ packed form
395H4645j55085m6384J09720R1190m5538p6236J7109M3633l2067m7751M8778R6151
407H8165j9188j35105n2210J16381J18296m4584j31041k4585R1132M3869n0045
418A085k5880M9157J8868q0489n8815Q7443J23438l2624j54543n7520J21678J19379
430A11177m6260j14951j0004P3117J7303n2469O29P5396P624j07493o5883R2873
442a8941J32150k3308j47371n7508R6585R1763k8568o8300N429L6841k9949m5079
454e6256M9649R3858j3492j29602o5154J03757J24073k7774j21361m0415P1315
465a1402N0689l3480k0773M2033J1650p4218n5424P4667J21032j5653j40002o5395
477a16276R1933J08641j9312r0477j6615M7395J746l8840J8294P4306L220j09844
$$ plain form
489 -45829 -114521 -24588 102918 89337 -40926 -101067 -20383 59792 33582 -18248 -3272 28200
501 28200 -8843 -65866 -22246 82504 82739 -40365 -115960 -34442 87839 78878 -29254 -70023
513 -70023 -13438 28472 2098 -14490 29000 46397 -27162 -87322 -23140 90412 89222 -35221
525 -35221 -105880 -29179 69186 56396 -19270 -36482 5009 6035 -35381 -18338 56874 65471
537 65471 -33463 -107254 -34257 92286 91552 -26226 -90354 -28799 48591 35808 -11871 -1376
549 -1376 24366 -11856 -62631 -25689 72000 83158 -29036 -109134 -44062 69865 79736 -8369
561 -8369 -58063 -20706 13189 -1184 -2017 38022 45629 -27464 -88423 -28800 81862 87314 -20712
574 -20712 -92866 -39300 45900 44926 -5959 -13184 9062 -9719 -50179 -20830 68035 80127 -25953
$$ packed form
489d5829o8692Q9933J27506j3581j30263o0141Q0684Q0175k6210n1830J4976L1472
501B8200l7043n7023M3620J04750K35j23104p5595Q1518J22281q961j08132m0769
513g0023N6585M1910k6374j6588M3490J7397p3559o0160O4182J13552j190j24443
525c5221p0659P6701R8365j2790p5666j7212M1491J026m1416J7043P5212Q597
537F5471r8934p3791P2997J26543p34j17778o4128O1555P7390j2783m7679J0495
549a376K5742l6222n0775L6942R7689J1158j12194q0098O5072J13927R871q8105
561h369m9694L7357L3895j4373q33M0039P607p3093o0959N9623J10662N452j08026
574b0712p2154N3566Q5200r74n0885p225K2246j8781m0460K9349Q8865J2092j06080
$$ plain form
587 -25953 -107977 -46149 77839 92402 -10837 -73960 -26663 30907 16366 -16159 9249 42510
599 42510 -4272 -75482 -47497 59964 94662 -2344 -97017 -56239 49570 70468 1922 -40414
611 -40414 -10224 15538 -11676 -21812 27036 56534 678 -73394 -50964 46274 77612 2272
623 2272 -64765 -38209 25549 32302 -5852 -9192 15861 2880 -35600 -25524 37947 61256 -5417
636 -5417 -68817 -32582 46076 53649 -11168 -45784 -7109 25121 -1419 -23250 9025 38731
648 38731 -975 -59776 -32782 55315 69223 -18501 -80493 -25853 62852 54473 -25901 -48810
660 -48810 4654 33735 -5093 -32866 10828 50002 648 -68549 -42141 53227 78977 -8952
672 -8952 -83697 -40392 47181 57876 -2168 -35030 -8275 9762 -10907 -10753 30888 45359 -11338
$$ packed form
587b5953q2024O1828J23988J4563j03239o3123M7297N7570j4541l2525K5408L3261
599D2510m6782p1210K7985J07461L4698r7006r4673M0778J05809K0898o8546m2336
611d0414L0190K5762k7214j0136M8848K9498n5856p4072K2430R7238L1338p5340
623B272o7037K6556O3758O753l8154l340K5053j2981l8480J0076O3471K3309o6673
636e417o3400L6235P8658P573o4817l4616L8675L2230k6540k1831L2275K9706
648C8731l9706n8801K6994Q8097J3908q7724o1992N4640Q8705q379q0374k2909
660d8810N3464K9081l8828k7773M3694L9174m9354o9197K6408R5368K5750q7929
672h952p4745M3305Q7573J0695o0044l2862K6755J8037k0669J54M1641J4471n6697
$$ plain form
685 -11338 -70211 -38099 49841 70661 1524 -59207 -41524 12228 28229 13491 11797 8048
697 8048 -25877 -50595 -10163 63847 67868 -18413 -82216 -40195 43391 61054 8144 -29345
709 -29345 -17867 -10072 -20687 -1761 48430 53244 -25079 -93103 -43654 67925 92872 2688
721 2688 -77731 -50397 25239 41933 9480 199 12505 -8373 -51901 -35604 49347 86414
733 86414 7810 -89445 -75698 29719 85971 31254 -40955 -43848 -6374 8619 5381 22416
745 22416 38687 -262 -60492 -51050 30464 81426 31048 -54260 -63918 -2602 40316 28246
757 28246 1111 -7499 -15655 -32326 -18063 34926 57773 6949 -59377 -51958 22043 60769 21857
770 21857 -27102 -27031 -1728 2283 -4160 15983 34544 405 -53157 -44204 29028 69553 14706
$$ packed form
685a1338n8873L2112Q7940K0820o9137o0731J7683N3752J6001j4738j694l749
697H048l3925k4718M0432P4010M021q6281o3803M2021Q3586J7663n2910l7489
709b9345J1478P795j0615J8926N0191M814p8323o8024M9449J11579K4947r0184
721B688q0419K7334P5636J6694l2453r281J2306k0878m3528J6297Q4951L7067
733H6414p8604r7255J3747J05417N6252n4717p2209k893L7474J4993l238J7035
745B2416J6271l8949o0230R442Q1514N0962n0378q5308r658O1316M2918j2070
757B8246k7135q610q156j6671J4263N2989K2847n0824o6326P419P4001L8726l8912
770B1857m8959P1K5303M011o443K0143J8561l4139n3562Q953P3232M0525n4847
$$ plain form
783 14706 -58185 -47863 20514 47285 7841 -25108 -5554 16048 -6007 -25180 5625 44676
795 44676 21740 -43419 -52633 14689 60479 20944 -43783 -43102 12076 35146 3691 -18462 -1332
808 -1332 12083 -7838 -22660 7385 40412 15310 -37337 -39222 15352 49215 14469 -34124
820 -34124 -28748 8082 18527 1146 -4575 7871 1395 -25406 -21540 21771 44013 5915 -44641
833 -44641 -34887 21646 43918 10250 -23314 -17170 2637 981 -4286 15007 27254 -4896 -46927
846 -46927 -32946 30667 58971 7521 -51707 -40804 15692 39668 12146 -12392 -4574 -377
858 -377 -16831 -15019 23067 47719 8017 -54142 -49606 20137 61520 24364 -36513 -42932 -3043
871 -3043 19333 11918 8049 11187 -4421 -34480 -28980 24864 58154 18981 -44409 -51211 4100
$$ packed form
783A4706p2891J0322O8377K6771l9444l2949J9554K1602k2055j9173L0805L9051
795D4676k2936o5159r214O7322M5790l9535o4727O81N5178K3070l1455k2153J7130
808a332J3415j9921j4822L0045L3027k5102n2647j885N4574L3863l4746m8593
820c4124N376L6830J0445j7381n721J2446o476k6801L866M3311K2242l8098n0556
833d4641R754N6533K2272l3668l3564O144J9807j656n267J9293J2247l2150m2031
846d6927J3981O3613K8304n1450n9228J0903N6496K3976k7522k4538P818M197
858c77j6454J812L8086K4652l9702o2159M536O9743M1383l7156o0877o419L9889
871c043K2376p415l869L138j5608l0059N500N3844L3290l9173o3390o802N5311
$$ plain form
884 4100 46046 27603 -10710 -21551 -13340 -9159 -2684 20026 34250 2508 -45915 -42559 15356
897 15356 55934 27988 -29441 -41628 -6282 21295 19215 8452 4813 -6718 -28685 -23035 21212
910 21212 48419 15036 -42503 -49734 4255 45510 25806 -15492 -26421 -8853 2414 1876 13040
923 13040 25822 4885 -33999 -35974 12259 51980 26111 -31797 -44357 -4750 29460 21145
935 21145 -4448 -10446 -6691 -13369 -11840 13962 34416 12560 -33855 -41162 6606 45874 27800
948 27800 -18673 -33806 -7560 15220 12038 5495 6000 -3247 -22549 -23119 10949 40047 17375
961 17375 -31176 -41772 -1503 36200 26097 -8658 -20495 -8923 11 2970 12496 21654 4674
974 4674 -29980 -32465 8660 42442 23392 -25268 -40141 -7468 23609 19802 803 -7350 -7560
$$ packed form
884D100M1946j8443l8313j0841Q211M181O475K2710J4224l1742m8423L356N7915
897A5356M0578k7946n7429j2187L5346K7577k080j0763l639j1531k1967N650M4247
910B1212K7207l3383n7539p231N3989M1255j9704m1298j0929J7568J1267n38J1164
923A3040J2782k0937l8884j975M8233L9721k5869n7908j2560L9607L4210q315
935B1145k5593n998L755o678J529K5802K0454k1856m6415p307M7768L9268j8074
948B7800m6473j5133K6246K2780l182o543N05r247j9302n70L4068K9098k2672
961A7375m8551j0596M0269L7703j0103l4755j1837J1572Q934K959R526R158j6980
974D674l4654k485M1125L3782j9050m8660j4873L2673L1077l807j8999q153k10
$$ plain form
987 -7560 -12910 -10642 14163 33531 13030 -28754 -38460 1127 39608 27777 -12447 -29787 -13377
1000 -13377 7039 10991 9273 9210 -3510 -25012 -23344 10233 38838 21174 -24658 -38881 -5748
1013 -5748 28914 26590 -669 -15543 -10656 -6312 -2000 12408 22917 6926 -26433 -34562 1247
1026 1247 36720 25613 -14772 -33802 -12634 15306 17945 7006 622 -5761 -14992 -13268 10136
1039 10136 31898 16690 -23339 -35976 -5276 29529 25654 -7104 -23672 -12663 1748 6815
1051 6815 9061 10760 1664 -19134 -22792 5339 32312 22266 -14741 -32631 -9817 20796 22420
1064 22420 3113 -11373 -12476 -8130 -2620 10159 19833 5433 -22037 -27500 248 29738 22967
1077 22967 -9840 -25754 -11110 10129 15914 8810 2107 -5670 -16217 -13036 9801 27366 13406
$$ packed form
987g560n350K268K4805J9368k0501m1784r706L9587L8481j1831m0224j7340J6410
1000a3377K0416L952j718o3j2720k1502J668L3577K8605j7664m5832j4223L3133
1013e748L4662k324k7259j4874M887M344M312J4408J0509j5991l3359q129L5809
1026A247L5473j1107m0385j9030K1168K7940K639j0939o384o383r231J724K3404
1039A0136K1762j5208m0029j2637L0700L4805l875l2758j6568J1009J4411N067
1051F815K246J699r096k0798l658K8131K6973j0046l7007j7890K2814L0613J624
1064B2420j9307j4486j103M346N510J2779R674j4400k7470n463K7748K9490o771
1077B2967l2807j5914J4644K1239N785p104o703p777j0547L181K2837J7565j3960
$$ plain form
1090 13406 -20955 -32831 -5476 24938 22889 -2920 -19664 -13353 -251 6668 12417 13600 432
1103 432 -19761 -21742 5246 31760 21269 -14494 -31276 -12729 16346 21751 5041 -9304 -13040
1116 -13040 -11676 -3749 11352 21559 8943 -19599 -28714 -3069 27344 27371 -2315 -24897 -17126
1129 -17126 4011 16029 14047 4047 -8797 -19108 -14783 8115 26091 14914 -15282 -29870
1141 -29870 -11284 18143 24136 6663 -11765 -16302 -8647 4422 16317 18582 1667 -21716 -23613
1154 -23613 1596 26729 21526 -8472 -26433 -15525 6515 17170 11327 -331 -10191 -16094 -8978
1167 -8978 11573 25385 12815 -15906 -28320 -6867 22144 24709 2150 -18435 -17580 -2564 8717
1180 8717 12433 8922 -3745 -17788 -17378 2318 23600 19281 -7928 -25003 -14150 11071 22684
$$ packed form
1090A3406l4361j1876K7355L0414k049k5809j6744O311J3102O919N749J183j3168
1103D32k0193j981K6988K6514j0491l5763j6782J8547K9075N405j6710j4345l736
1116a3040J364P927J5101J0207j2616k8542r115K5645L0413K7k9686k2582P771
1129a7126K1137J2018j982j0000j2844j0311M325K2898J7976j1177l0196j4588
1141b9870J8586K9427N993j7473j8428m537P655J3069J1895K265j6915k3383j897
1154b3613K5209K5133n203k9998j7961J0908K2040J0655n843j1658r860n903P116
1167h978K0551J3812j2570k8721j2414K1453K9011K565k2559k0585Q55J5016J1281
1180H717L716l511j2667j4043M10J9696K1282m319k7209j7075J0853K5221J1613
$$ plain form
1193 22684 11288 -6308 -14584 -11860 379 13739 16707 3574 -17188 -22371 -3046 19176 19359
1206 19359 -1165 -19273 -15836 714 13363 14311 4997 -8501 -16026 -9051 9681 22669 11382
1219 11382 -12743 -23030 -8789 13869 19433 4734 -11464 -15897 -8386 4294 13657 12756 -1194
1232 -1194 -17435 -17039 3338 22062 17839 -5241 -21013 -12409 7359 17069 11083 -2731 -12563
1245 -12563 -13027 -4131 10536 16959 5349 -14629 -21127 -5375 16364 19600 2767 -14230 -15829
1258 -15829 -2521 11717 15558 7697 -7106 -17234 -10417 7859 19799 11123 -10473 -20871 -10087
1271 -10087 8584 16639 8089 -6629 -14138 -10943 1582 14641 15364 1126 -15628 -16790 1317
1284 1317 19223 16856 -2059 -17353 -14631 1415 13237 12448 1530 -11842 -15926 -6131 10152
$$ packed form
1193B2684j1396j7596q276K724J2239J3360K968j3133k0762n183J9325K2222J83
1206A9359k0524j8108L437J6550J2649R48r314j3498p525O975J8732J2988j1287
1219A1382k4125j0287J4241K2658N564j4699j6198m433P511J2680R363r01j3950
1232a194j6241L96K0377J8724m223k3080j5772Q604J9768R710n986j3814r832
1245a2563m64Q896J4667O423j1610j9978o498J5752K1739L236j6833j6997j599
1258a5829J3308J4238L841p861j4803j0128O817J8276J1940q676k1596j0398J0784
1271a0087J8671Q055q550j4718p509L195J2525J3059P23j4238j6754j162J8107
1284A317J7906k367j8915j5294K722J6046J1822p89j0918j3372m084R795J6283
$$ plain form
1297 10152 17796 6845 -12244 -18164 -5371 12709 17793 6044 -9009 -14384 -7353 6923 15633
1310 15633 10679 -5327 -18120 -13358 5994 18066 10362 -7609 -17477 -9826 5051 13419 10608
1323 10608 -487 -11346 -12829 -1947 13739 17827 3044 -15616 -17129 -544 16045 14708 -1535
1336 -1535 -13699 -12945 -2394 8719 11812 5372 -7036 -15483 -8672 8474 18225 9871 -8874 -17135
1350 -17135 -6582 9661 15780 7302 -6547 -13898 -9230 3292 13640 10749 -4290 -16165 -12424
1363 -12424 3436 15009 10514 -3379 -12267 -9900 975 11589 13145 3685 -10813 -15619 -3286
1376 -3286 14103 16741 1113 -16082 -15416 347 12212 10157 -118 -8370 -9773 -5584 3818 13324
1390 13324 11229 -4133 -17234 -11493 9282 20972 9371 -11008 -17533 -5279 9419 12146 4296
$$ packed form
1297A0152P644j0951j9089n920J2793J8080N084j1749j5053n375P031J4276Q710
1310A5633m954j6006j2793M762J9352J2072p704j7971r868P651J4877Q368k811
1323A0608j1095j0859j483J0882J5686M088j4783j8660j513J6585J6589j337j6243
1336a535j2164P54J0551J1113L093o440j2408q447O811J7146R751q354j8745q261
1350a7135J0553J6243O119q478j3849p351M668J2522J0348k891j5039j1875L741
1363a2424J5860J1573m495j3893q888K367J0875J0614J556r460j4498m806J2333
1376c286J7389K638j5628j7195O66J5763J1865k055j0275q252j403M189R402R506
1390A3324k095j5362j3101N741K0775J1690j1601k0379o525J2254J4698K727p850
$$ plain form
1403 4296 -4916 -10850 -9586 -363 11111 13010 456 -14899 -14379 1635 16188 14277 -1488 -13320
1417 -13320 -11511 61 11953 13657 3054 -11131 -16249 -4743 12013 15678 2250 -13102 -14695
1430 -14695 -3012 9066 11401 5677 -4289 -12111 -10143 3214 17412 15133 -4955 -20292 -12668
1443 -12668 9082 19639 8019 -10002 -14546 -6171 3220 7989 8067 3082 -7749 -15716 -6956 12918
1457 12918 20646 5154 -16573 -18752 833 17558 14274 -1343 -11402 -9755 -2605 4614 10304
1470 10304 8145 -4049 -15778 -12317 5075 17920 10469 -7835 -16073 -7890 6786 13647 8733
1483 8733 -1924 -10739 -11082 181 13386 13832 -809 -15405 -13230 2297 12353 8336 -2278
1496 -2278 -8763 -7940 -3560 4113 11646 8777 -5291 -16353 -9007 11436 19570 4791 -13715 -14170
$$ packed form
1403D296r212n934J264R223J1474J899j2554j5355N20J6014J4553j911j5765j1832
1417a3320J809J1572J1892J704j0603j4185n118J1506J6756L665j3428j5352j593
1430a4695J1683J2078K335n724r966p822J968J3357J4198k279k0088j5337P624
1443a2668K1750J0557j1620j8021m544Q375R391M769P8m985j0831p967Q760J9874
1457A2918P728j5492k1727k179J9585J6725l284j5617j0059J647P150P219N690
1470A0304k159j2194j1729L461J7392J2845p451j8304q238Q183J4676O861m914
1483H733j0657q815l43J1263J3205M46j4641j4596K175J5527J0056m017j0614
1496b278o485Q23M380P673P533k869j4068j1062P346K0443Q134j4779j8506m55
$$ plain form
1510 -14170 812 10761 7036 -800 -3627 -4889 -6762 -3177 7489 12886 1480 -15038 -14175 4606
1524 4606 18069 10052 -8318 -13411 -2951 7194 7635 3291 -345 -4306 -8090 -4964 6513 12257
1538 12257 2966 -12101 -14025 150 12396 9265 -2316 -8693 -6115 -190 5504 8570 5978 -4187
1552 -4187 -12242 -6375 8577 14820 3489 -11608 -12206 -482 7958 6286 542 -2983 -6112 -7447
1566 -7447 -1279 10490 13387 -614 -16011 -12222 7759 18376 7375 -9590 -12174 -1980 5313
1579 5313 4991 3452 2183 -3901 -11564 -8168 8147 17101 4748 -15047 -16814 1243 16378 11477
1593 11477 -3335 -9340 -5429 -353 3709 7515 7985 -1429 -13609 -11963 5082 16838 8559 -9953
1607 -9953 -15954 -4469 8053 9336 3657 -2065 -6162 -8097 -2523 9921 14870 2843 -14097 -14482
$$ packed form
1510a4170J4982R949l725p836k827j262j873L585J0666N397j1406j6518Q63J8781
1524D606J3463q017j8370n093J0460J0145M41m344l636l961l784L126J1477N744
1538A2257r291j5067j924J4175J2246l131j1581o377K578N925N694L066k592j0165
1552d187q055N867J4952O243j1331j5097n98J1724Q440j672n744l525l129j335
1566g447O168J1769K897j4001j5397L789J9981J0617j1001j6965k584J0194P293
1579E313l22j539j269o084p663L396J6315Q954j2353j9795j767J8057J5135m901
1593A1477j4812o005L911N076M062L806M70r414j2180J646J7045J1756q279j8512
1607i953o001J1485J2522J283n679n722m097j935N574J2444M949j2027j6940l85
$$ plain form
1621 -14482 2614 15600 9504 -5199 -11002 -5775 525 3296 5936 5823 -2443 -13063 -10342 6865
1635 6865 18114 7701 -11752 -15503 -630 12459 9521 -517 -5019 -4348 -4312 -2169 5856 11167
1649 11167 2026 -13562 -14932 2241 16672 9709 -7850 -13707 -3604 6798 6845 3067 1242 -2010
1663 -2010 -7441 -6285 5692 14738 6018 -12054 -15858 -819 13466 9401 -4102 -9870 -4734 536
1677 536 1836 4569 6677 768 -10206 -10608 4178 16685 9257 -9209 -14889 -2219 10121 8466
1691 8466 -392 -4458 -4181 -4773 -3405 4663 11205 3853 -11735 -14547 1133 15817 11181 -5583
1705 -5583 -12264 -3963 5179 6288 3558 2305 -1418 -8610 -8446 4010 14541 7186 -10840 -16387
1719 -16387 -2301 12318 10205 -1918 -7387 -4131 -663 548 4977 9592 3245 -10377 -13294 1803
$$ packed form
1621a4482J7096J2986o096j4703n803N227O300K771K640j13q266j0620K721J7207
1635F865J1249j0413j9453l751J4873J3089k938j0038m502O71L6K143Q025N311
1649A1167r141j5588j370J7173J4431o963j7559n857J0103J0402M7l778j825l252
1663b010n431J156J1977R046q720j8072l804J5039J4285m065j3503n768N136N270
1677E36J300K733K108n909j0974m02J4786J2507p428j8466n680J2670J2340j655
1691H466q858m066K77n92J368Q068O542p352j5588k812J5680J4684m636j6764
1705e583o681Q301R142J109k730j253l723p192J64J2456J0531p355j8026n547
1719a6387J4086J4619k113j2123n469L256L468J211M429M615o347j3622k917J5097
$$ plain form
1733 1803 16338 10755 -8090 -15276 -4375 7722 7108 259 -2056 -2130 -5391 -6061 2624 12659 8164
1748 8164 -8733 -15597 -1904 14300 12249 -2843 -10920 -4708 3027 3502 2031 3299 772 -7154
1762 -7154 -10511 115 12778 9480 -6474 -14561 -4223 9605 9763 -16 -4810 -2523 -1008 -1342
1776 -1342 2641 8192 4707 -7711 -12576 -1223 12338 9321 -5506 -12214 -3829 5579 4946 349
1790 349 -182 465 -3901 -6313 1705 11834 7901 -7497 -13754 -1589 12327 9612 -4249 -9827
1804 -9827 -3145 3317 1795 -281 2798 2405 -5451 -9914 -246 12619 10177 -5952 -13912 -3461
1818 -3461 10577 10080 -1021 -6328 -2965 -121 -709 1409 6552 3903 -7265 -12469 -1894 12324
1832 12324 10458 -4531 -12544 -5034 6241 7245 1967 -423 -994 -4339 -5524 1978 11598 7749
$$ packed form
1733A803J4535n583j8845p186J0901J2097o14o849k315p4l261o70Q685J0035m495
1748H164j6897o864J3693J6204k051j5092q077O212P735M75j471J268k527p926
1762g154l357J0626J2663l298j5954q087J0338J3828J58r779m794K287J515l34
1776a342L983N551l485j2418m865J1353J3561l017j4827o708Q385R408o33m597
1790C49n31O47m366k412Q018J0129l933j5398o257J2165J3916k715j3861n578
1804i827O682O462j522k076L079l93p856m463R668J2865k442j6129p960J0451
1818c461J4038m97j1101n307L363K844n88K118N143k649j1168n204J0575J4218
1832A2324j866j4989q013P510J1275J004n278k390n71l345j185P502R620l849
$$ plain form
1846 7749 -7739 -15102 -3759 11182 10777 -2291 -9569 -5176 1073 1977 2560 5286 3074 -6721 -11072
1861 -11072 -515 13908 12104 -4735 -14672 -5985 8038 9690 1015 -4529 -3425 -2986 -3818 843
1875 843 8757 7168 -6191 -14459 -4733 11885 13593 -738 -11429 -6488 3571 5946 2809 1797
1889 1797 685 -4715 -8684 -1515 10426 10408 -4122 -14747 -7119 7984 10792 1073 -6334 -4666
1903 -4666 -537 163 1945 6569 5683 -4383 -11570 -3730 10490 12013 -1673 -12237 -6993 4361
1917 4361 6990 1425 -2039 -1221 -2658 -5211 -851 8287 8970 -3006 -12665 -5752 9205 12118 707
1932 707 -8629 -5458 2206 3272 872 1549 2196 -3000 -8706 -3720 8216 10331 -1809 -12236 -6933
1947 -6933 6349 9843 1647 -4802 -3040 -29 -525 506 5450 5976 -3081 -10873 -5072 8290 10867
$$ packed form
1846G749j5488p363J1343J4941m05j3068p278M393O249R04N83K726k212r795m351
1861a1072J0557J4423j804j6839r937Q687J4023J652q675n544J104M39q32M661
1875H43P914j589j3359q268R726J6618J708j4331j0691M941J0059K375l137j012
1889A797j112n400l969P169J1941j8j4530j0625P628J5103K808r719p407J668
1903d666M129P00J782M624q86j0066p187P840J4220J523j3686j0564N244J1354
1917D361K629n565l464Q18j437k553M360R138O83j1976r659O913J4957K913j1411
1932G07r336L171P664J066k400O77O47n196n706M986J1936K115j2140j0427N303
1947f933J3282L494q196o449J762L011m96J031M944N26r057p792N801J3362K577
$$ plain form
1962 10867 -820 -10826 -6833 3723 6204 1262 -1384 -125 -1374 -4599 -1530 7478 9082 -1438
1976 -1438 -11436 -6585 7147 11041 1034 -7976 -5960 703 2583 827 1753 2490 -2567 -8061 -3575
1991 -3575 7667 10669 -273 -10521 -6629 5150 9109 2198 -3885 -2617 -839 -1566 -612 4644
2005 4644 6089 -2130 -10565 -6282 6860 10860 1023 -9077 -6462 2771 5832 2015 -111 629 -1036
2020 -1036 -4596 -2396 6047 8914 -636 -10513 -7340 4836 9596 1630 -6643 -5531 296 1812 750
2035 750 2082 3360 -1204 -6991 -3955 6430 10183 995 -9412 -7021 3707 7829 2246 -3345
2049 -3345 -2985 -1036 -1679 -1103 4089 5468 -1505 -9402 -5983 5980 10591 1791 -7667 -6022 2112
2064 2112 5493 2192 -16 314 -1670 -5174 -2578 5390 8324 -491 -10729 -7856 4468 9731 2687
$$ packed form
1962A0867j1687j0006L993J0556K481m942k646J259j249l225L069R008J604j0520
1976a438r998M851J3732L894j0007r010K016O663J880j756R26P37n057n494M486
1991c575J1242L002j0942j0248L892J1779L959o911o083J268J778p27R54N256
2005D644J445q219q435M283J3142M000r837j0100K615R233L061l817k126P40j665
2020a036l560K200Q443K867r550r877L173J2176M760p966q273J112N827J516j062
2035G50J332J278m564n787L036J0385L753r188j0407K391J0728M122n583n591
2049c345L60J949o43N76N192J379o973p897L419J1963M611q800r458J645Q134
2064B112L381l301k208L30j984l504K596P968K934q815j0238K873J2324N263p044
$$ plain form
2079 2687 -5875 -5457 11 2198 1632 3201 3682 -1128 -7452 -4770 5826 10743 2005 -9142 -8816
2094 -8816 1412 7586 3703 -2268 -3613 -2671 -2372 -417 4861 6779 -45 -8788 -6798 4377 10658
2109 10658 4197 -5545 -7009 -928 3208 3198 2290 1016 -2974 -7117 -3983 5507 9433 1186 -9163
2124 -9163 -8283 2392 8626 4322 -2512 -3769 -1211 -623 15 3880 5989 300 -8291 -7554 3196
2139 3196 10383 3966 -7150 -8650 -565 5368 3533 -324 -913 -1012 -2894 -2518 3208 7612 2931 -6462
2155 -6462 -7865 1054 8396 5170 -3292 -6272 -2016 1213 1566 1459 1777 -825 -4933 -4496 2534 7444
2171 7444 3283 -5007 -6516 152 5819 4138 -683 -2280 -1743 -1515 -464 2675 4300 53 -6511
2186 -6511 -5810 2291 7375 2943 -4886 -5638 352 4012 2107 7 497 74 -2546 -2916 2670 7000
$$ packed form
2079B687q562M18N468K187n66J569M81m810o324K682J0596M917q738j1147L26
2094h816J0228O174l883n971j345R42K99J955N278J918o824q743J990J1175O281
2109A0658o461r742j464O081M136j0r08j274l990m143L134R490L926q247j0349
2124i163Q80J0675O234m304o834j257K558N88O38L865K109n689q591P37J0750
2139C196P187o417j1116j500Q085N933j835l857n89r9j882L76N726M404m681r393
2155f462j403Q919P342l226q462k980M256L229L53j07L18k602m108M37P030M910
2171G444m161q290j509O668N667j681m821j597N37K28J051L139J625m247o564
2186f511P01Q101N084m432p829p52N990L660j905k100M90m23k620l70N586M330
$$ plain form
2202 7000 2142 -6421 -7354 1244 7863 3571 -4532 -5928 -806 2473 1717 384 1450 241 -3372
2217 -3372 -3643 2142 7321 3888 -4635 -7134 -525 5930 5027 -976 -3942 -2732 -753 751 2482
2232 2482 3127 -392 -5220 -4965 1730 7022 3806 -3124 -5704 -1736 3376 3735 1846 10 -2259 -3948
2248 -3948 -2021 3282 6111 1320 -6492 -7101 387 6560 4248 -2392 -4616 -1900 500 1686 2702
2263 2702 3269 184 -5116 -4997 2145 8079 4178 -4871 -7737 -1525 4928 4340 -304 -3121 -2563 -1526
2279 -1526 -726 2195 4657 1851 -4523 -6088 -2 7101 5868 -1480 -5880 -3191 1828 3718 1975
2294 1975 -158 -1900 -3918 -2731 1703 5128 2595 -3977 -6360 -1559 4704 5029 869 -2978 -2860
2309 -2860 -641 1479 3118 3230 -144 -4518 -4452 1073 5656 3259 -3231 -5784 -2089 2693 3359 978
$$ packed form
2202G000m858q563r33Q598O619m292q103j396N122L279p56j333J066j209l613
2217c372k71N785N179l433q523k499O609O455r03o003k966J210J979J504J731
2232B482O45l519m828K55O695N292l216o930k580L968N112L59j889j836k269j689
2248c948J927N303K829m791p812o09P488O173k312o640k224K716K400J186J016
2263B702N67l085n300J19P142N934l901r049k866O212O453n88m644k817N58J037
2279a526Q00K921K462k806o374j565O086P103j233p348m400K689N019J890j743
2294A975k133j742k018J187M434L425k533o572k383M801O263L25m160l847J18
2309b860K219K120J639J12l374m374O6N525M583k397o490k553L695M782O66k381
$$ plain form
2325 978 -795 -1734 -2384 -1012 2461 5154 2248 -3813 -5559 -209 5552 4830 -1196 -4867 -2935 677
2341 677 2275 1471 589 -1255 -3283 -3053 1381 5110 3089 -2606 -5309 -1596 4022 4704 991 -2602
2357 -2602 -2804 -966 764 2149 2615 -26 -4120 -4592 -128 4904 4127 -1699 -5198 -2856 2015 4068
2373 4068 2325 -508 -2120 -2231 -701 2651 4191 1868 -3163 -4944 -1345 3665 4161 56 -3813
2388 -3813 -3788 -516 2175 2840 1561 -1418 -3338 -2473 1485 5021 3288 -1929 -4340 -2010 2351 3852
2404 3852 1518 -1418 -3155 -2658 -220 2585 3079 235 -3777 -4256 312 4560 3889 -622 -3912 -2580
2420 -2580 1361 2928 2327 521 -1581 -2955 -1827 1243 3942 2261 -2722 -5275 -2218 3138 4453
2435 4453 814 -3052 -3461 -610 2264 2688 1576 -441 -2465 -2180 604 3441 2988 -596 -3977 -3193
$$ packed form
2325I78j773r39o50J372L473K693k906o061j746N350N761p22o026l671J932L612
2341F77J598q04q82j844k028K30M434L729k021n695k703L713N618O82l713l593
2357b602k02J838J730J385M66k641m094m72M464N032p77n826l499K342M871K053
2373D068j743k833j612j11J530L352J540k323n031j781L599N010M96m105l869
2388c813K5L272K691O65j279k979j920Q65L958L536j733n217k411K330M361J501
2404C852k334k936j737M97K438K805M94k844m012m79M568M248o71m511l290J332
2420b580L941J567o01j806k102j374J128L070K699j681m983k553L057N356J315
2435D453l639l866m09K851K874M24j112k017k024K85K784K837m53l584l381P84
$$ plain form
2451 -3193 707 3493 2712 -1217 -3780 -3116 256 3016 2922 -157 -2811 -2669 267 3100 3203 586
2467 586 -2051 -2795 -1249 1850 3219 1795 -1905 -4415 -2324 1950 3984 1673 -2796 -4230 -1027
2482 -1027 2579 3195 1227 -1335 -2055 -1251 472 2593 2846 480 -2849 -3649 -239 3463 3600 -757
2498 -757 -4203 -3451 710 3379 2222 -613 -2872 -2088 322 2267 2613 844 -1351 -2408 -1287 1427
2514 1427 3369 1846 -1828 -3885 -2214 1804 3684 1252 -2579 -3768 -1100 2289 3058 828 -1228
2529 -1228 -1869 -841 729 2240 2327 538 -2566 -3095 -18 3401 3325 -630 -4113 -3214 837 3133 2058
2546 2058 -1208 -2620 -1802 276 1986 2059 896 -1113 -2468 -1035 1947 3453 1502 -2068 -3618 -1239
2562 -1239 2031 2842 1044 -2234 -3746 -1578 1704 3068 1323 -1719 -2648 -1176 1394 2779 1758
$$ packed form
2451c193L900K786p81l929k563O64L372K760r4l079k654J42K936K833J03k617
2467E86k637p44J546L099J369j424l700k510K091M274K034k311m469j434L203
2482a027L606O16j968k562p20Q04J723K121K53k366l329q00L410L702J37m357
2498g57l446P52M161K669j157k835k259P84K410J945L46j769k195j057J121K714
2514A427J942j523l674k057J671M018J880k432l831j189K668L389P69k230k056
2529a228o41J028J570J511Q7j789l104n29L077L419p6l955l483Q99M051K296j075
2546B058l266j412Q18K078J710P3j163k009j355J433K982J506j951l570j550K379
2562a239L270Q11j798l278j512K168L282J364j745l042r29J472K570J385j021
$$ plain form
2577 1758 -252 -1785 -2100 -313 2532 3195 483 -3397 -3996 198 3774 2822 -1244 -3774 -2227 1063
2593 1063 1986 1615 370 -769 -1750 -1383 1177 3725 2750 -1573 -4366 -2065 2678 3914 797 -2894
2609 -2894 -3204 -801 1365 2056 1015 -497 -2218 -2449 211 3078 3079 -89 -3263 -2075 959 2937
2625 2937 1913 -378 -2103 -2485 -668 1628 2694 600 -2737 -3670 -797 2951 3085 -169 -2463 -1822
2641 -1822 410 1609 1618 1317 -8 -1912 -2247 318 3492 2933 -1716 -4494 -2097 2112 3282 409
2657 409 -2266 -2144 -490 397 1397 1728 1003 -1458 -3000 -503 3172 3610 -309 -3304 -2427 961 2439
2674 2439 1045 -374 -1361 -1839 -1320 487 2738 2054 -1702 -3823 -1375 3082 3728 444 -2434 -1756
2690 -1756 437 1384 1085 1126 355 -1764 -3034 -821 3003 3226 -1051 -4707 -2604 2314 3459 663
$$ packed form
2577A758k010j533l15J787K845O63k712l880n99M194L576r52m066k530J547L290
2593A063R23l71j245j139r81L67K560K548r75m323k793K301M743J236l117l691
2609b894l10K403K166O91j041j512j721k31K660K867Jl168l174J188L034J978
2625B937j024k291j725l82J817K296J066k094l337r33K873L748J34l254k294O41
2641a822K232J199Rl01j325j904l35K565L174n59m649k778K397M209J170k873
2657D09k675J22J654Q87J000L31p25k461j542K497L675M38l919k995Q77L388J478
2674B439j394j419r87m78N19J807K251o84l756k121K448M457O46l284k878O78
2690a756K193R47k99M1p71k119j270K213L824K23m277l656K103M918J145k796
$$ plain form
2706 663 -1743 -1419 166 -11 344 1680 1978 -582 -3330 -1993 2549 3931 238 -3495 -3009 392
2722 392 2358 1190 -568 -788 -1159 -1051 111 2365 2522 -560 -3176 -1582 2080 3062 715 -1556
2738 -1556 -1634 -150 111 156 1237 934 -1610 -3431 -1046 2972 3296 -855 -3817 -1579 2580 2873 -171
2755 -171 -1496 235 926 -672 -1141 1248 2872 -16 -4260 -2716 2577 4364 -51 -4353 -2583 2251
2771 2251 2957 -156 -1780 47 1013 -272 -1031 1074 2730 595 -3142 -2804 1762 3724 714 -2734
2787 -2734 -2899 44 1759 900 -7 -388 -1265 -1803 -211 2648 2758 -882 -3305 -1250 2241 2728 209
2804 209 -1226 -757 -481 -1072 -199 2481 2444 -1934 -5031 -1893 4008 4572 -1005 -4836 -2011 2764 2859
2821 2859 -206 -765 863 311 -2438 -2110 2569 5076 86 -5979 -4576 2507 6164 1420 -4400 -3681
$$ packed form
2706F63k406L24J585j77L55J336K98k560k748J337M542J382l693l733M86L401
2722C92J966j168j758k20l71J08J162K254J57l082k616J594L662R82k347k271
2738a556p8J484K61M5J081l03k544j821K385M018L24m151k962K238M159K93l044
2755a71j325J731O91j598m69K389J624k888m244J544N293J787m415m302J770M834
2771B251P06l113j624J827R66j285p59K105J656k135l737L38M566J962l010l448
2787b734j65K943J715q59r07l81q77n38J592K859J10l640k423K055L491M87k519
2804B09j435M69K76n91Q73K680l7m378l097L138N901N64n577l831K825M775R5
2821B859l065n59J628n52k749L28M679K507m990o065J403P083L657m744n820P19
$$ plain form
2837 -3681 827 2282 444 -122 1557 682 -2535 -2803 1428 5238 2610 -3490 -4691 -178 3783 2724
2853 2724 -660 -2117 -1666 -1004 40 2030 2565 -26 -3517 -3092 1521 4054 1636 -1921 -1735 -325
2869 -325 380 344 1544 2271 -555 -4225 -3011 2599 5237 743 -4969 -3758 1748 3931 298 -2558
2885 -2558 -319 2071 -220 -2711 97 4291 2751 -3324 -5213 426 5642 2661 -3810 -4567 753
2900 753 3401 174 -2675 -472 2125 395 -2756 -1438 2864 3147 -1267 -3737 -505 3614 2345
2915 2345 -1785 -2350 477 1523 29 -1166 7 837 -932 -1787 90 2200 607 -2250 -1634 1696
2931 1696 2637 -188 -2077 -52 1906 446 -1595 -247 2367 872 -2846 -2898 1816 4314 -246 -4822
2947 -4822 -2675 3110 3728 -1010 -3513 -148 2742 488 -2506 -241 3673 2041 -3726 -4514 1728
$$ packed form
2837c681M508J455j838n66J679q75l217k68M231L810k628o100j201M513L961j059
2853B724l384j457M51O62J044J990N35k591l491M25M613K533k418l557J86J410
2869c25P05l6J200P27k826l670J214N610K638m494n712J211N506K183l633k856
2885b558K239K390k291k491K808M194j540o075j889N639N216k981o471p57N320
2900G53K648l227k849K203K597j730l151J318M302K83m414k470L232M119j269
2915B345m130n65K827J046j494j195J173Q30j769q55J877K110j593k857O16L330
2931A696R41k825j889K025J958j460k041J348K614j495l718n2M714K498m560m576
2947d822K147N785O18m738k503L365K890k254k994K265L914j632n767p88O242
$$ plain form
2962 1728 5907 1468 -4966 -4406 1595 4190 381 -2585 -777 1303 -612 -2339 233 3979 2277
2977 2277 -3187 -4434 668 4840 2627 -2321 -3161 -130 1391 247 343 1453 169 -3192 -3357 1159
2993 1159 4857 1778 -3405 -3837 823 3166 1210 -671 108 585 -1697 -2523 1207 4911 1955 -4358
3009 -4358 -5284 868 5565 2105 -3422 -3306 766 1879 -679 -927 2230 2729 -1972 -4817 -122 5850
3025 5850 4047 -3211 -5757 -390 4422 2336 -2408 -2154 919 731 -2224 -1341 2672 3274 -1575 -4883
3041 -4883 -981 4530 3705 -1744 -3672 -391 2600 811 -1095 191 1565 -521 -3138 -1167 3309
3056 3309 2888 -2084 -4484 -772 3590 1904 -2087 -1980 1246 1645 -1179 -1617 1891 2891 -1119 -3941
3072 -3941 -698 4068 3077 -2710 -4256 436 3592 828 -3095 -1451 2269 1438 -2446 -2154 2497 3803
$$ packed form
2962A728M179m439o434N60O001K595l809k966J808K080j915j727K572L746j702
2977B277n464j247N102M172k213m948q40L031J521j144R6J110j284l361j65M516
2993A159L698l079n183m32M660K343j956j881P79M77k282q26L730L704k956o313
3009d358r26O152M697l460n527J16M072J113k558k48L157M99m701k845M695N972
3025E850j803p258k546N367M812k086m744K54L073j88k955Q83M013O02m849l308
3041d883L902N511q25n449j928L281K991j789j906J286J374k086k617J971M476
3056C309m21m972k400L712M362j686l991J07L226L99k824m38L508J000m010k822
3072c941L243M766r91n787j546M692L156k764l923J644L720q31l884K92M651J306
$$ plain form
3088 3803 -1154 -4360 -854 4538 3190 -2567 -4017 528 3411 753 -2824 -762 2191 739 -2700
3103 -2700 -1761 2728 3264 -1689 -4500 -653 4273 2691 -2403 -2858 944 2411 -495 -1992 523 2422
3119 2422 -639 -3684 -1247 3797 2901 -2482 -4621 -155 3866 1782 -2482 -1630 1612 1455 -1516 -1633
3135 -1633 2408 3557 -1383 -4801 -878 4403 3255 -2865 -4470 278 3219 646 -2220 -910 2260
3150 2260 498 -3122 -1620 3383 3896 -1619 -4771 -758 4356 3149 -2076 -3188 648 2347 -646
3165 -646 -2305 632 2712 -430 -4147 -1802 3750 3896 -1923 -4631 -388 3938 2171 -1988 -1919 1685
3181 1685 1527 -1633 -2076 2026 3778 -831 -4963 -1700 3913 3558 -1974 -4198 -318 3043 712 -2096
3197 -2096 -488 2317 848 -3034 -2123 3025 4216 -953 -4951 -1534 3765 3206 -2114 -3210 397
$$ packed form
3088C803m957l206L506N392j348n757j450M545K883k658l577K062K953j452l439
3103b700R39M489N36m953k811L847M926j582n094m55L802J467k906j497K515J899
3119B422l061l045K437N044q96n383k139M466M021k084m264Q52L242j57k971j17
3135a633M041J149m940l418L923N281j148o120j605M748K941k573k866J310L170
3150B260j762l620J502N003N13n515l152M013N114j207n225j112L836J699k993
3165f46j659K937K080l142l717K345N552J46n819k708M243M326j767m159O9L604
3181A685j58l160m43M102J752m609m132L263N613l55n532k224L880L361k331k808
3197b096J608K805j469l882R11N148J191n169l998L417N299n59n320j096L607
$$ plain form
3212 397 2235 -722 -2404 602 3247 363 -4020 -2381 3752 4525 -1066 -4553 -1080 3531 2284
3227 2284 -1817 -1917 1319 1467 -1937 -2649 1708 3698 -286 -4669 -2373 3589 3736 -1494 -4035 -277
3243 -277 2966 1135 -2183 -440 2590 1130 -2935 -2440 2626 4260 -606 -4930 -1951 3339 2986 -1758
3259 -1758 -3215 272 2418 -645 -2469 596 3672 879 -3663 -2580 2968 4554 -714 -4267 -1337
3274 -1337 3286 2068 -1964 -2127 1480 2024 -1861 -3006 1291 3929 187 -4372 -2357 3338 4187 -1060
3290 -1060 -3922 -380 3113 994 -2139 -910 2431 1412 -2981 -2779 2008 4016 -496 -4850 -2262
3305 -2262 3169 3412 -1223 -3113 269 2481 -175 -2247 463 3429 1011 -3697 -3000 2906 4444
3320 4444 -384 -4528 -1814 2791 2237 -1663 -2034 1094 1785 -1871 -2773 1365 4417 563 -4379 -2956
$$ packed form
3212C97J838k957j682L006K645k884m383J639O133P73n591l487L473M611j247
3227B284m101j00L236J48l404p12M357J990l984m383K296N962J47n230k541L758
3243b77L243j831l318J743L030j460m065M95N066J634m866m324K979N290l53m744
3259a758j457L487K146l063j824L065L076k793m542J083N548J586n268l553K930
3274a337M623j218m032j63L607N44l885j145M297K638l742m559K015N695Q49n247
3290a060k862L542L493k119l133J229L341j019m393K02M787K008m512m354K588
3305b262N431K43m635j890L382K212k656k072K710K966k418m708O97N906J538
3320D444m828m144K714M605n54l900l71L128O91l656r02M138L052l854m942J423
$$ plain form
3336 -2956 3083 4340 -453 -3803 -980 2545 937 -2267 -982 2380 1418 -3059 -3566 1787 4750
3351 4750 824 -4552 -2857 2679 3742 -583 -2574 342 2282 -431 -2825 67 3900 1608 -3605
3366 -3605 -3638 1559 4411 649 -3889 -2147 2245 1873 -1396 -1651 1745 2155 -1601 -3480 749 4193
3382 4193 1602 -3604 -3072 1855 3541 -421 -3010 -628 2366 682 -2843 -1277 2925 2236 -2252
3397 -2252 -3467 1040 4276 1137 -3491 -2156 2539 2875 -1322 -2995 798 2968 -60 -3289 -973
3412 -973 3149 2104 -2700 -3232 1496 3893 109 -3751 -1645 3180 2591 -1871 -2717 1035 2942 -369
3428 -369 -2986 -140 3237 1152 -3372 -2597 2168 3901 -530 -4072 -1368 2680 2012 -1479 -1730 1562
3444 1562 1733 -1558 -2442 1560 4197 390 -4074 -2806 2703 3834 -476 -3255 -796 1939 472
$$ packed form
3336b956O039J257m793l350K823L525j608l204J285L362r62m477n07N353K963
3351D750l926n376J695N536J063m325j991K916J940k713k394K892L833k292n213
3366c605l3N197K852l762m538J742M392l72l269k55L396M10l756j879M229L444
3382D193k591n206N32M927J686l962k589K382K994j684l525J566M202o89m488
3397b252j215M507L236l139m628J335M695L36m197j673L793K170l028l229K316
3412i73M122j045m804n32M728K397l784l860K106M825n89m462q46L752J907l311
3428c69k617K846L377k085m524P75M765J733m431l542K704M048o68l491k51L292
3444A562J71l291q84M002K637l807m464J268N509J131m310k779K459K735j467
$$ plain form
3459 472 -2105 -13 2867 1072 -3383 -3258 2161 5038 662 -4329 -2818 2295 3212 -397 -1836 713
3475 713 1438 -1376 -2963 780 4436 1669 -4174 -4337 1501 4979 1315 -2854 -2071 1369 1258 -1138
3491 -1138 -371 2437 1860 -2470 -4087 693 4832 2357 -3451 -3867 609 3071 530 -1631 -287 1341
3507 1341 -620 -2785 -381 4085 2781 -2778 -4661 192 4347 2114 -2391 -2246 898 1391 -1241
3522 -1241 -1314 1905 2720 -1436 -4355 -864 4093 3374 -2162 -3751 346 3158 618 -1813 -352 2362
3538 2362 767 -2874 -2085 2816 3606 -869 -4294 -1281 3288 2194 -1981 -2640 838 2312 -748 -2637
3554 -2637 483 3286 883 -2825 -1953 2318 3156 -1000 -2894 91 2802 513 -2520 -1452 2302
3569 2302 2122 -1760 -2902 449 2864 382 -2750 -980 2625 1752 -2065 -2594 1554 3567 -212 -3325
$$ packed form
3459D72k577K092K880j795m455J25N419K877m376m991J511N113R17l609j439K549
3475G13P25k814j587L743L656k767n843j63N838L478l664m169P83L440j11k396
3491a138P67K808n77m330j617M780M139k475n808m16M476K462k541k161J344J628
3507A341j961k165K404M466j304n559j883M853M155k233m505J45L144M93k632
3522a241p3L219Q15m156k919L491M957p19n536j589M097K812k540k431J461K714
3538B362j595l641P89M901P90m475l425L013M569j094m175o59L478J474l060j889
3554b637L120K803k403l708Q72M271Q38m156j894K985K711k289l033J068L754
3569B302j80l882j142L351K415k482l132J770L605q73l817n29M148K013l779l113
$$ plain form
3585 -3325 -1545 2632 2146 -1716 -2439 667 2141 -761 -2803 281 3471 1343 -3295 -3000 1920 4063
3601 4063 239 -3236 -1344 2057 1359 -1600 -1029 1912 1913 -1986 -3430 628 4027 1685 -3282 -3383
3617 -3383 882 2887 359 -1631 -138 1401 -476 -2109 85 3483 2194 -2711 -3960 221 4041
3632 4041 1687 -2285 -2183 843 870 -1127 -956 1969 2206 -1885 -3889 -194 4219 2992 -2217 -3922
3648 -3922 26 2882 1085 -1474 -412 1442 -93 -2622 -1160 3089 3417 -1611 -4412 -947 3544
3663 3544 2849 -1486 -2613 270 1629 -443 -1237 1077 2755 -176 -3666 -1719 2845 3580 -977 -3838
3679 -3838 -1114 2342 1553 -1277 -1082 1141 835 -1742 -1753 1842 3213 -55 -3413 -1601 2650 2660 -1014
3696 -1014 -2530 92 1769 -78 -1977 -173 2252 712 -2728 -2367 1893 3260 -232 -3318 -1017
$$ packed form
3585c325J780M177m86l862p23L106J474k902k042L084L190k128m638K95M920K143
3601D063l824l475J892L401o98k959N71K941Jl899j444M058L399k342m967j01
3617c383M265K005k528j990J493J539j877j633K194L398j289m905j249M181L820
3632D041k354l972J02L026K7j997J71K925K37m091k004L695M413j227n209j705
3648c922L948K856j797k559J062J854j535k529J462M249L28n028k801L465M491
3663C544o95m335j127K883J359k072p94K314J678k931l490J947M564P35m557k861
3679c838K724L456p89k830J95K223l06k577j1L595J371l268l358J812M251J0l674
3696a014j516K622J677j847j899J804K425j540l440L61M260J367l492l086K301
$$ plain form
3711 -1017 2543 1790 -1502 -2058 1086 2140 -599 -2267 116 2659 809 -2802 -1956 1994 2639 -1054
3727 -1054 -3122 -343 2417 1040 -1988 -1553 1401 2030 -1047 -2054 741 2577 148 -2642 -1434
3742 -1434 2255 2493 -1530 -2981 46 2366 607 -1779 -939 1724 1164 -1566 -1703 1500 2682 -450
3758 -450 -3155 -1056 2650 2158 -1353 -2466 377 2068 -151 -1836 -83 1904 441 -2619 -1784 2092
3774 2092 2888 -956 -3254 -628 2654 2009 -1416 -1650 764 1495 -911 -1812 776 2533 -178 -3145
3790 -3145 -1686 2228 2770 -833 -2955 -800 2139 975 -1380 -870 1510 1210 -1717 -1861 1468 2746
3806 2746 -42 -3003 -1633 2205 2406 -934 -2248 17 1780 37 -1610 -191 2266 669 -2432
3821 -2432 -1838 1750 3028 -218 -2824 -1116 2349 1848 -1233 -1596 794 1453 -797 -2026 542 2376
$$ packed form
3711a017L560p53l292n56L144J054k739j668K383K543j850l611Q46L950O45l693
3727a054k068K779K760j377l028M35K954O29l077j007K795J836k429k790J208
3742a434L689K38m023j451L027K320j759k386Q40K663n60k730j37L203J182l132
3758d50k705K099L706m92l511j113K843J691k219j685J753J987j463l060Q35L876
3774B092P96l844k298K626L282o45l425k34K414P31k406r01K588J757k711k967
3790c145J459L914N42l603k122K155K939j164k355N10K380l00k927j44L329J278
3806B746k788k961J370L838K01l340j314K265J763j743j647J419K457j597l101
3821b432N94L588J278l246k606J708L465n01l081l63K390O59k250j229K568J834
$$ plain form
3837 2376 448 -2963 -1945 1832 2713 -202 -2710 -742 1828 1140 -1235 -821 1295 1083 -1473 -1702
3853 -1702 1102 2732 92 -2849 -1696 1928 2428 -645 -2187 -134 1762 72 -1592 30 2028
3868 2028 779 -2121 -2112 1542 2979 117 -2874 -1361 1852 1820 -761 -1803 456 1108 -962 -1834 376
3885 376 2567 698 -2648 -2057 1568 2995 177 -2347 -1043 1435 1035 -956 -828 1409 1057 -1552
3901 -1552 -2283 689 2907 705 -2609 -2361 1094 2433 -69 -1700 -330 1151 197 -1365 -125 2013
3917 2013 1368 -1799 -2166 901 2746 564 -2323 -1621 1081 1495 -629 -1223 683 1385 -775 -2030
3933 -2030 170 2602 1235 -2049 -2260 1019 2601 226 -1980 -935 1524 841 -1359 -1058 1312 1646
3949 1646 -1060 -2282 153 2544 1112 -2030 -1973 994 2278 -178 -1690 -299 1528 537 -1483 -671
$$ packed form
3837B376j928l411J018L777Q81k915k508J968K570o88k375M14K116k12k556k29
3853a702K804J630k640k941J153L624N00l073j542K053J896j690j664J622J998
3868B028j249k900RL654J437k862k991J513L213l2k581j042K259O52k070q72K210
3885C76K191j869l346N91L625J427k818k524J304K478m00j991J28K237l52k609
3901a552p31K972K218k202l314K48L455J339k502j631J370J481r54j562J240K138
3917B013o45l167l67L067J845k182k887P02K702M14k124n94J906P02k160j255
3933b030K200K432j367l284k11L279J582k375k206J045K459o83k200L01K370L34
3949A646k706j222K435K391j432l142N7K967J284k456j512J391J827r91k020Q12
$$ plain form
3965 -671 1626 1327 -1279 -2282 175 2403 713 -1991 -1557 1144 1509 -546 -1157 359 1501 -167
3981 -167 -1522 -187 1971 1012 -1637 -2006 809 2272 162 -2048 -986 1268 950 -736 -1047 967
3997 967 1350 -871 -2112 49 2438 1000 -1964 -1990 905 2390 139 -1691 -421 1219 566 -1158
4013 -1158 -685 1331 1229 -1373 -2304 144 2516 1147 -1909 -1825 700 1750 -119 -1208 -103 1089
4029 1089 -13 -1628 -400 2097 1427 -1534 -2364 316 2445 836 -1744 -1360 855 1172 -471 -875
4045 -875 913 1221 -559 -1979 -257 2168 1296 -1609 -2124 266 1870 377 -1348 -590 838 326
4061 326 -1128 -586 1699 1418 -1024 -2326 -70 2482 1435 -1499 -1813 648 1695 -14 -1032 97
4077 97 1217 -33 -1755 -658 1703 1614 -1213 -2290 89 1997 1020 -1161 -1193 708 932 -526 -814
$$ packed form
3965f71K297k99k606j003K457K228j690k704M34K701L65k055o11J516J142j668
3981a67j355J335K158r59k649l69K815J463k110k210J062K254l18j686l11K014
3997I67L83k221j241K161K389j438k964k6K895J485k251j830J270J640o53j724
4013a158M73K016j02k602r31K448K372j369l056Q4K525J050j869j089J105J192
4029A089j102j615J228K497o70k961q30K680K129j609k580L84K215L17j643m04
4045h75J788L08j780j420J722K425q72k905n15K390J604j493j725P58J428n12
4061C26j454N42K285k81k442j302K256K552j047k934l14K461J047j709j018J129
4077I7J120j250j722J097K361q9k827j077K379J908r77k181l2J901K24j458k88
$$ plain form
4094 -814 660 1288 -542 -2090 -376 1917 1409 -1093 -2129 60 1563 480 -962 -531 863 472
4110 472 -1180 -752 1306 1473 -713 -2144 -384 2093 1400 -1021 -1675 256 1276 81 -1034 -44
4126 -44 1211 9 -1578 -796 1545 1954 -970 -2334 -414 1725 1263 -812 -1374 462 833 -583 -937
4143 -937 600 1452 -72 -1948 -851 1697 1370 -728 -1863 -401 1420 533 -921 -430 869 212
4159 212 -1155 -680 1020 1739 -441 -1909 -608 1538 1446 -883 -1403 114 1122 -22 -891 -140 1188
4176 1188 136 -1411 -947 1199 1888 -442 -2066 -474 1721 1138 -812 -1210 339 1022 -410 -1279
4192 -1279 209 1459 51 -1602 -1089 1180 1696 -628 -1827 -330 1478 950 -769 -804 441 853
4208 853 -618 -836 530 1245 -120 -1708 -855 1290 1160 -530 -1486 -72 1119 336 -738 -129 673
$$ packed form
4094h14J474O28j830j548J714K293n08k502j036K189J503j083j442M31J394l91
4110D72j652M28K058J67k186j431J760K477o93k421o54J931J020j195j115R90
4126d4J255j202j587P82K341M09k924j364J920K139m62k075n62J836L71j416l54
4143i37J537Q52j524j876J097K548l27k098j135J462J821q87j454M91J299o57
4159B12j367M75J700P19k180j468J301K146r2k329n20J517J008j144q69P51J328
4176A188j052j547M64K146O89k330j624J592K195n83j950l98J549O83j432q69
4192a279J488J250j408j653N13K269N16k324j199J497J808n28j719l5J245M12
4208H53j471k18J366P15j365j588Q53K145j30j690r56J414J191p83j074O09Q02
$$ plain form
4225 673 195 -1012 -766 1118 1525 -406 -1715 -553 1697 1288 -776 -1211 379 908 -205 -840 232
4242 232 1393 169 -1663 -864 1412 1881 -462 -2019 -490 1309 985 -605 -739 437 593 -608
4258 -608 -872 824 1641 -9 -1827 -1272 1181 1899 -113 -1536 -682 1001 611 -547 -148 672 310
4275 310 -1048 -1050 768 1746 130 -1714 -1053 765 1296 -164 -825 -122 367 -288 -608 343 1225 316 -1550
4294 -1550 -1162 874 1750 47 -1411 -717 829 628 -554 -535 567 584 -925 -1265 486 1749 380
4311 380 -1587 -1131 847 1625 116 -1204 -390 740 282 -733 -317 1154 661 -1126 -1318 393 1540
4328 1540 594 -1436 -1252 790 1401 -126 -858 -134 579 243 -765 -160 1012 577 -1001 -1397 539
4345 539 1475 266 -1163 -870 472 673 -269 -565 360 487 -386 -902 196 1256 410 -1217 -1099 695
$$ packed form
4225F73m78j207K46J884M07j931j309J162K250m09k064m35J590N29j113o35J072
4242B32J161j224j832P99K276M69k343j557J529J799l24j590j34J176J56j201
4258f08k64J696Q17j650j818N55K453P18k012j423Q54J683l90j158L99Q20l62
4275C10j358kJ818R78j616j844O61J818N31j460o61P03M89o55l20R51Q82r09j866
4294a550L88K036Q76j703j458O94J546k01j182J9J102J7j509l40J751J263j369
4311C80j967M56J978P78j509j320Q14J130m58j015M16J471m93j787j92J711J147
4328A540r46k030J84K042O11j527p32P24P13l36j008O05J172m35j578l96J936
4345E39R36j209j429K93J342K01r42k96R25J27q73n16J098J060q46j627J18J794
$$ plain form
4363 695 1334 73 -1210 -305 832 510 -725 -393 589 509 -878 -1212 371 1587 388 -1391 -974
4380 -974 798 1242 130 -1036 -207 763 18 -830 -169 1001 344 -1102 -1233 401 1496 451 -1288
4397 -1288 -1086 561 986 -69 -721 119 596 -286 -883 84 1433 700 -1298 -1293 299 1298 527 -786
4415 -786 -871 295 508 -452 -122 552 571 -657 -1113 -59 1349 573 -1132 -996 340 1041 165 -705 -401
4434 -401 499 -7 -733 -332 1044 753 -909 -1377 167 1385 568 -868 -988 318 701 -25 -490 292
4452 292 558 -99 -1030 -202 1053 638 -944 -1275 60 1292 466 -776 -553 322 456 -490 -460 585
4470 585 611 -393 -1011 -67 1347 707 -701 -1237 72 1177 307 -661 -346 324 296 -606 -215 696 801
4489 801 -670 -1463 -106 1301 805 -554 -874 -47 869 271 -437 -47 560 -132 -833 -210 949 816
$$ packed form
4363F95O39j261j283R05J137l22j235L32R82q0j387l34J583J216j199j779M17
4380i74J772M44j112j166Q29R70p45q48O61J170o57j446j31J634J095j045j739
4397a288K02J647M25j055o52Q40M77q82n97R67J349p33j998NJ592R99p71j313
4415g86q5J166K13r60L30O74J9j228m56J054J408p76j705J36J336P01q76q70L04
4434d01R00n06p26M01J376k91j662m68J544J218q17j436j20J306L83p26m65P82
4452B92K66o57r31Q28J255m15j582l31J335J232q26j242K23Q75J34r46L0J045
4470E85K6j004o18R44J414o40j408n36J309J105q70r68L15O70k8r02L91R11J05
4489H01j471p93J357J407m96j359l20Q27R16n98p08L90O07o92p01O23J159j33
$$ plain form
4507 816 -841 -1420 -130 1188 654 -557 -741 -23 558 -301 -359 454 528 -458 -1144 -288 1168 1072 -667
4526 -667 -1320 -216 840 444 -562 -348 338 58 -723 -246 817 1011 -465 -1212 -173 1130 930 -766
4544 -766 -886 -152 703 91 -358 40 520 -87 -858 -587 961 1013 -387 -1225 -466 1047 641 -539 -550
4563 -550 136 503 -272 -504 246 868 150 -1150 -546 723 1074 -273 -1135 -266 573 272 -182 -397 194
4582 194 150 -447 -362 405 904 -90 -903 -413 826 854 -389 -860 -136 524 -164 -395 47 435 129 -776
4602 -776 -393 802 1035 -232 -1124 -376 1037 611 -527 -764 184 489 165 -572 116 582 96 -985
4620 -985 -720 843 1131 -348 -1219 -268 946 761 -317 -629 108 418 -322 -378 441 782 -62 -1071 -760
4639 -760 735 928 16 -923 -354 440 478 -269 -6 246 105 -609 -527 718 933 -130 -1048 -391 845
$$ packed form
4507H16j657n79J290J318n34j211j84P18N81q59n8Q13P4r86o86Q56J456r6j739
4526f67o53J104J056l96j006K14O86k80p81M77J063J94j476p47J039J303k00j696
4544g66j20P34Q55o12m49L98M80o07p71K71J548N2j400q38P59J513m06j180j1
4563e50O86L67p75k32P50O22p18j300O04J269L51j347q62Q69Q39l01m54k15N91
4582A94m4n97Q5P67M99r94q13M90J239K8j243m71P24O60o88k31M42L88l06r05
4602g76L83J195K33j267q92P48J413m26j138k37R48L05l24p37O88M66m86j081
4620i85K65J563K88j479q71R51J214j85j078l12P37L10p40n6Q19L41q44j009L11
4639g60J495J93r12r39N69P94L8p47K63K52j41p14Q2J245K15j063r18O57J236
$$ plain form
4658 845 936 -155 -661 -146 292 -11 -238 175 554 -77 -906 -753 653 1072 -13 -1058 -602 569 491
4677 491 -214 -233 112 188 -628 -655 499 903 -7 -1032 -737 548 887 -43 -1026 -322 452 292 -381 -86
4697 -86 561 193 -783 -586 489 1083 424 -935 -875 343 876 126 -464 -132 326 74 -426 42 885 250
4717 250 -834 -927 392 1175 231 -781 -801 235 602 -268 -323 327 395 -183 -535 30 918 372 -775 -556
4737 -556 475 785 302 -850 -437 368 122 -485 -90 435 460 -518 -965 135 1029 464 -958 -717 424
4756 424 849 -122 -653 -55 362 -58 -432 -91 791 313 -605 -810 234 1068 215 -934 -592 253 502
4775 502 -23 -554 -9 474 -416 -685 99 878 457 -621 -945 240 836 206 -802 -504 376 413 -128
4794 -128 -302 292 576 -304 -768 212 1075 518 -771 -790 278 679 132 -578 -389 335 -12 -573 -290 526
$$ packed form
4658H45R1j091n06N15M38l03k27M13L79o31q29J53J406M19j085j045M56J171p8
4677D91p05j9L45P6q16k7J154M04r10j025K95J285L39r30r83P04P74j60o73K95
4697h6O47l68r76J97J075N94o59j359O0J218N33p50n90L32M58k52n00M68Q43o35
4717B50j084r3J319P83r44j012k0J036L67q70n5O50O8n78l52N65Q88n46j147K19
4737e56J031L10m83j152M13Q05k46o07L95N25K5r78m47J100Q94n65j422K41J141
4756D24M25r71n31N98M17m20l74L41Q82m78r18k05J044Q34q53j149L42Q45K49
4775E02n25n31N45M83q90k69P84P79m21j078l24J185N96o30j008K98Q80L7n41
4794a28j74N94K84q80m64R80Q63n57j289j9J068M01n47p10J89P24l47n61K83Q16
$$ plain form
4814 526 551 -696 -952 170 1018 477 -698 -630 282 659 46 -330 50 405 76 -679 -70 673 519 -590
4834 -590 -679 221 847 371 -474 -501 137 388 -174 -274 223 457 -329 -838 68 871 549 -600 -893 187
4854 187 871 221 -389 -110 291 180 -493 -167 635 490 -428 -913 -19 1042 505 -351 -853 75 646 86
4874 86 -359 -9 180 -254 -520 -157 875 648 -588 -1020 -87 933 587 -387 -484 85 278 -159 -166 198
4894 198 517 -346 -808 -328 885 801 -457 -869 -143 678 315 -281 -82 -15 -45 -262 -15 573 617 -292 -824
4915 -824 -353 926 584 -140 -449 -25 316 26 -384 193 586 -166 -729 -113 727 858 -186 -894 -328
4934 -328 691 447 -337 -357 31 354 -232 -416 217 681 28 -856 -425 634 744 -84 -848 -190 771 392
4954 392 -231 -271 316 356 -460 -570 199 849 52 -791 -611 542 717 -268 -586 -4 498 135 -256 -256 340
$$ packed form
4814E26K5j247k56J122Q48n41j175O8R12L77o13l76L80L55l29p55O09P43j54j109
4834e90q9R00O26m76q45k7O38K51n62j00M97K34p86n09R06Q03l22j149k93J080
4854A87O84o50o10K79M01j11o73L26Q02j45r18m85Q94J061n37q56n02R28N71n60
4874H6m45L50J89m34k66L63J032k27j236m32R33J020l46r74r7N69J93m37pL64
4894A98L19q63m62M80J213q4j258m12P26Q21l63n96J99O7l0k17K47N88M4r09n32
4915h24M71J279l42p24l09M24L41k90m10N77L93p52n63O16Q40J31j044p08N66
4934c28J019k44p84k0L88L23n86j84O33M64o53q84M31J059J10q28p64O58R61l79
4954C92o23m0N87M0q16j10P69O50p97q43J80J153J75r85l18N82N02l63l91%N96
$$ plain form
4975 340 202 -519 -292 526 533 -61 -721 -344 566 540 -259 -377 208 325 45 -386 207 526 30 -706 -449
4996 -449 565 703 -212 -835 -79 738 407 -514 -429 319 271 -305 -452 320 655 -151 -811 -350 662 744
5016 744 -295 -847 -26 445 399 -333 -385 256 124 -364 -496 436 874 -94 -984 -470 730 818 -34 -508
5036 -508 -251 170 0 -46 51 471 71 -672 -360 609 728 -44 -851 -539 414 442 -211 -257 138 218 -437 -320
5058 -320 231 599 -131 -742 -691 526 715 -7 -670 -108 330 279 -310 86 356 166 -608 -549 525 846
5078 846 52 -740 -494 401 683 9 -282 87 297 -95 -427 121 688 185 -512 -749 336 947 104 -764
5098 -764 -480 408 431 -326 -309 241 260 -257 -471 -16 595 139 -454 -532 257 622 17 -706 -185 370 123
5119 123 -186 -335 301 459 -405 -471 170 799 108 -618 -567 410 664 -275 -362 -163 309 -138 -389 -97 729
$$ packed form
4975C40j38p21K27Q18Pn94o60L77R10k6p99j18N85J17k80m31N93L19m96p36K57
4996d49J014J38r15o23P56Q17l31r21Q5P48m8n76j47P72L35q06o60M61J012Q2
5016G44j039n52Q21M71m6p32n2O41j32m88j32R32M38r68q90N14J200Q8q52m74
5036e08K57M21j70m6R7M20m00p43L12R69J19p72q07L12R53K8o53m6L95Q0o55J17
5058c20N51L68p30o11N1J217J89p22o63N62M38n1n89L96K70j90p74N9J074L21
5078H46p94p92K46Q95K82o74k91L69K10l92l32N48N67n03o97k37J085O11q43q68
5098g64K84Q88K3p57J7N50J9n17k14M55O11m56n93p8P89L65o05p23N21N55k47
5119A23l09j49O36J58q64o6O41O29o91p26N1R77K54r39q7J99M72m47k51K92Q26
$$ plain form
5140 729 204 -579 -668 193 667 233 -648 -455 435 500 -151 -310 340 238 -263 -561 -87 662 310 -500 -631
5161 -631 126 607 180 -494 -427 454 214 -150 -121 439 253 -438 -488 120 744 67 -484 -677 243 617 68
5182 68 -416 23 216 28 -348 -283 365 383 -503 -798 62 805 357 -360 -436 151 303 105 -201 87 326
5203 326 -118 -593 20 707 270 -553 -543 149 605 178 -525 -249 343 156 -291 -240 369 327 -179 -754 90
5224 90 777 478 -509 -540 189 618 150 -592 -127 93 155 -449 -261 486 569 -293 -715 -73 661 218 -548
5245 -548 -498 181 344 -208 -408 174 493 36 -516 -102 575 423 -337 -621 -38 695 270 -395 -566 229
5265 229 685 2 -261 68 212 -36 -533 -132 490 337 -513 -654 30 591 213 -370 -49 106 11 -327
5285 -327 -124 461 211 -512 -713 58 767 285 -369 -496 110 521 126 -298 101 405 -119 -616 -116 729
$$ packed form
5140G29n25p83q9Q61M74m34q81J93Q90O5o51j59O50j02n01k98M74P49l52q10j31
5161f31P57M81m27o74O7Q81k40l64K9N60j86o91n0O08O24o77n51j93R20L74n49
5182F8m84M39J93j88l76O5O48J8q86k95Q60P43m48p17p6N87J52j98l06K88K39
5203C26m44m75O13O87m37q23J0O92M56m27p03K76N92j87m47N1O09m2n06n75Q44
5224I0O87k99r87l1P29M29m68p42M65K20O2o04J88P47Q3q62m22O42P34m43p66
5245e48N0O79J63n52k00N82L19m57n52M14O77j52p60k84N83P33m25o65j71P95
5265B29M56o83k63L29J44k48m97M01O22j53q50j41O84N61l78n83L21J55r5l38
5285c27K03N85k50p23k01P71P09m82o54j27O06M11l95m24L99L04n24m97N00Q45
$$ plain form
5305 729 687 -362 -846 -183 669 387 -306 -455 91 238 -250 -451 219 586 152 -623 -360 573 672 -78
5325 -78 -583 -134 397 109 -244 -117 316 82 -380 -351 512 342 -32 -766 -419 563 383 -141 -482 -17 145
5346 145 13 -223 70 264 60 -649 -268 516 554 -80 -651 52 448 344 -142 -179 336 247 -307 -380 322
5367 322 567 -69 -588 -293 436 566 -319 -635 -129 487 290 -370 -122 437 250 -394 -542 203 635 92
5387 92 -687 -335 588 594 -290 -362 -50 474 150 -267 -179 182 58 -445 -343 162 520 -75 -474 -217 390 506
5409 506 -193 -366 73 99 -55 -535 78 367 -180 -608 -247 381 634 -173 -649 -82 448 191 -245 -105
5429 -105 369 478 -342 -411 407 604 -46 -607 -317 512 526 -302 -547 -116 447 105 -317 -173 393 83 -457
5450 -457 -475 351 425 -34 -582 -454 349 573 -181 -446 57 285 139 -43 56 535 60 -534 -403 443 642
$$ packed form
5305G29m2j049m84O63Q52k82o93j49N46J47m88k01O70L67m34p75K63R33R9p50
5325g8n05M49N31k88l53J27M33k34m62K9Q63j70l74p34L47R82j80n24l41M65J62
5346A45j32k36K93J94k04p09L81P84L8o34n71P03L96j04m86l7N15q9n54p3P02
5367C22K45o36n19K95P29J30q85l16N06O16j97o60K48N59j87o44j48P45M32n43
5387I2p79L52R23Oq84p2L12N24l24m17Q8L61j24n03J02N05L58n95l99K57O07J16
5409E06o99j73M39K6j54m80O13K89n47m28L61O28K53q07m76N67N30k57m36J40
5429a05M74J09q20o9Q18J97o50n61K90Q29J4q28k45M31N63l42m22J44N66l10n40
5450d57j8Q26P4m59n48J28Q03K24p54k65N03K28j46j82R9M79m75n94J31Q46J99
$$ plain form
5471 642 -102 -468 -333 215 428 -351 -97 259 183 -357 -445 189 640 -13 -491 -491 390 521 12 -422 -240
5492 -240 265 76 -406 -257 441 322 -505 -576 301 716 226 -652 -518 515 349 -184 -398 58 305 181
5512 181 -372 133 628 176 -505 -638 272 533 107 -400 -211 454 183 -165 -250 108 202 -291 -481 -3 622
5533 622 -27 -453 -477 239 472 110 -529 -55 289 26 -515 78 470 246 -266 -660 167 610 325 -589
5553 -589 -548 165 477 -31 -485 -6 333 94 -397 -34 454 351 -464 -583 58 570 187 -413 -267 82
5573 82 178 -126 -129 177 278 -112 -445 11 714 494 -474 -557 150 509 -5 -456 -40 196 7 -473 -121 325
5595 325 270 -310 -423 35 462 65 -449 -203 216 317 -25 -476 206 449 -81 -399 -17 409 465 -282 -541
5616 -541 -24 470 -65 -532 -378 265 483 -107 -307 161 393 44 -565 -103 624 374 -526 -551 108 589
$$ packed form
5471F42p44l66J35N48K13p79K54L56p6n40q8O34M51o53m78%Q81J31n09m34J82
5492b40N05j89m82J49O98j19q27p1Q77M15m90q78J34J033j66n33k14M56K47j24
5512A81n53N05M95m52o81j33R10K61m26n07J89O65k71l48q5L58R4m93j90M78O25
5533F22o49m26k4P16K33l62o39M74L44k63n41N93L92k24n12l94Q27M43k85r14
5553e89M1P13L12n08m54M79L39k39m91L63M88j03q15j19O41N12l83o00J46L49
5573H2R6l04lL06J01l90l33M56P03k20r68q3P07L59n14m51M16K36j89m80L52M46
5595C25n5n80j13M58M27l97n14K46M19J01l42m51O82K43n30l18L82M26N6p47k59
5616e41N17M94n35m67J54O43K18n90k00M68K32l49o09M62P27k50r00k5O59M81
$$ plain form
5636 589 288 -360 -231 145 259 -83 -174 139 396 -198 -303 -11 500 278 -334 -382 108 414 -108 -315 -7
5657 -7 120 207 -312 -34 391 380 -405 -566 7 600 228 -490 -393 91 344 -173 -305 298 588 -207 -373 -27
5679 -27 653 466 -497 -619 -123 366 165 -161 -313 393 122 -83 -209 58 537 -146 -735 -84 573 371
5699 371 -278 -464 93 328 -69 -315 -141 192 60 -271 -223 306 427 -94 -511 -128 482 263 -247 -153 74
5720 74 135 -59 -182 76 289 -120 -361 -191 512 346 -338 -679 -185 315 38 -336 -71 252 216 -205 -418
5741 -418 217 480 -41 -653 -148 358 452 -377 -485 127 334 -32 -250 -115 300 209 -396 -197 50 422 -10
5762 -10 -605 -116 450 331 -168 -391 31 247 -151 -90 -120 333 -172 -404 -329 417 379 -276 -599 -235 464 200
5784 200 -193 -118 302 202 -217 -297 139 369 -129 -410 -232 336 330 -209 -385 142 440 -29 -19 -140 297 101
$$ packed form
5636E89l01o48J29L76J14l42r1L13K57n94j05K92N11k22o12m8M90L06n22k07L08
5657gJ27Q7n19K78M25j1p85j61N73N93l72p18R7M84K53n17j32O03K90p95j66L46
5679b7O80j87r63j22M96M89k01l26j52P06k71k05j26K67M79o83n89O51O57k02
5699C71o49j86N57K35l97k46J74L33j32l31M8N29J21n21m17L83O10k19n10R4K27
5720G4O1j94j23K58K13m09k41J70P03j66o84l41M94N00k77l74K65L23l6m21k13
5741d18O35K63n21o12N05N06R4q29j08O12K07l66k18J35M15r1o05J99K47L72m32
5762a0n95M89N66j19m99k23M22K16l98O1l0M53n05k32P5P46l8o55l23L64O99k64
5784B00l93P5M20j00m19q0M36K30m98k81J78N68on39j76N27K98m69J0j21M37j96
$$ plain form
5806 101 -416 34 224 353 -142 -502 -256 181 457 -319 -294 68 200 4 -170 -156 326 171 -454 -337 -4
5827 -4 408 12 -529 -293 301 207 -178 -312 206 177 -164 -375 3 384 -31 -393 -236 431 458 -98 -394 1
5849 1 202 82 -311 -83 157 72 -370 -236 132 463 -37 -436 -283 278 338 -178 -281 155 245 205 -291 -17
5871 -17 305 50 -353 -319 165 241 -76 -643 -156 261 114 -216 -170 -34 252 -160 -268 229 481 83 -498
5892 -498 -84 184 301 -152 -432 82 313 132 -359 -95 280 220 -149 -268 37 563 -9 -492 -163 211
5912 211 485 -103 -424 -140 285 228 -171 -150 364 318 -316 -346 250 560 3 -488 -61 162 342 -321 -221
5933 -221 13 332 -138 -374 32 297 150 -346 -281 243 298 -24 -263 -207 184 189 -13 -279 214 122 -147 -373
5955 -373 249 312 177 -334 -240 287 157 62 -305 -76 288 68 -222 -112 232 139 -348 -505 132 495 56
$$ packed form
5806A01n17M50J90J29m95l60K46M37K76p76K5L62J32j96j74J4M82j55o25J17L33
5827dM12l96n41K36N94r4l85j34N18k9l41k11L78L81m15l62J57O67K7n56k96L95
5849AK01j20l93K28K40q5m42J34L68L31n00l99J53N61O0n16j03M36R0m0m96K74
5871a7L22k55m03L4M84P6l17n67M87M17j47l30M6J36K86m12j08M97K52l98n81
5892d98M14K68J17m53k80N14K31j81m91K64L75o0l69j19L05N26n72m83L29L74
5912B11K74n88l21K84M25n7l99K1N14m6o34l0N96L10n57m91M27K23J80o63J00
5933b21K34L19m70k36M06K65j47m96O5N24N5l22k39N6L91Nk02k66M93r2k69k26
5955c73O22O3j35n11R4N27j30r5l67K29L64k20k90J10L44r3m87j57O37L63m39
$$ plain form
5976 56 -368 -386 185 216 -32 -357 40 146 -178 -299 101 387 211 -418 -549 158 240 237 -331 -243 172 161 -272
5999 -272 -98 200 173 -150 -426 -65 430 68 -43 -292 94 482 25 -211 -78 206 193 -150 -83 185 302
6020 302 -119 -416 159 231 103 -234 -181 258 219 -183 -91 110 279 -151 -431 -47 309 127 -181 -489 232
6041 232 383 79 -267 -176 340 274 -69 -18 185 143 -112 -394 -99 346 337 -207 -169 170 344 -109 -71 -47 425
6064 425 -46 -287 -105 209 80 -109 -410 199 350 55 -155 -448 199 236 68 -194 -66 238 -98 -389
6084 -389 -115 224 70 -293 -247 113 416 59 -187 -86 293 -23 -178 -188 68 159 -132 -489 -58 226 183
6105 183 -276 -270 110 281 -10 -141 -82 345 218 -305 -173 114 246 -207 -442 -89 425 259 -275 -381 90
6126 90 276 36 -262 53 507 171 -179 -167 120 78 -84 -250 121 285 1 -236 -197 105 161 -81 -264 104
$$ packed form
5976E6m24j8N71L1k48l25L97J06l24j21M00K86j76o29j31P07Q2ln68Q8M15j1m33
5999b72J74K98k7l23k76L61M95l62j11k49L86L88m57k36J33K84j3l43O7K68J17
6020C02m21k97N75P2j28l37N3M39l9m02R2K01J69m30k80L84L56j82l08l08P21
6041B32J51l04l46R1N16o6l43N1K03m2k55k82K95M45rn44L8L39J74m53L8K4M72
6064D25m71k41J82L14j29j89l01O09J51k95k10k93O47L7j68k62J28L04l36k91
6084c89K74L39j54l63M6L60L03l57k46J01L79l16j55j0K56R1k91l57M31K84m3
6105A83m59OL80J71k91j31N9M27j27n23J32K87J32m53k35L53N14j66n34j06M71
6126I0J86k40k98L15M54l36l50J2K87m2j62j66L71J64k84k37L9L02N6k42j83L68
$$ plain form
6148 104 222 -2 -471 -206 420 157 -221 -235 -7 311 -11 -12 13 88 88 -203 -155 216 340 -286 -394 -88 253
6171 253 200 -181 -279 108 200 -14 -201 -30 264 53 -230 -139 437 318 -163 -215 -108 175 322 -227 -54 174
6193 174 96 -148 -223 207 201 -197 -274 -208 402 129 -166 -436 11 235 100 -226 -173 139 140 -218 -92 413 407 -65
6217 -65 -355 -64 233 279 -248 -222 8 212 -216 -107 89 140 -80 -269 -173 141 223 -236 -259 -93 350 110
6239 110 -122 -166 265 272 -72 -283 -69 301 -73 -506 -207 352 280 -22 -263 146 254 135 -7 -158 8
6260 8 21 -264 -165 181 400 -22 -127 -208 295 262 -101 -213 -19 269 -11 -163 -153 185 164 -72 -39 94 221
6283 221 -150 -312 -53 72 -85 -175 -135 41 227 -173 6 -50 217 9 -64 -192 216 128 -54 -176 -226 200
6305 200 60 -258 -81 178 69 -110 -154 169 520 -131 -288 -186 72 264 -110 -234 23 213 4 -194
$$ packed form
6148A04J18k24m69K65O26k63l78j4K28L18l22jK5P5%k91M8L71J24o26j08L06L41
6171B53n3l81r8L87R2k14j87J71K94k11k83R1N76j19m81n2J07K83J47n49J73K28
6193A74p8k44p5M30ol98p7O6O10k73k95k70M47K24j35l26N3L12Jl58J26N05om72
6217f5k90K91K97M6n27K6K30K04m28J09J96N1k20j89R6L14Q2m59k3J66M43k40
6239A10k32m4M31Pl44k11K14L70l74m33K99N59p2l02k41M09J08j19j42j51J66
6260HJ3k85R9L46K19m22j05q1N03l3l63j12J94K88k80j52J0L38k1k36L3J33J27
6283B21l71j62K59J25j57r0M0J76J86m00J79n6K67k08p3j28M08q8j82j22n0M26
6305B00j40l18J77K59j09j79m4L23L51o51j57J02K58J92l74j24K57J90k09j98
$$ plain form
6325 -194 -223 36 -16 -276 -398 31 235 -187 -402 -14 275 231 38 -13 -37 210 -18 -5 171 166 68 -185 -27
6348 -27 283 252 -95 -205 -38 167 35 -127 -4 196 58 -32 -230 58 305 0 -221 -164 136 386 -156
6369 -156 -251 -167 243 7 -106 -111 142 -11 -220 -49 202 263 38 -262 -213 113 272 -198 -47 -106 159 69 -149
6392 -149 172 144 158 -163 -140 261 352 -42 -278 -29 70 104 -272 -20 63 32 -166 -10 39 257 75 -198 -310
6415 -310 170 178 -25 -49 -129 170 -112 63 228 387 72 20 -219 60 126 -37 -158 -141 262 155 -142 -158 77
6438 77 123 -72 -133 147 232 137 -48 -232 110 215 100 -193 -161 130 190 -155 -38 -18 -35 -105 -284 127 158 44
6462 44 -14 -104 -6 67 -90 -57 82 203 -40 -160 -27 81 208 -126 -98 82 214 43 -193 -213 180 44 -118
6485 -118 -177 115 209 -9 -152 -20 132 -95 -128 -117 46 114 96 -266 13 209 40 -126 -310 196 182 -4
$$ packed form
6325a94k9K59n2k60j22M29K04m22k15L88K89m4j93n1k4K47k28J3J76nr8k53J58
6348b7L10l1l47j10J67K05j32j62J23K00j38r0j98K88K47l05k21N7L00K50n42
6369a56r5Q4M10k36j13nK53j53k09J71K51O1k25l00M9L26J59m70J51n9K65r0k18
6392a49L21k8J4l21K3M01R1l94k36K49R9L4l76K52Q3l1j98J56M9K18j82k73j12
6415c10M80Qk03k4q0K99k82J75J65J59l15n2k39K79O6j63j21J7M03j07k97j6K35
6438G7M6j95o1K80Q5r5j85j84L42J05j15k93L2K91O0l45J17K0j7p0j79M11L1j14
6462D4n8r0R8P3j57L3J39J21k43j20J33J08J27l34K8J80J32j71k36k0L93j36j62
6485a18n9K92R4k18j43J32J52k27l3J1J63O8j8l62K79J96j69j66j84N06j4j86
$$ plain form
6507 -4 -96 -103 237 178 -238 -60 269 165 -23 -27 38 217 104 -66 -61 13 153 -112 -7 -65 186 90 -41 -192 8
6532 8 99 -15 -136 -27 44 -59 -207 -36 192 -43 -6 -146 261 123 1 -115 -21 278 -14 -100 -62 -74 169
6555 169 -207 -200 28 129 104 -98 -76 -1 335 -34 -138 14 233 93 -111 -141 -61 262 -151 -25 47 16 151
6578 151 -206 59 76 123 72 -119 -165 -4 -93 -65 20 173 48 -206 -241 114 -63 112 46 -121 165 -135 75
6601 75 2 149 79 62 -210 36 159 100 -67 -32 79 124 -45 -164 -165 -152 -6 -3 -9 75 63 -67 -58 56 40 -19 17
6628 17 -98 83 26 -117 96 -29 1 -140 -67 -45 236 79 -21 -168 -61 246 56 -134 -17 -42 26 -143
6650 -143 -19 70 -8 -54 -116 -49 59 -30 46 -116 44 35 -101 68 -195 -17 -41 -164 229 144 216 71 -81 -6
6674 -6 106 -23 -67 -39 74 26 51 41 19 51 18 -58 5 83 80 -52 137 59 -69 73 30 104 98 53 -41 62 -123
$$ packed form
6507dr2pL40n9m16J78L29j04j88mO5J79j13j70NP4J40k65J05n8K51r6j31j51K00
6532HR1j14j21J09P1j03j48J71K28k35L7j40M07j38j22j16R4K99k92q6L8j2K43
6555A69l76PK28J01k5k02K2P5L36l69j04J52K19j40k04l0Q0L23m13J26P2l1J35
6578A51l57K65J7M7n1j91m6J61q9K8Q5J53j25k54l5L55j77J75o6j67K86l00K10
6601G5p3J47p0j7k72K46J23n9j67L5J11M5j69j19jJ3J46LoQ4j2j30RJ14j6n9L6
6628A7j15J81n7j43K13j25L0j41P3K2K81j57j00j47J07L07j90j90J17k5O8j69
6650a43J24Q9p8m6o2O7J08q9P6j62J60rj36J69k63J78k4j23L93q5P2j45j52P5
6674fJ12j29m4K8J13m8K5j0k2L2l3p6O3P8lj32J89p8j28J42m3P4om5r4J03j85
$$ plain form
6701 -123 66 -176 -157 208 -26 -78 -33 -84 -45 59 -63 -106 43 49 14 -51 110 -7 -16 -16 -62 129 -56 -14 34 11
6727 11 72 5 146 29 21 -11 -123 34 63 56 -66 -64 186 -37 129 34 162 -36 -70 -65 -25 144 102 103 -192 64
6753 64 13 105 -53 6 -187 98 -66 22 -9 63 90 -105 -85 64 72 -144 -77 -115 -6 -44 6 204 -12 -22 -191
6778 -191 -37 172 92 52 -153 -38 162 149 -39 -54 2 32 -41 -100 -15 16 -38 34 -135 81 121 -44 -176 -102 58
6803 58 75 -66 93 72 143 64 -23 156 -100 31 -210 -39 41 102 -109 -118 27 63 66 -231 -50 97 -32 -134
6827 -134 -117 171 24 -33 -164 -101 37 98 -194 -30 285 77 -90 -103 93 -43 -127 -158 -67 -19 1 -165 -125 -44
6851 -44 185 -78 -34 115 92 25 54 -72 -119 42 88 -9 -46 158 -49 -203 77 -57 7 -70 83 -26 90 133
6875 133 -23 -91 -21 99 -44 -207 -149 59 122 -20 -50 -20 46 -219 -161 -22 89 39 -203 -116 206 37 75 24
$$ packed form
6701a23J89k42J9L65k34n2M5n1L9J04j22m3J49Ol5o5J61j17r%m6J91j85M2M8k3
6727A1O1o7J41j17ql2j12J57K9pj22KK50k23J66r5J28j98l4NM0J69m2Jk95K56
6753F4n1R2j58N9j93K85j64Q8l1P2K7j95K0J49Qk16O7l8J09l8N0J98k16j0j69
6778a91J54K09q0m0k05J15K00j3j88j5N6L0p3n9Q5L1n4P2j69K16M0j65j32P4J60
6803E8J7j41J59k1P1p9q7J79k56J31k41J71Q0O1k11rJ45L6Lk97J81J47j29j02
6827a34J7K88j47n7j31O3J38O1k92J64L15k08j67j3J96j36q4l1R1M8K0j66M0Q1
6851d4K29k63M4J49k3o7K9j26m7J61M6r7l7K04k07j54K80j34O4p7J53j09J16M3
6875A33j56o8P0J20j43j63N8K08O3j42l0L0O6k65N8J39J11n0k42Q7L22j69L8n1
$$ plain form
6899 24 35 111 45 -73 -76 69 1 -6 -10 122 164 -97 -93 -69 157 267 -181 -358 -179 102 87 -44 30 65 0 -198
6925 -198 -146 160 142 -87 -94 -141 75 -23 42 -163 36 18 -59 -185 127 230 53 -40 -47 145 213 -34 -206 -17
6949 -17 122 -7 -104 -130 20 -75 49 -112 -186 -22 162 -227 164 146 -79 -20 -19 2 -31 152 -34 154 114 170
6973 170 -127 -63 -27 -77 -170 -122 -83 233 -91 -89 45 22 6 32 -64 -25 34 34 -167 -130 -14 123 -222 -191 76 188
6999 188 -109 -64 128 196 60 -36 -136 215 70 -136 -122 11 211 323 -171 -185 -13 308 9 -150 -174 59
7021 59 76 -18 -34 380 42 -3 -196 -2 330 59 -61 79 194 87 161 -83 -36 40 19 -109 23 252 139
7044 139 -64 -219 9 291 87 -211 -120 100 28 -52 -50 130 263 -25 -451 103 278 -61 -83 -174 124 274
7066 274 52 -47 114 126 71 -82 -104 115 119 9 -133 -223 227 147 -39 -255 17 66 -1 -236 -54 219 67
$$ packed form
6899B4J1P6o6j18lJ45o8pmJ32M2k61MK4K26J10m48j77J79K81j5j31P4L5o5j98
6925a98N2L06j8k29pm7K16r8O5k05J99j8p7j26L12J03j77r3pJ92O8k47j72J89
6949a7J39j29r7k6J50r5J24j61p4J64J84l89L91j8k25N9JK1l3J83j86J88m0N6
6973A70k97O4L6n0r3M8L9L16l24KJ34k3j6K6r6L9N9%k01L7J16J37l45L1K67J12
6999A88k97M5J92O8j36r6j00L51j45k06J4J33K00J12m94j4J72L21k99j59k4K33
7021E9J7r4j6M14l38m5j93J94L32k71j20J40J15j07P4k44M7P6k1j28J32K29j13
7044A39k03j55K28K82k04k98R1K20p2q0KJ80J33k88m26N54J75l39k2r1K98J50
7066B74k22r9J61J2n5j53k2K19Mj10j42r0M50q0j86k16K72M9o7k35J82K73j52
$$ plain form
7089 67 -392 -347 158 145 -37 -215 65 239 -53 -79 5 325 64 -205 -274 0 204 200 -186 -24 198 29 -155
7112 -155 -248 170 162 -126 -264 -31 183 -17 -4 -357 -16 267 -111 -154 -115 214 -30 -135 -162 267 141 -182
7134 -182 -336 -52 140 246 -125 -4 166 221 -133 -153 157 406 139 -148 -115 217 312 100 -59 65 63 -19
7156 -19 -169 -303 90 243 -252 -317 -38 276 134 -226 -120 223 227 -136 -256 254 189 -27 -134 -99 68 95
7178 95 -169 -260 130 269 -48 -178 40 244 72 -173 -101 296 189 -8 -228 63 169 14 -204 -47 163
7199 163 197 -77 -221 -164 240 87 -174 -94 183 319 22 -137 -49 253 -93 -100 -31 253 69 -126 -327 206
7221 206 112 -162 -212 -168 119 253 -94 -123 214 331 -27 -146 130 168 -35 -460 -272 78 290 30 -274 48
7243 48 298 53 -289 -242 305 221 -300 -225 -75 202 4 -276 -174 290 -43 8 -86 0 104 -41 -217 -164 146
$$ packed form
7089F7m59M5N05j3j82j78K80J74k92k6Q4L20k61k69o9K74K04ml86J62K22j69j84
7112a55r3M18qk88j38K33K14k00J3l53L41K83l78m3L9L29k44j05k7M29j26l23
7134a82j54K84J92J06l71J21J70N5l54k0L10K49k67k87L3L32R5k12j59J24kq2
7156a9j50j34L93J53m95o5K79L14j42l60J06L43Ml63j20N10o5k16j07L5J67K7
7178I5k64r1L90J39l17j30K18K04j72k45P2L97j07j97k20K91J06j55k18J57K10
7199A63L4k74j44N7M04j53k61Q0K77J36k97j59Q8L02l46pO9K84j84j95k01N33
7221B06r4k74n0M4K87J34l47k9L37J17l58j19K76L8k03m25J88L50K12k60l04L22
7243D8K50k45l42M7N47q4n21P5J50K77j98k80J02M64l33N1r4Q6J04j45j76N3L10
$$ plain form
7266 146 155 -167 -334 233 297 -104 -274 -34 208 192 -166 -251 207 217 49 -101 -59 263 -52 -250 -285 19 43
7289 43 -135 -185 -101 378 78 -271 4 32 -49 -59 -276 103 207 -14 -281 -224 307 156 -143 -204 98 261 -2
7312 -2 -166 -160 99 62 -163 -207 78 158 168 -266 -250 152 213 -174 -141 20 327 -124 -415 -43 56 -47 -207 -285
7336 -285 204 264 84 -137 107 317 31 -183 -206 342 353 -158 -85 -99 444 135 -303 17 203 318 -61 -198
7358 -198 18 259 -123 -210 5 157 104 -71 -190 80 182 -47 -43 28 146 238 -192 -157 290 282 -65 -278 -2
7381 -2 298 160 -224 -120 190 76 -60 -281 -42 261 158 -171 -140 75 352 54 -397 0 250 202 -124
7402 -124 -343 50 199 -65 -268 59 136 55 -175 -156 191 96 -143 -80 184 264 112 -130 -219 115 118 -222 -241
7425 -241 84 418 0 -249 -43 214 179 -198 -191 206 15 -59 -220 -65 270 89 -219 -287 51 277 -34 -279
$$ packed form
7266A46Rl22j67N67O4m01j70K40K42j6l58q5M58J0j68j50M2L22l15j98l5L04K4
7289D3j78n0Q4M79l00l49K75K8q1j0k17L79J04k21k67N7N31j51k99o1L02J63k63
7312bj64OK59l7k25m4K85Q0J0m34J6M02O1l87L3J61L07m51k91L72R9j03j60p8
7336b85M89O0j80k21K44K10k86k14k3N48J1n11P3j4N43l09m38L20J86J15l79j37
7358a98K16K41l82q7K15J52n3j75j19K70J02k29MP1J18R2m30L5M47ql47k13K76
7381bL00j38l84J04L10j14j36k21K39L03j03l29L1K15K77k98m51L97K50m8l26
7402a24k19L93J49k64k03L27P7q1k30J9L47r5k39O3K64Q0j52k42q9L34Ll40j9
7425b41L25L34m18k49K06K57l5l77PL97j91p4j61J55L35j81l08o8L38K26l11k45
$$ plain form
7447 -279 -14 172 92 -242 -75 133 184 53 -172 55 188 -6 -322 -154 163 204 -202 -358 84 305 80
7468 80 -280 -145 158 147 -194 -200 15 457 43 -191 -150 113 158 27 -280 109 187 40 -295 -227 192 37 -173
7491 -173 -284 81 137 -18 -180 -95 83 100 -46 -180 185 267 88 -280 -128 252 56 -264 -272 92 206 -77
7513 -77 -204 -80 385 -3 -204 -189 5 242 -63 -162 85 225 106 -287 -16 219 184 -72 -103 25 66 -92
7535 -92 -129 -111 210 185 -9 -141 150 394 -47 -223 -80 418 104 61 -104 157 183 -279 -302 -29 214 102
7557 102 -281 -212 92 373 17 -140 -145 -1 -9 -44 -209 21 102 -210 -162 90 243 8 -141 23 146 249 -166
7580 -166 -367 -5 100 228 -303 -121 200 105 -263 -265 263 331 129 -208 -146 269 96 -63 -94 -32 243 85
7602 85 -214 -131 111 156 -131 -59 186 131 57 9 83 138 173 -235 -136 321 210 -74 -156 -29 177 -40 -39 -207 90
$$ packed form
7447b79K65J86q0l34J67K08N1j31k25K27J33j94l16J68L17M1m06j56M42K21k25
7468H0l60J35L03j1l41oK15M42m14k34M1K63M5j31l07L89P8j47l35O8M19j55k10
7491a73j11L65N6j55j62Q5J78J7j46j34L65Q2j79l68J52L80j96l20qL64J14k83
7513g7j27J24M65l88k01J5J94K37l05r9K47J40j19l93K71K35l5k56l1J28M1j58
7535i2l7J8L21k5j94j32K91K44m41j76J43M98l14m3j65K61K6m62k3K73K43j12
7557A02l83O9L04K81l56j57nJ44ql5j65K30Q1l12M8K52J53k35j49J64J23J03m15
7580a66k01L62J05J28n31J82L21r5l68kN28O8k02l37O2M15j73j59l1O2K75j58
7602H5k99Q3K42M5k87P2K45n5p4m8P4N5L5m08R9M57j11k84q2J27K06k17Jj68K97
$$ plain form
7627 90 173 -126 -420 121 280 -17 -295 -131 218 192 -151 -278 63 113 -23 -170 -151 242 172 -234 -244 -59
7649 -59 284 -54 -72 -99 217 100 -27 -193 71 104 -96 -131 -32 142 87 -203 -485 -57 207 136 -213 -39 85
7672 85 43 -197 -154 81 88 -113 -241 -56 209 222 -143 -246 196 47 -143 -116 83 324 37 -223 -31 281
7694 281 26 72 -213 136 66 -62 -329 -26 352 -3 -113 -21 173 266 -34 -182 -175 263 123 -394 -254 142
7716 142 141 113 -207 -88 227 -49 -126 -140 222 272 -9 -179 46 74 104 47 -72 159 123 -71 -154 8 222 56
7740 56 -163 -240 49 293 -190 -238 129 230 44 -280 -73 361 93 -170 -304 55 146 -96 -24 121 168 328
7762 328 -158 -247 -9 417 138 -152 -119 226 282 -8 24 141 236 -108 -216 -40 195 162 -255 -315 204 270 -51
7785 -51 -269 -115 96 87 -192 -127 211 253 -162 -147 -45 239 -43 -130 -314 49 -88 -311 -275 -73 235 123 -289
$$ packed form
7627I0Q3k99k94N41J59k97k78J64L49k6l43j27L41N0j36j47J9L93p0m06j0J85
7649e9L43l38j8k7L16j17j27j66K64L3k00l5R9J74n5k90k82M28K64p1l49J74J24
7672H5m2k40M3K35Pk01j28J85K65J3l65j03M42j49j90K7J99K41k87k60J92L12
7694B81k55M6k85L49p0j28k67L03L78l55j10R2J94R3l00j48PM38j40n17J40L96
7716A42jk8l20J19L15k76p7j4L62N0k81j70K25K8L0n7j19K31l6j94q3J62K14j66
7740E6k19p7K89K44m83m8L67J01j86l24K07M34k68k63j34L59R1k42P2J45M7J60
7762C28m86q9K38M26k79k90L3L45N6k90L2J17R5l44j08J76K35l3m17o0N19O6l21
7785e1k18J54K11rk79O5L38M2m15J5J02K84k82q7j84L63j37k23L6K02L08j12m12
$$ plain form
7808 -289 -128 150 196 -46 -24 45 255 134 -46 11 203 7 -259 -104 165 315 -167 -165 -116 48 141 -85 -266
7831 -266 128 76 -103 -212 87 173 122 -251 -213 -3 164 -38 -194 -139 194 3 -149 -61 148 -52 -82 -213
7853 -213 38 133 145 -264 -222 237 266 -86 -111 -87 138 156 -93 -205 249 208 -236 -165 -49 290 -68 -117 10
7876 10 202 67 -107 -178 141 175 40 -41 -144 385 -10 -190 -234 46 235 37 -285 98 177 210 -192 -29
7898 -29 32 191 -65 -311 -154 114 -46 -180 -34 141 135 -94 -318 76 241 -27 -51 -79 217 28 -286 -200
7920 -200 122 195 81 -236 -52 28 180 32 -262 147 133 97 -124 -17 272 110 -177 -60 127 88 58 -247
7942 -247 86 219 133 -194 -203 82 216 98 -209 18 153 68 -224 -132 -56 139 -6 -188 6 185 -262 -84
7964 -84 -162 150 106 -259 -270 -98 86 -118 -190 -140 48 -11 -40 -236 -10 121 -70 -167 -25 165 73 -211 52
$$ packed form
7808b89J61K78M6k42K2O9K10j21j80N7J92j96k66J55K69J50m82KM9J64R3k26j81
7831b66L94n2j79j09K99Q6n1l73L8K10J67k02j56N5L33j91j52Q8K09k00l0j31
7853b13K51R5J2m09M2M59K9l52k5K4K25J8k49j12M54m1m44P1J16L39l58m9J27
7876A0J92j35j74p1L19L4j35q1j03N29l95j80m4K80J89j98l22L83P9L3m02J63
7898b9O1J59k56k46J57K68j60j34J46J75ok29k24L94J65k68k4k8K96j89l14Q6
7920b00L22P3j14l17J84Q0J52j48k94M09j4l6k21J07K89j62k87J17J87l9l0l05
7942b47L33J33q6l27rK85J34j18l07K27J35q5k92R2P6J95j45j82J94J79m47J78
7964h4p8L12m4l65j1J72J84k04p2N0J88n9k9j96K26J31j91r7J42J90r2k84K63
$$ plain form
7987 52 181 137 -12 -49 -143 197 138 -262 -13 163 156 -17 -47 34 51 -29 -140 -80 25 138 -192 -174 -24 148
8011 148 -69 -161 -27 169 183 -136 -168 44 181 77 -14 -255 31 104 34 -140 82 271 90 -161 -207 224
8033 224 68 -179 -297 96 136 -140 -249 60 119 108 -149 7 199 123 71 -301 -274 123 159 -149 -189 144 228
8056 228 23 -30 20 -29 -26 -62 -138 183 34 -38 -54 -77 26 35 -326 -232 163 132 -56 -171 27 188 73 -127 -101
8081 -101 201 76 -193 -56 46 285 -34 -2 141 23 -25 -204 -140 -161 -16 109 -190 -15 157 -5 -127
8102 -127 175 273 209 -37 -195 162 143 301 -172 -41 -22 47 -174 -127 -111 177 11 -227 -104 141 91 -3 -163
8125 -163 -104 141 18 -110 -6 60 112 30 -15 30 136 42 -122 48 119 37 -86 -233 17 262 -128 -73 17 251
8149 251 57 95 -277 -38 92 26 -33 -76 29 77 -56 -137 163 92 42 -145 126 54 -9 -166 -121 150 124 -23
$$ packed form
7987E2J29m4j49l7r4L40n9m00K49J76pj73l0Q1J7q0j11O0J05J13l30J8J50J72
8011A48k17r2J34J96J4l19l2K12J37j04r1k41K86P3p0j74K22J89j81k51m6M31
8033B24j56k47j18L93M0k76j09L09N9j1k57J56J92p6n2l72K7L97L6l08m0L33Q4
8056B28k05n3N0m9Ll6p6L21j49p2j6k3J03Rl61R4L95l1j88j15J98J61j15k00K6
8081a01L02j25k69J37J02K39l19L2J43j18m8j79O4k1J45J25k99J75J72j62j22
8102a27L02R8o4k46j58L57j9J58m73J31J9O9k21M7J6K88j66k38J23K45n0r4j60
8125a63N9K45j23j28J04O6N2q2m5M5J06r4j64J70P1q2j23j47K50K45l90N5R0K34
8149B51j94L8l72K39J30o6n9m3J05M8j33q1L00p1n0j87K71p2o3j57M5K71k6j47
$$ plain form
8173 -23 -32 -123 189 -19 -195 -326 130 3 -104 -69 4 -30 -71 -153 -150 150 239 -134
$$ packed form
8173b3rr1L12k08j76j31M56j27j07L5P3l4m1q2LL00Q9l73
8191a34
$$ Imaginary data points
##PAGE= N=2
##DATA TABLE= (X++(I..I)), XYDATA
$$ plain form
0 0 0 0 0 0 0 0 0 0 0 0 8 -8 8 -8 16 -16 24 -24 32 -40 48 -56 65 -80 96 -112 128 -149 169 -193 224 -256
32 -256 289 -329 369 -417 469 -523 585 -654 726 -808 896 -991 1097 -1212 1336 -1477 1626
49 1626 -1790 1974 -2175 2396 -2645 2923 -3237 3591 -4001 4477 -5039 5714 -6544 7590 -8954
64 -8954 10823 -13552 17917 -26037 46304 -208553 -184249 372951 324561 -44609 -292720 -102667
76 -102667 82957 55968 -29145 83658 148242 -29144 -279685 -174438 199458 352315 53160
87 53160 -284540 -259952 50164 220510 122450 -34404 -82961 -89534 -78783 3308 144286
98 144286 158391 -28392 -200127 -129888 76317 165900 70338 -44068 -68388 -65143 -59091 30454
110 30454 153461 123381 -95496 -237867 -76237 191806 194795 -52159 -188454 -49866 109481
$$ packed form
0@%%%%%%%%%%Qj6J6j6K4l2M0m8N6p2Q8j04J21j45J76k08K40k77L18l62M17m80
32b56N45o18O98p86Q86r92J108j239J380j534J704j887K088k309K548k813L103
49A626l416L764m149M571n041N568o160O828p592Q478r516J0753j2258J4134j6544
64h954J9777k4375L1469m3954P2341k54857K4304N57200m8390l69170k48111J90053
76a02667J85624k6989q5113J12803O4584j77386k50541J05247L73896J52857k99155
87E3160l37700K4588L10116J70346r8060j56854m8557o573J0751Q2091J40978
98A44286J4105j86783j71735P0239K06205Q9583r5562j14406k4320L245O052Q9545
110C0454J23007l0080k18877j42371J61630K68043K989k46954j36295J38588J59347
$$ plain form
121 109481 45760 -77804 -9916 126464 53830 -161655 -165088 109274 259999 33278 -246578
132 -246578 -168671 142410 221150 -29837 -200842 -45204 151809 75403 -126373 -107205 103648
143 103648 146759 -57297 -174034 -13587 171160 90416 -125520 -132967 66205 148595 333
154 333 -135044 -55854 95737 81554 -47226 -75830 7408 43278 -11692 -31869 34368 54758
166 54758 -35103 -90304 -6890 98054 66015 -53042 -75641 8252 39960 -7649 -9789 55908
178 55908 48174 -83684 -141772 17973 189464 106456 -136712 -198756 9635 179775 81059
189 81059 -93339 -78249 48567 43539 -78227 -60894 120260 160206 -62022 -240958 -91005
200 -91005 202889 223043 -55635 -229686 -88916 118126 111956 -26279 -46230 35891 9097
$$ packed form
121A09481o3721j23564O7888J36380p2634k15485l433K74362J50725k26721k79856
132b46578P7907L11081P8740k50987j71005J55638J97013p6406k01776J9168K10853
143A03648M3111k04056j16737J60447J84747q0744k15936p447J99172Q2390j48262
154C33j35377P9190J51591j4183j28780k8604Q3238L5870n4970k0177O6237K0390
166E4758q9861n5201Q3414J04944l2039j19057k2599Q3893L1708m7609k140O5697
178E5908p734j31858n8088J59745J71491q3008k43168o2044K08391J70140r8716
189H1059j74398J5090J26816n028j21766J7333J81154L9946k22228j78936J49953
200i1005K93894K0154k78678j74051J40770K07042o170j38235j9951Q2121k6794
$$ plain form
211 9097 -104785 -77644 111239 193249 5830 -210708 -148199 98342 193713 49625 -106228
222 -106228 -92205 -4932 11530 10982 65606 79966 -34750 -158179 -93300 111169 179927 23077
234 23077 -137238 -110082 24221 77262 37500 22420 22740 -46939 -118079 -45467 129405 166552
246 166552 -24598 -195763 -109783 101339 150461 6598 -94724 -34254 29246 -18075 -45594
257 -45594 51649 129825 15069 -169756 -135214 104376 212407 34496 -175745 -132080 70883
268 70883 127395 1351 -71304 -1737 44094 -35425 -89357 22234 142527 57453 -130329
279 -130329 -144076 45487 167125 55232 -104754 -89551 30351 60357 -5131 -19794 37770
290 37770 26280 -71308 -84960 42284 130320 32636 -120686 -102862 52588 111348 13683
$$ packed form
211I097j13882K7141J88883Q2010j87419k16538O2509K46541R5371j44088j55853
222a06228J4023Q7273J6462n48N4624J4360j14716j23429O4879K04469O8758j56850
234B3077j60315K7156J34303N3041l9762j5080L20o9679p1140P2612J74872L7147
246A66552j91150j71165Q5980K11122M9122j43863j01322O0470O3500m7321k7519
257d5594R7243P8176j14756j84825L4542K39590J08031j77911k10241M3665K02963
268G0883N6512j26044p2655O9567M5831p9519n3932J11591J20293q5074j87782
279a30329j3747J89563J21638j11893j59986J5203J19902L0006o5488j4663N7564
290C7770j1490r7588j3652J27244Q8036r7684j53322J7824J55450N8760r7665
$$ plain form
301 13683 -69512 -26825 36354 1818 -44101 15675 88420 26061 -105568 -99562 62907 145554
313 145554 19286 -126994 -87774 57927 91391 -9738 -58270 7970 38564 -33063 -67728
324 -67728 29178 119970 33813 -124539 -110239 65199 147750 25758 -113237 -74888 48887
335 48887 58889 -20086 -27519 38408 32255 -69108 -90264 44166 139137 36517 -125135 -113646
347 -113646 52321 129319 24979 -76949 -41401 30576 13280 -35914 5888 80377 29681
358 29681 -99372 -104422 45260 142341 41114 -112117 -98361 36367 85935 11898 -39990
369 -39990 2386 28486 -34094 -64192 28659 114091 40675 -109264 -115749 41633 133355 37037
381 37037 -88500 -71628 27939 45101 -17265 -18045 45610 33843 -63864 -89752 29140 130984
$$ packed form
301A3683q3195M2687O3179l4536m5919N9776P2745o2359j31629O006J62469Q2647
313A45554j26268j46280L9220J45701L3464j01129m8532O6240L0594p1627l4665
324f7728R6906R0792q6157j58352J4300J75438Q2551j21992j38995L8349J23775
335D8887J0002p8975p433O5927o153j01363k1156J34430R4971j02620j61652J1489
347a13646J65967P6998j04340j01928L5548P1977j7296m9194M1802P4489n0696
358B9681j29053n050J49682R7081j01227j53231J3756J34728M9568p4037n1888
369c9990M2376K6100o2580l0098R2851Q5432p3416j49939o485J57382R1722r6318
381C7037j25537J6872R9567J7162o2366p80O3655j1767r7707k5888J18892J01844
$$ plain form
393 130984 50696 -102917 -107480 31167 107574 31110 -59417 -34788 22751 1394 -37648 5864
405 5864 74928 34227 -86343 -99562 35256 125314 41791 -90468 -84372 30955 72157 5077
417 5077 -31841 11341 28692 -35630 -69140 20862 111629 43644 -102749 -114953 30995 127185
429 127185 41767 -82981 -69875 25332 45497 -11269 -18926 40808 38444 -55557 -87529 20234
441 20234 121776 58170 -90927 -111435 16481 98593 38401 -46939 -37875 12044 -1865 -35600
453 -35600 9224 76435 37788 -79102 -102473 23179 124355 55356 -75658 -87315 11167
464 11167 64099 16316 -21521 9924 19534 -39374 -66870 14491 104398 52716 -86220 -111792
476 -111792 11430 106549 52774 -52961 -58082 10194 23910 -12597 -1307 50815 36147 -60423
$$ packed form
393A30984q0288j53613m563J38647P6407p6464r0527K4629N7539k1357l9042M3512
405E864O9064m0701j20570j3219J34818R0058q3523j32259O096J15327M1202o7080
417E077l6918M3182J7351o4322l3510R0002R0767o7985j46393j2204J45948R6190
429A27185q5418j24748J3106R5207K0165n6766p657N9734k364r4001l1972J07763
441B0234J01542o3606j49097k0508J27916Q2112o0192q5340R064M9919j3909l3735
453c5600M4824O7211l8647j16890k3371J25652J01176o8999j31014j1657R8482
464A1167N2932m7783l7837L1445R610n8908k7496Q1361Q9907n1682j38936k5572
476a11792J23222R5119n3775j05735n121O8276J3716l6507J1290N2122j4668r6570
$$ plain form
488 -60423 -93923 14269 116779 60260 -77391 -105317 4296 82716 32703 -35740 -21130
499 -21130 16562 -7624 -45636 415 81838 53972 -66895 -104378 4406 110207 64006
510 64006 -59216 -81260 1904 48502 12367 -17192 12504 24147 -36147 -70252 6315 95931
522 95931 58854 -67435 -104427 2175 94166 50967 -40436 -49348 6920 19706 -16628 -5738
534 -5738 49803 38299 -53574 -92733 536 106362 66534 -63595 -99765 -6760 72185 39760
546 39760 -24969 -19005 13424 -9188 -41805 294 75027 56250 -56157 -103253 -8357 95332
558 95332 68195 -39852 -76818 -14367 33012 13685 -1673 21409 19118 -39992 -70240 4336
570 4336 94714 63617 -53528 -96602 -12270 74051 50385 -21480 -31245 159 -4440 -29607
$$ packed form
488f0423l3500J08192J02510n6519j37651k7926J09613P8420n0013o8443J4610
499b1130L7692k4186l8012M6051Q1423k7866j20867l7483J08784J05801m6201
510F4006j23222k2044Q3164M6598l6135k9559K9696J1643o0294l4105P6567Q9616
522I5931l7077j26289l6992J06602R1991m3199r1403q912N6268J2786l6334J0890
534e738N5541j1504r1873l9159R3269J05826l9828j30129l6170R3005P8945l2425
546C9760o4729N964L2429k2612l2617M2099P4733j8777j12407m7096R4896J03689
558I5332k7137j08047l6966O2451M7379j9327j5358K3082k291n9110l0248P4576
570D336R0378l1097j17145m3074Q4332Q6321k3666p1865r765L1404m599k5167
$$ plain form
582 -29607 -704 63785 49070 -55670 -102332 -10572 99701 76596 -44037 -89179 -13039
593 -13039 53334 28313 -16049 -563 26429 -12187 -61793 -18110 74368 73865 -35533 -104466
605 -104466 -32078 75907 68626 -22102 -59434 -12513 24732 1594 -12959 24412 39829 -17238
617 -17238 -68124 -24006 66323 70443 -22076 -76139 -24805 44761 38825 -13074 -22173 6196 626
630 626 -27750 -12014 40097 44220 -24615 -68885 -13403 62007 48291 -26530 -51278 -142 35986
643 35986 5655 -20876 6528 28426 -9269 -51738 -15175 60230 51055 -41268 -79963 -5330
655 -5330 74719 44239 -44172 -53996 13599 42305 -964 -28995 10176 40826 -8007 -61032
667 -61032 -19246 65335 62400 -34850 -88338 -19312 67716 53143 -23942 -50632 -8659 20359
$$ packed form
582b9607K8903O4489j4715j04740m6662R1760J10273k3105j20633m5142P6140
593a3039O6373k5021m4362J5486K6992l8616m9606M3683R2478n03j09398o8933
605a04466P2388J07985p281r0728l7332M6921L7245k3138j4553L7371J5417n7067
617a7238n0886M4118R0329M120r2519n4063N1334O9566n936n1899r099K8369n570
630F26k8376J5736N2111M123o8835m4270N5482P5410j3716p4821k4748N1136L6128
643C5986l0331k6531K7404K1898l7695m2469L6563P5405r175r2323l8695P4633
655e330Q0049l0480q8411r824O7595K8706m3269k8031L9171L0650m8833n3025
667f1032M1786Q4581k935r7250n3488O9026Q7028j4573p7085k6690M1973K9018
$$ plain form
679 20359 1561 -4864 25020 27388 -25303 -60489 -10623 67421 60133 -25188 -70988 -27002 36053
692 36053 40349 4767 -9895 -9707 -26515 -31265 12689 63317 40452 -46643 -81808 -11717 69182
705 69182 59236 -13727 -48155 -18939 7147 2451 11813 39371 24366 -45469 -80491 -8622 87547
718 87547 73308 -35733 -94535 -33717 52399 53511 -1440 -19951 -3331 -9930 -32630 -6923
730 -6923 59760 65319 -25106 -96102 -45281 64178 88605 3476 -69355 -46856 11822 28327
742 28327 12155 10872 14321 -18423 -55066 -24001 53208 73810 1557 -73196 -52796 26847
754 26847 58722 22335 -18409 -23349 -14747 -14919 1879 38975 38883 -19317 -65974 -33137 43661
767 43661 62318 2573 -46425 -29112 10670 18099 5028 11581 19486 -11718 -47555 -21179 45682
$$ packed form
679B0359j8798o425K9884K368n2691l5186M9866P8044p288q5321m5800M3986O3055
692C6053M296l5582j4662J88j6808m750M3954N0628k2865q7095l5165P0091Q0899
705F9182r946p2963l4428K9216K6086m696R362K7558j5005o9835l5022P1869R6169
718H7547j4239j09041n8802O0818Q6116J112n4951j8511J6620o599k2700K5707
730f923O6683N559r0425p0996N0821J09459K4427q5129p2831K2499N8678J6505
742B8327j6172j283L449l2744l6643L1065P7209K0602p2253p4753K0400P9643
754B6847L1875l6387m0744m940Q602j72J6798L7096r2n8200m6657L2837P6798
767D3661J8657n9745m8998J7313L9782P429j3071O553P905l1204l5837K6376O6861
$$ plain form
780 45682 60668 -8471 -69758 -36206 38830 50358 -4347 -37782 -10689 17733 -524 -17828
792 -17828 9543 36748 6857 -46054 -37077 32904 61496 4642 -54535 -35377 27453 41458
804 41458 -2724 -27724 -5931 11431 -5029 -16522 9218 32182 2109 -41785 -27732 29471
816 29471 48495 1607 -42956 -23189 21864 26584 -146 -10879 1071 -206 -18525 -10521 25869
829 25869 32813 -11344 -49061 -22746 35012 42991 -4403 -35245 -16595 12509 12267 1459 10376
842 10376 15468 -13508 -39327 -12100 43195 48919 -13834 -61110 -28645 33919 43711 730 -28141
855 -28141 -13169 2127 -6112 -3122 24995 33249 -10140 -54623 -28743 42393 61863 4080 -52667
868 -52667 -38849 15017 34132 11731 -4711 -4224 -12487 -26626 -11155 33958 46747 -4831 -56416
$$ packed form
780D5682J4986o9139o1287L3552P5036J1528n4705l3435K7093K8422j8257j7304
792a7828K7371K7205k9891n2911Q977O9981K8592n6854n9177J9158O2830J4005
804D1458m4182k5000K1793J7362j6460j1493K5740K2964l0073m3894J4053N7203
816B9471J9024m6888m4563J9767M5053M720k6730j0733J1950j277j8319Q004L6390
829B5869O944m4157l7717K6315N7758P979m7394l0842J8650K9104k42j0808Q917
842A0376N092k8976k5819K7227N5295N724o2753m7276L2465O2564R792m2981k8871
855b8141J4972J5296q239K990K8117Q254m3389m4483K5880P1136J9470n7783n6747
868e2667J3818N3866J9115k2401j6442M87q263j4139J5471M5113J2789n1578n1585
$$ plain form
881 -56416 -38323 26782 55176 16742 -28577 -28263 -4216 7253 10435 19067 18611 -13632 -45745
894 -45745 -24291 33475 53000 6153 -47805 -40923 9941 34481 17657 -4047 -9239 -11224 -17878
907 -17878 -4957 31172 39847 -4268 -49793 -35280 25195 52172 13111 -33194 -31601 -934
919 -934 14308 8346 7751 10908 -8215 -33777 -20418 27584 49027 8440 -44549 -38040 14431
932 14431 41317 17555 -16014 -18902 -4917 -2963 -736 16559 23249 -4183 -39387 -29618 22025
945 22025 47356 12178 -34431 -34401 4472 27766 14768 -1903 -3650 -6872 -15428 -8283 20866
958 20866 34156 1541 -40302 -33120 14769 41658 15395 -24595 -27990 -3621 10603 9453 9598
971 9598 9853 -6180 -28102 -17887 23944 42117 8612 -36456 -35201 8588 34683 16285 -11405
$$ packed form
881e6416J8093O5105K8394l8434m5319L14K4047J1469L182Q632m56l2243l2113
894d5745K1454N7766J9525m6847n3958O882N0864K4540j6824k1704n192j985o654
907a7878J2921L6129Q675m4115m5525J4513O0475K6977l9061m6305J593L0667
919i34J5242n962n95L157j9123k5562J3359M8002K1443m0587n2989O509N2471
932A4431K6886k3762l3569k888J3985J954K227J7295O690k7432l5204R769N1643
945B2025K5331l5178m6609L0L8873K3294j2998j6671j747l222q556P145K9149
958B0866J3290l2615m1843P182M7889K6889k6263l9990l395K4369J4224j150J45
971I598K55j6033k1922J0215M1831J8173l3505m5068J255M3789K6095j8398k7690
$$ plain form
984 -11405 -17175 -8940 -4801 -62 16469 23191 -3092 -35201 -27318 17527 44060 16586 -26969
997 -26969 -31774 -1693 20884 16820 3710 -1845 -10204 -20566 -10033 20239 32969 3873 -36401
1010 -36401 -34169 9173 37013 19157 -14675 -23822 -7511 5206 8376 13857 14268 -4379 -27522
1023 -27522 -21435 16451 39403 12958 -28766 -34323 -1431 25898 17725 -3720 -11171 -10221 -10203 -2303
1037 -2303 16409 25743 3100 -30231 -27435 11265 37281 18745 -18588 -27819 -4982 13161 11997
1050 11997 5297 496 -7370 -18648 -13556 14200 30037 8256 -26414 -30569 2743 30490 19856
1063 19856 -7495 -18091 -9750 2000 7601 12431 12288 -4656 -24357 -18234 12040 30924 11699
1076 11699 -22844 -28364 -2529 19011 16335 1061 -7888 -9330 -9885 -1714 17143 23249 1791
$$ packed form
984a1405n770Q235M139M739J6531O722k6283l2109P883M4845K6533k7474m3555
997b6969m805L0081K2577m064j3110n555q359j0362J0533L0272J2730k9096m0274
1010c6401K232M3342K7840j7856l3832r147J6311J2717L170N481M11j8647k3143
1023b7522O087L7886K2952k6445m1724n557L2892K7329q173k1445p451R50J8P900
1037b303J8712R334k2643l3331K796L8700K6016j8536l7333r231K2837J8143j164
1050A1997o700m801p866j1278N092K7756J5837k1781l4670m155L3312K7747j0634
1063A9856k7351j0596Q341J1750N601M830j43j6944j9701O123L0274J8884j9225
1076A1699l4543n520K5835K1540k676j5274q949j442n55Q171J8857O106k1458
$$ plain form
1089 1791 -26493 -25030 8949 31994 15981 -15272 -25140 -8679 9432 11747 7811 2613 -9143
1102 -9143 -19657 -11127 15464 30460 9213 -24783 -28410 1389 27429 21070 -4639 -17432 -11945
1115 -11945 -2779 6201 13892 12758 -4002 -24940 -21423 9353 30806 16735 -16472 -29498 -8960
1128 -8960 16670 20928 8267 -5844 -13740 -12974 -1763 16938 23340 2624 -24413 -25681 1201
1141 1201 25880 19729 -6642 -21548 -15364 757 12946 15620 8218 -8983 -22731 -12733 14775
1154 14775 29418 12016 -18922 -26837 -4721 18024 19072 3151 -11186 -15008 -10352 712 16058
1167 16058 18633 -958 -23807 -23085 5543 28906 18991 -9573 -23503 -11704 9048 16899 10607
1180 10607 392 -10756 -16356 -7559 11641 22451 8075 -18930 -25964 -4504 19548 21158 870
$$ packed form
1089A791k8284J463L3979K3045j6013l1253r868J6461J8111K315l936n198j1756
1102i143j0514Q530K6591J4996k1247l3996l627K9799K6040o359k5709j2793N487
1115a1945R166Q980P691j134j6760k0938L517L0776K1453j4071l3207j3026K0538
1128h960K5630M258j2661j4111p896P66J1211J8701O402k0716k7037j268K6882
1141A201K4679o151k6371j4906O184J6121J2189K674p402j7201j3748R998K7508
1154A4775J4643j7402l0938p915K2116K2745J048j5921j4337l822M656J1064J5346
1167A6058K575j9591k2849P22K8628K3363r915k8564j3930J1799K0752P851o292
1180A0607j0215j1148n600Q797J9200J0810j4376k7005p034K1460K4052J610k0288
$$ plain form
1193 870 -16137 -15297 -3030 10224 16504 10311 -5675 -18965 -14067 8723 23747 12425 -11642
1206 -11642 -22829 -10016 10057 16360 7535 -5675 -14786 -12902 76 15387 18447 1052 -19298
1219 -19298 -18471 3215 21828 17364 -3841 -17415 -12622 1154 12007 12864 3535 -10151 -18734
1232 -18734 -9556 11685 21400 7502 -15865 -22079 -4181 16275 17996 3865 -10466 -13614 -5442
$$ packed form
1193H70j7007Q40J2267J3254O280o193j5986j3290M898K2790J5024j1322k4067
1206a1642j1187J2813K0073O303q825j3210r111J884J2978J5311L060j7395k0350
1219a9298Q27K1686J8613m464k1205j3574M793J3776J0853Q57r329j3686q583
1232a8734R178K1241R715j3898k3367o214J7898K0456J721j4131j4331l148Q172
$$ [...]
8191d3
##END NTUPLES=NMR FID
##END=
