##TITLE=1H_Pr NFfN
 200.13MHz, CDCl3,
 8 sc
 
 23.1.2025
##JCAMPDX= 6.0         $$ Bruker NMR JCAMP-DX V2.0
##DATA TYPE= NMR FID
##DATA CLASS= NTUPLES
##ORIGIN= UXNMR, Bruker Analytische Messtechnik GmbH
##OWNER= pz
$$ XWIN-NMR		Version 3.5
$$ Thu Jan 23 15:10:47 2025 Russian Standard Time (UT+4h)  she@DPX200
##.OBSERVE FREQUENCY= 200.1313
##.OBSERVE NUCLEUS= ^1H
##.DELAY= (6, 6)
##.ACQUISITION MODE= SIMULTANEOUS
##.ACQUISITION SCHEME= undefined
##.AVERAGES= 8
##.DIGITISER RES= 18
##SPECTROMETER/DATA SYSTEM= spect
##.PULSE SEQUENCE= zg30
##.SOLVENT NAME= D2O
##.SHIFT REFERENCE= (INTERNAL, D2O, 0, 14.3821)
##AUDIT TRAIL= $$ (NUMBER, WHEN, WHO, WHERE, WHAT)
$$ ##TITLE= Audit trail, XWIN-NMR		Version 3.5
$$ ##JCAMPDX= 5.01
$$ ##ORIGIN= Bruker BioSpin GmbH
$$ ##OWNER= she
$$ F:/spectra/data/she/nmr/H-C/1/audita.txt
$$ ##AUDIT TRAIL=  $$ (NUMBER, WHEN, WHO, WHERE, WHAT)
(   1,<2025-01-23 15:07:36.67 +0400>,<she>,<DPX200>,
      <created by zg, POWCHK disabled, PULCHK disabled
       configuration hash MD5:
       00 E9 B6 7A A2 85 ED C7 34 08 36 98 17 FE 4E 26
       data hash MD5: 16K
       87 4C C7 9B 89 7E EC 94 B3 40 2E 88 9D 24 EE A5>)
$$ ##END=
$$ 
$$ hash MD5
$$ 80 1F 6C 19 48 F4 0E F7 20 73 46 E8 83 7A 8A 26
##$RELAX= 
##$RELAX= 
##$RELAX= 
##$RELAX= 
##$RELAX= 
##$RELAX= 
$$ Bruker specific parameters
$$ --------------------------
##$DU= <F:/spectra>
##$EXPNO= 1
##$NAME= <H-C>
##$PROCNO= 1
##$TYPE= <nmr>
##$USER= <she>
##$AMP= (0..31)
100 100 100 100 100 100 100 100 100 100 100 100 100 100 100 100 100 100 
100 100 100 100 100 100 100 100 100 100 100 100 100 100 
##$AQSEQ= 0
##$AQ_mod= 1
##$AUNM= <au_zg>
##$AUTOPOS= <>
##$BF1= 200.13
##$BF2= 200.13
##$BF3= 200.13
##$BF4= 200.13
##$BF5= 200.13
##$BF6= 200.13
##$BF7= 200.13
##$BF8= 200.13
##$BYTORDA= 1
##$CFDGTYP= 0
##$CFRGTYP= 5
##$CHEMSTR= <none>
##$CNST= (0..31)
1 1 145 1 1 1 1 1 1 1 1 1 1 1 1 1 1 1 1 1 1 1 1 1 1 1 1 1 1 1 1 1 
##$CPDPRG= <>
##$CPDPRG1= <>
##$CPDPRG2= <>
##$CPDPRG3= <>
##$CPDPRG4= <mlev>
##$CPDPRG5= <mlev>
##$CPDPRG6= <mlev>
##$CPDPRG7= <mlev>
##$CPDPRG8= <mlev>
##$CPDPRGB= <>
##$CPDPRGT= <>
##$D= (0..31)
0 0.7 0 0 0 0 0 0 0 0 0 0.03 0 0 0 0 0 0 0 0 0 0 0 0 0 0 0 0 0 0 0 0 
##$DATE= 1737630456
##$DBL= (0..7)
120 120 120 120 120 120 120 120 
##$DBP= (0..7)
150 150 150 150 150 150 150 150 
##$DBP07= 0
##$DBPNAM0= <>
##$DBPNAM1= <>
##$DBPNAM2= <>
##$DBPNAM3= <>
##$DBPNAM4= <>
##$DBPNAM5= <>
##$DBPNAM6= <>
##$DBPNAM7= <>
##$DBPOAL= (0..7)
0.5 0.5 0.5 0.5 0.5 0.5 0.5 0.5 
##$DBPOFFS= (0..7)
0 0 0 0 0 0 0 0 
##$DE= 6
##$DECBNUC= <off>
##$DECIM= 32
##$DECNUC= <off>
##$DECSTAT= 4
##$DIGMOD= 1
##$DIGTYP= 9
##$DL= (0..7)
0 120 120 120 120 120 120 120 
##$DP= (0..7)
150 150 150 150 150 150 150 150 
##$DP07= 0
##$DPNAME0= <>
##$DPNAME1= <>
##$DPNAME2= <>
##$DPNAME3= <>
##$DPNAME4= <>
##$DPNAME5= <>
##$DPNAME6= <>
##$DPNAME7= <>
##$DPOAL= (0..7)
0.5 0.5 0.5 0.5 0.5 0.5 0.5 0.5 
##$DPOFFS= (0..7)
0 0 0 0 0 0 0 0 
##$DQDMODE= 0
##$DR= 18
##$DS= 0
##$DSLIST= <SSSSSSSSSSSSSSS>
##$DSPFIRM= 0
$$ [...]
##$SUBNAM0= <"">
##$SUBNAM1= <"">
##$SUBNAM2= <"">
##$SUBNAM3= <"">
##$SUBNAM4= <"">
##$SUBNAM5= <"">
##$SUBNAM6= <"">
##$SUBNAM7= <"">
##$SUBNAM8= <"">
##$SUBNAM9= <"">
##$SW= 18.0517328524113
##$SWIBOX= (0..15)
0 0 2 0 0 0 0 0 0 0 0 0 0 0 0 0 
##$SW_h= 3612.71676300578
##$TD= 16384
##$TD0= 1
##$TE= 0
##$TE2= 300
##$TE3= 300
##$TEG= 300
##$TL= (0..7)
0 120 120 120 120 120 120 120 
##$TP= (0..7)
150 150 150 150 150 150 150 150 
##$TP07= 0
##$TPNAME0= <>
##$TPNAME1= <>
##$TPNAME2= <>
##$TPNAME3= <>
##$TPNAME4= <>
##$TPNAME5= <>
##$TPNAME6= <>
##$TPNAME7= <>
##$TPOAL= (0..7)
0.5 0.5 0.5 0.5 0.5 0.5 0.5 0.5 
##$TPOFFS= (0..7)
0 0 0 0 0 0 0 0 
##$TUNHIN= 0
##$TUNHOUT= 0
##$TUNXOUT= 0
##$USERA1= <user>
##$USERA2= <user>
##$USERA3= <user>
##$USERA4= <user>
##$USERA5= <user>
##$V9= 5
##$VALIST= <valist>
##$VCLIST= <CCCCCCCCCCCCCCC>
##$VD= 0
##$VDLIST= <DDDDDDDDDDDDDDD>
##$VPLIST= <PPPPPPPPPPPPPPP>
##$VTLIST= <TTTTTTTTTTTTTTT>
##$WBST= 1024
##$WBSW= 4
##$XGAIN= (0..3)
0 0 0 0 
##$XL= 0
##$YL= 0
##$YMAX_a= 265212
##$YMIN_a= -271713
##$ZGOPTNS= <>
##$ZL1= 120
##$ZL2= 120
##$ZL3= 120
##$ZL4= 120
##$ABSF1= 10
##$ABSF2= 0
##$ABSG= 5
##$ABSL= 3
##$ALPHA= 0
##$AQORDER= 0
##$ASSFAC= 0
##$ASSFACI= 0
##$ASSFACX= 0
##$ASSWID= 0
##$AUNMP= <proc_1d>
##$AZFE= 0.1
##$AZFW= 0.1
##$BCFW= 1
##$BC_mod= 2
##$BYTORDP= 1
##$COROFFS= 0
##$CY= -3
##$DATMOD= 1
##$DC= 2
##$DFILT= <>
##$DTYPP= 0
##$F1P= 0
##$F2P= 0
##$FCOR= 0.5
##$FTSIZE= 0
##$FT_mod= 4
##$GAMMA= 1
##$GB= 0.15
##$INTBC= 1
##$INTSCL= 1
##$ISEN= 128
##$LB= 0.25
##$LEV0= 0
##$LPBIN= 0
##$MAXI= 10000
##$MC2= 0
##$MEAN= 0
##$ME_mod= 0
##$MI= 1.114404
##$NCOEF= 0
##$NC_proc= 0
##$NLEV= 6
##$NOISF1= 3.799351
##$NOISF2= 2.8
##$NSP= 1
##$NTH_PI= 0
##$NZP= 0
##$OFFSET= 14.38212
##$PC= 1
##$PHC0= 101.916
##$PHC1= 1.592201
##$PH_mod= 1
##$PKNL= yes
##$PPARMOD= 0
##$PSCAL= 0
##$PSIGN= 0
##$REVERSE= no
##$SF= 200.129724274929
##$SI= 16384
##$SIGF1= 3
##$SIGF2= 2
##$SINO= 400
##$SIOLD= 16384
##$SREGLST= <1H.CDCl3>
##$SSB= 0
##$STSI= 0
##$STSR= 0
##$SW_p= 3205.1282051282
##$SYMM= 0
##$S_DEV= 0
##$TDeff= 0
##$TDoff= 0
##$TI= <>
##$TILT= no
##$TM1= 0
##$TM2= 0
##$TOPLEV= 0
##$USERP1= <user>
##$USERP2= <user>
##$USERP3= <user>
##$USERP4= <user>
##$USERP5= <user>
##$WDW= 1
##$XDIM= 8192
##$YMAX_p= 0
##$YMIN_p= 0
$$ End of Bruker specific parameters
$$ ---------------------------------
##NTUPLES= NMR FID
##VAR_NAME=  TIME,          FID/REAL,        FID/IMAG
##SYMBOL=    X,             R,               I
##VAR_TYPE=  INDEPENDENT,   DEPENDENT,       DEPENDENT
##VAR_FORM=  AFFN,          ASDF,            ASDF
##VAR_DIM=   8192,          8192,            8192
##UNITS=     SECONDS,       ARBITRARY UNITS, ARBITRARY UNITS
##FACTOR=    0.0002768,     1,               1
##FIRST=     0,             0,               0
##LAST=      2.2672688,     0,               0
##MIN=       0,             -271713,         0
##MAX=       2.2672688,     265212,          0
$$ Real data points
##PAGE= N=1
##DATA TABLE= (X++(R..R)), XYDATA
$$ plain form
0 0 0 0 0 0 0 0 0 0 0 0 0 0 0 0 0 0 0 -4 8 -8 8 -8 9 -16 16 -19 24 -24 32 -36 40 -46 53 -60 68 -77 87 -98 111
39 111 -124 138 -154 171 -192 211 -234 259 -285 315 -347 380 -419 463 -508 562 -618 682 -755
58 -755 836 -932 1041 -1163 1311 -1489 1700 -1947 2212 -2366 1484 12681 265212 55395
72 55395 -217739 -9616 61803 1275 83430 -31557 -214913 81630 264263 -117589 -234936
83 -234936 124785 148226 -63696 -27738 -25388 -65176 140241 117921 -220698 -118458 240081
94 240081 75913 -193391 -37329 75673 3803 55516 -13197 -174860 41403 236687 -71492
105 -71492 -221901 85726 156147 -49623 -46515 -13426 -47294 102515 111243 -175651 -127837
116 -127837 200162 97337 -172894 -59509 79501 17664 32442 -7350 -141680 18660
$$ packed form
0@%%%%%%%%%%%%%%%%%mJ2j6J6j6J7k5L2l5M3m8N6o8P6q6R9j13J28j45J64j85K09
39A11k35K62k92L25l63M03m45M93n44O00o62P27p99Q82r71J070j180J300j437
58g55J591j768J973k204K474k800L189l647M159m578L850J1197K52531k09817
72E5395k73134K08123P1419o0528Q2155j14987j83356K96543J82633l81852j17347
83b34936L59721K3441k11922L5958K350l9788K05417k2320l38619J02240L58539
94B40081j64168k69304J56062J13002p1870N1713o8713j61663K16263J95284l08179
105g1492j50409L07627P0421k05770L108L3089l3868J49809Q728k86894M7814
116a27837L27999j02825k70231J13385J39010o1837J4778l9792j34330J60340
$$ plain form
126 18660 208631 -37306 -208028 54468 158260 -33666 -61467 -8566 -30537 75588 99308
137 99308 -137165 -128280 162437 108236 -149216 -73674 77809 27297 15253 -3330 -111563
148 -111563 1618 178636 -10662 -187415 27681 152338 -18499 -70392 -6933 -16289 54936
159 54936 86598 -106024 -124650 130421 114577 -126556 -85259 72566 38885 4314 -5904
170 -5904 -88142 -6643 154001 7575 -170058 6413 146721 -3472 -77276 -10620 -3448
181 -3448 42859 73037 -83052 -117623 103927 116609 -105785 -93124 65843 48273 -3101
192 -3101 -9073 -68642 -11704 130510 20684 -150629 -10308 136725 8764 -79886 -13810
203 -13810 6643 33056 60024 -64143 -108590 81642 114786 -87003 -97198 58008 56193
$$ packed form
126A8660J89971k45937j70722K62496J03792j91926k7801N2901k1971J06125K3720
137I9308k36473Q885K90717n4201k57452P5542J51483n0512j2044j8583j08233
148a11563J13181J77018j89298j76753K15096J24657j70837n1893O3459r356P1225
159E4936L1662j92622j8626K55071j5844k41133M1297J57825l3681l4571j0218
170e904q2238Q1499J60644j46426j77633J76471J40308j50193p3804O6656P172
181c448M6307L0178j56089l4571K21550J2682k22394J2661J58967j7570n1374
192c101n972n9569N6938J42214j09826j71313J40321J47033j27961q8650O6076
203a3810K0453K6413K6968j24167m4447J90232L3144k01789j0195J55206j815
$$ plain form
214 56193 -7065 -13911 -53416 -12808 111247 29029 -134553 -23593 128098 20471 -81656
225 -81656 -20201 15059 29513 48582 -51508 -99981 64151 112974 -70518 -101135 49664
236 49664 64046 -8247 -19787 -42583 -11723 95250 34327 -119275 -34048 118148 30643
247 30643 -81023 -26320 21311 26879 38422 -40864 -90821 48787 108805 -54716 -101836 40247
259 40247 69378 -7353 -24885 -33674 -10069 80563 38019 -104814 -42892 107650 39789 -78511
271 -78511 -33172 25535 26947 29562 -33532 -81827 36346 104197 -40652 -102004 30793 74311
283 74311 -4676 -30359 -28220 -6982 68960 39179 -91885 -49286 97021 47800 -74952 -40041
295 -40041 28405 28549 22059 -28515 -73022 26456 98420 -28159 -99860 21246 77185 -718
$$ packed form
214E6193o3258o846l9505M0608J24055q2218j63582J10960J51691j07627j02127
225h1656O1455L5260J4454J9069j00090m8473J64132M8823j83492l0617J50799
236D9664J4382p2293j1540k2796L0860J06973o0923j53602Q5227J52196q7505
247C0643j11666N4703M7631N568J1543p9286m9957J39608O0018j63521m7120J42083
259D0247K9131p6731j7532q789K3605R0632m2544j42833O1922J50542o7861j18300
271g8511M5339N8707J412K615o3094m8295J18173O7851j44849o1352J32797M3518
283G4311p8987k5683K139K1238P5942k9781j31064M2599J46307m9221j22752L4911
295d0041O8446J44o490n0574m4507R9478P1964j26579p1701J21106N5939p7903
$$ plain form
307 -718 -35033 -24254 -3386 58798 38830 -79802 -53507 86122 53922 -69708 -46222 29256
319 29256 30951 16007 -25256 -64318 18529 91727 -17136 -96587 12270 78620 3770 -39014
331 -39014 -22486 515 50748 36884 -69020 -55890 75401 58614 -63741 -51812 28908
342 28908 33968 11140 -23636 -56506 12942 84711 -8074 -91985 3846 78560 8983 -42104
354 -42104 -22033 4305 44352 34072 -59763 -56581 65436 61580 -57254 -56214 27377 37412
366 37412 7733 -23442 -49216 9016 77752 -531 -86759 -3633 77290 14178 -44086 -22814
378 -22814 7793 39563 30593 -51787 -55942 55962 63483 -50344 -59884 24949 40626 5572
390 5572 -23823 -43013 6595 70905 5459 -80942 -10506 74793 19472 -45417 -24453 10702
$$ packed form
307g18l4315J0779K0868O2184j9968j18632K6295J39629l2200j23630K3486P5478
319B9256J695j4944m1263l9062Q2847P3198j08863p9451J08857O6350p4850m2784
331c9014J6528K3001N0233j3864j05904J3130J31291j6787j22355J1929Q0720
342B8908N060k2828l4776l2870O9448P1769r2785q3911R5831P4714o9577n1087
354d2104K0071K6338M0047j0280r3835L182J22017l856j18834J040Q3591J0035
366C7412k9679l1175k5774N8232O8736p8283q6228Q3126Q0923o3112n8264K1272
378b2814L0607L1770q970q2380m155J11904P521j13827r540Q4833J5677l5054
390E572k9395j9190M9608O4310o5446q6401P0436Q5299n5321o4889K0964L5155
$$ plain form
402 10702 36073 27052 -45180 -54657 47388 64074 -43320 -62460 21550 43751 4640 -24785
414 -24785 -37651 5115 64376 10173 -74987 -16281 71674 24471 -45477 -26908 12996 33977
426 33977 23400 -39614 -52546 39458 63978 -36076 -64291 17591 46498 4919 -25932 -33576
438 -33576 4507 58465 13904 -68710 -21757 67547 29479 -44837 -29901 14531 32586 20174
450 20174 -35096 -50208 32474 62825 -29121 -64941 13122 48631 6027 -27294 -30178 4537
462 4537 52904 16452 -62510 -25688 62759 33281 -43165 -32569 15190 31897 17000 -31592
474 -31592 -46882 26497 60759 -22856 -64464 8972 49954 7418 -28495 -27679 5373 48089
486 48089 17340 -56743 -28402 57937 36543 -41296 -35471 15710 32051 14094 -29392 -43653
$$ packed form
402A0702K5371r021p2232r477J02045J6686j07394j9140Q4010K2201l9111k9425
414b4785j2866M2766N9261n4203q5160N8706Q7955m7203o9948J8569L9904K0981
426C3977j0577o3014j2932R2004K4520j00054k8215Q1882K8907m1579l0851p644
438c3576L8083N3958m4561q2614M6953Q9304l8068p4316J4936M4432J8055j2412
450B0174n5270j5112Q2682L0351r1946l5820P8063L5509m2604l3321k884L4715
462D537M8367l6452p8962L6822Q8447k9478p6446J0596M7759J6707j4897m8592
474c1592j5290P3379L4262q3615m1608P3436M0982m2536l5913Q16L3052M2716
486D8089l0749p4083K8341Q6339k1394p7839N825N1181J6341j7957m3486j4261
$$ plain form
498 -43653 21906 58339 -17160 -63356 4622 50942 9588 -29733 -25940 6342 43905 18087
510 18087 -51132 -30636 52567 39088 -38200 -37922 14984 32237 11921 -27144 -40338 17265
522 17265 55230 -11276 -61158 50 50599 12198 -29930 -25029 6894 39927 18277 -45514
534 -45514 -32428 46665 41388 -34696 -40399 13594 32936 10584 -25865 -37596 13845 52484
546 52484 -6255 -58942 -4593 50354 15527 -30428 -25049 7961 37358 17968 -41115 -33278
558 -33278 41587 42702 -31122 -42374 11877 33748 9499 -25057 -34512 11292 48984 -2287
570 -2287 -55568 -7994 48668 17858 -29778 -24751 8503 34371 16949 -36391 -33147 35993 42824
583 42824 -27109 -43248 9869 33864 8812 -24231 -31713 9429 45536 1110 -52206 -11135
$$ packed form
498d3653O5559L6433p5499m6196O7978M6320m1354l9321L793L2282L7563k5818
510A8087o9219K0496Q3203j3479p7288K78N2906J7253k0316l9065j3194N7603
522A7265L7965o6506m9882O1208N0549l8401m2128M901L1923L3033k1650o3791
534d5514J3086P9093n277p6084n703N3993J9342k2352l6449j1731N1441L8639
546E2484n8739n2687N4349N4947l4827m5955N379L3010K9397j9390n9083P837
558c3278P4865J115p3824j1252N4251K1871k4249l4556r455M5804L7692n1271
570b287n3281M7574N6662l0810m7636N027L3254K5868j7422n3340L244O9140O831
583D2824o9933j6139N3117K3995k5052l3043p482M1142L6107m4426n3316M1071
$$ plain form
595 -11135 47102 20458 -29704 -25477 9488 32861 15693 -33522 -32815 31966 43002 -23918 -44596
608 -44596 7794 35135 8759 -24597 -29676 8546 42755 3761 -49061 -13965 45152 23019
620 23019 -28607 -26291 9570 31294 14655 -30116 -32083 26951 42359 -19625 -44460 5040
632 5040 34830 9172 -23648 -27556 7135 39392 6320 -44855 -16498 42130 25273 -27085
644 -27085 -27154 9455 30169 13623 -27664 -31236 23271 41584 -16182 -44734 2459 35591 10024
657 10024 -24121 -26391 7072 37278 7752 -42051 -18222 40067 27343 -25911 -28513 9315
669 9315 29850 12397 -25977 -30088 19878 40386 -12824 -43984 -102 35184 10944 -23568
681 -23568 -24934 6625 34552 9057 -38049 -19662 36560 28667 -23634 -28984 8544 28706 11508
$$ packed form
595a1135N8237k6644n0162M227L4965K3373j7168m9215P07O4781J1036o6920k0678
608d4596N2390K7341k6376l3356n079L8222L4209l8994n2822L5096N9117k2133
620B3019n1626K316L5861K1724j6639m4771j967N9034J5408o1984k4835M9500
632E040K9790k5658l2820l908L4691L2257l3072n1175K8357N8628j6857n2358
644b7085o9L6609K0714j6546m1287l572N4507J8313n7766k8552M7193L3132k5567
657A0024l4145k270L3463L0206k9526m9803K3829N8289j2724n3254k602L7828
669I315K0535j7453l8374m111M9966K0508n3210l1160M3882L5286k4240l4512
681b3568j366L1559K7927k5495m7106J8387N6222p893n2301n350L7528K0162j7198
$$ plain form
694 11508 -23971 -28740 16719 38515 -9681 -42882 -2538 34877 12157 -23503 -24131 6822 32766
707 32766 9745 -35385 -20728 34081 29970 -22139 -30403 7845 29076 10791 -23302 -27746 14463
720 14463 37273 -6885 -41943 -5012 34478 13786 -23006 -23781 6679 31027 10356 -32155
732 -32155 -21500 30649 30751 -19595 -30817 6432 28162 10319 -21810 -26343 11911 35149 -4047
745 -4047 -39818 -7291 33190 15102 -22035 -23133 6509 29223 10619 -29388 -21664 27852 31010
758 31010 -17586 -31525 5205 28200 9900 -21498 -25213 10598 33534 -2290 -38386 -8835
770 -8835 32577 16464 -21711 -23220 6947 28426 10227 -27336 -21684 25246 31056 -15648 -31762
783 -31762 3893 27801 9680 -20660 -24018 9187 31552 -438 -36042 -10491 30837 17654
$$ packed form
694A1508l5479m769M5459K1796m8196l3201M0344L7415k2720l5660o28L0953K5944
707C2766k3021m5130J4657N4809m111n2109q264L8248K1231j8285l4093m444M2209
720A4463K2810m4158l5058L6931L9490k0692l6792p75L0460K4348k0671m2511
732c2155J0655N2149J02n0346j1222L7249K1730j7843l2129m533L8254K3238l9196
745d047l5771L2527M0481j8088l7137j098K9642K2714j8604m0007P724M9516L158
758C1010m8596j3939L6730K2995j8300l1398l715L5811K2936l5824l6096K9551
770h835M1412j6113l8175j509L0167K1479j8199l7563N652M6930N810m6704j6114
783c1762L5655K3908j8121l0340l358L3205K2365l1990l5604K5551M1328j3183
$$ plain form
795 17654 -20397 -22907 6506 26888 10363 -24890 -21487 22281 30695 -13180 -31713 2139 27354
808 27354 9898 -20159 -23193 7924 29931 1392 -34149 -12041 29480 19087 -19263 -23253
820 -23253 6308 26346 10228 -23219 -21407 19766 30443 -11051 -31855 352 27017 10291
832 10291 -19632 -22595 6933 28475 2931 -31907 -13393 27727 20503 -17795 -23358 5654 25369
845 25369 10272 -21426 -21100 17161 29619 -8771 -31387 -1452 26414 10839 -18968 -21889 6135
858 6135 26964 4050 -29861 -14258 26071 21272 -16421 -23552 5209 24921 9934 -20160 -20749
871 -20749 15194 28917 -7064 -30982 -3028 25846 11390 -18485 -21439 5684 25842 4924
883 4924 -27815 -15006 24388 22196 -14983 -23781 4526 24399 10003 -19127 -20339 13354 27853
$$ packed form
795A7654l8051k510K9413K0382j6525l5253L403M3768Q414m3875j8533L3852K5215
808B7354j7456l0057l034L1117K2007k8539l5541K2108M1521j0393l8350l990
820b3253K9561K0038j6118l3447J812M1173J0677m1494k0804L2207K6665j6726
832A0291k9923k963K9528K1542k5544l4838J8514M1120p224l8298n563K9012J9715
845B5369j5097l1698L26L8261J2458l8390k2616K9935K7866j5575k9807k921K8024
858F135K0829k2914l3911J5603M0329m799l7693p131K8761J9712j4987l0094n89
871b0749L5943J3723l5981k3918K7954K8874j4456k9875k954K7123K0158k0918
883D924l2739J2809L9394k192l7179q798K8307J9873j4396k9130j212L3693J4499
$$ plain form
896 27853 -5296 -30190 -4637 25084 12154 -17903 -20993 5154 24682 5820 -25887 -15576
908 -15576 22571 22747 -13397 -23863 3633 23865 9869 -18106 -19855 11508 26948 -3587 -29410
921 -29410 -6160 24189 12915 -17080 -20734 4675 23660 6401 -23990 -15996 20727 23311 -11738
934 -11738 -23990 2638 23308 9991 -17188 -19461 9963 25811 -2139 -28319 -7540 23290
946 23290 13664 -16321 -20443 4349 22818 6900 -22264 -16057 19097 23318 -10281 -23894 1762
959 1762 22888 9933 -16607 -18987 8803 24700 -968 -27285 -8620 22253 14313 -15491 -20276
972 -20276 4052 22113 7236 -20701 -16030 17373 23377 -8810 -23771 682 22228 9989
984 9989 -16005 -18610 7619 23485 142 -25996 -9662 21148 14969 -14505 -19982 3639 21361
$$ packed form
896B7853l3149k4894K5553K9721j2930l0057l090K6147J9528j8862l1707J0311
908a5576L8147J76l6144j0466K7496K0232j3996k7975j749L1363J5440l0535k5823
921b9410K3250L0349j1274k9995l654K5409J8985j7259l0391P994L6723K584l5049
934a1738j2252K6628K0670j3317k7179k273K9424J5848k7950k6180K0779L0830
946B3290r626k9985m122K4792J8469j5918k9164O207L5154M221l3599j3613K5656
959A762K1126j2955k6540k380K7790J5897k5668k6317J8665L0873p940k9804m785
972b0276K4328J8061j4877k7937M671L3403O004l2187j4961K4453K1546j2239
984I989k5994k605K6229J5866k3343k6138J6334L0810o179k9474n477K3621J7722
$$ plain form
997 21361 7545 -19249 -15920 15823 23121 -7342 -23530 -453 21670 10128 -15416 -18285 6607
1010 6607 22486 1180 -24733 -10438 20003 15609 -13390 -19867 3220 20842 7731 -17851
1022 -17851 -15800 14272 22802 -6019 -23165 -1572 20938 10387 -14767 -17962 5731 21394
1034 21394 1958 -23376 -11255 18859 16106 -12375 -19618 2686 20258 8042 -16791 -15595
1046 -15595 12821 22230 -4723 -22749 -2663 20280 10565 -14313 -17658 4995 20503 2658
1058 2658 -22150 -11638 17719 16541 -11204 -19498 2397 19834 8105 -15793 -15229 11629 21760
1071 21760 -3741 -22263 -3490 19543 10736 -13815 -17436 4447 19658 3175 -20851 -11996
1083 -11996 16652 16856 -10137 -19216 1888 19368 8268 -14908 -15081 10420 21048 -2635 -21693
$$ packed form
997B1361j3816k6794L329L1743P298l0463j6188K3077K2123j1542k5544k869K4892
1010F607J5879k1306k5913J4295L0441m394k8999o477K3087J7622j3111k5582
1022a7851K051L0072Q530k8821j7146K1593K2510j0551k5154l195K3693J5663
1034B1394j9436k5334J2121L0114k753k8481p243K2304J7572j2216k4833J196
1046a5595K8416R409k6953j8026K0086K2943r715k4878l345K2653J5508j7845
1058B658k4808J0512K9357j178k7745q294K1895J7437j1729k3898N64K6858J0131
1071B1760k5501j8522J8773K3033q807k4551l621K1883J5211j6483k4026Q855
1083a1996K8648K04k6993r079K1104J7480j1100k3176j73K5501J0628k3683j9058
$$ plain form
1096 -21693 -4609 18751 10994 -13196 -17256 3733 18901 3839 -19621 -12262 15461 17147 -8913
1109 -8913 -19010 1222 18904 8500 -13968 -14863 9180 20368 -1584 -21069 -5539 17781
1121 17781 11349 -12476 -17081 3226 18198 4306 -18438 -12438 14280 17397 -7803 -18825 633
1134 633 18506 8684 -13381 -14647 8274 19703 -804 -20421 -6383 17090 11675 -11896 -16906
1147 -16906 2836 17684 4634 -17383 -12448 13313 17393 -6687 -18442 -60 17970 8833
1159 8833 -12657 -14414 7182 18946 26 -19627 -7175 16078 11942 -11128 -16693 2260 16991
1172 16991 5113 -16091 -12511 12186 17370 -5594 -18069 -625 17382 8961 -12014 -14203 6438
1185 6438 18141 592 -18840 -7787 15301 12193 -10460 -16505 1953 16584 5434 -15222
$$ packed form
1096b1693J7084K3360p757k4190m060K0989J5168j5062k3460P359K7723J686k6060
1109h913j0097K0232J7682j0404k2468q95K4043J1188k1952j9485J5530K3320
1121A7781o432k3825m605K0307J4972j3892k2744O000K6718L117k5200j1022J9458
1134F33J7873r822k2065j266K2921J1429k0507j9617J4038K3473n415k3571n010
1147a6906J9742J4848j3050k2017M935K5761M080k4080j1755J8382J8030r137
1159H833k1490j757K1596J1764j8920j9653J2452K3253m136k3070n565J8953J4731
1172A6991j1878k1204L580K4697N184k2964j2475J7444J8007q421k0975k189K0641
1185F438J1703j7549j9432J1053K3088l108k2653o045J8458J4631j1150k0656
$$ plain form
1197 -15222 -12377 11373 17308 -4692 -17794 -1265 16954 9116 -11596 -14056 5596 17514 1149
1210 1149 -18111 -8325 14328 12410 -9672 -16295 1436 16051 5775 -14134 -12251 10198 17069
1223 17069 -3490 -17232 -2173 16159 9310 -10840 -13888 4740 16654 1811 -17197 -8854
1235 -8854 13306 12662 -8770 -16043 1013 15572 5991 -13344 -12027 9541 16717 -2863 -16853
1248 -16853 -2593 15798 9322 -10589 -13781 4342 16049 2052 -16643 -9081 12721 12675 -8139
1261 -8139 -15807 709 15293 6205 -12564 -11769 8720 16377 -2035 -16319 -3196 14999 9532
1274 9532 -9890 -13586 3570 15298 2632 -15537 -9379 11542 12852 -7108 -15447 179 14786
1287 14786 6591 -11646 -11603 7782 15968 -1247 -15794 -3902 14371 9642 -9505 -13507 2974
$$ packed form
1197a5222K845K3750N935k2000j3102J6529J8219p838k0712k460J9652J1918j6365
1210A149j9260R786K2653j918k2082o623J7731J4615j0276j9909J883K2449O871
1223A7069k0559j3742J5059J8332o849k0150l048J8628J1914j4843j9008Q343
1235h854K2160o44k1432p273J7056J4559r581j9335J317K1568P176j9580j3990
1248a6853J4260J8391o476j9911l192J8123J1707j3997j8695P562K1802m6k0814
1261h139p668J6516J4584r088j8769P95K0489P657j8412j4284J3123J8195n467
1274I532j9422l696J7156J1728j2666j8169O158K0921J310j9960q339J5626J4607
1287A4786q195j8237M3J9385Q186j7215j4547J1892J8273m729j9147m002J6481
$$ plain form
1300 2974 14728 2794 -14982 -9565 10966 12923 -6466 -15209 -59 14549 6731 -11108 -11448
1313 -11448 7228 15668 -706 -15394 -4447 13647 9759 -8968 -13463 2511 14135 3228
1325 3228 -14096 -9798 10073 12929 -5540 -14774 -575 13965 7066 -10252 -11270 6316 15048
1338 15048 93 -14696 -4981 12806 9839 -8441 -13257 1926 13682 3503 -13382 -9697 9366
1351 9366 12842 -4818 -14456 -906 13645 7103 -9870 -10994 5885 14664 336 -14347 -5331
1364 -5331 12265 9818 -8011 -13112 1584 13237 3616 -12611 -9703 8672 12777 -4124 -14061
1377 -14061 -1377 13200 7386 -9130 -10819 5182 13991 959 -13669 -5893 11411 9820 -7346
1390 -7346 -12907 1051 12686 3984 -11890 -9643 7956 12636 -3232 -13551 -1706 12775 7565
$$ packed form
1300B974J1754j1934j7776N417K0531J957j9389q743J5150J4608p818j7839l40
1313a1448J8676Q440j6374j4688J0947J8094l888j8727m495J5974J1624j0907
1325C228j7324M298J9871K856j8469r234J4199J4540o899j7318j018J7586Q732
1338A5048j4955j4789R715J7787k967j8280m816J5183J1756j0179j6885L685J9063
1351I366L476j7660r638J3550J4551o542j6973j124J6879Q779j4328j4683R016
1364e331J7596k447j7829n101J4696J1653r621j6227K908J8375M105j6901r937
1377a4061J2684J4577n814j6516j689J6001Q809j3032j4628P776J7304j591j7166
1390g346n561J3958J1635q702j5874K247J7599M680j5868j0319J1845J4481n210
$$ plain form
1403 7565 -8610 -10709 4571 13603 1279 -13165 -6189 10649 9919 -6914 -12842 656 12289
1416 12289 4169 -11217 -9560 7397 12488 -2629 -13139 -2074 12335 7663 -8168 -10612 4030
1429 4030 13041 1643 -12579 -6581 10006 9870 -6335 -12603 219 11830 4459 -10555 -9367
1442 -9367 6775 12289 -1949 -12736 -2481 11847 7709 -7662 -10414 3519 12565 1906 -12086
1455 -12086 -6746 9288 9771 -5847 -12340 55 11487 4570 -9955 -9230 6356 12121 -1487
1468 -1487 -12300 -2736 11376 7745 -7357 -10312 3198 12076 2081 -11534 -6891 8739 9709 -5355
1482 -5355 -12047 -206 11150 4756 -9381 -9035 5910 11772 -993 -11806 -3001 10934 7767
1495 7767 -6924 -10157 2697 11661 2212 -11154 -7022 8048 9618 -4869 -11901 -556 10893
$$ packed form
1403G565j6175k099J5280R032j2324j4444O976J6838p30j6833n928J3498J1633
1416A2289q120j5386J657J6957N091j5117j0510J1065J4409m672j5831k444J4642
1429D030R011j1398j4222N998J6587j36j6205o268J2822J1611p371j5014J188
1442i367J6142N514j4238j0787J0255J4328m138j5371k752J3933R046j0659j3992
1455a2086N340J6034M83j5618o493J2395J1432o917j4525P25J5586N765j3608
1468a487j0813R564J4112l631j5102k955J3510Q878r995j3615M643J5630R70j5064
1482e355o692J1841J1356o394j4137L46J4945N862j2765j0813Q805J3935l167
1495G767j4691l233J2854Q964r449j3366M132J5070J570j4487p032J1345J1449
$$ plain form
1508 10893 4828 -8877 -8885 5394 11618 -552 -11413 -3294 10454 7858 -6522 -10121 2316 11179
1522 11179 2349 -10676 -7224 7568 9563 -4373 -11548 -823 10546 5158 -8340 -8747 4997
1535 4997 11333 -49 -10998 -3650 9974 7855 -6155 -10017 1854 10743 2607 -10227 -7273
1548 -7273 6986 9477 -3805 -11334 -1191 10246 5301 -7863 -8619 4582 11108 325 -10587
1561 -10587 -3903 9449 7906 -5726 -9926 1443 10386 2723 -9731 -7376 6489 9435 -3252
1574 -3252 -10936 -1411 9918 5495 -7374 -8442 4162 10800 631 -10157 -4219 8884 7873
1587 7873 -5387 -9833 1090 9971 2848 -9368 -7303 6019 9288 -2848 -10642 -1534 9727
1600 9727 5537 -6977 -8219 3922 10512 834 -9864 -4216 8558 7779 -5167 -9722 899 9692
$$ packed form
1508A0893o065j3705qJ4279O224j2170j0861Q119J3748k596j4380l599J2437Q863
1522A1179q830j3025L452J4792J995j3936p175J0725J1369n388j3498m07J3744
1535D997O336j1382j0949P348J3624k119j4010l862J1871Q889q136j2834K954
1548g273J4259K491j3282p529J0143J1437m945j3164p56J3201O526j0783j0912
1561a0587O684J3352j543j3632m200J1369Q943p663j2454K355J3865K946j2687
1574c252p684R525J1329m423j2869j068J2604O638j0169j0788N938J3103j011
1587G873j3260m446J0923Q881p123j2216K065J3322L269j2136p794R108J1261
1600I727m190j2514j242J2141O590r678j0698N648J2774p79j2946m555J0621Q793
$$ plain form
1614 9692 2911 -8969 -7270 5702 9106 -2543 -10321 -1715 9428 5637 -6601 -8075 3617
1627 3617 10155 1068 -9465 -4471 8014 7653 -4794 -9551 498 9298 3039 -8550 -7106 5251
1641 5251 8965 -2047 -9931 -1888 9062 5718 -6190 -7965 3294 9854 1188 -9140 -4523 7595
1655 7595 7542 -4512 -9467 232 9045 3095 -8144 -7058 4921 8842 -1810 -9604 -2020 8803
1669 8803 5812 -5872 -7828 2973 9571 1460 -8812 -4804 7062 7451 -4173 -9287 -31 8658
1683 8658 3253 -7777 -6995 4557 8720 -1233 -9295 -2290 8441 6004 -5453 -7720 2566 9263
1697 9263 1695 -8334 -4885 6560 7379 -3829 -9143 -295 8425 3373 -7350 -6893 4271 8585
1711 8585 -959 -8935 -2400 8150 5954 -5241 -7604 2334 8926 1683 -8222 -5006 6189 7275
$$ packed form
1614I692o781j1880J699J2972L404j1649p778Q606J1143l791j2238j474J1692
1627C617O538r087j0533M994J2485l61j2447m757J0049Q800o259j1589J444J2357
1641E251L714j1012p884Q043J0950l344j1908j775J1259O560q666j0328M617J2118
1655G595n3j2054m955R699Q813n950j1239J086J1979L921j0652p794P584J0823
1669H803k991j1684j956J0801O598q111j0272M008J1866L89j1624n114R256Q689
1683H658n405j1030P82J1552M163r953q062P005J0731k437j1457k267J0286O697
1697I263p568j0029L449J1445Q19j1208n314Q848Q720n052j0723M57J1164M314
1711H585r544p976O535J0550k196j1195k363R938O592p243r905L216J1195J086
$$ plain form
1725 7275 -3630 -8912 -451 8138 3436 -7047 -6786 4057 8448 -646 -8639 -2542 7901 6005
1739 6005 -4871 -7465 2026 8739 1836 -7884 -5065 5813 7155 -3266 -8803 -744 7926 3573
1753 3573 -6630 -6734 3750 8229 -398 -8242 -2645 7552 5979 -4596 -7359 1797 8339 1949
1767 1949 -7640 -5196 5473 7044 -3009 -8507 -893 7647 3674 -6298 -6549 3611 8189 -89
1781 -89 -7986 -2754 7273 5966 -4420 -7340 1585 8199 2013 -7362 -5185 5154 6925 -2743 -8371
1796 -8371 -1066 7512 3829 -6023 -6492 3342 8030 91 -7706 -2842 6977 5985 -4061 -7270 1247
1811 1247 7874 2021 -7074 -5291 4731 6874 -2408 -8166 -1202 7207 3932 -5684 -6309 3112 7791
1826 7791 336 -7424 -3011 6634 5957 -3844 -7216 1024 7637 2108 -6887 -5261 4488 6728 -2158
$$ packed form
1725G275j0905n282Q461Q589m702j0483K61J0843M391r094p993O097J0443j896
1739F005j0876k594R491O713o903r720K819J0878J342j0421n537Q059Q670m353
1753C573j0203j04J0484M479q627p844N597J0197j573j0575k763R156O542o390
1767A949r589K444J0669J571j0053n498P614Q540l973r972k51J0160M578q278
1781h9p897N232J0027j307j0386k920Q925O614o186r375K177J0339J771r668n628
1796h371P305Q578l683r852m69R834M688p939p797M864R819r92j0046l209Q517
1811A247O627n853r095J783J0022K143r282n758O964Q409l275r616o25R421M679
1826G791p455p760M413R645o77r801l372Q240O613n529q995J626R749K240q886
$$ plain form
1841 -2158 -8019 -1328 7106 3963 -5427 -6186 2949 7741 524 -7201 -3098 6302 5960 -3630 -7107
1856 -7107 747 7388 2223 -6556 -5290 4097 6672 -1816 -7759 -1561 6839 4209 -5034 -6181 2619
1871 2619 7450 877 -6885 -3254 5948 5885 -3287 -7095 422 7068 2389 -6355 -5364 3789 6583 -1556
1887 -1556 -7494 -1658 6705 4247 -4786 -6091 2377 7385 945 -6653 -3364 5646 5862 -3123 -7043
1902 -7043 201 6883 2448 -6076 -5341 3562 6562 -1265 -7275 -1821 6436 4463 -4407 -5956 2153
1917 2153 7191 1220 -6370 -3563 5243 5859 -2799 -6876 -123 6613 2580 -5841 -5398 3266 6360
1932 6360 -965 -7051 -1959 6167 4529 -4110 -5905 1957 7019 1342 -6204 -3591 5020 5713 -2609
1947 -2609 -6820 -279 6401 2603 -5604 -5249 3109 6338 -695 -6823 -2021 5961 4573 -3838 -5844
$$ packed form
1841b158n861O691Q434l143r390p59R135M792p217p725M103R400l42r590l477
1856g107P854O641n165q779J266R387K575q488n943O198Q400k630r243j147Q800
1871B619M831o573p762L631R202o3r172l808P517O646m679q744R91R153K794q139
1887a556n938N836Q363k458r033j305Q468N008o440p598L289R010K16q985l920
1902g043P244O682m435q524P35Q903L000p827o010N454Q257j973q870j549Q109
1917B153N038n971p590K807Q806O16q658m077O753O736m033q421M43Q664L094
1932F360p325o086N092Q126j638q639j795P862N062n677p546K613Q611O93q322
1947b609m211O541O680l798q207L55Q358L229p033o128M802P982j388q411k006
$$ plain form
1962 -5844 1736 6807 1490 -5997 -3676 4640 5643 -2372 -6745 -556 6153 2834 -5258 -5248 2805
1977 2805 6224 -404 -6536 -2175 5744 4638 -3603 -5748 1482 6692 1576 -5780 -3759 4376 5550
1992 5550 -2231 -6599 -638 5994 2783 -5076 -5195 2666 6158 -296 -6307 -2233 5547 4596 -3360
2007 -3360 -5617 1321 6443 1617 -5679 -3830 4101 5474 -2018 -6498 -792 5761 2904 -4832 -5107
2022 -5107 2420 5986 -41 -6051 -2298 5281 4660 -3122 -5561 1113 6294 1686 -5458 -3853 3871
2037 3871 5317 -1893 -6349 -990 5594 2953 -4639 -5063 2311 5929 84 -5861 -2300 5134 4608
2052 4608 -2953 -5540 960 6093 1774 -5256 -3937 3633 5261 -1712 -6197 -1127 5357 2985 -4436
2067 -4436 -5003 2162 5821 234 -5646 -2413 4952 4605 -2748 -5389 752 5898 1856 -5086 -3940
$$ packed form
1962e844P580N071n317p487K321Q316J003q015m373O189O709l319q092J0Q053
1977B805L419o628o132M361P919j106q241k145P230N210n116p356K021Q135J174
1992E550p781m368N961O632l211p859j19P861L492o454o011M074P780r51p956
2007c360k257O938N122m826p296J849P931J373p492m480N706O553k857p736k75
2022e107P527L566o027o010L753P579o21p782k439O674N181m608p144J605P724
2037C871J446p210m456N359O584k641p592m24P374L618n845n945L561P434n26
2052D608p561k587O500N133m319p030J319P570J628o973m485N070O484k372p421
2067d436n67P165L659n587n880L233P365l47p353k641O141N146m042o942J146
$$ plain form
2082 -3940 3369 5160 -1532 -5999 -1146 5297 3043 -4170 -4886 2029 5741 361 -5476 -2420 4790
2097 4790 4601 -2633 -5362 592 5729 1825 -4938 -3947 3205 5065 -1400 -5883 -1282 5097 3072
2112 3072 -3932 -4796 1940 5665 568 -5211 -2465 4497 4616 -2399 -5271 384 5526 1959 -4771
2127 -4771 -3987 2909 4950 -1171 -5734 -1454 4906 3156 -3758 -4801 1690 5572 750 -5131 -2484
2142 -2484 4298 4481 -2245 -5221 277 5355 1936 -4622 -4007 2779 4979 -1117 -5564 -1464 4826
2157 4826 3233 -3578 -4699 1677 5492 793 -4922 -2604 4133 4497 -2162 -5176 66 5209 1984
2172 1984 -4488 -3987 2547 4828 -876 -5449 -1520 4706 3298 -3303 -4629 1494 5427 945 -4768
2187 -4768 -2656 3961 4454 -2006 -5099 -12 5079 2045 -4376 -4012 2492 4786 -809 -5304 -1604
$$ packed form
2082c940P309J791o692m467M853O443k254p213p16O915L712n380n837L056P210
2097D790j89p234k729N954N137l904o763R91P152J860o465m483M601O379k025
2112C072p004q64O736L725n097n779K746O962J19p015k872N655N142l567o730
2127d771P84O896K041o121m563M280O360j750o914j043O491L882m822n881K647
2142b484O782J83o726k976N498N078l419o558O15O786K200o096m447M100O290
2157D826j593o811j121O376L815m699n715K318O737L64o659l014N242N143l225
2172A984o472N01O534K281n704m573L929O226j408o601j326O123L933m482n713
2187d768K112O617M93o460l093N087N091l034o421L64O504K294n595m495L700
$$ plain form
2202 -1604 4593 3306 -3187 -4478 1468 5301 948 -4613 -2657 3851 4463 -1880 -5093 -188 4845
2217 4845 2053 -4291 -4084 2293 4743 -579 -5161 -1702 4403 3473 -2933 -4512 1218 5221 1157
2232 1157 -4507 -2769 3572 4433 -1642 -5057 -349 4771 2087 -4093 -4066 2106 4673 -447 -5020 -1692
2248 -1692 4269 3536 -2710 -4409 1147 5159 1218 -4407 -2778 3406 4377 -1597 -4968 -514 4587
2263 4587 2164 -3911 -4041 2070 4625 -275 -4901 -1769 4126 3501 -2522 -4415 1018 5015 1302
2278 1302 -4234 -2936 3190 4279 -1393 -4894 -694 4440 2295 -3683 -4054 1825 4652 -53 -4716
2293 -4716 -1862 3999 3630 -2378 -4334 795 4918 1413 -4145 -2975 2997 4242 -1325 -4853 -837
2308 -837 4332 2376 -3563 -4021 1711 4547 47 -4613 -1931 3876 3643 -2214 -4257 609 4782 1448
$$ packed form
2202a604O197j287o493j291N946L833m353n561J956O508O12o343l213M905N033
2217D845k792o344K07O377K450n322m582L459O105r30o406j579N730M003m064
2232A157n664J738O341Q61o075l415M708N120k684o180K7O172K567n120m573L328
2248a692N961p33o246j699N556M012l941n625J629O184R71n974l371M454N101
2263D587k423o075j30O111K555m900m626L132N895o25o023j893N433L997l713
2278A302n536J298O126J089n672l501M200N134k145n978l71N879K827m705m663
2293d716K854N861l69o008j956N129M123l505n558J170N972J245n567l528M016
2308h37N169j956n939m58N732K836m500m660K682N807k33n857k043M866M173l334
$$ plain form
2324 1448 -3978 -3030 2787 4235 -1114 -4820 -926 4204 2415 -3322 -3987 1640 4512 178 -4459
2339 -4459 -1965 3745 3641 -2053 -4331 516 4712 1538 -3876 -3117 2622 4107 -1099 -4678 -1111
2354 -1111 4046 2480 -3245 -3995 1430 4483 310 -4282 -2007 3665 3672 -1900 -4236 472 4598 1642
2370 1642 -3812 -3109 2484 3975 -1009 -4653 -1154 3919 2485 -3125 -3925 1367 4452 429 -4142
2385 -4142 -1995 3527 3645 -1772 -4247 281 4453 1685 -3711 -3235 2257 3983 -784 -4555 -1260
2400 -1260 3864 2598 -2925 -3931 1237 4456 646 -4044 -2160 3398 3698 -1583 -4208 99 4314
2415 4314 1735 -3601 -3347 2124 3959 -646 -4528 -1368 3725 2650 -2758 -3895 1123 4336 696
2430 696 -3892 -2162 3220 3667 -1497 -4185 -49 4210 1815 -3445 -3311 1942 4027 -575 -4406 -1466
$$ packed form
2324A448n426R48N817J448n349l706L894N130j789n737o65N627K872m334m637
2339d459K494N710j04n694k278M847M196l174n414P59N739J485n206l579L567
2354a111N157j566n725p50N425L053m173m592K275N672Pn572k336M708M126k956
2370A642n454P03N593J491m984l644L499N073j434n610q00N292L085m023m571
2385d142K147N522J18n417k475M528M172k768n396M76N492J726m767l771L295
2400a260N124j266n523j006N168L219l810m690J884N558L00n281k625M307M215
2415D314k579n336K54N471J835m605l882L160N093j075n408j137N018L213l640
2430F96m588J730N382M47n164k688M136M259k395n260J34N253K085m602l831K940
$$ plain form
2446 -1466 3687 2764 -2631 -3831 1052 4329 858 -3833 -2278 3118 3766 -1354 -4141 -234 4126
2461 4126 1899 -3354 -3364 1804 3935 -365 -4279 -1596 3546 2846 -2424 -3841 880 4280 1012 -3741
2477 -3741 -2340 2919 3723 -1228 -4172 -296 3974 1886 -3245 -3434 1756 3944 -328 -4148 -1634
2492 -1634 3437 2920 -2203 -3780 789 4221 1052 -3577 -2424 2784 3719 -1104 -4043 -520 3833
2507 3833 2004 -3160 -3451 1507 3859 -169 -4102 -1694 3289 2989 -2138 -3734 681 4199 1267
2522 1267 -3394 -2403 2582 3629 -1036 -4035 -573 3721 2055 -3057 -3426 1399 3825 -12 -3968
2537 -3968 -1696 3241 3015 -1905 -3705 649 4123 1277 -3364 -2479 2479 3621 -961 -4037 -818
2552 -818 3612 2146 -2889 -3434 1215 3812 123 -3886 -1829 3103 3113 -1749 -3634 378 4025 1399
$$ packed form
2446a466N153r23n395j200M883L277l471m691J555N396O48n120k787L907M360
2461D126k227n253j0N168K131m300l914K683N142p00n270j417M721L400l268m753
2477c741J401N259Q04m951k944L876M270k088n131j89N190K188m272l820K514
2492a634N071n17n123j577M569L432l169m629J153N208R35m823k939L523M353
2507C833j829n164k91M958K352m028l933K408M983l00n127j596M415L518k932
2522A267m661R91M985J047m665k999L462M294j666n112l69M825K426l837l956
2537c968K272M937k26m920j800M354L474k846m641Q85M958J142m582l076L219
2552h18M430j466n035n45M649K597l689m009K057M932J0m862j885M012L647k626
$$ plain form
2568 1399 -3209 -2560 2271 3645 -826 -3895 -918 3451 2166 -2738 -3461 1160 3794 277 -3729
2583 -3729 -1850 2984 3092 -1564 -3587 329 3865 1463 -3123 -2517 2138 3480 -702 -3822 -968
2598 -968 3320 2162 -2646 -3427 1066 3652 352 -3599 -1887 2840 3106 -1466 -3566 177 3803 1551
2614 1551 -3046 -2639 1925 3499 -538 -3842 -1109 3225 2292 -2416 -3428 903 3685 519 -3438
2629 -3438 -1892 2730 3144 -1311 -3537 143 3684 1632 -2867 -2738 1861 3469 -474 -3712 -1249
2644 -1249 3104 2200 -2394 -3415 828 3568 599 -3328 -1989 2620 3165 -1222 -3456 -59 3567
2659 3567 1671 -2721 -2779 1640 3365 -332 -3664 -1325 2899 2276 -2202 -3361 673 3591 776 -3194
2675 -3194 -2031 2465 3195 -1030 -3388 -189 3521 1742 -2739 -2817 1569 3354 -268 -3540 -1378 2836
$$ packed form
2568A399m608O49M831J374m471l069K977M369j285m904p23M621K634l517m006
2583c729J879M834J08m656k023L916L536k402m586O06M655J342m182l120K854
2598i68M288j158m808p81M493K586l300l951J712M727K66m572k100L743L626k252
2614A551m597M07M564J574m037l304K733M334r33m708j012M331K782l166l957
2629c438J546M622M14m455k226L680L541k052m499J29M599J608l943l238K463
2644a249M353r04m594j021M243K740k969l927J339M609N45m387k234L397L626
2659C567j896m392n8M419J725l697l332K339M224o23m478j159M034K918k815l970
2675c194J163M496P30m225k358L199L710j779m481p8M386J785l622l272K162M214
$$ plain form
2691 2836 2376 -2014 -3297 586 3545 867 -3080 -1963 2422 3181 -890 -3349 -316 3366 1779
2706 1779 -2594 -2798 1369 3321 -155 -3524 -1511 2735 2419 -1867 -3320 489 3480 995 -2931
2721 -2931 -2066 2243 3180 -728 -3310 -428 3221 1859 -2457 -2848 1224 3217 -37 -3379 -1528 2582
2737 2582 2452 -1760 -3222 429 3363 1090 -2840 -2055 2124 3123 -683 -3300 -540 3054 1804 -2389
2753 -2389 -2817 1070 3173 57 -3278 -1603 2511 2421 -1548 -3201 287 3367 1242 -2771 -2159 2025
2769 2025 3189 -559 -3219 -725 3021 1847 -2232 -2889 907 3151 160 -3283 -1704 2404 2524
2784 2524 -1405 -3114 180 3275 1259 -2547 -2186 1919 3109 -474 -3172 -772 2866 1939 -2196
2799 -2196 -2876 836 3048 313 -3122 -1655 2309 2569 -1342 -3061 66 3234 1407 -2508 -2247 1728
$$ packed form
2691B836m60m390j283L883K959k678l947J117M385P59m071k459L033L682j587
2706A779m373k04M167J952l476l369K013M246l16m286j453L809K991k485l926
2721b931Q65M309R37l908k582K882L649j362m316l91M072J993l254l342J851M110
2737B582j30m212j462L651K934k273l930P85M179R99l806k617K760L594j250m193
2753b389m28L887K103l116l335J675M114r0l969j653L488L080k125m013O12M184
2769B025J164l748k660K494L746j174m079o57L796K244k991l443J579M108J20
2784B524l929j709L294L095k016l806L61M105J190l583k698K400L638r27m135
2799b196o80L712K212k735l435J467L964K60l911j719L127L168j827l915K61L975
$$ plain form
2815 1728 3006 -383 -3170 -871 2783 1935 -2065 -2926 714 3073 410 -3034 -1716 2173 2645 -1147
2831 -1147 -3031 -7 3139 1475 -2364 -2294 1609 2992 -287 -3116 -990 2632 1956 -1989 -2905 595
2847 595 2980 449 -2911 -1695 2180 2564 -1024 -2949 -38 3044 1460 -2308 -2290 1452 2942 -211
2863 -211 -3013 -1112 2531 1998 -1819 -2871 481 2981 592 -2795 -1798 2027 2709 -893 -2943 -149
2879 -149 2972 1613 -2150 -2289 1367 2946 -63 -3020 -1174 2419 2094 -1754 -2867 432 2918 801
2895 801 -2623 -1797 1919 2678 -740 -2832 -321 2836 1601 -2054 -2297 1171 2877 -60 -2922 -1249
2911 -1249 2275 2048 -1549 -2867 236 2834 857 -2561 -1869 1873 2617 -614 -2798 -396 2742 1714
2927 1714 -1965 -2395 1033 2836 108 -2867 -1342 2154 2073 -1493 -2816 209 2768 918 -2431 -1949
$$ packed form
2815A728J278l389k787K299L654q48m000q61L640K359k663l444J318L889M72l792
2831a147j884L024L146j664l839P0L903J383l279k829K126L622o76l945r16L500
2847E95K385k531l360J216L875L84l588j925K911L082j584l768J8L742J490l153
2863b11k802J901L643n33l817j052L352K500k389l387R97L825O82l602k050K794
2879a49L121j359l763j39L656J579l009k957J846L593l25l848j113L299K486k117
2895H01l424Q26L716P59l418k092K511L157j235l655k43L468J706k937k862J673
2911a249L524k27l597j318L103K598j977l418O92L742P44l231k184K402L138j028
2927A714l679m30L428J803k728k975J525L496q1l566j323L025K559j850l349M82
$$ plain form
2943 -1949 1706 2672 -448 -2707 -478 2681 1718 -1852 -2440 974 2717 164 -2784 -1468 2079 2117
2959 2117 -1342 -2787 68 2703 981 -2361 -1877 1604 2674 -435 -2691 -587 2552 1696 -1831
2974 -1831 -2352 793 2692 238 -2672 -1505 1931 2095 -1210 -2751 -52 2708 1094 -2212 -1956 1453
2990 1453 2640 -267 -2609 -683 2492 1758 -1699 -2419 577 2622 332 -2662 -1620 1869 2189 -1043
3006 -1043 -2657 -146 2628 1219 -2094 -1964 1422 2678 -193 -2612 -771 2375 1783 -1637 -2469 543
3022 543 2613 393 -2583 -1612 1743 2192 -1036 -2649 -158 2598 1260 -2049 -2034 1287 2625 -90
3038 -90 -2555 -909 2280 1788 -1467 -2480 392 2523 565 -2475 -1717 1663 2279 -845 -2603 -293
3054 -293 2554 1430 -1861 -1978 1186 2621 22 -2485 -944 2199 1835 -1433 -2478 331 2479 571
$$ packed form
2943a949L655R66l120k259K229L159r63l570n88L414J743k553k948J316L547L8
2959B117l459j445K855K635j722l342M84L481J070l109k256K104L139q56l527
2974a831n21L145J899k454k910J167L436J64l305j541K699K760j614l306K56L409
2990A453J187k907k342J926L175p34l457p20K996K045k290k994J042L489L20l232
3006a043j614K511K774j409l313J30L386J256k871k419J841L146n92l420q32L012
3022E43K070k220k976R71L355M49l228j613K491K756j338l309J5L321J338k715
3038i0k465J646L189m92l255j013K872K131j958l040P58L380O16l124j758K310
3054b93K847j124l291j17L164J435k599k507J541L143l64l268j045K809K148j908
$$ plain form
3070 571 -2393 -1635 1505 2265 -670 -2549 -298 2501 1370 -1802 -2027 1122 2582 83 -2423 -1036
3086 -1036 2055 1828 -1359 -2457 244 2435 650 -2282 -1684 1493 2233 -574 -2499 -383 2457 1511
3102 1511 -1702 -1978 957 2549 229 -2421 -1096 1930 1881 -1261 -2460 105 2364 722 -2242 -1755
3118 -1755 1446 2243 -484 -2465 -434 2336 1482 -1602 -2044 855 2507 252 -2353 -1149 1834 1851
3134 1851 -1158 -2451 29 2313 821 -2060 -1721 1378 2287 -385 -2396 -523 2300 1593 -1479 -2066
3150 -2066 733 2480 293 -2309 -1257 1721 1882 -1029 -2429 -73 2275 899 -1975 -1766 1196
3165 1196 2258 -219 -2306 -633 2171 1664 -1422 -2039 589 2360 404 -2230 -1338 1595 1970 -955
3181 -955 -2499 -209 2218 983 -1861 -1771 1198 2287 -173 -2238 -707 2065 1687 -1332 -2082 464
$$ packed form
3070E71k964P58L140P60k935j879K251K799j131l172k25L149J460k499k506J387
3086a036L091k27l187j098K701K191j785k932N98L177P40k807j925K116K840r46
3102A511l213k76K935J592k320k650J325L026m9l142j199K565K259j642k964M87
3118a755L201P97k727j981K031K770q54l084m42K899J652k255k605J204K983J7
3134A851l009j293K480K284j492k881L39L099R09k672k011J873K823p07l072n87
3150b066K799J747k187k602J052K978J61k911j400K356K348j376k874K09K962
3165A196J062k477k087J673K804n07l086o17K628J771j956k634Q92K933L75k925
3181i55j544K290K427j235k844R0K969J089k460k065J531K772l78l019p50K546
$$ plain form
3197 464 2331 446 -2151 -1388 1507 1911 -843 -2375 -271 2146 1009 -1786 -1794 1081 2307 -30
3213 -30 -2183 -776 1956 1693 -1243 -2077 422 2292 543 -2040 -1437 1409 1950 -757 -2373 -290
3229 -290 2102 1141 -1690 -1813 918 2322 73 -2145 -766 1955 1697 -1140 -2092 306 2241 506
3245 506 -2082 -1474 1291 1852 -652 -2308 -382 2039 1200 -1589 -1831 874 2212 122 -2017 -895
3261 -895 1885 1715 -1056 -2124 202 2180 635 -1966 -1544 1206 1945 -483 -2276 -485 2013 1263
3277 1263 -1473 -1839 776 2238 221 -2023 -952 1683 1717 -987 -2106 108 2118 695 -1854 -1611
3293 -1611 1131 1876 -389 -2145 -510 1936 1337 -1350 -1794 732 2186 343 -1959 -989 1632 1706
3309 1706 -825 -2054 -31 2030 720 -1829 -1653 1005 1936 -267 -2170 -545 1884 1391 -1290 -1792
$$ packed form
3197D64J867j885k597P63K895M04k754j532K104K417j137k795qK875J226k337
3213c0k153J407K732k63k936q34K499J870j749k583O03K846N41k707j616K083
3229b90K392r61k831j23K731J404k249k218J379K721k58k837r52K398J935j735
3245E06k588O08K765N61k504j656J926K421q39k789k42K705J338k090k139J122
3261h95K780j70k771j068K326J978j545k601M22K750P39k428j793J791K498p50
3277A263k736l66K615J462k017k244J071K635L4k704j119K214K010j423k549K43
3293a611K742P45k265j756J635K446n99k687m44K526J454j843k302R70K621P4
3309A706k531j229K023K061j310k549J76K658R31k203j903J625K429m93k681n02
$$ plain form
3325 -1792 568 2155 367 -1881 -1079 1517 1773 -799 -2077 -130 1969 785 -1742 -1611 898 1908
3341 1908 -187 -2067 -639 1776 1438 -1145 -1820 519 2132 487 -1824 -1090 1433 1710 -696 -2064
3357 -2064 -183 1827 866 -1643 -1666 856 1939 -98 -1998 -653 1736 1455 -1085 -1828 414 2058
3373 2058 572 -1795 -1205 1279 1777 -564 -2071 -238 1830 999 -1529 -1706 747 1922 -10 -1910
3389 -1910 -751 1658 1485 -977 -1807 326 2014 637 -1691 -1239 1247 1696 -529 -2007 -321 1704
3405 1704 1015 -1442 -1633 661 1915 103 -1883 -785 1579 1529 -895 -1819 241 1994 624 -1644
3421 -1644 -1296 1134 1704 -571 -2011 -496 1702 1035 -1385 -1665 648 1901 112 -1777 -813 1480
3437 1480 1548 -768 -1759 161 1906 668 -1607 -1321 966 1655 -388 -1929 -521 1674 1079 -1335
$$ packed form
3325a792K360J587j788k248Q02K596K56k572j278J947K099j184k527J31K509J010
3341A908k095j880J428K415l38k583o75K339J613j645k311P34K523K77k406j368
3357b064J881K010r61k509k3K522J083k037j900J345K389k81k540p43K242J644
3373B058j486k367N90K484M98k341j507J833K068q31k528j77K453J175j932j900
3389a910J159K409j73k462q30K133J688j377k328M52K486M49k225j478J686K025
3405A704o89k457j91K294J254j812j986J098K364n0k424r24K060J753j370k268
3421a644L48K430N70k275j440J515K198o67k420k80K313J253j789j889R64K293
3437A480O8k316r91J920J745j238k275K86K287O89k043j541J408K195n95k414
$$ plain form
3453 -1335 -1703 549 1879 218 -1779 -871 1493 1594 -721 -1747 62 1786 709 -1522 -1405 968
3469 968 1695 -327 -1958 -547 1531 1137 -1200 -1654 472 1836 327 -1674 -905 1423 1576 -634
3485 -634 -1789 -8 1746 803 -1463 -1428 805 1606 -273 -1845 -645 1507 1165 -1128 -1642 404 1761
3502 1761 408 -1589 -931 1291 1539 -550 -1743 -71 1695 737 -1387 -1406 759 1651 -202 -1787
3518 -1787 -652 1420 1171 -1006 -1611 316 1815 481 -1531 -982 1250 1526 -456 -1715 -142 1643
3534 1643 781 -1315 -1386 662 1652 -76 -1742 -704 1393 1220 -936 -1597 321 1764 523 -1472
3550 -1472 -1024 1190 1543 -415 -1711 -242 1588 818 -1312 -1423 625 1566 -55 -1696 -716 1308
3566 1308 1217 -776 -1591 238 1732 499 -1375 -1084 1022 1519 -386 -1733 -365 1473 871 -1228
$$ packed form
3453a335l68K252J330j661j997R08K364J01k315j026J809J724j077k231J17K373
3469I68P27k022j631J411K078l94k337m54K126J364j509k001P69K328J53k210
3485f34j155J781J754r43k266L5K233Q01j879j572J200K152l42k293n14K046J357
3502A761j353j997O58K222K48k089j193J672J766r58k124j9K165Q92j853j585
3518a787J135K072k49k177o05J927J499j334k012N49K232K76j982j259J573J785
3534A643q62k096p1K048R90j728j666J038K097j73k156o61J918J443j241j995
3550a472M48K214L53j958j296J469J830p70k130j11K048R41j621j641R80K024
3566A308r1j993q15J829J494j233j874K91K106M97j905j347J368J838o02k099
$$ plain form
3582 -1228 -1420 573 1549 114 -1681 -764 1251 1318 -781 -1562 187 1698 584 -1376 -1070 961 1511
3599 1511 -320 -1662 -361 1417 936 -1191 -1455 451 1620 116 -1591 -766 1202 1333 -584 -1540
3615 -1540 110 1656 664 -1226 -1073 878 1471 -292 -1683 -433 1316 943 -1056 -1492 394 1549
3631 1549 170 -1476 -784 1161 1375 -557 -1482 26 1650 717 -1238 -1083 830 1506 -191 -1529
3647 -1529 -439 1323 965 -969 -1421 357 1534 210 -1417 -848 1079 1380 -482 -1513 -1 1559
3663 1559 700 -1215 -1132 783 1449 -164 -1534 -491 1267 1043 -945 -1413 226 1458 325 -1395
3679 -1395 -790 1030 1376 -377 -1445 -99 1527 718 -1108 -1222 717 1473 -54 -1486 -626 1228
3695 1228 1025 -903 -1418 245 1522 414 -1286 -898 1008 1381 -289 -1436 -187 1455 854 -1052
$$ packed form
3582a228j92J993R76j435j795R17K015O7k099p81J749J511j114j960L06K031N50
3599A511j831j342J301J778m81k127k64J906J169j504j707Q25J968J31j917r56
3615a540J650J546r92j890J53J951N93j763j391J250J749l73j999m36J886J155
3631A549j379j646O92J945K14j932r25J508J624r33j955J55J913O76j697j338
3647a529J090J762l58j934m52J778J177j324j627N69J927L01j862j031J512J560
3663A559q59j915Q3J915O66j613j370J043J758k24j988m68J639J232j133j720
3679a395O05J820L46j753j068J346J626q09j826j14J939P56j527j432Q60J854
3695A228k03j928n15J663J277j108j700L88J906L73j670j147J249J642o01j906
$$ plain form
3711 -1052 -1173 553 1394 -58 -1468 -671 1115 1019 -797 -1395 159 1508 395 -1251 -860 932 1290
3728 1290 -368 -1420 -193 1411 795 -973 -1162 479 1342 30 -1418 -689 1090 1037 -727 -1381 49
3745 49 1438 462 -1104 -925 855 1324 -283 -1321 -248 1280 816 -958 -1216 465 1292 55 -1376
3762 -1376 -655 1072 1081 -662 -1326 51 1394 550 -1081 -920 805 1324 -218 -1351 -273 1233 808
3779 808 -897 -1155 312 1311 127 -1369 -752 1006 1045 -619 -1299 -27 1322 478 -1111 -934 804
3796 804 1257 -92 -1338 -331 1108 780 -852 -1251 325 1211 152 -1261 -711 865 1102 -463 -1234
3813 -1234 -39 1254 586 -957 -905 725 1247 -116 -1243 -370 1117 908 -738 -1232 253 1268 214
3830 214 -1282 -756 829 1048 -503 -1236 -60 1260 640 -950 -958 648 1225 -26 -1208 -473 1062
$$ packed form
3711a052j21J726Q41j452j410P97J786r6j816n98J554J349j113j646L91J792L58
3728A290j658j052J227J604o16j768j89J641Q63j312j448P29J779n3j764o54J430
3745D9J389r76j566J79J780M69j607j038J073J528m64j774k58J681Q27j237j431
3762a376P21J727Rj743o64J377J343q44j631J61J725N19j542j133J078J506m25
3779H08j705k58J467R99j184j496O17J758L9j664o80J272J349q44j589J77J738
3796H04M53j349j246J007J439l28j632l99J576Q86j059j413N50J576K37j565p71
3813a234J195J293o68j543N2J630N22j363j127Q73J487k09j646m94J485J015j054
3830B14j496N26J585K19j551p33J176J320o20j590qJ606N77j251j182P35J535
$$ plain form
3847 1062 806 -793 -1187 155 1187 176 -1192 -788 794 1093 -375 -1224 -113 1181 695 -868
3863 -868 -924 544 1262 23 -1200 -476 990 856 -709 -1189 73 1189 319 -1122 -813 765 1084
3880 1084 -368 -1182 -150 1173 698 -855 -929 478 1246 -15 -1112 -517 932 888 -644 -1196 76
3897 76 1111 344 -998 -805 688 1100 -257 -1166 -166 1178 668 -772 -985 391 1132 80 -1153
3914 -1153 -556 876 844 -551 -1162 19 1109 387 -961 -821 600 1058 -169 -1104 -271 1096 754
3931 754 -684 -942 339 1154 49 -1070 -542 863 786 -528 -1125 -44 1104 416 -925 -808 554
3948 554 1046 -94 -1083 -230 1052 754 -642 -973 273 1077 141 -1082 -669 749 874 -488 -1145 -50
3966 -50 1078 438 -956 -801 558 1086 -81 -1083 -250 978 764 -584 -925 266 1113 145 -1001
$$ packed form
3847A062k56j599l94J342J032j011j368M04J582K99j468q49J111J294m86j563
3863h68n6J468P18j239j223P24J466j34j565m80J262J116q70j441L09J578L19
3880A084j452q14J032J323m75j553p4J407P68j261j097N95J449m4j532n52J272
3897G6J035p67j342J93J493M12j357r09J000J344n10j440k13J376P41j052j233
3914a153N97J432l2j395o11J181J090p22j348J40J421M58j227r35Q33J367l42
3931G54j438k58J281Q15j105j119N28J405p7j314n97J081J148o88j341J17J362
3948E54M92j140r89Q53J282k98j396l31J246Q04r36j223M13J418J25j362o57J095
3966e0J128o40j394J55J359N28j167j002Q33J228k14j348l41J191Q47r68j146
$$ plain form
3983 -1001 -630 676 875 -404 -1055 -47 1035 507 -813 -829 502 1041 -62 -983 -271 939 764
4000 764 -581 -933 194 1017 211 -960 -631 708 892 -444 -1066 -150 1001 530 -829 -831 491 1036
4018 1036 15 -943 -355 886 755 -591 -876 144 982 203 -945 -650 634 859 -359 -1006 -117
4035 -117 954 535 -722 -794 424 985 27 -917 -302 794 765 -461 -964 68 969 247 -907 -702
4053 -702 586 859 -254 -1027 -140 925 531 -643 -755 363 995 52 -885 -406 807 738 -470 -880
4071 -880 25 907 278 -847 -668 518 894 -242 -951 -232 924 539 -603 -732 324 1029 115 -867
4089 -867 -403 714 751 -483 -914 40 856 290 -815 -639 482 888 -137 -918 -158 836 525 -565
4107 -565 -683 267 907 111 -869 -394 729 708 -352 -855 -20 861 361 -762 -668 505 821 -124 -821
$$ packed form
3983a001L71J306J99j279o51J008J082n28j320j6J331N39j103r21P12J210j75
4000G64j345l52J127Q23q06j171L29J339J84j336o22R16J151m71j359kJ322N45
4018A036j021r58N88J241j31j346k85J020Q38p79j148K95J284K25j218o47Q89
4035a17J071m19j257p2J218N61r58r44O15J096k9j226n03J032R01p22j154K05
4053g02J288K73j113p73Q87J065l94j174j12J118O32r43r37M79J213o9j208m10
4071h80R05Q82o29j125J79J186L76j136p09P19J156l85j142j29J056P05r14r82
4089h67M64J117L7j234m31R54Q16n66j105J76J121M06j025p81P60R94l11j090
4107e65j18R50O40p96r80M75J123k1j060n03Q35Q81n00j123R4J173L16r45o97
$$ plain form
4126 -821 -222 850 581 -493 -749 301 882 187 -838 -454 642 655 -346 -870 -81 827 388 -694
4144 -694 -648 406 812 -91 -839 -243 811 646 -471 -758 251 871 194 -730 -510 611 669 -311 -899
4163 -899 -45 820 377 -702 -685 392 797 -21 -760 -293 672 564 -490 -747 164 850 166 -757 -499
4182 -499 490 685 -252 -797 -152 755 354 -588 -679 393 776 12 -816 -278 798 563 -386 -761 148 883
4202 883 261 -708 -487 500 694 -240 -832 -134 731 350 -613 -705 288 775 49 -757 -322 628 612 -368 -719
4223 -719 90 787 263 -705 -520 424 658 -199 -813 -149 733 396 -561 -619 266 809 64 -750 -293 668
4243 668 614 -310 -729 117 831 250 -703 -511 407 650 -182 -697 -233 636 397 -491 -623 232 724 100
4263 100 -673 -290 574 569 -304 -780 82 715 242 -636 -500 413 638 -166 -772 -172 589 435 -427 -622 285
$$ packed form
4126h21N99J072k69j074k56J050N81o95j025L84J096J3j001n24P89R08m39j082
4144f94M6J054M06r03p48N96J054j65j117k87J009O20o77r24K20J121N8r80n88
4163h99Q54Q65m43j079J7J077M05q18p39M67R65j08j054k57R11O86o84r23K58
4182d99R89J95r37n45O45R07m01r42r1J072L83p64q28N38J076k35r49l75R09P35
4202H83o22r69K21R87J94r34n92O98Q65l81r63r2R93M87p26q06M35R50j6r80l51
4223g19Q09O97n24r68J85R44K34q57o14O64Q82l37r57n8Q85N43p45q14M57R61
4243F68n4r24m19Q46P14n81r53J92R18K43q32n15M64Q69k39q88j32Q55M92o24
4263A00p73L83Q64nq73m76Q62O33m73q78J36R13K25q04o06O00P61j54q62j95R07
$$ plain form
4284 285 784 83 -620 -326 555 594 -291 -639 1 682 238 -622 -541 354 631 -138 -716 -158 644 444 -466
4305 -466 -626 201 711 110 -592 -327 571 633 -258 -650 15 596 300 -530 -542 318 622 -94 -717 -171 620
4326 620 465 -429 -659 258 655 191 -609 -342 487 570 -266 -674 -27 607 267 -572 -561 267 602 -66 -648
4347 -648 -236 579 502 -337 -589 148 632 173 -564 -330 427 532 -201 -679 -30 632 290 -505 -515 282 621
4368 621 -84 -631 -306 539 433 -361 -560 142 653 176 -525 -320 430 528 -194 -627 -60 503 268 -539
4388 -539 -515 243 542 -57 -637 -206 466 480 -298 -550 126 634 155 -515 -423 416 509 -173 -603 -86 549
4409 549 278 -467 -462 197 604 59 -557 -258 437 460 -259 -554 71 604 163 -507 -365 332 520 -164 -567
4430 -567 -112 499 294 -413 -526 210 566 9 -538 -264 497 411 -285 -537 98 590 184 -483 -320 308
$$ packed form
4284B85M99p01p03K94Q81L9q85l48O40O81m44q60Q1Q95K77p69n78N58Q02k00r10
4305d66j60Q27N10o01p02K65Q98O2q91l92O65N81k96q30j2Q60L04p16o23N46P91
4326F20j55q94k30R17L97m64q00K67Q29Q3q36m08O47O34l40q39J1Q28L35o68n82
4347f48M12Q15p7q39k52P37M84m59p37K34P57J05p33m78O49O62l42p95j0P97L39
4368F21p05n47L25Q45j06p94j99P02N11m77p01K05P50R8p22m33N67N63k35q07
4388e39K4P58K99n99n80M31O72J4p78k52O76N08m79o70R2Q39R3o82m30N17O35
4409E49k71p45NO59M07n45o16K99O95K3p19k95O25N33m41o70J42O97J88o84m03
4430e67M55O11k05p07j13P36L56n57n47K74P61q6o96k52O35M92m06o67J63O28
$$ plain form
4450 308 487 -126 -580 -117 561 338 -405 -486 240 502 74 -492 -221 455 447 -231 -476 23 498 190 -445
4471 -445 -370 267 485 -194 -537 -120 441 269 -403 -429 156 534 81 -469 -236 428 508 -182 -519 43 510
4492 510 180 -383 -357 210 411 -97 -518 -177 456 266 -298 -429 143 488 61 -423 -241 382 383 -158 -474
4513 -474 -18 497 232 -404 -385 252 408 -86 -486 -155 339 293 -353 -399 146 471 104 -445 -264 354 381
4534 381 -134 -496 5 465 237 -370 -347 245 417 11 -533 -135 384 269 -333 -405 140 416 147 -402 -232
4555 -232 365 357 -125 -468 14 460 166 -345 -373 205 448 -62 -465 -162 316 330 -231 -437 127 471 82
4576 82 -421 -251 306 410 -110 -447 32 401 205 -383 -363 197 385 -47 -435 -140 347 277 -235 -354 74
4597 74 440 119 -306 -269 342 388 -133 -404 -55 398 153 -333 -294 109 406 -17 -421 -110 372 267 -265
$$ packed form
4450C08J79o13m54M63O78k23p43q1P26K62m28n66K71O76qo78k45M99M75l08o35
4471d45P5O37K18o79l43M17N61j72o72k6N85L78m53n50K33O64Q0o90l37N62M67
4492E10l30n63K6N67K01n08m21L41O33j90n64j31N72L45m27m84J82O23Jn41l16
4513d74M56N15k65o36J9O37J56m94m00L31M94m6o46m6N45L25l67n49J81O18K7
4534C81n15l62N01M60k28o07K3N92J72m06n44L98N19j15o02p2N45K76k69n49J70
4555b32N97qm82l43M82M46k94n11k8N78K43n10m03L03M78J4n61k06N64L44l89
4576H2n03J70N57J04n20l37M79L69j96n88K0N60J88m32l88K95M87p0n12j19M28
4597G4L66l21m25L7O11M6n21k71L49M53k45m86L9M03K97m23m04L11M82j05n32
$$ plain form
4618 -265 -321 35 419 59 -317 -256 302 365 -84 -421 -52 391 193 -356 -300 111 356 -51 -368 -141 254
4639 254 318 -148 -357 11 371 117 -289 -244 259 344 -63 -377 -43 343 221 -284 -327 161 342 2 -353
4660 -353 -183 291 243 -145 -323 31 336 137 -330 -193 227 289 -62 -367 -53 346 203 -225 -369 143 300
4681 300 17 -347 -209 249 249 -171 -305 66 351 132 -318 -240 185 285 -94 -379 -127 294 180 -215 -333
4702 -333 33 328 11 -315 -137 246 285 -167 -266 4 323 152 -262 -208 223 362 -144 -285 -78 251 189
4723 189 -244 -284 63 336 -11 -325 -174 243 302 -112 -306 23 347 128 -298 -185 192 210 -51 -352 -53
4744 -53 344 165 -202 -233 68 324 33 -287 -111 234 184 -86 -262 28 264 97 -234 -241 151 300 -77 -349
4766 -349 -90 323 156 -243 -261 84 251 19 -302 -195 310 247 -162 -271 60 249 78 -252 -230 170 259
$$ packed form
4618b65n6L56L84l60l76O1N58O3m49l37L69M43j98n49N6M11K45m07l17K27L95
4639B54O4m66k09L68L60k54m06M5N03Q5m07l14L34L86j22n05m3M88J81l40l55
4660c53J70M74m8l88j78L54L05j99m67J37M20O2l51l05L14L99j43m28j44N12J57
4681C00k83l64J38M58%m20j34L71K85k19m50P8M25J00l79k85K52M21j14l95j18
4702c33L66K95l17l26J78L83L9m52r9K70L19j71m14N4M31J39n06j41K07L29o2
4723A89m33m0L47K73l47l14J51M17N9m14j94L29L24k19m26J13L77J8k61l01K99
4744e3L97j79l67l1L01K56k91l20J76L45n0k70j76K90K36j67l31pL92J49l77k72
4766c49K59M13j67l99j8L45J67k32l21J07N05o3m09j09L31J89j71l30K2M00Q9
$$ plain form
4787 259 -47 -288 -38 233 206 -212 -251 76 276 88 -250 -173 236 241 -60 -247 11 290 92 -284 -211 166
4809 166 298 -87 -288 -145 181 134 -210 -232 49 295 14 -283 -122 199 211 -98 -210 11 261 118 -205
4830 -205 -155 152 289 29 -294 -60 221 198 -178 -249 66 257 9 -194 -125 194 259 -75 -224 -17 236 58
4852 58 -238 -199 108 295 -15 -296 -89 271 124 -220 -264 33 213 66 -194 -116 165 280 -59 -207 13
4873 13 237 113 -157 -161 101 191 -29 -270 -57 218 142 -157 -168 34 240 66 -210 -166 144 168 -111 -198 33
4896 33 245 54 -208 -185 113 219 -49 -204 -70 173 190 -131 -190 67 205 52 -235 -110 120 185 -136 -207
4918 -207 -26 250 101 -178 -138 117 197 -48 -214 -112 203 122 -197 -234 17 170 43 -180 -137 174 122 -61
4940 -61 -193 -45 198 29 -212 -164 94 202 -63 -206 -12 167 110 -93 -205 129 192 42 -143 -88 166 196
$$ packed form
4787B59l06k41K50K71k7m18l9L27K00j88l38P7M09Nl01j87K58K79j98l76P3L77
4809A66J32l85k01J43L26m7l44k2K81K46k81k97J61L21J2l09j12K21K50j43l23
4830b05N0L07J37k60l23K34K81k3l76p1L15J91k48k03O9L19O5l34j49K07K53j78
4852E8k96L9L07J87l10k81K07L60j47l44m4K97J80j47k60P8K81J15l39j48K20
4873A3K24j24k70mK62R0k20k41K13K75p6k99j1K02K06j74k76M4L10K4k79q7K31
4896C3K12j91k62K3K98J06k68j55J34K43J7l21n9K57J38j53k87J25K30O5l21p1
4918b07J81K76j49k79M0K55Q0k45j66J02L15q1l19l7K51J53j27k23M3L11n2j83
4940f1j32J48K43j69k41M8K58J08k65j43J94J79n7k03j12L34O3j50j85N5K54L0
$$ plain form
4962 196 -72 -188 -17 215 105 -169 -168 110 196 -44 -194 -73 150 114 -106 -190 63 175 76 -217 -73 117
4984 117 213 -40 -213 -17 192 86 -151 -168 93 139 -134 -239 -36 165 116 -167 -113 65 167 46 -174 -88
5006 -88 155 214 -42 -137 -34 205 114 -117 -128 92 138 4 -162 -47 229 124 -159 -164 49 177 9 -169 -108
5029 -108 101 107 -74 -181 26 164 93 -152 -143 87 170 -38 -110 -67 135 130 -53 -176 42 204 -14 -167 -90 104
5053 104 138 -31 -204 -6 113 109 -152 -118 94 198 12 -184 -45 181 92 -146 -153 63 131 35 -175 -128 160
5076 160 134 -37 -172 -29 133 47 -143 -148 97 117 14 -157 -17 166 106 -111 -114 -1 183 88 -93 -55 84
5099 84 87 -114 -95 -15 165 81 -149 -114 84 165 -61 -135 -56 158 89 -113 -67 28 158 12 -136 -85 133 117 -103
5124 -103 -114 -38 79 53 -131 -145 52 201 33 -94 -10 107 128 -43 -105 -21 163 4 -160 2 86 135 -86
$$ packed form
4962A96k68j16J71K32j10k74JK78Q6k40j50J21K23l6k20q4K53J12r9k93J44J90
4984A17R6k53j73J96K09j06k37j7K61M6k73j05K03K01m9k83N4J78J02j21k20Q6
5006h8K43N9k56r5J03K39r1k31j1K20M6j34j66J15K76j05k83nK13J28j68j78O1
5029a08K09Oj81j07K07J38p1k45RK30Q3k08p2M3K02nj83j23K18J62k18j53P7J94
5053A04L4j69j73J98J19mk61L4K12J04j86j96J39K26q9k38pK16O8r6k10M7K88
5076A60k6j71j35J43J62q6j90nK45K0j03j71J40J83o0k17lJ13J84r5j81L8J39
5099H4Lk01J9Q0J80q4k30L5J98Q1k26p4P9K14o9k02M6R5J30j46j48N1K18j6k20
5124a03j1P6J17k6j84j4J97J49j68j27Q4J17K1j71o2Q4J84j59j64J62Q4M9k21
$$ plain form
5147 -86 -194 -8 126 59 -139 -138 72 137 -19 -138 -3 149 114 -21 -133 26 119 8 -121 -103 132 105 -59
5170 -59 -100 9 115 81 -115 -116 74 114 -5 -60 -29 116 118 -89 -76 62 147 21 -121 -34 99 88 -41 -173 12
5195 12 139 30 -120 -155 60 65 -57 -117 -12 135 51 -37 -107 7 112 49 -103 -31 76 103 -18 -148 -9 138
5219 138 77 -108 6 78 108 -37 -87 -45 107 106 -109 -122 29 143 8 -147 -84 74 69 0 -190 -8 120 4
5243 4 -124 -128 89 116 -14 -135 -27 156 32 -66 -90 48 168 26 -77 -71 103 80 -25 -106 -37 144 29 -134
5267 -134 -59 99 67 12 -73 -80 133 80 -25 -110 25 131 -7 -98 -76 66 83 -50 -108 -26 116 37 -121 -68 120
5292 120 129 5 -116 0 116 32 -57 -43 72 56 -8 -190 -54 47 113 -5 -116 61 83 7 -133 -33 96
5315 96 19 19 -55 13 42 86 -75 -98 4 56 -39 -177 -24 52 38 -63 -114 -7 77 67 -140 -53 72 96 -17 -86
$$ packed form
5147h6j08J86J34o7j98JK10O5j56j19J35J52l5j35j12J59R3j11j29J8K35k7j64
5170e9m1J09J06l4j96jJ90M0j19n5L1J45Kk07J3J38Q5j26j42Q7J33j1j29j32J85
5195A2J27j09j50l5K15Nj22o0J05J47q4q8p0J14J05o3j52P2J07K7j21j30J39J47
5219A38o1j85J14P2L0j45n0M2J52jk15j3J51J14j35j55O3J58no9j90J82J28j16
5243Dj28mK17K7j30j21J08J83j24r8k4J38J20j42j03OJ74k3j05q1O9J81j15j63
5267a34P5J58l2n5q5pK13n3j05q5J35J06j38r1K2J42J7j33n8Q2J42p9j58N3J88
5292A20Rj24j21J16J16q4q9J4J15j6o4j82J36J01O6j18j11J77K2p6j40J00J29
5315I6p7%p4O8K9M4j61k3J02N2r5j38J53P6j4j01n1J07Q4j0k07Q7J25K4j13o9
$$ plain form
5341 -86 3 78 28 -90 -100 53 105 -4 -113 -49 61 5 -13 -63 21 105 9 -62 -57 43 52 8 -68 8 82 57 -112 -88
5369 -88 48 111 -5 -134 -118 101 18 -48 -84 7 89 -13 -76 -66 34 116 -67 -124 1 93 55 -77 -9 -15 25 -43
5395 -43 -94 -25 117 29 -59 -47 29 34 -26 -62 -88 96 71 -9 -98 20 98 22 -52 -51 24 93 -60 -68 -45 27 45 -37 -87 67
5425 67 102 28 -89 -71 73 55 -50 -96 -21 73 27 -57 -46 23 72 -26 -119 -74 69 10 -48 -68 10 29 -9 -50 -25 117
5453 117 115 -43 -86 41 39 -14 -90 -103 31 71 84 -98 -44 73 41 -35 -72 6 94 57 -79 -26 107 18 -97 -75 14
5480 14 112 63 -105 -9 63 61 -21 -64 -32 86 74 -75 -53 58 24 17 12 -20 70 39 -51 -67 15 62 38 -66 -59 36 49 -32
5510 -32 -90 -26 122 33 -83 -64 19 87 -33 -64 -44 13 44 -13 -115 12 100 2 -88 -49 56 77 5 -88 6 81 39
5537 39 -84 -89 4 44 28 -72 18 91 24 -63 -72 -1 67 -44 -89 -69 29 85 -3 -116 -16 67 2 -76 -87 10 92 34 -48
$$ packed form
5341h6Q9P5n0j18j0J53N2j09j09O4J10n6j8n0Q4Q4r6p1NJ00Rm4p6P6P4k5j69K4
5369h8J36O3j16j29J6K19q3o6l6R1Q2j02o3J0J00Q2j83n7J25R2l8j32O8oM0o8
5395d3n1O9J42q8q8J2P6No0l6k6J84k5q0q9J18P8p6p4JP5O9j53qK3P2J8q2n0J54
5425F7L5p4j17J8J44j8j05m6P5R4m6q4J1O9M9r8r3M5J43n9n8k0P8J9l8m1K5J42
5453A17kj58m3J27kn3p6j3J34M0J3j82N4J17l2p6l7P8Q8l7j36N3J33q9j15K2Q9
5480A4R8m9j68R6P2kq2m3L2J18j2j49K2J11l4pnl2R0l1r0j6Q2M7k4j04PR5J3q1
5510c2n8O4J48q9j16J9Q3O8j20l1K0N7L1n7j02J27Q8r8r0L9J05K1p2r3R4P5m2
5537C9j23nR3M0j6j00R0P3o7q7rP1O8j11m5K0R8N6q8j13J00Q3o5p8j1R7Q2n8q2
$$ plain form
5566 -48 -8 80 102 -13 -97 -77 81 43 -118 -77 29 52 -58 -62 33 52 46 -89 -39 14 85 24 -34 -30 114 74 -36 -64
5594 -64 61 96 15 -53 -82 81 47 -121 -101 -13 91 -12 -73 -77 57 114 4 -74 -9 72 75 -47 -127 -24 79 7
5620 7 -137 -53 -6 68 -89 -97 32 130 47 -35 -70 49 111 4 -65 -49 64 33 -29 -73 33 62 47 -70 -29 2 28
5647 28 -23 -94 -15 34 40 -92 -55 20 51 -27 -120 -3 -23 33 -53 -62 48 43 -34 -49 -17 64 56 13 -84 5 105 7 -35 -119
5677 -119 104 112 73 -59 -31 94 16 -67 -120 4 106 -29 -14 -78 89 82 27 -110 21 38 21 -47 -103 45 77 -93
5703 -93 -105 -74 68 67 -57 -56 1 79 17 -36 10 138 101 -30 -14 19 79 12 -72 -48 83 76 -57 -77 -24 97 56 -59
5731 -59 -92 -8 78 32 -87 -100 26 57 -43 -76 -15 78 82 -60 8 85 64 -25 -61 4 140 51 -92 -40 -25 64 -23 -84
5759 -84 -14 57 30 -84 -121 -29 86 41 -99 -95 26 34 -13 -130 -31 95 11 -89 -56 35 72 -2 -50 -28 111 61 -53
$$ packed form
5566d8M0Q8K2j15q4K0J58l8j61M1J06K3j10mR5J9oj35N0N3P1o1n8MJ44m0j10k8
5594f4J25L5q1o8k9J63l4j68K0Q8J04j03o1mJ34N7j10p8O5Q1Lj22q0J03J03p2
5620Gj44Q4M7P4j57qJ29R8q3q2l5J19O2j07o9J6J13l1o2m4J06K9j5j17M1L1K6
5647B8n1p1P9M9Oj32L7P5L1p8r3J17k0N6q6rJ10np7j5L2Q1qm3r7Q9J00r8m2q4
5677a19K23Ql9j32K8J25p8q3n3J24J02j35J5o4J67pn5j37J31J7j7o8n6J48L2j70
5703i3j2L1J42jj24JN7P8o2n3M6J28l7j31J6L3O0o7q4K4J31pj33k0N3J21m1j15
5731e9l3Q4Q6m6j19j3J26L1j00l3O1R3Mj42O8P7k1q9l6O5J36q9j43N2J5Q9q7o1
5759h4P0P1k7j14l7R2J15m5j40MJ21Qm7j17R9J26q4j00L3R1L7p4m8K2J39n0j14
$$ plain form
5786 -53 -59 14 63 25 -34 -71 94 95 -33 -89 -27 77 19 -132 -112 7 67 13 -65 6 36 46 -44 -51 14 126 34 -75
5814 -75 -37 104 73 -28 -105 31 29 31 -102 -18 -6 128 33 -74 -57 74 29 -68 -80 15 46 -9 -106 -15 111 76 -58
5841 -58 -124 -13 91 -23 -62 -74 39 108 28 -62 -17 74 53 -51 -81 47 155 -36 -64 -34 74 64 -137 -100 -23
5866 -23 50 16 -103 -135 29 77 -13 -141 12 129 48 -21 -96 12 119 19 -84 19 86 52 -34 -125 -17 86
5890 86 11 -91 -59 33 81 -38 -112 8 98 82 -101 -117 15 126 -20 -99 16 136 62 -58 -125 -24 117 88
5914 88 -129 -115 43 90 -64 -94 -29 107 79 -94 -107 -2 138 40 -74 -56 83 127 -127 -138 28 117 91 -82
5938 -82 -54 70 72 -11 -125 -7 97 132 -72 -87 90 164 -30 -115 -90 101 91 -55 -99 -9 44 17 -147 -78 39
5963 39 35 13 -110 -45 102 103 -41 -68 80 172 24 -128 -47 112 76 -120 -151 1 111 16 -146 -70 27 114 -14
$$ packed form
5786e3oP3M9l8n9l7J65Jj28n6O2J04n8j51K0J19O0n4p8P1L0J0r0pO5J12r2j09
5814g5L8J41l1j01p7J36kKj33Q4J2J34r5j07J7J31m5r7j2R5L1n5r7R1J26l5j34
5841e8o6J11J04j14l9j2J13O9q0r0M5R1k1j04l0J28J08j91k8L0J08j0k01L7P7
5866b3P3l4j19l2J64M8r0j28J53J17q1o9p5J08J07j00j03J03O7l4q6r1J08J03
5890H6p5j02L2R2M8j19p4J20R0j6j83j6J32J11j46p9J15J20p4j20o7J01J41k9
5914H8k17J4J58M7j54l0O5J36k8j73j3J05J40r8j14J8J39M4k54j1J66Q9k6j73
5938h2K8J24Kq3j14J18J04L5k04j5J77P4j94q5K5J91j0j46m4R0N3k7j64O9J17
5963C9mk2j23O5J47Jj44k7J48R2j48j52Q1J59l6j96l1J52J10r5j62P6R7Q7j28
$$ plain form
5988 -14 -121 -17 131 103 -117 -81 51 114 22 -158 -108 115 95 -39 -133 -29 118 15 -92 -80 61 85 17 -116
6012 -116 -60 133 51 -43 -113 38 143 43 -95 -71 151 113 -74 -80 14 166 -12 -139 -80 38 140 -7 -167
6035 -167 -14 147 53 -94 -128 48 171 1 -145 -90 135 149 -97 -113 -35 137 51 -63 -100 103 136 -17 -113
6058 -113 -60 146 82 -100 -129 46 153 8 -80 -46 105 114 -85 -136 -10 112 -3 -166 -125 60 123 -66 -164 -59
6082 -59 170 100 -95 -125 37 177 0 -174 -18 101 119 -80 -128 -14 119 64 -114 -129 7 165 -29 -119 -47
6105 -47 126 142 -140 -105 33 141 3 -107 -67 109 128 -47 -187 10 147 108 -113 -127 22 163 -25 -81 -63
6128 -63 176 99 -39 -106 17 147 -20 -193 -108 92 134 -27 -143 15 102 42 -138 -152 61 123 10 -136 -64
6151 -64 126 119 -68 -137 -5 76 -9 -162 -123 107 148 -46 -143 -10 148 28 -132 -70 67 169 -39 -134 -89 74
$$ packed form
5988a4j07J04J48k8k20L6J32O3r2j80N0K23k0j34r4J04J47j03j07J2J41K4o8j33
6012a16N6J93q2r4p0J51J05j00j38K4K22l8j87oR4J52j78j27N9J18J02j47j60
6035a67J53J61r4j47l4J76J23j70j46N5K25J4k46j6P8J72q6j14l7K03L3j53r6
6058a13N3K06o4j82k9J75J07j45q8L4J51Rj99n1J26J22j15j63M1J85O3j89r8J05
6082e9K29p0j95l0J62J40j77j74J56J19J8j99m8J14J33n5j78j5J36J58j94r0P2
6105d7J73J6k82L5J38J08j38j10M0J76J9j75j40J97J37l9k21j4J49J41j88n6J8
6128f3K39p7j38o7J23J30j67j73Q5K00M2j61j16J58Q7o0j80j4K13O2j13j46P2
6151f4J90pj87o9J32Q1q5j53L9K30M1j94r7J33J58j20j60O2J37J02k08r5M5J63
$$ plain form
6175 74 89 -108 -111 83 199 8 -160 -131 98 138 -59 -142 -49 161 76 -148 -183 97 170 -56 -183 -19 206 111
6199 111 -101 -188 87 121 42 -173 -146 48 122 -99 -215 35 95 80 -171 -148 91 153 -7 -137 -26 123 111
6222 111 -88 -182 60 186 36 -152 -170 98 120 -78 -200 -53 231 128 -161 -111 45 221 -25 -190 -110 129
6244 129 140 -126 -182 13 201 49 -151 -127 102 164 -66 -192 23 185 69 -84 -108 79 185 -17 -181 -65
6266 -65 219 102 -139 -188 16 136 0 -141 -117 115 152 -85 -185 -93 140 81 -111 -143 98 187 3 -164 -108
6289 -108 167 165 -49 -165 -7 146 40 -173 -113 33 204 -65 -217 -46 169 82 -111 -168 11 164 -43 -210
6311 -210 -64 114 145 -145 -171 -28 168 69 -160 -151 100 155 -28 -248 -20 190 123 -57 -188 16 165 -28
6333 -28 -233 -86 173 162 -95 -153 -16 173 65 -154 -166 51 203 -43 -181 -103 221 130 -132 -154 -16 171
$$ packed form
6175G4J5j97lJ94J16j91j68K9K29M0j97q3R3K10q5k24l5K80P3k26j27J64K25r5
6199A11k12q7K75L4p9k15K7J94P4k21j16K50O0j5k51K3K39O2j60j30J11J49j2
6222A11j99r4K42J26j50j88j8K68K2j98j22J47K84j03k89N0J56J76k46j65Q0K39
6244A29J1k66n6J95J88j52k00K4K29O2k30j26K15J62j16j53k4J87J06k02j64J16
6266f5K84j17k41m9K04J20j36j41K4K32L7k37j00R2K33n9j92l2K41Q9j84j67N6
6289a08K75kk14j16J58J53j06k13O0J46J71k69j52J71K15q7j93n7J79J53k07j67
6311b10J46J78L1k90k6J43J96r9k29RK51N5j83k20K28K10o7j80j31K04J49j93
6333b8k05J47K59j1k57n8J37J89j08k19j2K17J52k46j38P8L24r1k62k2J38J87
$$ plain form
6355 171 67 -183 -74 125 205 -51 -180 -5 185 87 -142 -167 123 172 -31 -242 -81 167 115 -134 -251 27
6377 27 156 43 -266 -128 179 172 -89 -174 -11 168 81 -186 -146 123 230 -60 -214 -59 177 131 -59 -143 83
6400 83 181 32 -176 -101 146 175 -90 -187 37 119 115 -175 -131 100 193 -3 -238 -74 195 168 -120 -215 75 216
6424 216 23 -201 -174 120 189 -86 -238 -5 228 119 -135 -206 53 199 68 -212 -87 190 145 -131 -196 -19
6446 -19 222 43 -141 -171 92 186 -20 -216 -6 193 142 -166 -229 91 210 18 -186 -121 194 194 -79 -260 -17
6469 -17 195 30 -166 -190 135 201 -3 -268 -92 173 132 -215 -187 81 197 19 -241 -133 256 236 -123 -219
6491 -219 -32 208 30 -237 -205 116 220 -53 -209 -85 208 132 -232 -221 62 164 92 -237 -108 150 152 -25
6513 -25 -240 44 211 72 -212 -150 124 227 -47 -254 -93 211 120 -147 -177 35 320 66 -159 -135 149 207
$$ packed form
6355A71j04k50J09J99Q0k56j29J75J90r8k29k5K90M9k03k11J61K48n2k49j17K78
6377B7J29j13l09J38L07pk61q5J63J79q7k67M0K69J07k90j54J55K36m6j90q4K26
6400H3R8j49k08P5K47K9k65r7K24Q2mk90M4K31R3j96k35J64K69k7k88r5K90J41
6424B16j93k24K7K94O9k75j52K33K33j09k54p1K59J46j31k80J25K77m5k76o5J77
6446a9K41j79j84l0K63R4k06j96K10J99n1l08o3L20J19j92k04O5L15%k73j81K43
6469a7K12j65j96k4L25O6k04k65J76K65m1l47K8K68J16j78k60J08L89k0l59r6
6491b19J87K40j78k67L2L21J04k73j56J24K93p6l64J1K83J02p2l29J29K58Kj77
6513b5k15K84J67j39k84O2K74J03k74k07J61L04r1k67l0K12K85k54k25K4K84N8
$$ plain form
6535 207 -102 -255 -20 215 114 -178 -151 108 257 11 -248 -53 198 189 -178 -190 88 199 105 -185 -145 168
6557 168 236 -62 -219 -24 233 114 -126 -197 68 192 -13 -220 -88 198 221 -119 -242 8 203 107 -214
6578 -214 -100 126 212 -70 -214 9 224 127 -216 -197 81 243 50 -250 -155 278 144 -188 -190 3 193 62
6600 62 -229 -134 150 215 -56 -245 -5 246 123 -194 -199 102 238 2 -281 -151 202 192 -82 -192 44 282
6622 282 88 -226 -123 187 207 -70 -268 -58 222 166 -153 -227 102 282 -11 -252 -80 227 129 -96 -233
6643 -233 10 252 92 -192 -163 114 198 -36 -217 -72 231 157 -170 -210 40 212 17 -274 -144 175 226 -116
6665 -116 -237 47 269 168 -215 -177 124 194 -65 -300 -63 188 156 -166 -209 32 231 47 -257 -119 188
6686 188 211 -47 -258 -4 240 72 -216 -190 129 234 -36 -246 -98 205 156 -108 -209 56 268 35 -248
$$ packed form
6535B07l09j53K35K35j01k92K7K59J49k46k59J95K51rl67j2K78J11r4k90M0L13
6557A68O8k98j57J95K57j19k40p1K65J24k05k07J32K86K3l40j23K50J95r6l21
6578b14J14K26Q6k82j44K23K15r7l43J9K78J62j93l00R5M33j34l32kJ93J90j31
6600F2k91R5K84O5k71j89K40K51j23l17nL01J36k36k83J30L53j0k74j10K36K38
6622B82j94l14J03L10K0k77j98K10K80n6l19p4L29J80k93k41J72L07r8k25j37
6643b33K43K42j60k84K9K77Q4k34j81J45L03p4l27m0K50J72j95k91J30L19N1l42
6665a16j21K84K22j01l83L8L01P0k59k35K37K51l2l22m3K41J99j84l04J38L07
6686A88K3k58k11K54K44j68k88K6L19J05k70k10J48L03m9k64j01K65K12k33k83
$$ plain form
6707 -248 -198 166 253 -124 -250 -61 274 136 -206 -203 78 212 -28 -262 -142 138 173 -166 -227 33 284 81
6729 81 -221 -157 193 250 -63 -232 -69 244 99 -209 -197 124 248 -52 -240 -138 241 236 -155 -207 70 239
6751 239 118 -184 -142 147 241 -85 -247 -96 269 181 -179 -274 80 242 39 -278 -121 191 170 -156 -264 33
6773 33 300 92 -234 -176 182 269 -1 -281 -84 206 170 -178 -238 82 252 40 -239 -133 168 230 -150 -267
6795 -267 -12 282 80 -256 -171 172 277 -64 -218 -115 290 124 -213 -200 41 237 12 -314 -132 226 269
6816 269 -136 -241 67 280 64 -155 -170 140 231 -36 -262 -109 230 113 -199 -284 54 240 48 -275 -177
6837 -177 181 232 -107 -274 -8 293 117 -236 -211 89 267 -81 -265 -95 215 172 -111 -306 -6 248 25
6858 25 -240 -193 188 237 -90 -237 -6 238 148 -190 -252 98 264 14 -249 -104 198 200 -199 -282 6 241 76
$$ packed form
6707b48N0L64Q7l77j26J89L35j38l42LK81J34k40k34J20K80L5l39o1K60K51k03
6729H1l02O4L50N7l13j69J63L13j45l08J2L21J24l00j88J02L79nl91n2K77J69
6751B39j21l02M2K89R4l26j62J51L65q8l60r5L54J62k03l17J57L12k1l26j08K97
6773C3K67k08l26N8L58Q7k70k80J97K90l6l48o0L20J70k12k79J06L01O2l80j17
6795b67K55K94k02l36Q5L43J05l41j54J03M05j66l37J3K41J96k25l26J82L58M3
6816B69m05j05L08K13k16k19j5L10R1k67k26J53L39j17l12q5L38J86j92l23R8
6837a77L58N1l39j67K66L01j76l53K5L00J78l48j84J70L10m3k83j95L00K54k23
6858B5k65M7L81M9l27j47K31K44r0l38o2L50J66k50k63J45L02Kl99q3K88K35j65
$$ plain form
6881 76 -297 -169 146 237 -61 -328 -19 304 123 -177 -307 54 288 -30 -261 -53 177 176 -140 -336 36
6902 36 228 98 -237 -149 226 295 -89 -258 -50 239 174 -193 -260 96 304 -19 -345 -153 229 170 -152 -292
6924 -292 -13 265 91 -245 -209 168 321 -51 -313 -44 258 188 -156 -277 72 271 59 -309 -194 212 186
6945 186 -124 -260 11 245 145 -216 -155 144 317 -49 -284 -73 229 218 -189 -222 53 283 88 -275 -128
6966 -128 144 225 -138 -349 -53 258 123 -245 -213 183 309 -10 -277 -71 273 175 -168 -235 78 298 132
6987 132 -277 -132 192 184 -144 -282 -39 318 80 -237 -206 129 283 -87 -276 -49 286 196 -191 -284 38 281
7009 281 86 -288 -123 171 231 -101 -356 20 273 214 -229 -217 97 304 -51 -280 -46 241 165 -155 -301
7030 -301 92 257 34 -277 -206 208 242 -40 -284 -60 289 242 -213 -189 75 280 79 -271 -64 216 201 -139
$$ packed form
6881G6l73J28L15R1k98k67L09L23j81l00j30L61K34l18k31K08K30jl16j96L72
6902C6J92j30l35Q8L75O9l84j69K08K89o5l67o7L56K08l23l26J92L82n9l22j40
6924b92K79K78j74l36L6L77J53l72k62K69L02p0l44j21L49J99k12l68J15M06k6
6945A86l10j36K71K34j00l61O1K99J73l66k35K11L02j1m07l3K75K30j95l63J47
6966a28K72Q1l63k11K96L11j35l68L2L96J26l19k67K06L44r8l43o7L13K20j66
6987A32m09J45L24ql28j38K43L57k38l17L1L35J54l70j89K27L35r0l87r3L22K43
7009B81j95l74J65K94O0l32k55L76K53n9m43J2L14K07l55k29K34K87p6l20j46
7030c01L93J65k23l11P1M14L4k82k44K24L49m7m55K4K64K05k01l50K07K80j5l40
$$ plain form
7052 -139 -305 -40 295 4 -290 -218 112 301 -65 -353 -5 320 200 -185 -206 118 301 27 -339 -177 254
7073 254 192 -103 -315 -22 263 124 -215 -203 200 241 -45 -312 -66 297 208 -196 -215 105 346 58 -186 -139
7095 -139 207 262 -76 -302 -37 265 95 -264 -176 179 256 -6 -261 -69 303 220 -241 -274 69 259 -28 -267
7117 -267 -89 241 261 -118 -298 -8 308 138 -238 -210 147 309 -16 -321 -66 242 168 -120 -198 71 352
7138 352 49 -319 -152 191 210 -148 -342 -7 264 137 -228 -225 131 251 15 -256 -81 248 178 -168 -335
7159 -335 88 325 52 -280 -150 176 273 -71 -344 0 294 170 -245 -245 141 340 -21 -310 -96 255 187
7180 187 -82 -292 37 259 64 -261 -175 129 344 -86 -284 -108 298 175 -186 -271 96 299 -13 -295 -135
7201 -135 271 191 -116 -259 82 263 109 -275 -218 156 291 -95 -337 -43 325 147 -235 -295 108 276 4
$$ packed form
7052a39j66K65L35k91k94P2L30J89l66k88L48L25j20l85k1L24J83k74l66J62M31
7073B54o2k95k12K93K85j39l39J2M03M1k86k67K46L63q9m04j9L20K41k88k44M7
7095a39L46N5l38k26K65L02j70l59Q8L55P7k62k55J92L72q3m61l3L43J90k87k39
7117b67J78L30K0l79j80K90L16j70l76K8L57J62l25l05K55L08p4k88p8K69K81
7138C52l03l68J67L43J9l58j94L35K71j27l65LL56J20k36k71J75L29p0l46j67
7159c35M23K37k73l32J30L26R7l44k73L44K94j24m15%L86J99l61k89K14L51o8
7180A87k69k10L29K22j95l25Q6L04K15m30j98J76M06j23l61q5L67K03l12k82J60
7201a35M06q0l07j43L41J81j54l84N7L74J35l86k42K94L68j78l82o0M03J68k72
$$ plain form
7222 4 -261 -116 244 216 -129 -301 13 348 40 -278 -252 163 267 -57 -317 -83 263 192 -227 -300 116 310
7244 310 32 -255 -128 250 237 -118 -285 19 281 113 -205 -226 123 305 -56 -332 -12 343 205 -186 -279
7265 -279 96 379 56 -269 -115 236 201 -128 -284 16 261 124 -238 -208 122 288 -29 -304 -71 308 211
7286 211 -158 -299 139 345 9 -237 -187 254 318 -76 -354 25 246 131 -274 -212 73 277 -18 -315 -97
7307 -97 248 179 -159 -260 93 319 27 -297 -235 160 295 -62 -310 -34 302 133 -231 -284 91 311 9
7328 9 -295 -105 263 225 -150 -325 100 307 64 -285 -211 168 265 -17 -265 -41 255 118 -191 -274 119 288
7350 288 2 -295 -116 269 252 -180 -285 33 356 44 -315 -172 211 252 -86 -286 -119 234 127 -236 -331
7371 -331 95 246 0 -283 -134 282 317 -115 -249 9 348 108 -200 -226 149 266 -93 -278 -21 266 164
$$ packed form
7222Dk65J45L60k8l45j72L14L35l08l18K6M15J04l24k60K34L46p1m19p3M16J94
7244C10k78k87J27L78j3l55j67L04K62j68l18k1L49J82l61k76L20L55j38l91r3
7265b79L75K83l23l25J54L51l5l29j56L00K45j37l62L0L30J66l17k75K33L79r7
7286B11l69j41M38K06l36k46N0M41O4l94k78L79K21j15m05O2K85K04k95k97K18
7307i7L45o9l38j01L53K26k92l24O2L95J35l57k48K76L36j69l64n3L75K20l02
7328Il04J90L68l8l75j75M25K07k43l49P4L79R7k82k48K24K96j37l09q3L93J69
7350B88k86k97J79L85j7m32j05L18L23l12l59J43L83M1l38k00J67L53j07l63r5
7371c31M26J51k46k83J49M16L5m32j34K58L39k40l08k6L75J17l59j85K57K87j02
$$ plain form
7392 164 -285 -280 41 334 24 -302 -94 212 276 -115 -307 30 344 130 -249 -209 189 275 -24 -307 -69 272
7414 272 186 -227 -313 70 302 53 -304 -128 200 240 -119 -349 34 309 159 -242 -254 144 298 -51 -353
7435 -353 -152 251 183 -218 -291 29 266 45 -294 -148 164 266 -109 -312 -47 351 164 -274 -264 178 240
7456 240 -57 -338 -196 266 176 -181 -268 98 349 20 -351 -206 165 331 -78 -287 -5 316 197 -234 -188
7477 -188 179 295 -16 -346 -67 266 247 -164 -350 63 291 92 -326 -159 258 214 -73 -303 -28 281 145
7498 145 -231 -234 87 316 6 -337 -160 259 226 -168 -266 48 300 138 -260 -242 186 293 -96 -321 -3 280
7520 280 164 -198 -224 58 297 47 -325 -141 222 206 -163 -230 66 308 109 -333 -170 167 275 -44 -380
7541 -380 -48 295 187 -243 -242 161 247 13 -352 -166 234 277 -169 -323 26 384 138 -245 -253 197 300 -32
$$ packed form
7392A64m49NL21K93l10l26K08L06O4l91j92L37L14k14l79M0L98Q6k99k83K38L41
7414B72q6m13q6L83K32k49l57J76L28M0l59k30L83K75j50m01j2L98J54l49l02
7435c53K01M03o8m01p3L20K37k21l39J46L12J02l75k03K65L98j87m38J0M42O2
7456B40k97k81J42M62r0l57q7L66K51l29l71J45L71J66m09k09K82L21j19m31M6
7477a88L67J16l11l30K79L33j9m11j86M13K28j99m18J67M17m4k87k30K75L09j36
7498A45l76lL21K29l10l43J77M19l3l94r8L14K52j62l98J8M28J07l89k25L18K83
7520B80j16l62k6K82K39k50l72J84L63j6l69o7K96K42j99m42J63L37J08l19l36
7541c80L32L43j08m30JM03Q6k34l65J86M00M3m46j54L49L58k46l83qM50J03l32
$$ plain form
7563 -32 -309 -80 335 165 -217 -339 119 330 12 -263 -190 199 328 -154 -368 -3 248 166 -263 -280 166
7584 166 255 -44 -355 -106 244 173 -274 -269 47 276 48 -307 -151 162 265 -67 -344 44 316 119 -253
7605 -253 -237 171 285 -83 -324 -121 296 163 -230 -298 86 276 24 -296 -232 227 266 -99 -349 -68 307
7626 307 116 -184 -258 153 307 -40 -325 -64 259 224 -160 -399 17 382 41 -243 -259 262 308 -97 -336
7647 -336 -13 328 139 -235 -299 102 338 -35 -336 -144 292 210 -172 -330 11 354 86 -275 -220 158 252
7668 252 -76 -309 -40 339 159 -222 -247 133 305 21 -392 -154 248 218 -177 -289 35 272 88 -284 -233
7689 -233 142 260 -71 -331 -62 262 161 -214 -279 121 319 36 -388 -174 186 230 -168 -343 -6 264 117
7710 117 -226 -225 204 220 -41 -367 -72 320 205 -173 -261 122 252 4 -301 -188 108 216 -109 -336 -20
$$ packed form
7563c2k77K29M15j70l82j22M58K11l18k75P3L89J29m82k14L65K51q2m29j7M46
7584A66Q9k99l11K49L50p1m47NL16K29k28l55J56L13J03l32k77L88K72j97l72
7605b53J6M08J14l68k41K03M17j33l93o8L84J90k52l20O4M59L9l65k50K81L75
7626C07j91l00p4M11J54l47k85K61L23l5l84k39M16L65l41k84j6N21M6m05k39
7647c36L23L41j89l74o4M01K36l73l01J92M36q2l82j58L41L43k68l61N5L78R4
7668B52l28k33K69L79j80l81k5L80J72k84m13K38M02l0l95j12L24K37j84l72N1
7689b33L75J18l31k60K69L24j01l75o5M00J98k83m24K14L60M4l98j75L37K70j47
7710A17l43JM29J6k61l26K95L92j15l78q8L83J30k48l05J13K96J08l25k27L16
$$ plain form
7731 -20 289 107 -262 -230 170 289 -35 -293 -106 280 216 -189 -334 51 312 64 -318 -200 195 245 -112
7752 -112 -280 -5 317 140 -272 -259 164 313 36 -293 -119 342 235 -233 -288 63 290 50 -281 -237 182
7773 182 252 -96 -346 -52 287 172 -240 -226 154 322 1 -290 -127 260 216 -142 -313 67 323 64 -311
7794 -311 -243 178 229 -83 -324 4 385 172 -164 -295 185 286 57 -283 -155 283 267 -197 -270 31 310
7815 310 81 -297 -214 180 255 -34 -299 -82 229 177 -223 -278 149 347 53 -295 -147 262 217 -150 -304 31
7837 31 289 92 -249 -207 280 310 -93 -302 -40 279 190 -211 -193 70 342 45 -306 -160 244 204 -187 -279
7859 -279 6 321 123 -286 -276 165 292 -59 -283 -93 301 199 -194 -281 122 310 2 -319 -219 232 195
7880 195 -164 -308 11 275 57 -286 -214 94 246 -48 -338 -42 319 226 -194 -259 63 306 43 -314 -135
$$ packed form
7731b0L09j82l69L2M00J19l24k58J87L86o4m05j45L85K61k48l82J18L95N0l57
7752a12j68K75L22j77m12J3M23J49k77l29J74M61j07m68n5L51K27k40l31M4M19
7773A82P0l48k50K94L39j15m12J4L80J68l21k91J63L87m4l58j71L80K56k59l75
7794c11O8M21N1l12k41L28L81k13l36j31M80J01k29l40J28M38j6m64p3L01K79
7815C10k29l78Q3L94P5k89k65K17L11n2m00n5M27J98k94l48J48M09m5l67j54L35
7837C1K58j97l41M2M87L0m03k09K62L19q9m01J8K63K72k97l51J46M04m0l91r2
7859b79K85L15j98m09J0M41J27l51k24J90L94j02l93q7M03J88l08l21J00M51l7
7880A95l59j44L19K64k18l43P2L08J52k94k90K96L61r3m20o5L22K43k63l57J79
$$ plain form
7901 -135 183 199 -156 -361 -26 231 143 -240 -282 126 285 38 -286 -69 287 200 -164 -316 62 284 110
7922 110 -254 -231 200 237 -115 -303 -53 286 133 -270 -210 111 346 3 -357 -63 269 224 -176 -280 53
7943 53 318 24 -334 -225 170 247 -121 -304 -35 263 187 -263 -281 131 306 35 -341 -131 313 275 -169 -340
7965 -340 15 292 100 -305 -184 162 292 -93 -266 -36 304 169 -229 -260 82 331 -19 -320 -153 214
7985 214 252 -118 -314 53 275 101 -293 -244 165 291 -90 -366 -67 264 161 -208 -278 165 298 35 -256
8006 -256 -123 233 252 -81 -342 54 279 87 -265 -250 219 316 -30 -323 -42 250 116 -226 -281 78 349
8027 349 4 -293 -178 231 247 -131 -306 -22 320 124 -313 -285 140 309 -46 -379 -50 235 195 -155 -276
8048 -276 85 304 55 -318 -156 247 234 -134 -299 -24 333 129 -346 -237 131 324 -33 -336 -123 280
$$ packed form
7901a35L18J6l55k05L35K57q8l83m2M08J59k47l24K17L56q7l64j52L78K22j74
7922A10l64K3M31L7l52j88K50L39j53m03O0L21K35l43l60K94L32m5m00j04L33
7943E3K65k94l58J09L95P7l68j83K69K98p6m50j8M12J75k71l76K10M44l8m44j71
7965c40L55K77j92m05J21L46J30l85j73K30L40j35l98l1L42K49l50l01J67L67
7985B14L8l70j96L67K22j74l94M9M09J26l81k76K99L31j03l69p0M43J33k63k91
8006b56J33L56J9l33k61L96K25j92l52J5M69R7l46k93K81K92j34l42n5L59K71
8027C49l45k97J15M09J6l78j75K84L42j96m37K8M25J69l55l33L29K85m0l50j21
8048b76L61K19k49l73J62M03j3l68j65K75L57k04m75J09L68J93l57l03K13M03
$$ plain form
8068 280 219 -198 -268 91 316 55 -329 -208 207 322 -117 -372 -43 261 139 -283 -224 124 312 -21 -276
8089 -276 -122 261 207 -149 -245 71 298 62 -263 -191 200 255 -50 -282 -60 228 97 -243 -264 155 266 22
8111 22 -275 -109 265 217 -152 -282 87 281 81 -231 -205 166 268 -83 -351 -74 271 193 -226 -270 71 307
8133 307 34 -264 -85 247 255 -125 -236 48 323 133 -268 -243 182 293 -80 -322 -53 249 131 -261 -255 128
8155 128 289 -16 -295 -116 242 241 -157 -318 51 339 136 -285 -244 227 313 -79 -311 -112 251 152 -269 -348
8177 -348 147 312 -10 -275 -160 274 222 -100 -309 49 340 158 -236 -238
$$ packed form
8068B80o1m17p0L59K25k61l84J21M15J15m39k55L29L04j22m22N9L48J88l33k55
8089b76J54L83n4l56r6L16K27k36l25P2L91N5l05k32K22K88j31l40k1M19J11k44
8111B2k97J66L74m8l69j30L69J94k00l12K6L71J02l51k68K77L45p8m19m4L41K36
8133C07k73k98J79L32Ql80j11K84K75j90m01K5M25J11l73k42K69L02j18l92OL83
8155A28J61l05k79J79L58jl98j61L69K88k03m21M1M71Q6l92k32J99L63r9m21p9
8177c48M95J65l22k65J15M34n2l22k09L58K91j82l94k
8191b38
$$ Imaginary data points
##PAGE= N=2
##DATA TABLE= (X++(I..I)), XYDATA
$$ plain form
0 0 0 0 0 0 0 0 0 0 0 0 -1 8 -8 8 -8 16 -16 24 -24 32 -34 42 -49 58 -72 81 -97 113 -129 145 -164 188 -218
33 -218 243 -275 309 -348 391 -437 487 -540 600 -666 739 -815 900 -992 1095 -1208 1330
50 1330 -1463 1612 -1777 1964 -2168 2401 -2668 2973 -3329 3747 -4252 4873 -5657 6685 -8092
65 -8092 10145 -13436 19526 -34533 148463 104894 -271713 -12830 135457 8694 3435 -9489
77 -9489 -164970 55642 241336 -104032 -266256 126897 192591 -99836 -90025 26286 -22286
88 -22286 88624 101040 -180708 -120864 244307 102502 -222516 -55206 140905 15151 -12188
99 -12188 -8224 -123734 20742 210478 -61992 -241159 80230 193985 -73396 -101752 23917
110 23917 -260 61021 89033 -139013 -121772 198074 118865 -192990 -78609 131100 34583
$$ packed form
0@%%%%%%%%%%jRj6J6j6K4l2M0m8N6o6P6r1J07j30J53j78K10k42K74l09L52m06
33b18M61n18N84o57P39q28R24j027J140j266J405j554J715j892K087k303K538
50A330k793L075l389L741m132M569n069N641o302P076p999R125j0530J2342j4777
65h092J8237k3581L2962n4059J82996m3569l76607K58883J48287j26763n259j2924
77i489j55481K20612J85694l45368j62224L93153O5694k92427R811J16311m8572
88b2286J10910J2416k81748N9844L65171j41805l25018J67310J96111j25754k7339
99a2188L964j15510J44476J89736k72470j79167L21389J13755k67381k8356J25669
110B3917k4177O1281K8012k28046J7241L19846p9209l11855J14381K09709r6517
$$ plain form
121 34583 -27571 -12435 -94239 6738 178550 -31038 -218788 46918 189005 -47514 -110874
132 -110874 18487 16877 44606 73350 -105226 -116308 157497 124227 -161652 -93050 117448
143 117448 47089 -36155 -15821 -69010 -3593 147619 -7535 -191748 19656 176151 -24774
154 -24774 -112639 11383 29619 32793 58394 -78657 -108312 123764 125056 -133799 -103262 102512
166 102512 59462 -39385 -23521 -50519 -5940 122843 6963 -169063 -496 164952 -5212
177 -5212 -113322 1588 40198 28303 43917 -60920 -98001 97159 121933 -109610 -109231 87984
189 87984 68760 -39887 -30200 -35936 -6173 100966 16980 -146048 -15770 150091 10555
200 10555 -109506 -6661 47079 24676 31039 -46466 -86975 75147 115826 -88574 -110944
$$ packed form
121C4583o2154J5136q1804J00977J71812k09588j87750K65706J42087k36519o3360
132a10874J29361j610K7729K8744j78576j1082K73805l3270k85879O8602K10498
143A17448p0359q3244K0334n3189O5417J51212j55154j84213K11404J56495k00925
154b4774q7865J24022J8236L174K5601j37051k9655K32076J292k58855L0537K05774
166A02512m3050r8847J5864k6998M4579J28783j15880j76026J68567J65448j70164
177e212j08110J14910L8610j1895J5614j04837l7081J95160K4774k31543L79J97215
189H7984j9224j08647R687n736K9763J07139q3986j63028J30278J65861j39536
200A0555j20061J02845N3740k2403O363p7505m0509J62122M0679k04400k2370
$$ plain form
211 -110944 73799 75296 -37776 -37019 -25311 -3443 83315 22387 -127034 -26677 137690
222 137690 23919 -106153 -16473 52445 25911 19899 -38612 -76832 58847 109922 -71125
233 -71125 -112550 60688 81787 -33885 -44158 -18642 825 69702 24939 -110283 -34600
244 -34600 124863 35106 -100675 -25207 55351 27552 10764 -32189 -67165 44815 102551
255 102551 -55041 -110939 47377 85318 -28229 -49560 -13947 5055 57807 26486 -94541
266 -94541 -40796 111965 44622 -94054 -33998 56190 30969 3319 -29039 -58076 34081 94986
278 94986 -41398 -108951 35110 88339 -21626 -54932 -12098 10179 49333 25756 -81270
289 -81270 -44488 99712 52327 -86856 -42263 55560 35068 -2727 -27738 -49979 26033 87120
$$ packed form
211a10944J84743J497j13072P57J1708K1868Q6758o0928j49421J00357J64367
222A37690j13771j30072Q9680O8918k6534o012n8511l8220J35679N1075j81047
233g1125m1425J73238K1099j15672j0273K5516J9467O8877m4763j35222P5683
244c4600J59463q9757j35781P5468Q0558k7799j6788m2953l4976J11980N7736
255A02551j57592n5898J58316L7941j13547k1331L5613J9002N2752l1321j21027
266i4541N3745J52761o7343j38676O0056R0188k5221k7650l2358k9037R2157O0905
278I4986j36384o7553J44061N3229j09965l3306M2834K2277L9154k3577j07026
289h1270L6782J44200m7385j39183M4593R7823k0492l7795k5011k2241P6012O1087
$$ plain form
301 87120 -29854 -104796 23663 89051 -14257 -58604 -11626 15127 42261 23878 -69390
312 -69390 -46394 87886 57689 -78683 -49047 52987 39356 -6841 -27864 -42414 20004
323 20004 78922 -20046 -99599 13390 88500 -6824 -61142 -12693 19743 37509 20992 -59401
335 -59401 -46410 76614 61346 -70230 -54840 49372 43610 -9619 -29043 -35994 16003 70958
347 70958 -12387 -93461 4441 86423 728 -62552 -14796 23990 34248 17665 -51074 -45305
359 -45305 66443 62932 -62004 -59147 44815 47382 -11220 -31178 -30469 13747 63431 -6294
371 -6294 -86935 -3251 83558 7752 -62661 -17602 27242 32429 14130 -44296 -43115 57117
383 57117 63500 -53663 -62503 39663 50768 -11377 -33415 -26279 12676 56635 -1772 -79961
$$ packed form
301H7120j16974p4942J28459O5388j03308m4347M6978K6753K7134j8383r3268
312f9390K2996J34280l0197j36372K9636J02034j3631m6197k1023j4550O2418
323B0004N8918r8968p9553J12989P5110r5324n4318M8449L2436J7766j6517q0393
335e9401J2991J23024j5268j31576J5390J04212n762n3229j9424o951N1997N4955
347G0958q3345q1074R7902Q1982q5695o3280M7756L8786J0258j6583o8739N769
359d5305J11748l511j24936K857J03962K567n8602j9958P09M4216M9684o9725
371f294q0641Q3684Q6809p5806p0413M5059M4844N187j8299n8426J181J00232
383E7117O383j17163q840J02166J1105o2145k2038P136L8955M3959n8407p8189
$$ plain form
395 -79961 -9597 79570 14526 -61850 -21015 29922 31661 10651 -38998 -40758 49024 62862
407 62862 -45886 -64636 33789 53566 -10452 -35913 -22977 12568 50350 1570 -73248 -14845
419 -14845 75158 20551 -60006 -24632 31480 31969 7515 -35102 -37799 41642 61418 -38339 -65951
432 -65951 27723 55785 -8529 -38236 -21003 13043 45324 4036 -66530 -19283 70135 26367
444 26367 -57221 -28606 32218 32985 4897 -32223 -34967 35436 59134 -31392 -66067 21402 57052
457 57052 -5720 -40237 -19743 13913 40797 5530 -60120 -22313 64767 30792 -53636 -31833
469 -31833 31895 34081 2607 -30325 -31716 30166 56085 -25254 -65074 15706 57386 -2998
481 -2998 -41615 -19119 15243 37175 5774 -54156 -23937 59454 34172 -50026 -35020 31155
$$ packed form
395g9961P0364Q9167o5044p6376M0835N0937J739k1010m9649j760Q9782J3838
407F2862j08748j8750R8425J9777o4018k5461J2936L5545L7782m8780p4818N8403
419a4845R0003n4607q0557L5374N6112M89k4454m2617k697P9441J9776r9757k7612
432f5951R3674K8062o4314k9707J7233L4046L2281m1288p0566M7247Q9418m3768
444B6367q3588K8615O0824P67k8088l7120k744P0403K3698r0526l4675Q7469L5650
457E7052o2772l4517K0494L3656K6884l5267o5650L7807Q7080l3975q4428K1803
469c1833O3728K186l1474l2932j391O1882K5919q1339l9820Q0780M1680o0384
481b998l8617K2496L4362K1932l1401n9930L0219Q3391k5282q4198J5006O6175
$$ plain form
493 31155 35647 669 -29445 -28809 26354 52732 -20233 -63430 10282 57230 375 -42854 -19230
506 -19230 16720 34337 5852 -48715 -25125 54078 37012 -45512 -37675 29247 37045 -305
518 -305 -28714 -26066 22476 49024 -15082 -60981 4581 55949 4210 -42843 -19966 17438 32132
531 32132 5961 -43482 -25831 48304 39258 -40520 -40257 26722 38605 -661 -28783 -24321 19783
544 19783 45862 -10917 -58564 -558 54687 8337 -42923 -21502 18639 31036 5469 -39489
556 -39489 -25841 43555 40544 -36067 -42021 23824 39917 -651 -29171 -22321 17814 42099 -7637
569 -7637 -55136 -4493 52158 11522 -41552 -22354 18972 29679 4797 -35310 -25001 38238
581 38238 40608 -30970 -42743 20515 40303 -197 -29130 -20759 16272 38713 -5210 -51619
$$ packed form
493C1155M492l4978l0114O36N5163K6378p2965m3197P3712M6948n6855m3229K3624
506a9230L5950J7617k8485n4567K3590P9203j7066q2524P837O6922P798l7350
518c05k8409K648M8542K6548o4106m5899O5562N1368n1739m7053K2877L7404J4694
531C2132k6171m9443J7651P4135r046p9778K63O6979J1883l9266k8122M462M4104
544A9783K6079n6779m7647N8006N5245m6350n1260K1421M0141J2397k5567m4958
556c9489J3648O9396l011p6611n954O5845J6093m0568k8520O850M0135K4285m9736
569g637m7499N0643N6651m0636n3074J9198M1326J0707k4882m0107J0309O3239
581C8238K370p1578j1773O3258J9788m0500k8933Q371L7031K2441m3923m6409
$$ plain form
593 -51619 -7721 49681 14730 -40530 -23795 19804 29540 3887 -32839 -23942 34799 40568 -27309
606 -27309 -43733 17598 41489 519 -30305 -19909 15718 35972 -3384 -48595 -10599 47235
618 47235 17762 -38786 -25419 19607 29494 3386 -30092 -22917 30457 39811 -22597 -43496 13732
631 13732 40998 1873 -30042 -19175 14471 33028 -1418 -44628 -13170 43643 20451 -36110
643 -36110 -26741 19049 29551 3094 -28105 -21810 27203 38794 -19018 -43487 10304 41371
655 41371 3444 -30982 -19152 14628 31124 -694 -42014 -14740 41267 22664 -34269 -28284
667 -28284 18655 30317 2632 -27014 -20590 24525 37479 -15648 -42676 7053 40636 4908
679 4908 -30648 -19089 14064 29005 203 -38363 -15930 37540 24369 -31061 -29052 17338
$$ packed form
593e1619M3898N7402l4951n5260J6735M3599R736k5653l6726Q897N8741N769o7877
606b7309j6424O1331K3891m0970l0824J0396L5627K0254l9356m5211L7996N7834
618D7235k9473n6548J3367M5026R887k6108l3478P175N3374R354o2408k0899N7228
631A3732K7266l9125l1915J0867L3646J8557l4446m3210L1458N6813k3192n6561
643c6110R369M5790J0502k6457l1199O295M9013J1591n7812k4469N3791L1067
655D1371l7927l4426J1830L3780J6496l1818m1320K7274N6007j8603n6933N985
667b8284M6939J1662k7685k9646O424M5115J2954n3127k7028M9729L3583l5728
679D908l5556J1559L3153J4941k8802l8566K2433N3470j3171n5430K009M6390
$$ plain form
691 17338 30250 2568 -25404 -19432 21752 35583 -12656 -41355 3876 39596 6673 -30715
703 -30715 -19448 14058 27678 491 -35879 -16597 35135 25878 -28689 -30358 16309 31292
715 31292 2534 -25305 -18503 20215 34306 -10249 -40495 910 38808 8676 -30436 -20155
727 -20155 13808 26663 927 -33038 -17064 31858 26958 -25471 -30808 14441 31127 3107
739 3107 -24108 -17738 17784 32140 -7775 -38533 -1936 36812 10424 -29377 -20581 13349 25478
752 25478 1289 -30587 -17093 29219 27369 -22753 -31133 12913 31625 3483 -24128 -17022 16865
765 16865 30598 -6334 -37175 -3872 35629 11770 -28934 -21227 13501 25224 1137 -28820
777 -28820 -16671 27044 27640 -20196 -31271 11184 31510 3946 -23673 -16465 15624 28689 -4828
$$ packed form
691A7338J2912k7682k7972N972M1184J3831m8239k8699M5231L5720l2923l7388
703c0715J1267L3506J3620k7187l6370J9282N1732r257n4567j669M6667J4983
715C1292k8758k7839O802L8718J4091m4555l0246M1405L7898l0132l9112J0281
727b0155L3963J2855k5736l3965J5974M8922m900n2429n337M5249J6686k8020
739C107k7215O370L5522J4356l9915l0758L6597L8748k6388l9801Q796L3930J2129
752B5478k4189l1876J3494M6312j850n0122q380M4046J8712k8142k7611P106L3887
765A6865J3733l6932l0841L3303L9501k3859m0704P707L4728J1723k4087k9957
777b8820J2149M3715N96m7836j1075M2455K0326k7564k7619P208L2089J3065l3517
$$ plain form
790 -4828 -35081 -5889 33475 13311 -27455 -21647 12778 24427 1484 -26541 -16367 24401
802 24401 27407 -17305 -30944 9060 31305 4825 -23314 -16255 14518 27154 -3519 -33433
814 -33433 -7697 31679 14841 -26119 -22571 12287 24570 1746 -25227 -16067 22453 27497 -14832
827 -14832 -31036 7017 31104 5790 -23160 -16413 13501 25812 -2417 -31639 -9351 29542
839 29542 16222 -24359 -23177 11390 24350 2259 -23556 -15717 20351 26953 -12248 -30255 4840
852 4840 30458 6873 -22618 -16380 12624 24520 -1529 -29910 -10403 27585 17138 -22756
864 -22756 -23555 10582 24389 2502 -22589 -15176 18756 26424 -10344 -29780 3016 29881 7802
877 7802 -22385 -16734 12010 23576 -1029 -28375 -11289 25752 18203 -21007 -24037 9725 24414
$$ packed form
790d828l0253K9192L9364k0164m0766N808L4425J1649k2943k8025J0174M0768
802B4401L006m4712j3639M0004K2245k6480k8139P059L0773J2636l0673k9914
814c3433K5736L9376j6838m0960L548L4858J2283k2824k6973R160L8520N044m2329
827a4832j6204L8053K4087k5314k8950O747K9914J2311k8229k9222K2288L8893
839B9542j3320m0581J182L4567J2960k2091k5815P839L6068O602l9201j8007L5095
852D840K5618k3585k9491O238K9004J1896k6049k8381J9507L7988j0447l9894
864b2756p99L4137J3807k1887k5091P413L3932P668l6768j9436L2796K6865k2079
877G802l0187N651K8744J1566k4605k7346J7086L7041p549l9210l030L3762J4689
$$ plain form
890 24414 3011 -21546 -14786 17320 25753 -8470 -28845 1174 28938 8819 -21889 -16979 11222
903 11222 22599 -388 -26788 -11955 23799 18793 -19073 -24170 8661 24419 3541 -20767
915 -20767 -14431 15921 24936 -6768 -28075 -630 27867 9808 -21213 -17388 10488 21846 52
928 52 -25262 -12435 21967 19448 -17109 -24396 7515 24417 4249 -19885 -14200 14751 24082
941 24082 -5361 -27020 -2285 26707 10770 -20570 -17855 9811 21170 489 -23958 -12679
953 -12679 20475 19628 -15356 -24253 6463 24365 4731 -19323 -13873 13723 23245 -4130 -26098
966 -26098 -3645 25529 11516 -19753 -18170 9202 20680 737 -22736 -12654 18918 19827 -13568
979 -13568 -23948 5302 24076 5467 -18606 -13682 12774 22302 -3151 -24925 -4794 24047
$$ packed form
890B4414k1403k4557O760L2106Q433l4223k0375L0019K7764k0119l0708M910K8201
903A1222J1377k2987k6400J4833L5754n006l7866n097L2831J5758k0878k4308
915b0767O336L0352R015l1704k1307K7445K8497j8059l1021L825K7876J1358k1794
928E2k5314J2827L4402k519l6557p287L1911J6902k0168k4134N685K8951R331
941B4082k9443k1659K4735K8992j5937l1340K715K7666J1359k0681k4447J1279
953a2679L3154q47l4984q897L0716J7902j9634k4054N450K7596R522k7375k1968
966b6098K2453K9174j4013l1269J583K7372J1478j9943k3473J0082L1572R09l3395
979a3568j0380K9250J8774j8609k4073M924K6456R528k5453k1774K0131K8841
$$ plain form
991 24047 12267 -18805 -18481 8460 20179 1191 -21495 -12678 17486 19783 -11895 -23553 4116
1004 4116 23741 6117 -18039 -13564 11836 21442 -2255 -23976 -5994 22658 12867 -17787 -18852
1017 -18852 7631 19880 1542 -20403 -12595 16184 19772 -10074 -23126 2850 23323 6842
1029 6842 -17382 -13641 11133 20585 -1539 -22820 -6908 21261 13404 -16664 -19062 6819 19522
1042 19522 1990 -19378 -12435 14964 19548 -8593 -22547 1712 22748 7504 -16880 -13704
1054 -13704 10294 19867 -950 -21873 -7603 19890 13778 -15620 -19172 6195 19306 2295
1066 2295 -18489 -12176 13982 19187 -7336 -21900 826 22184 7955 -16313 -13780 9706 19155
1079 19155 -629 -20972 -8181 18644 14068 -14490 -19173 5428 19034 2786 -17666 -11991
$$ packed form
991B4047j1780l1072L24K6941J1719j8988k2686Q817L0164K297l1678j1658K7669
1004D116J9625j7624k4156M475K5400R606k3697k1721J7982K8652r791l0654j065
1017a8852K6483J2249j8338k1945P808K8779L588k9846j3052K5976K0473j6481
1029F842k4224L741K4774R452k2124k1281J5912K8169p857l0068k398K5881J2703
1042A9522j7532k1368O943K7399M584k8141j3954K4259K1036j5244k4384L176
1054a3704K3998R573k0817k0923J4270K7493o112k9398l552K5367J3111j7011
1066B295k0784O313K6158N205k6523j4564K2726K1358j4229k4268K533K3486R449
1079A9155j9784k0343J2791K6825m576k8558m683K4601J3606j6248k0452N675
$$ plain form
1091 -11991 13102 18807 -6094 -21199 -285 21482 8699 -15687 -13888 8948 18434 -24
1103 -24 -20012 -8727 17230 14348 -13192 -19136 4611 18811 3383 -16833 -11863 12159 18515
1116 18515 -4842 -20499 -1283 20613 9222 -15033 -14186 8160 17943 286 -19141 -9194 16043
1129 16043 14492 -12108 -19209 3832 18621 3860 -16179 -11688 11441 18107 -3927 -19837 -2129
1142 -2129 19844 9804 -14485 -14354 7504 17393 632 -18393 -9473 14941 14590 -10925 -18934
1155 -18934 2993 18363 4478 -15512 -11506 10599 17633 -2927 -19022 -3033 18855 10259
1167 10259 -13599 -14522 6695 16900 1001 -17453 -9690 13637 14534 -9646 -18608 2301 18040
1180 18040 5000 -14698 -11360 9970 17237 -2194 -18249 -3733 17993 10551 -13042 -14673 6132
$$ packed form
1091a1991K5093N705k4901j5105K0914K1767j2783k4386J799K2836R486j8458
1103b4j9988J1285K5957k882k7540n944K3747J4200j5428k0216M970K4022O356
1116A8515k3357j5657J9216K1896j1391k4255Q47K2346R783j7657j9427R947K5237
1129A6043j551k6600p101K3041J4789j4761k0039M491K3129O666k2034j5910J7708
1142b129K1973j0040k4289J31K1858R889j6761j9025Q920K4414l51k5515q009
1155a8934K1927J5370j3885j9990M006K2105P034k0560j6095J5989K1888q596
1167A0259k3858r23K1217J0205j5899j8454P763K3327Q97k4180q962K0909J5739
1180A8040j3040j9698L338K1330P267j9431j6055J4516K1726p442k3593j631K0805
$$ plain form
1193 6132 16453 1240 -16848 -9764 12945 14522 -8691 -18300 1574 17813 5464 -14142 -11293
1206 -11293 9348 16762 -1562 -17600 -4371 16988 10830 -12248 -14863 5271 15963 1646
1218 1646 -16027 -9939 11770 14422 -7382 -17801 652 17155 6074 -13303 -11269 8558 16207
1231 16207 -801 -16758 -5062 15901 11131 -11449 -14883 4580 15603 1945 -15390 -9872
1243 -9872 11079 14284 -6634 -17281 216 16939 6470 -12965 -11164 8240 15795 -547 -16298
1256 -16298 -5354 15108 11101 -10886 -14963 4074 15286 2214 -14871 -9770 10321 14048 -5633
1269 -5633 -16756 -421 16362 6981 -12119 -11088 7501 15367 69 -15402 -5960 13893 11244
1282 11244 -9948 -14879 3171 14755 2712 -14047 -9829 9532 13873 -4715 -16118 -1136
$$ packed form
1193F132J0321j5213j8088P084K2709J577k3213r609J9874J6239j2349j9606K849
1206a1293K0641P414j8324j6038J3229K1359o158k3078k615K0134J0692j4317
1218A646j7673O088K1709K652k1804j0419J8453J6503j1081j9377K034J9827P649
1231A6207j7008j5957J1696K0963m770k2580l434J9463J1023j3658j7335N518
1243i872K0951L205k0918j0647J7497J6723j0469j9435J801J9404P555j6342j5751
1256a6298J0944K0462m007k1987m077J9037J1212j3072j7085N101K0091L727j9681
1269e633j1123J6335J6783r381j9100J031J8589P866j5298j5471R442J9853k649
1282A1244k1192m931J8050J1584j2043j6759M218J9361M341j8588j1403J4982
$$ plain form
1294 -1136 15844 7433 -11559 -11175 6933 15006 297 -14972 -6289 13160 11229 -9328 -14876
1307 -14876 2758 14625 2916 -13621 -9674 9061 13783 -3939 -15696 -1585 15291 7778
1319 7778 -10950 -11234 6326 14527 705 -14262 -6693 12083 11276 -8466 -14676 1924 14070
1332 14070 3348 -12832 -9712 8244 13477 -3039 -14895 -2202 14618 8163 -10330 -11186 5743
1345 5743 14102 988 -13810 -6911 11320 11124 -7796 -14531 1482 13886 3615 -12367 -9448
1358 -9448 7992 13229 -2598 -14339 -2415 14100 8300 -9821 -11252 5220 13702 1106 -13209
1371 -13209 -7079 10558 11090 -7065 -14224 834 13412 4085 -11650 -9491 7359 12891 -1868
1384 -1868 -13690 -2998 13352 8620 -9164 -11227 4563 13173 1532 -12688 -7329 9723 10899
$$ packed form
1294a136J6980q411j8992L84J8108Q073j4709j5269Q683J9449j931k0557n548
1307a4876J7634J1867j1709j6537L947J8735M722j7722j1757J4111J6876p513
1319G778j8728k84J7560Q201j3822j4967P569J8776q07j9742o210J6600J2146
1332A4070j0722j6180L120J7956N233j6516j1856J2693J6820o455j8493q56J6929
1345E743Q359j3114j4798O899J8231j96j8920o735J6013J2404j0271j5982K919
1358i448J7440N237j5827j1741J1924J6515n800j8121j431J6472Q482j2596j4315
1371a3209O130J7637N32j8155p159J5058J2578r327j5735K159J6850N532j4759
1384a868j1822J0692J6350m732j7784k063J5790Q610j1641j4220N359J7052J176
$$ plain form
1397 10899 -6214 -13923 269 13085 4431 -11111 -9314 6903 12665 -1266 -13164 -3351 12703
1410 12703 8735 -8552 -11263 4036 12858 1647 -12225 -7427 9027 10724 -5664 -13571 -107
$$ packed form
1397A0899j7113p709J4192J2816q654j5542J797J6217N762j3931j1898R813J6054
1410A2703l968j7287k711J5299Q822j1211j3872M798J6454J697j6388p907J3464
$$ [...]
8191B32
##END NTUPLES=NMR FID
##END=
