##TITLE=1H_Pr NCS_2H
 200.13MHz, CDCl3,
 8 sc
 
 8.8.2025
##JCAMPDX= 6.0         $$ Bruker NMR JCAMP-DX V2.0
##DATA TYPE= NMR FID
##DATA CLASS= NTUPLES
##ORIGIN= UXNMR, Bruker Analytische Messtechnik GmbH
##OWNER= pz
$$ XWIN-NMR		Version 3.5
$$ Fri Aug  8 14:53:27 2025 Russian Standard Time (UT+4h)  she@DPX200
##.OBSERVE FREQUENCY= 200.1313
##.OBSERVE NUCLEUS= ^1H
##.DELAY= (6, 6)
##.ACQUISITION MODE= SIMULTANEOUS
##.ACQUISITION SCHEME= undefined
##.AVERAGES= 8
##.DIGITISER RES= 18
##SPECTROMETER/DATA SYSTEM= spect
##.PULSE SEQUENCE= zg30
##.SOLVENT NAME= CDCl3
##.SHIFT REFERENCE= (INTERNAL, CDCl3, 0, 14.3821)
##AUDIT TRAIL= $$ (NUMBER, WHEN, WHO, WHERE, WHAT)
$$ ##TITLE= Audit trail, XWIN-NMR		Version 3.5
$$ ##JCAMPDX= 5.01
$$ ##ORIGIN= Bruker BioSpin GmbH
$$ ##OWNER= she
$$ F:/spectra/data/she/nmr/H-C/1/audita.txt
$$ ##AUDIT TRAIL=  $$ (NUMBER, WHEN, WHO, WHERE, WHAT)
(   1,<2025-08-08 14:51:54.10 +0400>,<she>,<DPX200>,
      <created by zg, POWCHK disabled, PULCHK disabled
       configuration hash MD5:
       00 E9 B6 7A A2 85 ED C7 34 08 36 98 17 FE 4E 26
       data hash MD5: 16K
       F7 9E E6 AA E9 ED EA 6E 48 16 64 5D 92 B5 3D 48>)
$$ ##END=
$$ 
$$ hash MD5
$$ 5A 5D E2 F8 F5 70 05 5E 00 2A A2 45 3A 7B 1A 81
##$RELAX= 
##$RELAX= 
##$RELAX= 
##$RELAX= 
##$RELAX= 
##$RELAX= 
$$ Bruker specific parameters
$$ --------------------------
##$DU= <F:/spectra>
##$EXPNO= 1
##$NAME= <H-C>
##$PROCNO= 1
##$TYPE= <nmr>
##$USER= <she>
##$AMP= (0..31)
100 100 100 100 100 100 100 100 100 100 100 100 100 100 100 100 100 100 
100 100 100 100 100 100 100 100 100 100 100 100 100 100 
##$AQSEQ= 0
##$AQ_mod= 1
##$AUNM= <au_zg>
##$AUTOPOS= <>
##$BF1= 200.13
##$BF2= 200.13
##$BF3= 200.13
##$BF4= 200.13
##$BF5= 200.13
##$BF6= 200.13
##$BF7= 200.13
##$BF8= 200.13
##$BYTORDA= 1
##$CFDGTYP= 0
##$CFRGTYP= 5
##$CHEMSTR= <none>
##$CNST= (0..31)
1 1 145 1 1 1 1 1 1 1 1 1 1 1 1 1 1 1 1 1 1 1 1 1 1 1 1 1 1 1 1 1 
##$CPDPRG= <>
##$CPDPRG1= <>
##$CPDPRG2= <>
##$CPDPRG3= <>
##$CPDPRG4= <mlev>
##$CPDPRG5= <mlev>
##$CPDPRG6= <mlev>
##$CPDPRG7= <mlev>
##$CPDPRG8= <mlev>
##$CPDPRGB= <>
##$CPDPRGT= <>
##$D= (0..31)
0 0.7 0 0 0 0 0 0 0 0 0 0.03 0 0 0 0 0 0 0 0 0 0 0 0 0 0 0 0 0 0 0 0 
##$DATE= 1754650313
##$DBL= (0..7)
120 120 120 120 120 120 120 120 
##$DBP= (0..7)
150 150 150 150 150 150 150 150 
##$DBP07= 0
##$DBPNAM0= <>
##$DBPNAM1= <>
##$DBPNAM2= <>
##$DBPNAM3= <>
##$DBPNAM4= <>
##$DBPNAM5= <>
##$DBPNAM6= <>
##$DBPNAM7= <>
##$DBPOAL= (0..7)
0.5 0.5 0.5 0.5 0.5 0.5 0.5 0.5 
##$DBPOFFS= (0..7)
0 0 0 0 0 0 0 0 
##$DE= 6
##$DECBNUC= <off>
##$DECIM= 32
##$DECNUC= <off>
##$DECSTAT= 4
##$DIGMOD= 1
##$DIGTYP= 9
##$DL= (0..7)
0 120 120 120 120 120 120 120 
##$DP= (0..7)
150 150 150 150 150 150 150 150 
##$DP07= 0
##$DPNAME0= <>
##$DPNAME1= <>
##$DPNAME2= <>
##$DPNAME3= <>
##$DPNAME4= <>
##$DPNAME5= <>
##$DPNAME6= <>
##$DPNAME7= <>
##$DPOAL= (0..7)
0.5 0.5 0.5 0.5 0.5 0.5 0.5 0.5 
##$DPOFFS= (0..7)
0 0 0 0 0 0 0 0 
##$DQDMODE= 0
##$DR= 18
##$DS= 0
##$DSLIST= <SSSSSSSSSSSSSSS>
$$ [...]
##$SUBNAM0= <"">
##$SUBNAM1= <"">
##$SUBNAM2= <"">
##$SUBNAM3= <"">
##$SUBNAM4= <"">
##$SUBNAM5= <"">
##$SUBNAM6= <"">
##$SUBNAM7= <"">
##$SUBNAM8= <"">
##$SUBNAM9= <"">
##$SW= 18.0517328524113
##$SWIBOX= (0..15)
0 0 2 0 0 0 0 0 0 0 0 0 0 0 0 0 
##$SW_h= 3612.71676300578
##$TD= 16384
##$TD0= 1
##$TE= 0
##$TE2= 300
##$TE3= 300
##$TEG= 300
##$TL= (0..7)
0 120 120 120 120 120 120 120 
##$TP= (0..7)
150 150 150 150 150 150 150 150 
##$TP07= 0
##$TPNAME0= <>
##$TPNAME1= <>
##$TPNAME2= <>
##$TPNAME3= <>
##$TPNAME4= <>
##$TPNAME5= <>
##$TPNAME6= <>
##$TPNAME7= <>
##$TPOAL= (0..7)
0.5 0.5 0.5 0.5 0.5 0.5 0.5 0.5 
##$TPOFFS= (0..7)
0 0 0 0 0 0 0 0 
##$TUNHIN= 0
##$TUNHOUT= 0
##$TUNXOUT= 0
##$USERA1= <user>
##$USERA2= <user>
##$USERA3= <user>
##$USERA4= <user>
##$USERA5= <user>
##$V9= 5
##$VALIST= <valist>
##$VCLIST= <CCCCCCCCCCCCCCC>
##$VD= 0
##$VDLIST= <DDDDDDDDDDDDDDD>
##$VPLIST= <PPPPPPPPPPPPPPP>
##$VTLIST= <TTTTTTTTTTTTTTT>
##$WBST= 1024
##$WBSW= 4
##$XGAIN= (0..3)
0 0 0 0 
##$XL= 0
##$YL= 0
##$YMAX_a= 392045
##$YMIN_a= -406740
##$ZGOPTNS= <>
##$ZL1= 120
##$ZL2= 120
##$ZL3= 120
##$ZL4= 120
##$ABSF1= 10
##$ABSF2= 0
##$ABSG= 5
##$ABSL= 3
##$ALPHA= 0
##$AQORDER= 0
##$ASSFAC= 0
##$ASSFACI= 0
##$ASSFACX= 0
##$ASSWID= 0
##$AUNMP= <proc_1d>
##$AZFE= 0.1
##$AZFW= 0.1
##$BCFW= 1
##$BC_mod= 2
##$BYTORDP= 1
##$COROFFS= 0
##$CY= -3
##$DATMOD= 1
##$DC= 2
##$DFILT= <>
##$DTYPP= 0
##$F1P= 0
##$F2P= 0
##$FCOR= 0.5
##$FTSIZE= 0
##$FT_mod= 4
##$GAMMA= 1
##$GB= 0.15
##$INTBC= 1
##$INTSCL= 1
##$ISEN= 128
##$LB= 0.25
##$LEV0= 0
##$LPBIN= 0
##$MAXI= 10000
##$MC2= 0
##$MEAN= 0
##$ME_mod= 0
##$MI= 1.114404
##$NCOEF= 0
##$NC_proc= 0
##$NLEV= 6
##$NOISF1= 3.799351
##$NOISF2= 2.8
##$NSP= 1
##$NTH_PI= 0
##$NZP= 0
##$OFFSET= 14.38212
##$PC= 1
##$PHC0= -1559.884
##$PHC1= 13.3923
##$PH_mod= 1
##$PKNL= yes
##$PPARMOD= 0
##$PSCAL= 0
##$PSIGN= 0
##$REVERSE= no
##$SF= 200.129724274929
##$SI= 16384
##$SIGF1= 3
##$SIGF2= 2
##$SINO= 400
##$SIOLD= 16384
##$SREGLST= <1H.CDCl3>
##$SSB= 0
##$STSI= 0
##$STSR= 0
##$SW_p= 3205.1282051282
##$SYMM= 0
##$S_DEV= 0
##$TDeff= 0
##$TDoff= 0
##$TI= <>
##$TILT= no
##$TM1= 0
##$TM2= 0
##$TOPLEV= 0
##$USERP1= <user>
##$USERP2= <user>
##$USERP3= <user>
##$USERP4= <user>
##$USERP5= <user>
##$WDW= 1
##$XDIM= 8192
##$YMAX_p= 0
##$YMIN_p= 0
$$ End of Bruker specific parameters
$$ ---------------------------------
##NTUPLES= NMR FID
##VAR_NAME=  TIME,          FID/REAL,        FID/IMAG
##SYMBOL=    X,             R,               I
##VAR_TYPE=  INDEPENDENT,   DEPENDENT,       DEPENDENT
##VAR_FORM=  AFFN,          ASDF,            ASDF
##VAR_DIM=   8192,          8192,            8192
##UNITS=     SECONDS,       ARBITRARY UNITS, ARBITRARY UNITS
##FACTOR=    0.0002768,     1,               1
##FIRST=     0,             0,               0
##LAST=      2.2672688,     0,               0
##MIN=       0,             -406740,         0
##MAX=       2.2672688,     392045,          0
$$ Real data points
##PAGE= N=1
##DATA TABLE= (X++(R..R)), XYDATA
$$ [...]
1844E35n69k27L16M02k81l21M09j02j33m18N69M9o06k07N64j84%j46L65O8K47
$$ 535 -34 -261 55 457 176 -145 264 162 29 -389 180 229 -377 -584 -20 -204 -204 -350 15 83 330
1865C30n18N90Kl67K13j94K85l15j3K38k31m29M73j11k53m54N47L31k11k54N22
$$ 330 -188 402 404 37 250 56 341 26 13 251 20 -409 64 -47 -300 -754 -207 124 -87 -341 181
1886A81K88p49L42J42K06q5n37L28J86k63m82L61J40l78l89M72M05j95l67N86
$$ 181 469 -280 62 204 410 325 -212 116 302 39 -443 -82 58 -320 -709 -237 168 -27 -394 192
1906A92%m26K70P1J86K12l40K85m05o4k93J79R3o5l87K55Q0j19K66k0m60N64L85
$$ 192 192 -234 36 107 293 505 165 450 45 -19 -312 -133 -40 -105 -492 -237 -157 -276 -10 -30 -490 74 459
1929D59l51k81kO43m01l56K10M61m66j78J99KKm23J40K59M4l08M93K44k9l79k59
$$ 459 108 -173 -175 468 67 -289 -79 382 -84 -262 -63 -61 -59 -482 -342 -83 -39 -347 146 390 361 -18 -277
1952b77O17J53n60L05J32q4m12n9L53Mo02RM22O8k11j20L2N75m78rL21M15k91
$$ -277 340 493 -67 238 370 286 -126 -185 168 172 -430 -421 1 69 -142 -262 -230 345 -133 -142 179 594 303
1975C03l12J22J78Ml31p5J18P3k28j71J31K86k55K26j32L00K6n91M62N74l33o64
$$ 303 -9 113 291 295 -36 -111 7 80 -148 -319 -188 98 -157 69 -63 237 263 -328 134 708 375 -289
1997b89L01K6R9j38l4m8kMl11O67n13K40j16M53j41l8r7J0L09l47k28J43M38J43
$$ -289 12 38 137 -1 -35 -83 -85 -81 -392 275 -238 2 -114 339 198 160 63 73 382 35 -193 -50 388 531
2021E31r83RM33M9k72l6N35j29n41K50O06k12m87L9O00M9l63m39O91k43l70P3
$$ 531 -452 -443 -10 39 -233 -269 266 137 -404 -154 452 240 -247 -208 392 441 78 -361 330 87 -283 -210
2043b10j4N21n05j11N26J88m16q2J43M14k06l85M12j45l18J50K50j6k07m70N67
$$ -210 -224 297 -208 -319 207 395 -21 -103 40 454 248 -137 275 130 -188 -38 212 196 -11 -481 86
2064H6m7l6k29J55j78K71J13k05R6L11n5k0l98L22j73j06m6J67J85n31KK74L14
$$ 86 39 3 -226 -71 -249 22 135 -70 26 337 282 262 -136 186 13 -93 -139 28 213 -318 -316 -42 272
2087B72o1o36P74J04k40k99L56J11k79m29M36M76r22k9J00M24l57l05L05L45l41
$$ 272 211 -425 349 453 213 -86 270 381 102 -327 109 585 -337 -366 -266 158 -199 -504 -199 146 -195
2108a95l46N37K86j24j11L22P4j96J08K07m90j24L3J38k78Q2m81N12l15lK53J29
$$ -195 -541 -4 282 158 47 369 443 247 355 562 72 -52 -19 119 -159 -77 -558 -46 -361 -364 -111 18
2130A8q9K23P9j79J2J05K97Q7o68J46M17m65j86K78p7N6o08K96M79k62k91L30
$$ 18 -71 152 231 52 64 169 466 553 -115 31 448 -17 -203 75 -2 54 -554 -258 221 -41 -332 -2
2152bL86l2m53J03N20o4m86K77k19J11n23L0N01n29j22O55ql29m0p8N81k42j70
$$ -2 384 352 -101 2 522 458 -28 249 30 141 -382 -352 149 -380 -502 153 145 -184 -224 -302 279 37 -133
2175a33R4K26k22L39N8m84l8M8j08L08n59M12J99l81k8N2J25N6l77N35J41k65
$$ -133 -39 187 -35 304 362 -122 -160 -112 -220 88 -471 -59 140 -241 -269 -217 -92 -36 -413 122 263 -2
2197bK69L13k78k00k9n9K80n58OK12K78n09J84j5L06m26k30Q60k16m25K67K63
$$ -2 267 580 302 102 73 14 294 -264 -258 -46 232 -277 -93 -108 198 -228 -458 402 186 -239 28 291
2219B91R5m90J12J86J62l97PL68n61O0J1L95j82l73J1M00j82K08J91q2p7Q3l6
$$ 291 386 -104 8 194 356 -41 -34 334 -227 -167 -156 239 57 -316 -305 95 -87 121 312 230 153 236 200
2242B00j67m12M97Q6l20l53N48l5p7l49P0N38k22j74J96L7LL3j63N04n5o14M00
$$ 200 33 -379 118 204 -116 -469 79 44 -33 -382 -312 226 4 -170 26 63 66 99 -64 440 385 -229 171
2265A71O2l02p0M02j47J25l40M4K88k88K1M13j58l90L61j20Q5k17j67L57l27j29
$$ 171 233 -69 -139 263 116 241 -99 -55 233 -55 -34 379 221 -169 192 72 157 -60 -227 130 -197 -326
2287c26M78J63o69P0n6Q80j97m11K15k48L36l48K03J19j99j35K11qm07k02M37
$$ -326 152 315 -354 -284 -340 540 343 -68 147 -101 235 -113 90 209 10 -125 86 78 -329 -531 -94
2308i4m8J10j44P2L56m39K99K75Jn10M34n8J02l95j15L53l04m27N43m51L44j74
$$ -94 -142 -32 -176 -104 252 -187 112 387 388 -122 312 254 356 -39 -154 199 -105 -532 11 -440 -96 -270
2330b70kK29K0j50J61J65n5J25J82J85m72j06K02M1l92J93j97Q1k28J52l3L16
$$ -270 -272 -43 -23 -173 -12 153 98 223 405 590 118 12 214 255 -137 56 -141 -60 -288 -136 -169 147
2352A47j94j26J13J16k45K01K35K34k96k16Q4J82m40J75k07r3J79J58l90L7K38
$$ 147 -47 -173 -60 56 -189 12 247 481 185 -31 53 235 -205 -30 -237 -330 -151 7 -383 -346 -108
2373a08K93o00J08L49%K89j06P1R0l71J26K40l28k39N1K76l55K32j82p3L23m88
$$ -108 185 -415 -307 42 42 331 225 296 386 15 141 381 53 -186 -135 141 -214 18 -164 -237 86 -402
2395d02J37J8L73K50n69M5O59l84k42K79j65j6K61k28jk44q9J0M93m31L06l65
$$ -402 -265 -247 126 376 -193 -148 511 127 -115 164 -1 -17 244 16 15 -229 -318 -308 185 -246 60 -305
2417c05L94K15j64m3n6J46M2p9k03J51l02M07J24l50j74N00n12P0M05k68k31N21
$$ -305 89 304 140 97 41 187 229 150 -53 98 -204 203 327 -23 -197 303 -209 -139 266 -2 -233 288
2439B88P3o2n72M29K78j49m50J80J84K41o44k71M35L0j61K39L9k11JQ2R6K59o11
$$ 288 361 299 -273 156 434 285 -165 15 199 440 -204 -475 -40 -10 -171 68 107 -104 -103 -21 75 334 -277
2462b77O0M87Rk38n6k09M88l11kj06p6N26m23m59P23m9j14NqmQ7l61L40K60m11
$$ -277 -217 270 279 41 -15 -224 264 -47 -49 -155 -231 295 -128 -587 136 87 -27 -22 -30 -34 53 -308 32 292 -119
2487a19o3O11l32o3l01N0M76k85l17K30J33J01p8J12l1k47k60M04J98o8k86j33
$$ -119 -182 429 97 34 -267 -217 259 -26 -343 -113 20 121 43 155 124 -123 -383 21 219 151 -135 -268
2509b68L13L8J72m46J01L20k27m7j75K45j93J64q4L68j11K9m76J84M58n14j4R5
$$ -268 45 83 255 -191 -90 230 3 -44 -219 26 -167 -3 -87 281 170 199 -277 -93 365 -149 -163 -68
2531f8J32J71m51qN11k34Mj17M35l09Q3K41k35O6l38M69l30rJ02l16K47j32m56
$$ -68 64 235 -216 -224 287 53 57 -60 375 66 149 390 155 221 -117 352 22 13 115 -201 46 -86 -542
2554e42L75L09k77J90R6r5p4m0L40J28m38K28J93k32nj19m23L59k36k6L27j68
$$ -542 -167 142 -135 55 151 56 -18 -58 282 410 -28 200 393 161 156 37 -386 -27 -263 -289 38 -130
2576a30r3O80l42l75L58j43L72l29j48N48j48l34P9l56L40r1MM0Q7n16N2L54J84
$$ -130 -223 457 115 -260 98 -45 327 -2 -150 398 250 -84 -5 -361 -21 -112 -108 -68 19 -497 -445 -91 93
2599I3k45k3L89L6j55K69l8k97L3K12k43L0k80o5K51J56k17j38O1j60K19n0J81
$$ 93 -152 -175 214 250 95 364 326 29 62 274 31 61 -219 -284 -33 123 -94 -232 -171 -331 -112 -162 19
2622A9j6K97k39o7J87j58J58n7lL7nr9k44L8R5l41J84L82j23j57j51J82L14j44
$$ 19 3 300 61 -6 181 23 181 124 121 158 153 54 -190 -152 -57 -398 -214 168 45 -112 -263 -81 233 89
2646H9j23L25k41Q9n48L53N1j96l67M86J03q3k18MN73l90j86K73J20n76O04o6
$$ 89 -34 291 50 139 -409 -56 -5 -201 -568 -82 21 -62 -280 -276 297 -93 -279 -6 114 -462 142 76
2668G6K25M8l69K74R9l52j23K16l46M8K3K78j06l8j42J72j15j02O85m83O4K88
$$ 76 301 349 -20 254 353 1 -122 94 -252 -204 -181 97 -9 -47 -189 -17 -132 -234 451 -32 32 320
2690C20k21J34l11j72K92%k27n6J73K0L4J4r4K12q3J13n5j44n3j79N99l90j38
$$ 320 99 233 -78 -250 42 42 -185 -241 -68 -48 -14 0 -94 118 35 148 93 -51 -104 -283 316 -74 -212
2713b12K8K35j98n1K82J43j59k75K09L49k79k05Q7M69n11O2L32k26mp5j6J47k12
$$ -212 -184 51 -147 -198 84 227 68 -207 2 351 72 -133 -46 423 -88 -26 306 80 76 1 -15 132 -80
2736h0J76j77J44j01k88P00n45J16N1J91j24J69l27K30qm40L62m7j96j54L02l4
$$ -80 96 -81 63 -38 -326 374 -171 -55 -4 187 63 232 -95 135 127 -313 49 2 -194 -348 -46 -80
2758h0J89m24L04L05k76J23J14M2O1j67J41k85L6p9QJ14l00J11j65P1k3k36M35
$$ -80 109 -315 -11 294 18 141 255 297 358 191 332 47 83 4 12 126 -174 -63 -228 -157 -180 -416 19
2781A9m6L0K13j03l0m7J21j75J80l86K06K29l29J24n5M5N6o51N82P2r7l01M31
$$ 19 -27 3 216 113 83 36 157 -18 162 -224 -18 211 -118 6 -49 -4 52 -599 -17 55 -42 -343 88
2804H8l4P9j35J54J44l41j31N34l04k74J16K18j76k9k63K35K24l03L62k70J11
$$ 88 54 133 -2 152 296 -45 -176 358 54 -220 -104 114 -62 -91 -354 -119 105 -198 164 -106 5
2825Er8K22O5j11m0J13J88m42J13K63l30J8j60J18Q4l06J02K90p4r9L7l0J93j31
$$ 5 -93 129 194 83 43 156 344 -98 15 278 -52 -34 -194 -76 8 -298 -196 94 20 -79 -42 -72 121 -10
2849a0K28K21l60J99j72k03j19J25L65j80k23J5p5K04j95K76j01p3K60l3k3J13
$$ -10 218 439 79 278 106 -97 -216 -91 274 94 -129 -114 -189 15 -180 96 -5 -78 182 149 126 239
2871B39k54R0O8Q1k03j69L64l00n3K36k31J54j27M1J10k50R3K57K8m15j1M78M2
$$ 239 -15 75 143 224 21 -148 216 -84 -137 99 -132 22 -105 -64 46 -204 -111 146 174 -241 -252 226 268
2894B68j54j77K43P0l60K10k28L3m5J76q1M4l1K7q8Q2k55K16K53l1p4j62L03k56
$$ 268 114 -63 180 250 -110 100 -128 -95 -140 36 -45 -1 -32 -5 -93 -11 -266 -50 203 172 98 -64 239 -17
2918a7j71K96J7k26J16K03l26j83K95k56J89J7J83mj69Oj57K07j44K84mq6M9j48
$$ -17 -188 108 125 -101 15 218 -108 -291 4 -252 -63 -46 137 133 -36 -30 -187 20 -124 160 156 70 119 -29
2942b9p0K96l3l16J45J10j12J56M7k26k24K49R6J74J33p00L06J86k64p0K15Lr9
$$ -29 -99 197 164 -152 -7 103 -9 147 194 -32 -256 -7 89 263 396 -304 2 188 -76 -146 69 72 -27
2965b7k61J57M0J97k28R3p5J67j69j1K65j54%J63R3m75L65m26K69Q8j40K71k21
$$ -27 -288 -131 -91 106 -122 -29 -104 63 -106 -117 148 -6 -6 157 250 -225 140 -286 -17 71 -69 202 -19
2988a9j28J35J22n5p8n3K34j18N7j11j5l92L81q6J48q6J30l25K70k9j86M45k41
$$ -19 -147 -12 110 55 -23 -76 158 40 97 -14 -29 -421 -40 -126 22 -64 66 -259 11 -18 -204 241 0
3011@J44M1qr2j85K44J96k88n2j55Q9L17m55j48L31J27m56N76j40Q8j1m5k9N3
$$ 0 144 185 177 85 -100 144 340 52 0 -155 -66 251 -204 -352 -21 106 -350 226 86 174 163 118 89 142
3035A42r0J15Q3o2Pl01r1M11j99k50L73o50P66k78l55N46k39R8K0Q1l5K31n43
$$ 142 52 167 250 188 195 -106 -197 214 15 -235 138 -512 254 -24 -379 167 -72 26 46 127 92 323 -220
3058b20O5J25J69l07k8J55j93J81j54K91j86J5j6l8J33R2o0J48K27j04j40l83
$$ -220 -155 -30 139 -168 -196 -41 -234 -53 -207 84 -102 -87 -103 -141 -8 84 24 172 399 295 155 -228
3080b28L07p3k28J8J37r7L04m45K65K25k10K1M0J20l24J39J3J59k9J72o7J8k04
$$ -228 79 6 -222 -204 -67 -164 140 -305 -40 185 -25 -4 36 156 -168 -29 -16 143 114 286 219 237 33
3103C3n5k56N09j50j47k72M07P7J5j35j77P9j50M36k17L30j82l84L65k57R6O2
$$ 33 -22 -278 231 81 -66 -338 69 146 161 26 -151 -72 -222 214 -3 327 145 -239 126 -131 -35 27
3125B7k30J00N3M8J54j88j8p1k3k5M09r0j88L6N2J65o8J20j17p4K4j39No6j40
$$ 27 -203 -103 -50 -2 152 -36 -54 -125 -148 -173 236 146 -42 -6 46 211 143 263 146 72 96 -43 -38 -104 -244
3150b44J10J71m7j70P1J39J16M3l28M89j82j08m46L98J57j02L7j82q4J93r6L30
$$ -244 -134 37 -10 -180 -109 30 146 189 -139 350 168 60 -386 12 169 67 104 -78 -162 31 -65 265
3172B65k79k2k60P19l92J23l95O2J54j11Pk32M11j84K74R9j88l01K47p3O5J77
$$ 265 -14 -36 -296 423 31 154 -241 -179 -25 -136 -129 -361 50 -134 140 239 51 -250 -3 -76 -11 166
3194A66k04j39L72k04J9J12k04K16K01j10m30k17L09P2k05J91jQ1lj2r2J18o7
$$ 166 -38 -177 195 -9 10 122 -82 134 335 225 -205 -422 -113 -41 -246 -55 -56 25 22 10 -82 36 -31
3217c1K03j28o3K25j94R5J8r3m7J22k23l7r1K64k10K49j26J09K02k33O50n73J5
$$ -31 172 44 -19 206 12 107 125 32 -15 107 -116 -153 -244 20 -190 59 -67 42 244 11 661 88 103
3240A03o0l4j90J92O5O6j03j15J68Nl26K70K96m21r7M18k18P7PJ7r8J80j87j93
$$ 103 43 9 -181 11 76 142 39 -76 92 97 -229 41 337 -84 -181 237 19 96 103 120 22 202 15 -178
3264a78L67j7m28K55l19J0K71j2P5o7K8j26M52j46j12O7K43o74K82J98l09J01
$$ -178 189 172 -256 -1 -320 -310 -39 -51 24 -43 -15 -141 311 165 53 120 363 -311 -29 169 -140 -39
3286c9L7J27m2m09J94j25K1K54k04L72M1l31J27J34p0J3O9j83q7J45L3j20r0L6
$$ -39 -2 125 83 -326 -132 -257 -236 18 -186 186 227 -104 23 157 87 100 169 -14 -101 44 77 -43 -133 -97
3310i7N2N4r3Q7j67J27J64J25q6j78J70j4J16j58k02K53j85m1J5K53l59k7L7K06
$$ -97 -45 9 -84 3 -164 -37 127 252 166 -12 158 144 260 102 -100 153 -32 -73 -58 195 -164 -191 -154 52
3334E2k58J48k37K40K39j40j2q3K15q2q5J2J33o9pj03k1k01J98K20k12n7J6M13
$$ 52 -206 -58 -295 -55 184 44 32 -51 164 82 -3 9 142 73 66 -37 -58 -259 -61 159 -53 -110 -94 319
3358C19m77J17Oo0L4k4M12m7l77j81L05ML1k8l20K51P8L0j11K8K09k00J60j59
$$ 319 -158 -41 -35 -95 -61 -85 327 280 -97 -278 27 31 62 34 -286 -35 43 73 -38 -10 199 -1 159 0
3382@J18Rj04k6j41M61m87r5L47k1j0P5j40J07k80L44j56k40J73K08m5m1j22j3
$$ 0 118 127 23 -3 -144 317 -170 -265 82 61 51 126 -14 93 -187 157 1 -239 -66 142 97 56 -66 -79
3406g9j18J30qj60J95J18k83k6J12j30K69k37o3K10J17r5n1J27K07k31k20q5L99
$$ -79 -197 -67 -75 -235 -40 78 -205 -231 -119 -249 20 -217 -280 -70 47 -48 -99 28 235 4 -216 -301 98
3429I8J17l27J95q5j8J84k84J18J58j46k07N24l60M08k62L0k73K9m8K64l97J31
$$ 98 215 -112 83 -2 -20 164 -120 -2 156 10 -197 327 -33 375 113 143 -130 -101 -149 115 -282 -151
3451a51j40L01q8Q4J9J9M9k17K40j72l8K10j10j6N2J22k08k12L30r3l40K31k77
$$ -151 -291 10 -78 6 25 44 93 -124 116 -56 -94 116 6 -10 42 164 -44 -256 74 -19 -359 -128 -405
3474d05L23j38K4K19R1j27L1R1k20o2Q5K05L0k13j85M8j6J48Q8j08J58l0k38L76
$$ -405 -82 -220 -196 23 114 -13 18 109 -111 -173 -88 117 147 -66 -251 -203 -219 -71 17 -91 67 37 -201 175
3498A75k37R9J33n0J10j15j15p8qK02j95M9M6n2k45K71J93k52p3L2J88q6n8J75
$$ 175 -62 37 170 120 230 115 0 -78 -86 116 -79 -30 16 -36 -281 -10 183 -69 -142 -110 78 -8 -66 109
3522A09J06k85J77k13j9R4J17m2kp9k05J67k42O8J52J40J3j25n0N1J67L0J50m33
$$ 109 215 -70 107 -106 -125 -31 86 44 42 -37 -242 -75 -317 -249 -97 43 56 -69 -119 -68 99 129 279 -154
3546a54J90J22k12o8J97M6J30n96L92N8K5l07J04qr3N4k66O00j67j08J71j13L5
$$ -154 36 158 -54 -122 75 121 251 -345 47 105 130 -177 -73 -81 -174 -120 -386 214 47 -61 110 -3 32
3569C2j25p9L02k41j1L0j94K15J14L0l10L26k72N5K3J32M21l20Rq0N4k15N6j16
$$ 32 -93 -172 130 -111 -122 -92 -286 -71 43 73 -237 89 -183 -128 -105 27 448 128 137 57 111 -104 -48 -164
3593a64K75J57k57l6K35k66m0J80k9r8R1l1K12j93j69Q4J06l60M75J2m30J50j
$$ -164 111 268 11 -25 210 -56 -96 84 55 -43 48 17 229 36 -133 -49 57 -303 172 184 -246 -96 -97
3616i7j19M5L39j72J72m9o0o5N2k38J97J05n1k1Rj6r6K32k9L9j38k33L97j07j84
$$ -97 -216 -171 168 -4 168 119 59 -6 46 -192 5 110 59 38 47 31 -65 167 138 177 39 -194 203 96 -88
3641h8N4J26j06M9p7R3j00j32K4R9k1kK49m05K74R0n4R8o6J07j71L9R2J87n42
$$ -88 -34 92 -14 35 -42 51 -49 -181 -157 -58 -79 -81 168 -237 37 127 73 171 105 212 41 80 172 359 -183
3666a83K94k35K70j87Q8j56K11o6j93J08L6j56J56l04K7L67j46K77r3lk8J50J
$$ -183 111 -124 146 -41 47 -109 102 36 -157 -49 -13 -169 -13 -317 -290 77 -69 208 115 112 84 234 235
3689B35j29J0Q4n04M0J10K57l36K50J45l02Q7j75L92k41L22k80j58K01r0NN08
$$ 235 106 116 200 -304 -264 -154 103 -233 17 162 -140 -53 -228 164 -77 245 -35 -193 8 -82 -77 431
3711D31o99M58l59K39j8M5k61R2o4M91l85l5j2J96Rl22R5K34K23k16M4k14k4N3
$$ 431 -268 190 -169 70 52 97 -164 -72 -136 355 -30 -65 -77 119 128 -194 -99 135 358 142 186 -28 -52 1
3735Ak98J87PJ91k8R9k92K65j68K97j72j92J81k65J66m51M09J14J74k59K27r0
$$ 1 -297 -110 -103 88 60 159 -133 132 -36 261 89 -103 78 -187 -21 -472 -63 51 225 -34 193 103
3757A03j72O7rj20J10o5J66j14p6J18K72l16LM2Pj45L20J2k20K6J00m9n9M7l38
$$ 103 -69 -2 -11 -131 -21 -86 80 -34 -110 8 280 -36 -33 9 16 -129 191 203 -17 9 109 60 1 48 -290
3782b90M73j57q6m5n3J31j51O23l91j65J38n0k6R6l04J95N4k6J06j94J02K23j57
$$ -290 183 26 -60 -105 -158 -27 -178 445 54 -111 27 -23 -49 47 -257 -62 -8 -34 72 -122 -20 203 46
3805D6N8q4Q4q8j82L94j98J01m3l53K37R9K6k41O0J7M7J8pj8M4q3l0j32K37M8
$$ 46 104 20 104 16 -166 228 30 131 88 -265 -28 71 97 -144 -84 -67 -20 -2 -9 -27 17 -66 -96 -228 9 57
3831E7k9j24M07m19J13j21K21J8K9k17K22O5j60k55J64K66l73L58k00K69m37K34
$$ 57 28 -96 311 -108 5 -116 105 123 152 -65 157 222 62 -193 -29 237 -136 222 22 291 -146 88
3853H8j41m6R2Q1j66J84n1o8K54j96j7q5m7J29j1j87K21N8j07j4n4K13q1k50J0
$$ 88 -53 -99 -7 74 -92 92 41 -27 227 31 14 -71 -118 11 0 -187 34 92 -15 -29 -83 130 49 -201 -191
3878a91n3P9J3K03J01k90k8L87k74l8Q0J76j75N4m8P8k0j28L05O8o16M17Rj35
$$ -191 -244 -165 -152 51 152 -138 -166 221 -53 -91 -11 165 -10 44 -4 74 54 -74 231 299 -317 100 109 -26
3902b6j74K10J53l87R8qR2Q3j37J10j09m1J18p1j74J19K87k25L01k52m3P9J03
$$ -26 -200 10 163 -224 -126 -134 -42 41 -96 14 -95 -136 -18 -89 -263 -144 143 -82 219 -33 -76 3 106
3925A06j59P9r0Q9N2j04J60j94j27J06j27K87j04Q2k62R1PJ73k1j39K89k10j89
$$ 106 -53 26 -64 25 77 -27 133 -61 -188 -82 -209 78 -26 56 -206 -115 -108 65 44 -95 194 -16 -205
3948b05K29p6J68j8N8l08K74k47r6K23O0K6m31L64j03M7JL3j45J73J66l60N36
$$ -205 24 -52 116 98 156 -152 122 -125 -221 2 62 88 -343 21 -82 -35 -34 -1 -146 27 193 -167 369
3971C69m27K66J03k51k41L02r1j95J1J06Q1J14k32k13L32rP5pk21j3j12J00M34
$$ 369 -58 208 311 60 -181 121 30 -165 -154 -48 33 147 -85 -298 34 25 100 93 -128 -141 -253 -153 281
3994B81k03Q4j51j67J45r6K28j01Q2k78K19J33j75j28L73m24N9K09PN9l4j88J86
$$ 281 78 162 11 -156 -11 -107 121 20 102 -176 43 176 1 -127 246 -178 -119 90 97 156 122 -66 120
4017A20k9J41l35m3J50q4J71J6M7l61K7N5L50m50J12K08j13k8l1J53j74q9k2J79
$$ 120 91 232 -103 -146 4 -80 91 107 154 -207 -180 -125 225 -225 -113 95 -18 -46 -77 76 -98 -187 -209 -30
4041c0j15K44n6O8j75J15j65N3K58k41L40j39o7J26m0l43J20LQ4M7j38J05k49
$$ -30 -145 99 43 111 -64 51 -114 -61 197 -44 296 157 90 216 176 -167 -47 -44 40 87 -51 54 -195
4064a95J56P0J22l18J01K61l31n4L56o2k0o9K32l71l4J61q3J85k07o0K47n4j4
$$ -195 -39 31 153 -165 -64 197 -134 -188 168 106 86 17 249 -122 -156 5 -78 107 -100 -160 87 33 19
4087A9J85k49q1K09j0O5Nj33J34l77L24K52m49K84n38K58P2j49k5r6J65L5K03
$$ 19 204 -45 -126 83 73 138 143 10 144 -233 91 343 -106 178 -360 -102 -30 -179 -204 -300 -135 -100 103
4110A03j4K77l93L8%j6j4J07j1m2k11J72j09L0q4R9K90k70R1k49J76K56l64K07
$$ 103 89 366 -27 11 11 -5 -19 88 77 35 -176 -4 -113 -83 -167 -68 222 -48 43 -206 -30 226 -138 69
4134F9j62J95j78K82m12J76L45m10L71j64j35J9k57N4K69k08J79n4J41j79q0L23
$$ 69 -93 102 -76 206 -206 -30 315 -95 276 112 -23 -4 -261 -207 62 -146 33 -21 120 -59 -139 184
4156A84k71L1J23K72k89Mm5n1o0L19j06j10k9K9L0j04j57K10R3J10ln01M98j38
$$ 184 -87 -56 67 339 50 54 9 -42 -102 217 111 1 -28 1 31 -73 -230 -20 73 183 180 -321 177 39
4180C9K5K0j55L4J74k66l73O44l88K86j34L02j5k28J54l1L9K4j50j49R7J59J12
$$ 39 64 84 -71 -37 137 -129 -502 142 -246 40 -94 208 193 -35 119 88 127 151 1 -148 -51 108 220
4203B20j80k6K70k54m8L0n0j76K93k12L21m21J51R3L8j03R3J58l84K16K14k09
$$ 220 40 14 284 30 -18 12 -38 -214 79 -133 188 -233 -82 11 49 -54 39 197 -187 29 243 34
4225C4j54J70j24J0J88r7j17L28l13L2L41m19K70r8j14L22q8J7k87J75j94J29
$$ 34 -120 50 -74 -64 124 27 -90 238 -75 -43 298 -121 149 51 -63 259 171 188 -99 76 -118 11
4247A1J31l23K82R1j24L4l7L8R4j21k32K8L32J17m30r9O5L75k98Pj32J56j57K45
$$ 11 142 -181 101 192 68 102 65 103 197 76 -156 -128 204 321 -109 -208 -143 232 -66 -59 -191 -35 -192 53
4271E3k92K83j39k61K13M7K60l5r0m1K68k51K2k54J37m6K32m30K25j77K37L01
$$ 53 -239 44 -95 -356 -143 -96 164 129 39 -2 266 15 37 -217 -80 -126 106 -324 -99 -276 -39 262
4293B62l03K03m58L16k0j18N5J66R0j26k08J73j01M3j37J49o8j50J38M5j51M58
$$ 262 -41 162 -296 20 0 -118 -63 103 193 67 -141 32 -69 -26 -163 -14 -82 -232 -94 -49 -200 258
4315B58l42K00J0qj12rQ8j95J27j79L51k38k09J76r0l2K59l7l7J48M5o6k2K5J04
$$ 258 -84 116 126 118 6 -3 85 -110 17 -162 189 -49 -258 -82 -172 -204 55 18 -19 129 174 108 86 111 215
4340B15k93K71m35K48o2q6PJ0j30K79J52j87j48K34k08k40J18P4J73J40k03n1
$$ 215 -78 193 -242 6 -56 -142 -135 -125 -255 24 176 -11 -159 75 -133 -373 -255 -181 -8 132 -71 -122
4362a22OK27J56j02l06M0K07k51K00o7J31q2k63J95j62J70p2K25N0j87J95M4k36
$$ -122 -116 111 267 165 -141 -101 106 -145 55 -12 119 37 -226 -31 -193 -23 -95 130 180 -7 188 232 -4
4385dj82K73N1j38M12m41K32k46p3J73P7M0j69N5K60k71Q4l81K01J57k32O1r4
$$ -4 -186 87 138 0 412 -29 203 -43 -116 57 134 174 5 60 320 49 133 -248 -47 110 -122 -61 -155
4408a55L4L47k60K4k84K25J42j71J13r0k80N09P5J46j43j87J08j12j90n0J78P4
$$ -155 -121 226 -34 -10 -294 -69 73 -98 15 -75 -355 154 229 375 232 45 153 41 -149 -199 -21 53
4430E3j13N7L1J20k89K24j6k87K13L21k30Q6k36K7K69k66K67j99o8j46J91J19
$$ 53 -60 -3 28 148 -141 83 67 -220 -7 314 84 170 -66 -39 230 -36 231 32 -36 -182 9 128
4452A28j37p3PJ78N3m04L58k83M07k11j09M85o17L75n1l9k39O2O2K20K1K1m02
$$ 128 -9 -82 -75 103 156 -248 110 -173 234 23 -86 399 -218 157 106 67 -172 -110 -48 172 193 214 -188
4475a88J69J17mp8O1l12K63n9l5J52l9k57L11j44l46L88p9R3j82N0K4J37R9p2
$$ -188 -19 98 94 16 77 -235 28 -31 -66 86 47 -210 101 -43 -389 -1 -80 13 -169 -119 -95 42 141 69
4499F9j79J00JJ34j52K16l61J06Q3kr1J8K7nQ6r1M6j15K27m4p5J33l05J49k15
$$ 69 -110 -10 -9 125 -27 189 -172 -66 17 15 -76 -58 -31 -36 50 -41 5 -110 117 73 -2 131 -174 -25 -240
4524b40J21L23l33J47j05p0K81L3j43p5k7J86k47K19R7k67pj75L66K49n74K09
$$ -240 -119 204 -129 18 -87 -157 124 157 14 -61 -88 98 -149 70 167 -100 -107 -282 84 333 -241 -32
4546c2j58K4M90n97K93j07P1o7L3j05K50j03J33J27k13o6j62K85J3k52L96l35
$$ -32 -190 -166 324 -273 20 -87 -16 -83 -50 -155 95 -8 125 252 39 -27 -189 96 109 -143 253 -82
4568h2J59l05K77j74J28j17r9M50k84J27r7J36Q5l70J56p4J95l5j38J8j01J39
$$ -82 77 -228 49 -125 3 -114 -213 237 -47 80 -17 119 204 -166 -10 -84 111 76 -62 -44 -145 -6
4590fN1J7j40R1j16O3J18k68M79j43L4l06J62J22L6m39L63Q3j90j83J84K68l28
$$ -6 45 62 -78 13 -103 -40 78 -190 289 146 180 -126 36 158 194 -245 118 201 11 -172 12 280 -48
4613d8K3N9j27k6P3J12j10k7N2k7p8J98l8P2j64K29j42o3J70j25j25k0j33N4K73
$$ -48 -25 34 -93 -119 -46 66 -44 -71 -19 -46 -124 74 36 108 -56 173 31 -32 138 13 -112 -132 -265 -211 62
4638F2P3k84l1J21n6J84N1J11l88L01k94M71m52L63p1j83j96k2J56O4rK53o7m23
$$ 62 135 -149 -180 -59 -115 69 120 231 -157 144 -150 321 -131 232 161 -22 -218 -240 -84 -20 -29 224 157 -266
4662b66K70k95M64k05K13j07m6L5q9J80Rn77M22m1j09O4j3qK35m22K6L07n1OJ57
$$ -266 4 -291 173 -32 181 74 28 63 -26 154 163 -414 8 -33 -142 -78 -91 -99 136 -286 -260 47 -4 2 159
4687A59j44m5o2O1lMJ71L0j61J96l64K93j03j97J03K79P4l17J76k44j39K40j42
$$ 159 15 -30 -92 -31 -34 -30 141 171 10 206 -158 135 32 -165 -62 217 291 -26 150 -94 -233 7 -135
4710a35J2J21q9j77OL56l7m57M35J43%m5n1j5K36l67j54K36Jk58K65j69L42j77
$$ -135 -123 -2 -91 -268 -262 94 57 -400 35 178 178 133 82 67 303 -64 -218 18 19 -239 26 -143 199 22
4734B2N6J2k96K20m3o7J56L2J88l06o4K1K83n36N48k17j7k77J60Q2L5j39J07m3
$$ 22 78 90 -206 14 -29 -96 60 92 280 -26 -90 -69 214 -322 226 9 -8 -285 -125 -43 -8 -147 -40 -83
4758h3p5L24j64q3J57l37K75J57k50K19j15P2L16l62k67J56K24j00J00k05j15
$$ -83 -158 166 2 -81 76 -261 14 171 -79 140 25 97 413 51 -216 -60 164 64 164 -41 -156
4779a56M56l69J27Q6l0j27K2K09k70l60M33J99r7L3M9k36r1P8k49J99J19L2P3
$$ -156 300 -69 58 144 114 -13 9 218 -52 -412 21 220 123 156 205 -31 -122 -44 -293 -94 25 57 130
4802A30J42m48Q4J71J2j75n3K47j93J23ok33J22P5qr1K86m4k30n1J35j4j9L11
$$ 130 272 -176 -92 79 91 -84 -137 110 -83 40 34 -199 -77 -2 -10 -101 185 141 -89 -140 -5 -19 -38 273
4826B73k05L33o0m20K68j60J81m1j74j76m8J44J63%k49J34k7k14M17j10rP2J65
$$ 273 68 401 341 -79 189 29 210 169 -5 -181 -229 -85 78 78 -171 -37 -64 -278 139 29 20 92 257
4849B57l18J10K4k83M28k95K28j4m66L48N9p6J00k59p5J68J39q3J31j87K71mj56
$$ 257 -61 49 73 -210 218 -77 151 137 -329 19 78 2 102 -157 -232 -64 75 -8 123 -64 207 203 47
4872D7J23k43J2L0R8K37m61K09j48J42J0n8k37K69j34K4j53Q5J9K22P2jl59O6
$$ 47 170 -73 -61 -31 67 304 -157 52 -96 46 56 -2 -239 30 -104 -80 -233 -148 -129 93 165 164 -195 -129
4896a29n6L68j39k93K96k4j03m0n1J05K79M8q4o22N42N8L2n42N20j74J6O7j72
$$ -129 -185 183 44 -249 47 23 -80 -120 -171 -66 213 261 177 -445 97 155 187 -355 165 -9 7 74 -98
4919i8L4o4K14k41K56J40l63J80O0j67K77k10K33k41m0k18K66j11M4K36k76K16
$$ -98 -64 -128 86 -155 101 241 -122 58 118 -49 228 18 251 10 -30 -248 18 -93 -49 187 -89 127
4941A27K3k59K89j94j16J96l1J15m5k39j13K91J51r0k17J16k31K47j61J20o6j08
$$ 127 150 -109 180 -14 -130 66 35 150 105 -134 -247 44 195 105 -112 4 -227 20 -141 -21 -87 -195
4963a95K06k01k0J85P7%j9J38j42k49J21K97j01j99j0n7n9K41k61K67K02m4j50
$$ -195 11 -190 -210 -25 52 52 33 171 29 -220 -99 198 97 -102 -112 -169 -228 13 -248 19 221 177 27
4986B7r4%M78m28kJ45lk84L00k15R4mL1k61L57o5P3j74J41l3l29K33J0P1p3mJ81
$$ 27 -67 -67 411 -17 -19 126 123 -161 139 -76 18 14 45 -216 141 76 149 -25 116 83 -246 -13 -3 68 -5 -9 172
5013A72k25J34J37n0j57PJ32j61q4oJ56k35L52N4j60k01L20q8j76L2R7J65l79
$$ 172 -53 81 218 168 11 18 150 -11 -95 -101 55 -180 172 226 66 -135 185 97 -79 -47 50 215 -164
5036a64P5K52j54%j6OJ71l55J14j01M7J27l58K72M8R3qN1P9p4k07R0l3r5L74l8
$$ -164 -89 163 9 9 -7 -1 170 -185 -71 -172 -125 2 -356 -84 -36 57 49 100 179 105 -102 -12 -45 -140 234 196
5062A96p2j40p1L39j66j14P7j29p7K27K9j92Q0l8l24N35k04j62K65k58M68k18
$$ 196 124 -16 -87 252 86 -28 49 -80 -157 70 99 -93 -13 -51 -375 160 -44 -206 59 -199 269 51
5084E1L2M1j65l8k1J83l7J6Q9k41J53Q5p4O9l4O5j47k03K71Q9j19j54K81O9Jl48
$$ 51 83 124 -41 -79 -100 83 46 62 151 -90 63 148 74 143 109 174 27 -176 95 184 65 -89 192 261 262 -86
5110h6J51q1J42Nj59P1o3j39N7L8l2J41j16K97J37l67k2J2O4O4j08J47o6l10J98
$$ -86 65 -16 126 131 -28 43 -20 -159 -102 -64 -96 45 -71 226 363 -4 -26 -14 50 114 6 153 87 -223 -25
5135b5j76K07Q1j92j06M2K10J85j93P0P8j48j02P9L54k95k28K78Kj44j20L69j72
$$ -25 -201 6 87 -105 -211 -169 41 226 33 103 181 33 -69 10 364 69 -159 119 121 -23 -143 226 54
5158E4l79M35k16K36k42K68k07l65O93o44N39k0J0k34K24j47J17K00n21K15j33
$$ 54 -325 110 -106 130 -112 156 -51 -416 277 -367 172 152 162 -72 152 5 122 322 -199 16 -117
5179a17K69O2l66K18k05K30k95L51Lq7j15Q6j11P5j34J93j63Q4p2M5J30j74L61
$$ -117 152 214 -152 66 -139 91 -204 147 150 63 -52 34 -77 -2 -136 57 -106 -22 -94 -49 81 -93 268
5202B68k82q9K55l4k0m31N67o3j56J70R4j50j01K36M3k67k7m5K22k21K28k12J75
$$ 268 -14 -103 152 118 98 -333 234 171 15 185 279 129 28 264 307 40 13 -32 190 -31 197 -15 160
5225A60o1j66J68N5q2o3J65k76j22K35N8j94J67j15L53j51p9o4K35m14O3Q4r7
$$ 160 99 -67 101 156 74 11 176 -100 -222 13 71 -123 44 -71 282 131 52 -12 223 -191 -128 -44 -141
5248a41J71Q9K1j82L09l71K90K42n88K98pL0n1k28O3j06Q0P4J1J42L3l0j25j76
$$ -141 30 119 140 -42 267 -104 186 428 -160 138 131 161 110 -118 -55 -161 -81 -7 4 146 179 149 24 -152
5272a52K26j64P8j45K26q7J11k8k90K62j01k02Q9J45Q0O3k60P5j03L47j03L7Q2
$$ -152 74 -90 -12 -157 69 -18 93 65 -225 37 -64 -266 -177 -32 48 111 -149 -74 -177 170 67 104 186
5295A86j23n2j48K19j98r9K15R9q1K7Q8l25L57P3l45J72nl0q4l2J16n7N8j04K00
$$ 186 63 11 -137 82 -116 -215 0 99 18 45 133 -192 165 238 -107 65 60 30 -54 -86 30 -27 31 -73 127
5320A27j15rO0K72n69M25j90K24k1j00k60K18m03N00R4k66j02J06J37j18l0K15
$$ 127 12 3 63 335 -234 191 1 225 204 104 -156 62 -341 159 253 -13 -115 -9 128 10 -20 195
5342A95k98j62L75j6o1Kj96M39m39L98j11j86Q6l6K37k67L00j88%o1L1n3o6jJ67
$$ 195 -103 -265 110 94 33 35 -161 278 -161 237 126 -60 26 -10 227 -40 260 72 72 11 42 -11 -77 -78 89
5367H9l6p5k32J7J75k01L02J01j07M8j18k2K14j85R4r3J60k93K32mQ4m71J21N46
$$ 89 53 -22 -254 -237 -62 -263 39 140 33 81 -37 -59 155 -30 64 -29 131 -162 70 66 150 -321 -200 346
5391C46r0n13L4L76l85K9J62l0J19k87K82l23L85J28j11k49o0l7J5J93K53k95
$$ 346 256 -257 -223 153 -232 -203 -41 -71 48 -239 43 -280 105 233 122 -127 -187 -224 -209 -16 237 -58
5413e8j88J89L7K0Pj01J28l4j49R3J26r9J54M8k39K51L2k07R8p9p9K2p0k56K85
$$ -58 -246 -57 -20 0 7 -94 34 0 -149 -56 70 -29 125 173 -66 185 217 10 108 29 -50 -28 -98 -354 -69
5438f9K6R6L1l19L64l17J14K03Mm15M04r1J01j07j23N3n7K09j35N5j59K06k19
$$ -69 -43 53 84 -235 129 -188 -74 129 133 -282 122 31 132 25 -98 -45 -102 107 -28 27 -132 74 -145
5461a45P7j26J20J36K00q5j16j77K09p8p6Jk08J60K60j06L5pj87P6m4J96LM3l95
$$ -145 -68 -194 -74 62 262 177 61 -116 93 15 -61 -60 -268 -108 152 46 81 74 -113 -37 -81 115 118 161 -234
5486b34JL00n7k30J40m29N57k31J43j04K65n8J0Pj60J60k88L11J08p1J10n5Jk16
$$ -234 -233 67 10 -220 -80 -509 48 -183 -40 -144 121 63 73 80 -80 80 -208 103 211 140 250 195 196 -20
5510b0J69k72J81n7p3K82k44J86j26J48j08J21m13L94n5j35K49j17K78k69l49
$$ -20 149 -123 58 1 -72 210 -34 152 26 174 66 187 -226 168 113 -22 227 110 388 119 -230
5531b30j23L09o9J59j16O4j89K10L27p0k07j86K09j87J93k80O5J40Q7o1k30J84
$$ -230 -353 -44 -113 46 -70 -6 -195 15 342 272 65 -121 88 -99 94 -186 -121 19 106 45 -185 -1
5553ao6M8lr7nJ8m3J52j81O4Q1J35l53L79j89N3%j27J4K7O8k0KJ9R5k39R2J25
$$ -1 -67 -19 -22 -119 -124 -106 -149 3 -178 -114 -33 102 -251 128 -61 -8 -8 -135 -121 -94 -26 -46 -44 -25 70 -169 -77 48
5581D8j68J32j50K04o2Pj84j1L11k71J52l28M94r3P3j41l9K6j20M8j80L3L49l96
$$ 48 -120 12 -138 66 4 11 -173 -184 127 -144 8 -320 174 81 154 13 -26 0 -120 -72 -252 -219 130 -266
5605b66M75r0jJ56n31J60r4J00J45L6q2k17K58O5J11p8k13j0J25j60P9k7J04j28
$$ -266 209 119 118 274 -257 -97 -191 -91 54 90 8 -209 49 114 225 147 -66 -76 49 -111 -32 -59 45 -83
5629h3N3J13q5j29k38K82J23j24J35l47M33k9k57j6l3L29p9k04p1J70J55p9j82
$$ -83 -30 83 -2 -131 -369 -87 36 -88 47 -300 133 104 -153 -169 -202 127 48 -156 -227 -57 98 19 -163
5652a63J26J26k19J02J6k46P1L42l82J74R7p4M3l1J75l97L08K6J11p0j8l24N27
$$ -163 -37 89 -130 -28 -12 -258 -187 155 -227 -53 44 -30 13 -18 157 -240 68 94 205 135 117 -207 320
5675C20n65K72r6K90k54M8Onj04l8k2M11l22o8L14Q0Q3n39N8PJ68Q0k48K27o7
$$ 320 -245 27 -69 221 -33 15 21 16 -88 -126 -148 263 -59 -127 187 267 350 -189 -131 -124 44 124 -124 103 36
5700C6%K34q8M8l42J86k33K44%j45J40k77J02K60n83N32k2L5M5k27j05K57K1j79
$$ 36 36 270 182 230 -112 74 -159 85 85 -60 80 -197 -95 165 -418 114 92 127 172 -55 -160 97 118 -61
5724f1k03Q7J98lq4j31J58J81om23L32O4J54rl61K37m11M77l74J40J09j8M5Oj97
$$ -61 -264 -177 21 18 -66 -197 -39 142 136 -287 45 109 263 254 -107 130 -281 196 -178 -38 71 53 98 104 -93
5749i3j9K91k97K7J48P5k23L86l07j18J03J57J36j17l13K20Lk30p0K25Rj1J43
$$ -93 -112 179 -118 -91 57 132 -91 295 -12 -130 -27 130 266 149 -164 56 59 -171 -241 -16 -7 -18 125
5772A25K7q1N0k72K60k41J2k8K16j73J25J10k95J04K41j53j4M2l68M70J2k82J7
$$ 125 152 71 121 -151 109 -132 -120 -148 68 -105 20 130 -165 -61 180 27 13 55 -313 157 169 -113 -96
5795i6J41J72l90J58Q7j43l6K16m0j29L12j85o7l07M82k06J37l67O43l81m5o1
$$ -96 45 217 -173 -15 72 -71 -107 109 69 -60 252 67 0 -307 175 -31 106 -261 382 1 -44 -105
5817a05J09j99L70J03k51M7j55P6J44k05m1J50Kr2l3L04l33R1M8k81L11L9j64
$$ -105 4 -195 175 278 27 74 -81 -5 139 -66 -107 43 45 -47 -80 224 -109 -18 30 -251 60 99 -65
5840f5k9L28l37J64k57J79pp6L12k83L12k58L87l62Q5Q7k93L95j25o5j41K21k77
$$ -65 -94 234 -103 61 -196 -17 -24 -100 212 -71 241 -17 370 8 93 180 -113 282 157 92 -49 172 -105
5863a05R3J51k75n4K27J89j83O3p1m2J45l36M7J19j50K42K04N9m74O08m75K21
$$ -105 -12 139 -136 -190 37 226 43 106 35 -7 138 -198 -151 -32 -182 60 264 323 -151 457 -18 203
5885B03j04K98k81m7M4L0K08k74J60j41j38L34l55p5K43k05O5J49j49j03J18J48
$$ 203 99 397 116 69 113 143 351 77 237 96 -42 292 -63 -138 105 -100 -35 114 -35 -138 -20 128
5907A28j38L62l34K50l72J05j04k5M77r8j86J3j3l28O6K42j28qK03k71K18l2M8
$$ 128 -10 352 18 268 -104 1 -103 -128 349 251 65 78 65 -263 -197 45 -83 -91 112 -159 59 27 75
5930G5j74K03J70k16L55j55j98n1K38j60l3m0q7N6O5m5p0R9j12J83J01l39L2K21
$$ 75 -99 104 274 58 413 258 60 9 247 87 54 14 -73 -17 48 3 -67 32 -80 103 204 -135 -103 118
5954A18O5k18K51k44j01J00J92k43j82J98j03K57j57Jq2K35k41J31k05J28M10
$$ 118 183 -35 216 -28 -129 -29 163 -80 -262 -64 -167 90 -67 -66 -148 87 -154 -23 -228 -100 310
5975C10m93L2M6j18J03K72k85o6M57l46P2r6k8J34k0L6k15N25l45P3K0j08n5p5
$$ 310 -183 -151 -105 -223 -120 152 -133 -199 258 -88 -16 -112 -140 -6 -26 10 -205 320 -25 48 68 -40 -95 -170
5999a70O5K88p3k33K85j20j51J79k09J93L1k34K80L5j77j99J25k39J40M6J98J01
$$ -170 -105 183 110 -123 162 42 -109 70 -139 54 85 -149 131 166 -11 -210 -85 -324 -184 -138 60 161
6021A61j79l0j94J61j08J97l04K82j22J24J28l1M6j32j14K71k76J52K7N6j61r0
$$ 161 -18 -48 -242 -81 -189 8 -296 -14 -136 -12 116 85 131 -1 -115 156 -120 32 59 115 -46 -136
6043a36J28j57O1K98j26j23Nk1J0P8n6K88k86L4K10j60K15k41M1j16j77N3L51
$$ -136 -8 -165 -104 194 68 -55 -50 -71 -61 17 -39 249 -37 -3 207 47 262 21 62 -54 -231 -178 173
6066A73j62j80p1M19j54K7o1%j97M2J24J06k02J75J28ol15J49j33K71P9k92J73
$$ 173 11 -169 -240 179 25 52 -9 -9 -206 -164 -40 66 -136 39 167 161 -154 -5 -138 133 212 -80 93
6089I3j47L7m9r4n7N57l43p4N6j2J70m6J30j79j16J8j25M46n90K30J51k05N87
$$ 93 -54 -17 -66 -160 -217 340 -3 -77 -21 -33 137 91 221 42 -74 -56 -181 265 -325 -95 56 -149 438
6112D38m28j00J20j35R9J0k61j88M57l6L03j59m6j22O5K06k04l6k08L79k95J93
$$ 438 10 -90 30 -105 -6 4 -257 -445 12 -24 279 120 74 -48 17 223 19 -17 -225 154 -141 52
6134E2K5l38J72J27k67M35r2n2m8J83j77j2K77j8l51L8p4R1l6R2pj56k57M50k78
$$ 52 77 -261 -89 38 -229 206 114 62 14 197 20 8 285 267 -84 -46 -120 -29 -65 27 20 -136 -393 57 -221
6159b21L12j2j97K05N3l22J40K2R3q6J48k3J4n7l17L34j48r3K09J6o5J9J19Q8
$$ -221 91 79 -118 87 140 -182 -42 -20 73 -13 135 112 126 69 -248 86 -62 -155 54 70 5 24 143 231
6183B31r3j31J15P8K4n93L42P7o4k62K52q2n3J28N8J3m0kJ89k40OJ64k0qn6L3
$$ 231 138 7 122 200 224 -369 -27 50 -14 -276 -24 -106 -159 -31 27 40 0 -2 187 -53 -47 117 97 89 33 66
6209F6J05o0j75K06j27K5j88R7K61l12r0L60n35L12O4j59K5J91j34Q5j12L16j91
$$ 66 171 111 -64 142 15 40 -148 -51 210 -102 -192 168 -367 -55 9 -150 -125 66 -68 17 -95 221 30
6232C0l5j59L26o7n8j07K57J22l56K28k54J81o8J97o6m55K24J05n5j62J83j69
$$ 30 -5 -164 162 95 37 -70 187 309 -47 181 -73 108 40 237 171 -284 -60 45 -10 -172 11 -158
6254a58J28j07L67l93K21k8J04r7k6n1R4J98m6J10n94K43M3q1J20r7k5j3j98K63
$$ -158 -30 -137 230 -163 58 30 134 37 11 -40 54 252 206 316 -278 -35 8 -73 47 -50 -75 -88 -286 -23
6278b3j11oK62j93Q6J36k91L04k72J27r3J14J96m56M60j57j22O4J45j87%l1k1
$$ -23 -134 -140 122 -71 15 151 -140 164 -108 19 -74 40 236 -220 240 83 -39 25 170 -17 -17 -48 -69
6301f9j61L40l33K55j95L95k08P4j4j58p4K66K22j39j19j72O9r8M9K62k18J67
$$ -69 -230 110 -223 32 -163 232 24 98 84 -74 -148 118 340 201 82 -90 -21 -119 -70 192 -26 141
6323A41j82j62K20L09m11k14N28k03k4j30J35l30L55M0K02n61K76R4pj64k02N50
$$ 141 -41 -203 17 326 -85 -299 229 26 2 -128 7 -323 32 72 274 -287 -11 83 76 -88 -290 260
6345B60j24J00j24k4j95K72J14k61p0N0n4L2M1j63k7M72k58p8K06P8k52l65K16
$$ 260 136 236 112 88 -107 165 279 18 -52 -2 -56 -24 17 -146 -173 299 41 -37 169 247 -5 -370 -154
6368a54M80m35m0J81k73L73j03l0j76%M1J67J3R7j35J53l11J37Jj8J05L50l52
$$ -154 326 -109 -149 32 -241 132 29 -1 -177 -177 -136 31 44 141 6 159 -152 -15 -14 -32 73 423 71
6391G1j2J00l34J98N0k27J67Qm5p1K83p2j25J45k38P8J44K69n34j4j4KJ6J89L23
$$ 71 59 159 -175 23 73 -154 13 21 -24 -95 188 116 -9 136 -102 -24 120 389 -145 -159 -173 -171 -155 34 357
6416C57l43K24l69j7K12k21J07Q9o3j25R7p0R3O8l7j13J79k35K92J2k34p4K12
$$ 357 14 238 -131 -148 64 -157 -50 39 -24 -149 -52 -122 -29 39 2 -111 68 -167 125 137 -97 -171 41
6439D1qk10pJ23q7o8L08k38O4O5J54j97J69j17R1k50L54Q8k13N3k59j71K46R3
$$ 41 33 -177 -184 -61 -148 -216 92 -146 -82 -17 137 -60 109 -8 83 -167 187 275 62 115 -144 -315 -69 24
6463B4m6L2j99K68M7o1k77p6M27l61L80k35K85l67L24l3KP5N7l26j87P2K08j8
$$ 24 -22 10 -189 79 126 65 -212 -288 139 -222 158 -77 208 -159 165 132 134 209 266 -60 -247 -175 33 15
6487A5P0j91OJ06J19j89O5J32j07j0j91L28j95oj7N4J64j09K08j42k08J77n7K6
$$ 15 85 -106 -100 6 125 -64 1 133 26 16 -175 153 -42 -48 -65 -11 153 44 252 110 -98 79 22 48
6511D8L1m4P1j22Qj11J16K1o1J82N5l67L47l98M23P3l73K26J20m04P4K36nP8k83
$$ 48 79 35 106 -16 -8 -119 -3 18 -43 139 194 -173 174 -224 199 272 -101 125 245 -159 -85 151 146 224 -59
6536e9J62k42j05J3M21l64M3J69k30O3K8K01j45K83o64L78q2R8p3m7N2M8J0J4
$$ -59 103 -139 -244 -231 190 -174 -131 38 -192 -129 -101 100 -45 238 -426 -48 -130 -32 -105 -152 -100 -52 -42 -28
6560b8J41j41j4j01L46k87R7P0k50K32j87K27j14j46J24R3j69O0K05j55P8p9j44
$$ -28 113 -28 -42 -143 203 -84 13 83 -167 65 -122 105 -9 -155 -31 62 -107 -47 158 3 81 2 -142
6583a42j53L25N8l23J85R8j18J25k15K17m3N7J20l07Q1n1m0J47KJ54J03j89j58
$$ -142 -295 30 88 -235 -50 48 -70 55 -160 57 14 71 191 -116 -35 -86 -126 21 23 177 280 91 -67
6606f7q4L17k60K88j35l18L63L8j14r0l9J94j25l38L07L2l17L84l30L62o6j79
$$ -67 -151 166 -94 194 59 -259 104 142 28 -62 -101 93 -32 -370 -63 -31 -348 36 -294 68 2 -177
6628a77L15l91M05k4j0j72m2K70k10j21J56R4j14j58J68m75K49J99N6j92K27N8
$$ -177 138 -253 152 128 118 -54 -96 174 -36 -157 -1 93 -21 -179 -11 -486 -237 -38 18 -174 53 111
6650A11N6j36J5r5J02N8p6m7J11k28J83J49k06J45j13J9j15Q9J71k07K6r2j2m
$$ 111 167 31 46 -49 53 111 35 -12 99 -129 54 203 -3 142 29 48 -67 22 193 -14 12 -80 -92 -96
6674i6K16K4j62L8mP0O5ql28k55L30Q6%j25J67j61K20J74l68o4N16n48N7J30P
$$ -96 120 144 -18 20 16 86 151 143 -185 -440 -110 -24 -24 -149 18 -143 77 251 -117 -181 335 -213 -156 -26 -19
6699a9K2R9k92J76J08k35J87n7j94K05K67n22K14L9R0j52K21j13k05K99j22K45
$$ -19 3 102 -190 -14 94 -141 46 -11 -205 0 267 -255 -41 -2 88 -64 157 44 -161 138 16 261
6721B61k29p4O2m5N1l4o6kq4J40P9j46J2o9kP6L53m63J64L44m62P7K52O3n95M21
$$ 261 32 -42 20 -25 26 -8 -74 -76 -160 -20 59 -87 -75 -144 -146 -70 283 -180 -16 328 -134 -57 195 258 -337 84
6747H4j1rJ70l34J13P8O9q4k27K20j59J7P1n8K04p1j32n2J7K30j6O3k57j20K02
$$ 84 73 64 234 -100 13 91 160 76 -151 69 -90 -73 -2 -60 144 73 -59 -111 -94 136 120 183 -74 -194 8
6772HM5p1o1j00L00k21J03J17M3j04j80L23k16j54K35k05M6l2K1K96k15k09K43
$$ 8 53 -18 -79 -179 121 -100 3 120 163 59 -121 202 -14 -168 67 -138 -92 -124 -103 193 -22 -231 12
6795A2J8j62O0Q6j18j79L53j43j28L58j39J4K09o8p7J66k60r5j50L48j7l06M39
$$ 12 30 -132 -72 14 -104 -283 70 -73 -201 157 18 32 241 173 96 262 2 -93 -243 105 88 -218 221
6818B21j45Q2r0O4K6L0j63k80K90NK1K50l95K53j9j00k3J17M0j32o6J8p9L18k88
$$ 221 76 158 68 132 158 188 25 -255 35 40 61 311 -84 169 150 50 27 144 184 52 -14 4 -75 243 -45
6843d5o0K17j88J22j2K23P6l60M3J86k61j7O4k2L64l67l4LM2K2J3j17K17P9k33
$$ -45 -105 112 -76 46 34 257 333 -27 16 202 -59 -76 -12 -34 330 -37 -71 -68 -26 -4 9 -108 109 188 -45
6868d5J89j44Jj8J85k43ML34k05K71n45M73j62O6k93o1L86qj18m14K76J32q7L4
$$ -45 144 0 1 -17 168 -75 -71 263 58 329 -216 257 95 161 -132 -193 193 185 67 -347 -71 61 -26 8
6892Hj94J08M8R6r6k23L3K48j15M6K26j56k58L4J24J00L8j8j23j22K80N2mk43
$$ 8 -186 -78 -30 66 -30 -253 -220 28 -87 -41 185 29 -229 -195 -71 29 67 49 -74 -196 84 136 132 -111
6916a11RK00k12K05K08n2k39j66J87J0J91j34j90J27k18M8K68l06J09K14M1n12
$$ -111 -102 98 -114 91 299 247 8 -158 29 39 230 96 -94 33 -185 -137 131 -175 -66 148 189 -323
6938c23M51j10j0K5j83K52Oj50p4R5J50q7j13M6j09j38M53l82N0J0J8q9J11P1
$$ -323 128 18 8 33 -150 102 108 -42 -116 -21 129 42 -71 -25 -134 -272 181 -201 -151 -141 -123 -212 -101 -30
6962c0j31L08l62R0N9Q1q1q8L08j12l36J52J02J53j78M44k23m00L70p0o8m0K77
$$ -30 -161 147 -215 -125 -66 15 -66 -154 154 42 -294 -142 -40 113 -65 379 156 -244 126 56 -12 -52 225
6985B25k97r7J78oP7n2N6K69l90J35j56L2pp2L00p3j21j58n8J96r1JJ4L5kK8j34
$$ 225 -72 -169 9 3 80 28 84 353 -37 98 -58 -26 -33 -105 195 122 1 -157 -215 -19 -110 -109 -95 -60 -62 -34 -168
7012a68N5J95K79l34j25L27o8K4k06j00J30M8n7J4K5K0n3j6J11P2j96M4n3N0k7
$$ -168 -113 82 361 27 -98 229 161 185 -21 -121 9 57 0 14 39 59 6 -10 101 173 -23 21 -32 18 -9
7037iJ2Q2k13j05l4R2L24l26M87m71j1J55O7Pl07K24L0j17M20k42j91J98k25O2
$$ -9 3 85 -128 -233 -267 -175 149 -177 310 -161 -172 -17 50 57 -250 -26 4 -113 307 65 -126 72 -153 -91
7061i1L71m93M20j68m76M24pk1N4q5J48J17k63R3K0Q6k85K81j52k8j7Q3k44L61
$$ -91 280 -213 207 39 -437 -13 -20 -41 13 -72 76 193 -70 23 43 129 -156 125 -27 -55 -72 11 -233 128
7085A28k67M78l04q2M1m1Q0J89k33K4j94M29k23Pk46K66L4k21J01m8j35J58K01
$$ 128 -139 339 35 -47 -6 -47 33 222 -11 13 -181 248 25 32 -214 52 86 -135 -34 -82 -217 -59 142
7108A42r0k0j56J10j30L5J66j23K20j93k2L8K37k98J79j88p7J96q0R7j68J48Q6
$$ 142 52 32 -124 -14 -144 -109 57 -66 154 -39 -61 -23 214 -84 95 -93 -170 26 -54 43 -125 23 109
7131A09m19L91k83K89M4k71J31j24K13j11K39n2k29J48p9J14J52l01r9J64k04
$$ 109 -310 81 -202 87 131 -140 -9 -133 80 -31 208 156 -73 75 -4 110 262 -39 -138 26 -178
7152a78M76l95k7q8K17k02M70n15K00j14L53j76q6J71%J7j34O2j99J04j49Q4K7
$$ -178 298 -97 -124 -212 5 -197 273 -242 -42 -156 197 21 -65 106 106 123 -11 51 -148 -44 -193 -109 -82
7175h2p3K31k26o4J91%p1R4J32nk66p5L86j31L7P7m2l48K70k23K04J21k9k05r5
$$ -82 -155 76 -150 -214 -23 -23 -94 0 132 127 -139 -214 172 41 78 155 113 -235 35 -188 16 137 108 -97 -192
7200a92M84k25k5k31M20m72L56M9m67L54P0nr2l35M37j25n6J87k40J76k13o1M52
$$ -192 292 67 42 -189 231 -241 115 164 -303 51 121 116 24 -311 126 1 -55 132 -108 68 -145 -206 246
7223B46l10K44j57r9J25j44K37k18j46K54l79L14r3P7m0j58K60mK6J50j52q1K92
$$ 246 -64 180 23 -76 49 -95 142 -76 -222 32 -347 -33 -126 -49 -89 -247 13 9 35 185 33 -48 244
7246B44n43K35l6J40l44L27j26K51m13M17j41O3k23K93l04K74L7K9l50J23R8L7
$$ 244 -299 -64 -100 40 -304 23 -103 148 -265 152 11 74 -149 144 -160 114 151 180 -170 -47 51 88
7268H8R6j74m3M9J51j70j83J98j4K14r3j5l1R9K45l86l34L86L07m92J52j41J39
$$ 88 184 10 -33 16 167 -3 -186 12 -2 212 119 104 73 172 417 31 -303 83 390 -102 50 -91 48
7291D8j44P7r0J13RK09j06j74M6P7J10k25k35J82Q6K12k81p6J14qJ00j72P2J31
$$ 48 -96 -19 -109 4 13 222 116 -58 -12 65 175 -50 -285 -103 -17 195 -86 -162 -48 -56 44 -128 -56 75
7315G5j66j2K02k04J4K93k27r1N9J10j56l7N18m64J48J85r9O2R1l31k3M3k6K8
$$ 75 -91 -103 99 -105 -91 202 -25 -116 -57 53 -103 -140 378 -86 62 247 148 210 301 -30 -53 -10 -36 -8
7339hL7nj74J33N2M5q4J17k34M91l87%j18K79l29J38K31m10J71K57j96r6L20K3
$$ -8 29 24 -150 -17 35 80 -4 113 -121 370 -17 -17 -135 144 -185 -47 184 -226 -55 202 6 -90 230 253
7363B53k6m00K79j48K9o4J28jJ3M3N8m7l0p1J86k92j43j3K36o1o2J31j23K04p
$$ 253 227 -173 106 -42 -13 -77 51 50 63 106 164 117 87 16 202 -90 -233 -246 -10 -71 -133 -2 -125 79 72
7388G2j55p4J35K26m11K18MM5j13r4j7J72J92k05J04k24K11k85K80l52k3M25l54
$$ 72 -83 -157 -22 204 -207 11 15 60 -53 -147 -164 8 200 -5 99 -125 86 -199 81 -271 -294 131 -223
7411b23L89jk48P3R8k1j33J80k35n9J8J65k10J12O9Q9j1k3J5m2r1K04l8j90J01
$$ -223 166 165 -83 -10 88 67 -66 114 -121 -180 -162 3 -207 -95 -26 63 52 29 44 2 -89 115 77 -113 -12
7436a2J20k93M53m22J35J15Rj3K1j68K20j06j30j22p8K85r5K7q8J75k20L02J9
$$ -12 108 -185 268 -154 -19 96 105 92 113 -55 165 59 -71 -193 -271 14 -81 -54 -142 33 -187 115 134
7459A34j19R5n3j39L12m23L22k28M9p5M25j68P9k03J97k40j87J12K64l3p3j4K49
$$ 134 15 110 57 -82 230 -193 129 -99 -50 -125 300 132 211 8 205 -35 -222 -110 154 121 48 34 283
7482B83j97J81l41k33L06o5K22J2jj54j21P8J65l43L12L1K22k81j69J03O4l88
$$ 283 86 267 -74 -307 -1 -66 156 168 167 13 -108 -30 135 -208 104 135 357 76 -93 10 74 -314
7504c14L77J14j52k84L63K6k52J60P0k78j0J10r9j9L35j70N1q7P1J81k44J30k28
$$ -314 63 177 25 -259 104 130 -122 38 108 -170 -180 -70 -169 -188 147 -23 28 -59 12 193 -51 79 -149
7527a49O4J24L0l3J2J52j65k27K70o8j45L01k17J44k09l2K35j77k37M36j73n1
$$ -149 -85 39 69 36 48 200 35 -192 78 10 -135 166 -51 93 -116 -148 87 -90 -327 109 -64 -115
7549a15k08L25r2N5Q3J01l82N45k33p7O8j25K09j83M8J34j73p1Q2j41L10kj95
$$ -115 -323 2 -90 -35 48 149 -233 312 79 2 70 -55 154 -29 19 153 -20 -91 -9 -150 160 158 -37
7572c7k0J33r9O7j92J72j54k7K47j14J59j62R8j20j78J36j01M36j30L5j9K24j93
$$ -37 -57 76 -23 44 -148 24 -130 -157 90 -24 135 -27 71 -49 -227 -91 -192 244 114 149 130 354 161
7595A61J00k50Mlr9L40l71o1J6K33O8k60J58l9j11J46N1J20j86o3J64j46K34q5
$$ 161 261 11 15 12 -87 253 -118 -179 -163 70 138 -122 36 -3 -114 32 83 203 17 -46 118 -28 206 121
7619A21R1l68J14o8K05N2p8q9K68j80j70L24k14J60k47J37J41k17nJ21O3l40L03
$$ 121 212 -156 -42 -110 95 147 69 -20 248 68 -102 222 8 168 -79 58 199 -18 -23 98 161 -179 124
7642A24j9k30J63J4J8k79K47p7L9J4J59k15N9J66m56N02k99K68l67L60k29j30
$$ 124 105 -125 38 52 70 -209 38 -39 0 14 173 -42 17 183 -273 229 -70 198 -169 191 -38 -168
7664a68K21m0J3k2L1q6l13L18o4J5J67L2M6k87p8J51q4Q4n1J53j28k16K74J72
$$ -168 53 13 26 4 35 -51 -364 -46 -110 -95 72 104 150 -137 -215 -64 -148 -64 -115 38 -90 -306 -32 140
7688A40j73o1K32m4J78l65J06L77m16Q5j3n4m7J14J30m31J67Q3j90O9J14K01m27
$$ 140 -33 -94 138 94 272 -93 13 390 -26 59 46 -8 -55 59 189 -242 -75 8 -182 -113 1 202 -225
7711b25J52n8L46j96k42L96k79R1K93l07O4J43m2j4n1o3K3N2k4J68k09j07K54
$$ -225 -73 -131 215 19 -223 173 -106 -15 278 -29 35 178 136 122 71 8 31 83 59 227 18 -89 165
7734A65j16j75L97k90m4J25j39j0j11j55L58ML6j82J35j32L56M2k60j95J99j70
$$ 165 49 -126 271 -19 -63 62 -77 -87 -198 -353 5 9 45 -137 -2 -134 222 264 4 -191 8 -162
7756a62L47k58K93k31Jk4J72j6M6j42J02l5j90K96n3k52L85m32J36O5J9qn3o3
$$ -162 185 -73 220 -11 -10 -34 138 122 168 26 128 93 -97 199 146 -106 279 -153 -17 48 67 59 6 -57
7780e7J40j12K6n1K45k3q8k38J82q0m0J94J72l24k4K02K15l48kj61K02n1P4j4
$$ -57 83 -29 -3 -54 191 168 80 -158 24 -56 -96 98 270 -54 -78 124 339 -9 -11 -172 30 -21 53 39
7804C9Q2j92K46j99r2N7J03j24K27k91j09K29k67K91j18L68k34J3k16N22m06R9
$$ 39 121 -71 175 -24 -116 -59 44 -80 147 -144 -253 -24 -291 0 -118 250 16 29 -187 335 -71 28
7826B8R2k10L0Q9p1J31j09j97K96J41m4l05J20j1n3m9M34k74k4k01L88n8k05K01
$$ 28 120 -90 -60 29 -42 89 -20 -217 79 220 176 -129 -9 -20 -73 -122 312 38 14 -187 201 143 -62 139
7850A39k15J63k76K31J4Q8j84j45K86r7J50j24p4J26J48j94j37L69j17M1j41j15
$$ 139 -76 87 -189 42 56 144 -40 -185 101 4 154 30 -44 82 230 36 -101 268 151 192 51 -64
7872f4j4L67k67k32L42J2j5J04q8k25L09m24J44L04m00J40R0O8m8j00J01j31o
$$ -64 -78 289 22 -210 132 144 129 233 145 -80 229 -195 -51 253 -147 -7 83 151 103 3 104 -27 -33
7895c3j1J28j73J30j57l6Q4M4l7O2k21J91j06N8J80j49O9R5J2m6k65K97j17k02
$$ -33 -44 84 -89 41 -116 -152 -68 -24 -61 1 -220 -29 -135 -77 103 -46 23 118 130 84 -181 116 -1 -203
7919b03J99J9Q5j1j54oM29l20j35L2m6L02m47J39J41r7K8k1J75k74J30J00p8M5
$$ -203 -4 15 100 89 -65 -71 358 38 -97 -65 -111 191 -256 -117 24 -73 -45 -66 109 -165 -35 65 -13 32
7943C2q0J04J03j07K6o3N4j48J33M3Q9j37j21J72j17o2K60k19p5J23j19j11K18
$$ 32 -48 56 159 52 78 15 69 -79 54 97 186 49 -72 100 -17 -79 181 -38 -113 10 -109 -220 -2
7966bk52M56k09k25K23ll02J05M27j77j88k0Q0K8J76j31k95K54j56J84o6J61l3
$$ -2 -254 202 -7 -232 -9 -12 -314 -209 218 41 -147 -167 -87 -59 117 -14 -309 -55 -211 -27 -93 68 35
7989C5O1o5n1p9K0M22k59K2l58K19J87k33K49j96l77K24L8m6O9Q5j55K11o2N0
$$ 35 96 31 -20 -99 -79 343 84 106 -252 -33 154 -79 170 -26 -403 -179 -141 -187 -118 -33 -188 23 -39 11
8013A1P5n9j24J06K2J75l09jJ44k08J47j32J82j13K9J11J63k59R1nl2K3J70M5
$$ 11 86 27 -97 9 31 206 -103 -104 40 -168 -21 -153 29 -84 -55 56 219 -40 51 46 14 37 207 252
8037B52o0k39R9R8k85J03r9K30r2p8L41j63j76P2R5o38Q28l37J31j79L0P2K2p9
$$ 252 192 -47 52 150 -135 -32 -131 99 7 -71 270 107 -69 3 98 -540 288 -49 82 -97 -67 5 27 -52
8061e2Lj97J85K98j99k6J20J53n01L21Pl0R3k2j84J03j44K87k93K52l60K44K50
$$ -52 -49 -246 -61 237 38 12 132 285 -216 105 112 82 175 153 -31 72 -72 215 -78 174 -186 58 308
8084C08j33J3q6k83L53j65M1Q8r6j73p0J65%J55J62n41K30k4J90k54L40k5K1o8
$$ 308 175 188 102 -181 172 7 48 136 40 -133 -203 -38 -38 117 279 -262 -32 -56 134 -120 220 195 216 148
8108A48j63J47l09L4K33R4l20J10K00qk87J87P7p2k39P6L21l56Q3K36k49K66p7
$$ 148 -15 132 -177 -143 90 184 -136 -26 174 166 -121 66 143 71 -168 -92 229 -127 -44 192 -57 209 132
8131A32j0l4J15k27k13L08l8R4K4J5k25j67L69J43l33j52K59k14N22m33J69l8
$$ 132 122 88 203 -24 -237 71 33 127 151 166 -59 -226 143 286 -47 -199 60 -154 368 -65 104 66
8153F6o0lj98J81J8L2k48J60N9R5k81nL12m22L25j60K40r2RL3Q7j68q6O6L8K00
$$ 66 6 3 -195 -14 4 36 -212 -52 7 102 -179 -184 128 -294 31 -129 111 19 28 61 148 -20 -106 -40 -2 198
8179A98k90L5J03k7p7k46N76j94q8O5j30N2
$$ 198 -92 -57 46 19 -58 -304 272 78 -10 55 -75 -23
8191b3
$$ Imaginary data points
##PAGE= N=2
##DATA TABLE= (X++(I..I)), XYDATA
0@%%%%%%%%%%Qj6J6j6K4l2L9m7N6p2Q7j00J17j36J60j89K20k55K93l35L85m40
$$ 0 0 0 0 0 0 0 0 0 0 0 8 -8 8 -8 16 -16 23 -24 32 -40 47 -53 64 -72 88 -101 119 -136 157 -178 207 -233
32b33M98n68O45p26Q16r14J023j143J273j417J574j746J934k136K358k602K868
$$ -233 265 -303 342 -384 432 -482 541 -602 671 -746 828 -918 1016 -1120 1238 -1364 1504
49A504l161L480l832M225m661N145n689O306p011P824q775R908j1280J2982j5166
$$ 1504 -1657 1823 -2009 2216 -2445 2700 -2989 3317 -3694 4130 -4645 5263 -6017 6965 -8201
64h201J8078k2182K8441l9267O3163k12063J54835M09241l23979l35750Q4879
$$ -8201 9877 -12305 16136 -23131 40032 -172031 -17196 392045 68066 -267684 -182805
75a82805L20774P566j35877n7906J476k4999J36802J19443j44617k49150Q5782
$$ -182805 137969 145535 9658 -48248 -46772 -71771 65031 184474 39857 -209293 -123511
86a23511K99940K1525l06335j04383K12090J42743r9603j14821p37M9555M3479
$$ -123511 176429 197954 -108381 -212764 -674 142069 42466 -72355 -73092 -23537 19942
97A9942N6548k9234j30207j0318J67818N6282j43537q8364R7888P8745o6542m0002
$$ 19942 76490 47256 -82951 -93269 74549 130831 -12706 -101070 -3182 75563 9021 -30981
109c0981N4632k8977p5191P2569J11492q1992j54109O1859J86173k8324j76700
$$ -30981 23651 -5326 -80517 -7948 103544 21552 -132557 -70698 115475 87151 -89549
120h9549J3381J41867j0878r6243L5570P5924q1176q9528J24280J17886j46730
$$ -89549 -76168 65699 54821 -41422 -5852 70072 -11104 -100632 23648 141534 -5196
131e196j55186J22329J78526p4880j80009K8723J48255k713q5640O649K6669k8392
$$ -5196 -160382 -38053 140473 65593 -114416 -85693 62562 59849 -25791 -19142 7527 -20865
143b0865Q874O9508q613j11556j2135J31353L5108j21277n5978Q4510O1943m9121
$$ -20865 -11991 57517 48904 -62652 -74787 56566 91674 -29603 -85581 -1071 60872 11751
155A1751m7773K6995J3476j7886K6836K1459n1961l0675N9036M6832n7451n6922
$$ 11751 -36022 -9027 4449 -13437 13399 34858 -17103 -47778 11258 58090 639 -56283
167e6283N5379N1776n6833l7763N6440K6188n9042k6731O7235L2200p2694l1392
$$ -56283 -904 50872 -5961 -43724 12716 38904 -20138 -46869 20366 52566 -20128 -51520
179e1520O8417K6159n2210j6716L9567K389m2437J6905N6995l7369p6176L9951
$$ -51520 16897 43056 -9154 -25870 13697 16086 -26351 -9446 47549 10180 -65996 -26045
191b6045R1218k2951r9593m480R6415K6551p1496l0029L3674K1038K319K393j7749
$$ -26045 65173 42222 -57371 -61851 34564 61115 -10381 -40410 -6736 14302 16621 19014 1265
204A265l6020Q557O7909J1729q6056l7618P4925N8034m6553o7379J6518N8004
$$ 1265 -34755 -26198 41711 53440 -32616 -70234 4691 62725 16172 -51207 -34689 23315
216B3315M378k5062r409j0275L988L6215J6486m2199m4741L3247O5323k1813o9409
$$ 23315 27693 2631 -6778 -17053 -13065 23150 39636 -2563 -47304 -14057 51266 29453 -39956
229c9956K825N3333J1316l3751j6124J8055N605m853J6509j73l0445l61L7823
$$ -39956 -37131 16202 27518 -6233 -22357 -4302 1303 -3550 12959 12786 -17659 -18020 19803
242A9803J2113l6819k4872L3581K7194l0341k2420J9215J2094j4164p497J4883
$$ 19803 31916 -4903 -29775 3806 31000 659 -21761 -2546 9548 -4616 -12113 2770
254B770L702k1521K609K8094m730k3965N323K1546K43j9369O74J8265q906j6093
$$ 2770 6472 -15049 -12440 15654 10924 -13041 -7718 13828 14071 -5298 -4624 13641 4735 -11358
268a1358J3204J0297j7044j3322J4245J7621j5114k0380J6526J9180j2063j1075
$$ -11358 1846 12143 -4901 -18223 -3978 13643 -1471 -21851 -5325 13855 1792 -9283
280i283Q802R904m816o011R022J742j5931M011J6524q416j9441K260J9121J780
$$ -9283 -481 9423 4607 -1404 7618 9360 -6571 -2560 13964 5548 -13893 -11633 7488 9268
294I268k3284l438K1600K753j2491k72O705L461k454K298N093r745n130J5574
$$ 9268 -14016 -17454 4146 6899 -5592 -5864 841 4302 1848 4146 9239 -506 -5636 9938
308I938M142j7623q843J1179J2646j0937j7131Q573J2829n413m718K077K029Q25
$$ 9938 14080 -3543 -12386 -1207 11439 502 -16629 -8056 4773 -640 -5358 -3281 -1252 -427
322d27K149N729k562j0730O769J2926p040j2793Q92J0552K032j2856m718J0020
$$ -427 1722 7451 4889 -5841 928 13854 6814 -5979 -5087 5465 7497 -5359 -10077 -57
336e7M41n124J464R43l23O29L234M118o152l284J0581L094r200l390M800N228
$$ -57 384 -4740 -3276 -2333 -2656 -2027 1207 5325 -827 -4111 6470 9564 364 -3026 1774 7002
352G002m980q230M086M066m473l83Q18j689Q58J722L622r67o350L885Q275l142
$$ 7002 2022 -6208 -2122 1944 -2529 -2912 -2094 -3783 -2925 -1203 2419 1452 -4898 -1013 7262 4120
368D120n222k53L488L390n031k525K720k817M4M576k178m485j311M698O382m446
$$ 4120 -1102 -1355 2133 5523 492 -2033 687 -2130 -2086 2490 312 -4173 -5484 -786 5596 1150
384A150p268L970N501J189j340n436n92M457K099L60n550o344N446P598j377o050
$$ 1150 -6118 -2148 3353 4542 3202 -2234 -2826 1631 3730 4090 -1460 -7804 -2358 5240 3863 -2187
400b187n852M035J0314l17p206n573J687J1066M379r965q972K571J1364N529j1854
$$ -2187 -8039 -4004 6310 5993 -1213 -6786 -5099 5967 10346 381 -8591 -6020 5344 10873 -981
415i81r608N756Q037L897n269q848O06P093P408l19j2504o469J1657J1938l907
$$ -981 -10589 -4833 3204 7101 1832 -7016 -6410 683 8091 7772 -4732 -11201 456 12394 8487
430H487j5428o651J4327J2015q659j2802j365R458Q858l859p735k788J751R623
$$ 8487 -6941 -13592 735 12750 4091 -8711 -10076 -618 8240 4381 -3354 -6142 -4391 5232
444E232O341q689j1317M92J3275R879j2046j7354L739J6693O463j2291j5181N819
$$ 5232 11573 2884 -8433 -7941 5334 15213 3167 -14187 -10448 6245 12708 417 -14764 -8945
458h945J4896K102p112p168k11P782N546O64n451j0412J696J5333N443j3325j6106
$$ -8945 5951 8053 941 -6227 -6438 1344 6890 7554 2103 -8309 -6613 8720 14163 838 -15268
473a5268M451K1680K839k0054j0039J1378J3823j898j1480j570N209J829M396
$$ -15268 -10817 10863 13702 -6352 -16391 -5013 8810 6912 -4568 -6138 -929 900 5296
486E296L734p999r751L268J6837M862k1329j4546J5836J9302o247k1908m687J8755
$$ 5296 9030 1031 -8720 -5452 11385 16247 -5082 -19628 -3792 15510 9263 -12645 -17332 1423
500A423J0390r627q613O45N245N483J811q70q090o879J0199J4180o316j9017o414
$$ 1423 11813 2186 -6427 -5782 -537 4946 6757 5887 -2203 -9082 1117 15297 8981 -10036 -16450
515a6450J7848J6214j3738k1533L190J9880P881j3056j2985P108J1831j84k583
$$ -16450 1398 17612 3874 -17659 -14469 5411 13292 236 -12749 -5641 6190 6006 3423
528C423j782l726j938N929J0559m476j9845k859K1329J0251j7224j9609Q765K2939
$$ 3423 1641 -2085 -4023 1906 12465 7989 -11856 -14715 6614 16865 -359 -19968 -11203 11736
542A1736j152j7951l248J0023O174k098r15P24n816l532J2053Q796j3498j6341
$$ 11736 10584 -7367 -10615 -592 5582 3484 2569 3293 -2523 -6055 5998 14794 1296 -15045
556a5045O139K0939K253k2651j0284J5921J4463n406j3983l220J0983O767j506
$$ -15045 -8906 12033 14286 -8365 -18649 -2728 11735 6329 -7654 -10874 109 6876 5370
569E370l805n169p38O852P015j834j2337p443J2077J3517o846j8093m025J6880
$$ 5370 1565 -3604 -4342 2510 9525 7691 -4646 -12089 -12 13505 6659 -11434 -15459 1421
583A421J3578j2295j6633M279J5456N185r708q124M295N628P26J427l602p251
$$ 1421 14999 2704 -13929 -9650 5806 10991 1283 -6841 -2546 3082 3808 5235 1633 -5618
597e618j75R560O670j0007j4130O582J6518j169j4042n100J0644R323o233p257
$$ -5618 -5793 3767 10437 430 -13700 -7118 9400 8231 -5811 -10911 -267 9056 2823 -4434
611d434K917L182j76K72N70j326m470N96P604m02p676k723N396N080j892p053
$$ -4434 -1517 1665 1489 1761 2331 1005 -3465 -2869 4735 4333 -3343 -6066 -670 4410 2518 -4535
627d535M21N409J245j183k183n88K007N15k17R74k359k031J674K139J734l671
$$ -4535 -4114 1295 2540 1357 -826 -1414 593 1108 891 1865 -494 -2525 -851 1288 3022 -649
643f49m424L376O187j417n250k384M965M970l929m164J085K166J150o11j303r31
$$ -649 -5073 -1697 4490 3073 -2177 -4561 404 5374 1445 -2719 -1634 532 1682 1071 -232 -1163
659a163j246J604M310k269n095P24M968K299l521m528K857M331r90k419j092Q81
$$ -1163 -2409 -805 3505 1236 -3859 -3135 1833 4132 611 -3917 -1060 3271 2281 -138 -1230 -349
675c49J378q96k0l51j829R74J832p30o00p89N37K657o33j229M48P6N40O95j014
$$ -349 1029 133 113 -238 -2067 -1093 739 9 -591 -1380 -843 1814 1181 -48 400 476 1016 1711 697
694F97p81r5m20J079m50j418K96m87O63J433p56q29M7J494J763p64k743J566J699
$$ 697 -84 -179 -599 480 30 -1388 -1092 -1579 -916 517 -239 -1068 -1021 473 2236 1472 -1271 295 1994
713A994L77j021k683L37K187l68j352j462j029K587J371j562j474l5K363K459
$$ 1994 2371 1350 -1333 -996 1191 823 -529 -1991 -3020 -433 938 -624 -2098 -2133 230 2689
729B689k185j511J309J268J258j460k250O00J764m14j108k086j17K201j51r53
$$ 2689 504 -1007 302 1570 2828 1368 -882 -282 1482 1068 -40 -2126 -2243 -42 -193 -1146
745a146o42m08K430R66j142o19J048R62J184j706j040J022L5M5q56j921Q25P47
$$ -1146 -1788 -2196 234 1200 58 -561 487 1449 2633 927 -113 909 944 989 133 -1788 -963 -216
763b16m73m13n13J93J216J41n21M46K74J458K72j382K75L55p2j05j161m16P93
$$ -216 -689 -1102 -1615 -1422 -206 -65 -586 -140 134 1592 1864 482 757 1112 1040 935 -226 -642 151
782A51p36m50j41p14J195L18o39N36L67N3J217p93j75J224m33J39p3j279O58j77
$$ 151 -585 -1035 -1176 -1890 -695 -377 -1016 -480 -113 -60 1157 364 189 1413 980 1119 1046 -233 425 248
802B48p16M1m50k84Q55q88k6J052n70P68N01j62L46k61J11J010o41q90N98j71
$$ 248 -468 -427 -877 -1161 -306 -1194 -1220 -168 -738 30 531 369 715 454 565 1575 934 44 642 471
822D71l21j14p78M9J2m17J017j90p65R54L4L35M93j035L86J193p44q3k02n32P09
$$ 471 150 36 -742 -693 -681 -1098 -81 -271 -1036 -82 -48 287 780 -255 131 1324 580 497 295 -237 472
843D72l34m15n3p04O26J091j375o11R02L84J115r43q39R62K43j08K48q83k82O36
$$ 472 138 -277 -330 -1034 -408 683 -692 -1303 -401 -17 1098 155 -684 278 521 413 661 -222 -504 132
863A32M59J46j188j245J723R82j649l46P1Q71R74m73o57K94n63J127P06j754n73
$$ 132 591 737 -451 -1696 27 1009 -640 -986 -915 -44 930 457 -200 94 -469 658 1364 -390 -963
882i63Q34R02q9j816Q9J712m69m73R15o86j59L10O22N82j695j001K359O60j713
$$ -963 -129 773 684 -1132 -1043 669 200 -273 642 -44 -203 107 729 1311 -384 -1385 974 1634 -79
901g9j270M57J768m08k056J176M49p37M92J160r9j133p00K120J533k745j030J066
$$ -79 -1349 -892 876 468 -1588 -412 37 -700 -208 952 853 -280 -980 1140 2673 -72 -1102 -36
919c6J514l87k129l31J360k25j47M3p74J93J237p2J30l01o51J238N94k79K63j790
$$ -36 1478 1091 -1038 -1369 -9 -234 -381 -338 -1112 -919 318 246 376 75 -576 662 1256 977 1240 -550
939e50k06K147M72k596j677J270K761j672k802J355K595p55j499P53J983p32k309
$$ -550 -756 1391 1863 -733 -2410 -1140 1621 -51 -2853 -1498 1097 342 -1157 -404 1579 847 -1462
956a462K333K578l296k216J933L215j828m616J004M399q99l904L39K576O00k022
$$ -1462 871 3449 153 -2063 -130 3085 1257 -3359 -2355 2044 1145 -2759 -2420 156 756 -1266
972a266K41K611o45k478J722K307n17k682k62K562N42k880j315J257J355k72j619
$$ -1266 -1025 1586 941 -1537 185 2492 1975 -707 -969 1593 2135 -745 -2060 -803 552 280 -1339
989a339r14J824Q65l21r21J58J516Kj239J252J217k136q83J420K132j625m364
$$ -1339 -2253 -429 436 115 -806 -648 868 870 -369 883 2100 -36 -919 501 2633 1008 -3356
1006c356J629M188j346m739M12M353Q96m285m18M702J99l699N84L824n21l931
$$ -3356 -1727 2461 1115 -3624 -3212 1141 2037 -2248 -2666 2036 2235 -1464 -880 2944 2423 -1508
1022a508n64N110j35n316m86M081Q13l757j650L379J954l187j012L192M1j458
$$ -1508 -2072 3038 2903 -2413 -2899 1182 1995 -1762 -3412 -33 1921 -1266 -2278 914 955 -503
1038e03k44J703J156j992j189K334L66j243r93k30J153N36j579p61K50J394O69
$$ -503 -747 956 2112 120 -1069 1265 1631 388 -605 -835 318 854 -725 -1486 -1236 158 827
1055H27j421j028K113Q67j465n88J341R34j969r77K949M40l717n04L172J004k840
$$ 827 -594 -1622 491 1358 -107 -695 646 1580 -389 -1366 1583 2023 -1694 -2198 974 1978 -862
1072h62k856L884K574l529j875K869J688j996j584K135K056l482q86L164J053
$$ -862 -3718 166 2740 -789 -2664 205 1893 -103 -1687 448 2504 -978 -1864 1300 2353
1087B353l288j003K335J846k973j831K642J399k061o63J167J082p63q54J797m46
$$ 2353 -935 -1938 397 2243 -730 -2561 81 1480 -581 -1244 -77 1005 242 -612 1185 739
1103G39j906P82J212m58r01q0P04J56r94R90L95j510M73J609m44j719L71J906
$$ 739 -1167 -385 827 369 -532 -612 92 248 -746 244 639 -871 -398 1211 767 -952 -581 1325
1121A325J03k735M28K096o23j924J130Q43m18j887Q77K456j638j783J722J929
$$ 1325 1428 -1307 -879 1217 594 -1330 -200 643 225 -1662 -785 1671 33 -1750 -28 1901
1137A901j405j639R94K086j148k155J552J139j804r81J576P38j246j611K200J201
$$ 1901 496 -1143 -149 1937 789 -1366 186 1325 -479 -1460 116 854 -392 -2003 197 1398
1153A398k208n91J869P48j606j41J551N57k019N0J622l27j827N9J461m20j546
$$ 1398 -810 -1401 468 1216 -390 -531 1020 1577 -442 -392 1230 903 -924 -865 596 176 -1370
1170a370K4J739m08j388J070J115n47o93M11J498r34j317J406Q78j897j48R79
$$ -1370 -1346 393 -15 -1403 -333 782 235 -458 -47 1451 517 -800 606 1484 -413 -561 418
1187D18K01r29j230J311Q21j888J27J854q26p15M67J577j1j950Q55J842r57j466
$$ 418 619 -310 -1540 -229 592 -1296 -1169 685 -141 -856 -389 1188 1177 -773 82 1924 967 -499
1205d99O23P89n37j529N12J549j655j209J306J303j152r57J317J103p20j071J643
$$ -499 124 913 376 -1153 -641 908 -747 -1956 -650 653 -499 -1456 -139 964 244 -827 816
1222H16P36j699P5J095Q5j378r40J619L03k019L24J045k15q18MJ037J91j089P03
$$ 816 1552 -147 -72 1023 1108 -270 -1210 409 712 -1307 -983 62 -153 -971 -967 70 261 -828 -125
1241a25J404q11r50R33Q19n07j495P69J000j131j238J201N29j273m7P11M16p30
$$ -125 1279 468 -482 451 1270 763 -732 37 1037 -94 -1332 -131 398 -875 -922 -211 205 -525
1259e25n77J800L22j493N39R76j7j046n1Q33L3j462L73P95p18p30lJ067K17j576
$$ -525 -1102 698 1020 -473 66 1042 1025 -21 -72 761 794 -668 -295 500 -218 -948 -951 116 333 -1243
1279a243O19J420p65n30R72L78k04r15M42P04q73m18P48J43r39j37N85J34n19
$$ -1243 -624 796 31 -499 473 851 647 -268 174 878 5 -413 335 478 -461 -598 -13 121 -398
1298c98l80R12M27j039K52Q80j18o20k89R60J05j020J77N85k75l45K50k61J8j51
$$ -398 -778 134 561 -478 -226 654 536 -84 -373 587 692 -328 -151 434 159 -186 64 -197 -179 -330
1318c30L62K44l62m12P70k85K36k10J06L83m98j8J46K4p50M56L13k05o55K53Q61
$$ -330 32 276 -86 -498 272 -13 223 13 119 502 4 -14 132 156 -594 -138 175 -30 -685 -432 429
1339D29j1j008N29L83j06k74l39N29L18o74k1O95o37m09L76k1J25j21j56P83j34
$$ 429 418 -590 -61 322 216 -58 -397 132 450 -224 -245 450 -187 -596 -220 -241 -116 -237 -393 390 256
1360B56j73L44m66J00J07O8n8k05j45P88m99n28M23l01j3M56o66N70m1l26P78
$$ 256 83 427 -39 61 168 236 178 -27 -172 616 117 -411 12 -289 -302 154 -512 58 17 -309 469
1381D69l43j80M07l79P12k20m66j14J66j43n7k14p7L40j55p1K54j8j80L52Q5L97
$$ 469 126 -54 353 -26 686 466 0 -114 52 -91 -148 -362 -439 -99 -254 -325 -71 -89 -269 83 168 565
1403E65j62m52N13M69p76R0m51L58R3n45l96K92M3k42J86J07K83j13k6O83J45
$$ 565 403 -49 464 933 157 247 -204 154 247 -298 -694 -402 -359 -601 -415 -308 -25 -138 -164 519 664
1424F64l29q7N5L19q7p52J87N92m74m73QQL67l76k49M71J01mk07L78L63m12p0
$$ 664 335 248 303 622 535 -217 -30 562 88 -385 -377 -369 -2 -378 -627 -156 -55 -59 -266 112 475 63 -7
1447gP20K62o33n66J93P40l30j322l0J119k26m86j85O64N87q46j05R00K89p23
$$ -7 713 975 342 -224 -31 709 379 -943 -973 146 -80 -566 -751 -87 500 -346 -451 449 738 15
1467A5kO88L82q19q47R06M38o55q67O17K98m17p08P23M89l32m09L16Q21J71j085
$$ 15 13 701 1083 264 -583 323 761 106 -761 -144 154 -263 -971 -248 241 -91 -500 -184 637 808 -277
1488b77L25J183p14m95m3j17O53n00o70K53Q20q73k78L73M12L53j064L93P96j41
$$ -277 48 1231 517 22 -21 -138 515 15 -655 -402 418 -455 -733 -360 52 405 -659 -266 530 389
1508C89p13L33M18N31j177m16J309k1j092n32O59J054j004p58P81J032r94j13
$$ 389 -324 9 427 958 -219 -635 674 653 -439 -971 -312 742 -262 -1020 -239 793 -201 -314
1526c14L22L86q5n44K95Q66q17q55O86M99k00q88o9J226j64j003J98L66K93j99
$$ -314 8 394 309 -235 60 926 109 -746 -60 439 239 -649 -718 508 344 -659 -461 -95 198 -1
1546am70O56J10l95P0N09k51k11j72m2L78l07k46o5M08J27k71k85M63M39k14l13
$$ -1 -471 185 295 -100 -30 479 228 17 -155 -197 181 -126 -372 -437 -29 98 -173 -458 5 444 230 -83
1568h3J21N27j70j018M70Q08p13n76N18L40j32n94j34J098m22n52M45M10M30j164
$$ -83 38 565 395 -623 -153 655 -58 -634 -116 224 92 -502 -636 462 40 -512 -67 343 773 -391
1588c91k47J174N7j085N25K36q1l54k36R87n72m70K23L99P4m32M9M79J51o04K08
$$ -391 -638 536 593 -492 33 269 188 -166 -402 585 13 -457 -234 165 239 -193 -144 335 486 -118 90
1609I0O56r34M7J70M0L57o73J54R9k64j63L96j23o8K48J10l0k9q6O69k82n06L82
$$ 90 746 -188 -141 29 69 426 -247 -93 6 -258 -421 -25 -148 -216 32 142 112 83 -3 666 384 -122 260
1632B60K15m58j93L34J25o09n49O01L69p12J37P75Jm90k82J003K52q26k58O90
$$ 260 475 17 -176 158 283 -326 -875 -274 95 -617 -480 295 296 -194 -476 527 779 -47 -305 385
1652C85N9m07j33M97l7r30M1O98k88n18L22L44M74p33Q5N55j25l43L57K61m03
$$ 385 444 37 -96 401 364 -566 -525 173 -115 -633 -311 33 507 -226 -141 414 289 -54 303 564 161
1673A61K1j25M06j61q38J62M26m99J00J85Kj76Q5J09L05o10O11N24l59k07%L13
$$ 161 182 57 463 302 -536 -374 52 -447 -347 -162 -160 -336 -251 -142 163 -447 164 688 329 122 122 435
1695D35k1o64L8M45k23q53O86M8R2n32K23P20m44m03P46K32m26r1N47M5n92k01
$$ 435 414 -250 -212 233 10 -843 -157 -109 -17 -549 -326 394 -50 -453 293 525 99 8 555 600 8 -193
1717a93L37K94j083N74j25J63k52j34N07J8m81Q8P04q0l23J86K65r2n02J01O56
$$ -193 144 438 -645 -71 -196 -33 -285 -419 88 106 -375 -287 417 337 14 200 465 373 -129 -28 628
1738F28l16p58M30J20m41J3M2N25j75p64N17K83k18J47K00j50j60p3M10J13o36
$$ 628 312 -446 -16 104 -337 -324 -282 243 68 -696 -179 104 -114 33 233 83 -77 -150 260 373 -263
1759b63K53L80qo41j10K37L33n32n3N41J3l32L64L2K60p11L30L83m32l41N58K3
$$ -263 -10 370 362 -279 -389 -152 181 -351 -404 137 150 -182 182 214 474 -237 93 476 44 -297 261 284
1781B84l54j91J67K43l10j03N07M2n87M2N25J59m19k90O39K01r27J93L06Pp9l55
$$ 284 -70 -261 -94 149 -161 -264 243 285 -302 -260 265 424 5 -285 354 555 -372 -179 127 134 55 -300
1803c00K42K57m51j71O05k36p0J15K84j57k44o4N75l52j81M98n87R4P8o1k6L6
$$ -300 -58 199 -252 -423 182 -54 -124 -9 275 118 -126 -190 385 33 -148 350 -237 -143 -65 -126 -152 -116
1825a16j99M21K87n83J67L93j62l12K06K36M6o55J71L10k75l21J28L26k3n35L34
$$ -116 -315 106 393 -190 -23 370 208 -104 102 338 384 -271 -100 210 -65 -386 -258 68 45 -490 -156
1846a56M09k88p1%L17n7j62J09O36p08j53N71l49j90j90M90L9k80n83O73k44k05
$$ -156 253 -35 -106 -106 211 154 -8 101 737 29 -124 447 98 -92 -282 208 247 -33 -616 57 -187 -392
1868c92J11M69J25j52k05L76K97q40M02L74p82J21J44j33J30o35K94K77l71o3
$$ -392 -281 188 313 161 -44 332 629 -211 191 565 -217 -96 48 -85 45 -590 -296 -19 -390 -453
1888d53M72J06j34j0J98L94o26o6O84k75j54m2k33L88m16n64P31k45j82k86N38
$$ -453 19 125 -9 -19 179 573 -53 -119 565 290 136 94 -139 249 -167 -731 0 -245 -427 -713 -175
1909a75L30n1j27K27M60m16R2j84j19N6J74m85K25l51J13Kj43j25L54n43M00K22
$$ -175 155 104 -23 204 664 248 340 156 37 93 267 -218 7 -344 -231 -229 -372 -497 -143 -686 -286 -64
1931f4J61p0j94L56L90o2n47K52K8k07j77L6K90q8r61N58J75k10N6q1K90L66n92
$$ -64 97 27 -167 189 579 517 -30 222 250 43 -134 -98 192 104 -857 -299 -124 -334 -278 -359 -69 297 -295
1954b95J24O89k90j70J9K73K40o92k72M59m8M3m14J61J14j42k60L43K72Q5j95
$$ -295 -171 518 228 58 77 350 590 -102 -374 85 37 80 -334 -173 -59 -201 -461 -118 154 239 44
1975D4l83N79K97m91l52M38N4k85R6J21J43m72k84L24J88j64k37L48Q1j27k20
$$ 44 -339 240 537 46 -306 132 186 -99 -3 118 261 -211 -495 -171 17 -147 -384 -36 45 -82 -302
1996c02K73M79j62l69J08L54j06m59k92Q96m28k55l0J83K09j93o3Q0J87j20j7
$$ -302 -29 450 288 -81 27 381 275 -184 -476 420 -8 -263 -293 -110 99 -94 -157 -77 110 -10 -27
2017b7j31K87L13p27M36O5j56l60R0M04R6n67M7O06j27m22j5M22K00p74k08P94
$$ -27 -158 129 442 -285 151 216 60 -300 -210 194 290 -277 -230 376 249 -173 -188 234 434 -340 -548 246
2039B46K0n45K12M02j64k99k26M31k9m73M85p8J47p1l64L77K57m35K4L00q2o6
$$ 246 266 -279 -67 335 171 -128 -354 77 48 -425 60 -18 129 58 -306 71 328 -107 -83 217 135 69
2061F9m1OM1J05j80L2k35K70q0J51k79K25p2P1j12K8M33m97k67N54P4m01l32M01
$$ 69 28 34 75 180 0 32 -203 67 -13 138 -141 84 12 83 -29 -1 432 -65 -332 222 296 -105 -437 -36
2085c6J81m82p9L52M14p95M61j4J72nm03M58L04o72J98L65j02J95p50L18K93n34
$$ -36 145 -337 -416 -64 350 -445 16 2 174 169 -234 224 528 -144 54 419 317 512 -238 80 373 -161
2107a61n67O90n0j14r4J15M37o9P3pp6P4o8M3J04k9l29J14j29p1q7Q3j53Q5p2
$$ -161 -728 -38 -88 -202 -296 -181 256 187 260 253 177 251 183 226 330 301 -28 86 -43 -114 -201 -118 -271 -186 -258
2132b58O0q9o6P19j34m13L02O50m30K61m96J24j9m61K09J09k64k90L14K75ql34
$$ -258 -198 -287 -353 366 232 -181 121 771 341 602 106 230 211 -250 -41 68 -196 -486 -172 103 95 -239
2154b39K93L25l59r6J96L04r1p4p9J67j69k39R5J29m02Q3Q6l25K90k62j18N44
$$ -239 54 379 20 -76 120 424 333 259 180 347 178 -61 34 163 -239 -156 -70 -395 -105 -367 -485 59
2176E9j44q2M19j33j75J27J37J26j99L8L96m70m44M25k77Pk44J87J77l88k0N49
$$ 59 -85 -167 252 119 -56 71 208 334 135 173 569 99 -345 80 -197 -190 -434 -247 -70 -458 -478 71
2198G1P2m19M17R9R0l52j54K07O05j038K30J56j62j83j89L45M61o22L11K50j13
$$ 71 143 -276 141 240 330 -22 -176 31 636 -402 -172 -16 -178 -361 -550 -205 256 -366 -55 195 82
2219H2M0mPM03l40ML03n47o1K16P7r5l74J50K67m83j2N10l96Q8J57Q6qO6l55P57
$$ 82 122 118 125 528 188 192 495 -52 -113 103 180 85 -289 -139 128 -355 -367 143 -253 -165 -8 78 70 136 -219 538
2245E38l15n62N82M4K7n42M7K74M2n81J13O48n04N9K1K12K47l52J30K99n19o1
$$ 538 223 -339 243 287 314 -228 -181 93 135 -446 -333 315 -189 -130 -109 103 350 -2 128 427 -92 -153
2267a53JL20j95j64jM44k97k55O34l56l35M14K1K92k40j20L47l88j03J10K03k46
$$ -153 -152 168 -27 -191 -192 252 -45 -300 334 -22 -357 57 78 370 130 10 357 -31 -134 -24 179 -67
2289f7J84j06m3J84o77L36N00l21j77M30j92P6j57J43J66l13j27K88j6n6k73Q2
$$ -67 117 11 -32 152 -525 -189 311 -10 -187 243 51 127 -30 113 279 -34 -161 127 111 55 -218 -136
2311a36K40l30q6RL12j42J00J01mo0Q5M39j45l50L45j26J9k08j45k22N96o85L78
$$ -136 104 -226 -312 -303 9 -133 -33 68 64 4 89 528 383 33 378 252 271 63 -82 -304 292 -393 -15
2334a5l6l10L63J08j05J21l70L62L50m42Q0J21k26k2L00k67j50n5j56k5K75j72
$$ -15 -51 -361 2 110 5 126 -244 118 468 26 106 227 1 -21 279 12 -138 -193 -349 -374 -99 -271
2356b71P7L81j43k3j26M64k24j32J15K35k07M9m6j68K79m70J93N4l03K01J48k47
$$ -271 -194 187 44 21 -105 359 135 3 118 353 146 195 149 -19 260 -210 -17 37 -266 -65 83 -164
2378a64j54J85oL62k58L1K29k23J13Q5r1k86K06p7L20k44n98L52L67l61k87J51
$$ -164 -318 -133 -139 223 -35 -4 225 2 115 200 109 -177 29 -48 272 28 -570 -218 149 -212 -499 -348
2400c48N78m4j83L83j02l36M41j28j56r7j68O2M47l74p8j00r2L25k81q6K61p3
$$ -348 230 186 3 386 284 -52 389 261 105 8 -160 -98 349 -25 -103 -203 -295 30 -251 -337 -76 -149
2422a49K2L15k89K48Q9k53K64K81k92l20J82p9k1j30j95J92L09l48k6j70P02j0
$$ -149 -127 188 -101 147 236 -17 247 528 236 -84 98 19 -2 -132 -327 -135 174 -174 -200 -370 332 322
2444C22p80L88O1M16l05k46L08Kq9j02J66n6j04k4j0L14n96Q3L06J9k94J20L54
$$ 322 -458 -70 -9 407 102 -144 164 166 77 -25 141 85 -19 -43 -53 261 -335 -252 54 73 -221 -101 253
2467B53j45K74j27j69J60j81K8l40N5L09l65J70l8J99j23l8J42J48l39j11K95
$$ 253 108 382 255 86 246 65 93 -247 -192 117 -248 -78 -116 83 -40 -78 64 212 -127 -238 57
2488E7J57l23K70j08J35J34n87J03K24k59J77l41J92M96l83J26R7k64k05K75K17
$$ 57 214 -109 161 53 188 322 -265 -162 62 -197 -20 -361 -169 327 -56 70 167 -97 -302 -27 190
2509A90oK08m87j6L64k10j02l06K03L18k96L23m2k98L35Q6k05K91l43o8J89P6
$$ 190 184 392 -95 -111 253 43 -59 -365 -162 156 -140 183 141 -157 178 264 59 350 7 -61 128 204
2531B04k94o8J44J50l12m52M54Q9N2j47j16K57J78l28M08M7j11p7k33K54K29n10
$$ 204 -90 -158 -14 136 -176 -628 -174 -85 -33 -180 -296 -39 139 -189 219 266 155 78 -155 99 328 -182
2553a82M2M65n48L13j01j94M21l00l39K95OP4J80M4o1K11j88J31l7j44j06k94
$$ -182 -140 325 -223 90 -11 -205 216 -84 -423 -128 -122 -48 132 176 115 326 138 269 232 88 -18 -312
2575c12j12M94j32l52L66J18R3k84k8J43J67l15k5M52K3j82q5L21k40m00J07M67
$$ -312 -424 70 -62 -414 -48 70 163 -121 -149 -6 161 -154 -179 273 296 114 29 350 110 -290 -183 284
2597B84j55n25O5M64k76j14k06N75J27o27M62rq4K43n6Nj67M0L96l06l21J35j36
$$ 284 129 -396 -331 133 -143 -257 -463 112 239 -388 74 65 -19 224 168 173 6 46 442 136 -185 -50 -186
2620a86k03r9M21J12q9K0k18M44j38J88k02J72k89J72J58l6o58J85K60N6l9k48
$$ -186 -389 -488 -67 45 -44 -24 -242 202 64 252 50 222 -67 105 263 227 -431 -246 14 70 31 -217
2642b17K56L96o89K9K44L25m83mN20j66r2k96L90jl49L0L14j36L0l43M34M3n18
$$ -217 39 435 -254 -225 19 344 -139 -143 377 211 119 -177 213 212 -137 -107 207 71 101 -242 192 235 -283
2665b83M42j35K5J9q7J39L39n60J87J22k49J4J40j40Q9k27R5J27q4j43J22l4L3
$$ -283 159 24 49 68 -19 120 459 -101 86 208 -41 -27 113 -27 62 -165 -70 57 -27 -170 -48 -82 -49
2688d9j79K33K86o60M74J47m00J07j53J09L8j89%L88J14l77r1J78k4k50N05k1
$$ -49 -228 5 291 -369 105 252 -148 -41 -194 -85 -47 -236 -236 152 266 -111 -202 -24 -48 -298 207 186
2710A86k28j38J58M5M9j04N2K20o7l58J64J14r2l13M85k79k15M0K65M2j6k05K99
$$ 186 -42 -180 -22 23 72 -32 20 240 173 -185 -21 93 1 -312 173 -106 -321 -281 -16 26 10 -195 104
2733A04r2J01L9j27J53k75L8L14k01k61K33J93n69J02J28J54J39m06K38K88m52
$$ 104 12 113 152 25 178 -97 -59 255 54 -207 26 219 -350 -248 -120 34 173 -233 5 293 -159
2754a59K83K04n80n0K19K71j11j88j73m4K00j02J00Q9J86K6k9l2o4q8K12p8j35
$$ -159 124 328 -252 -302 -83 188 77 -111 -284 -328 -128 -230 -130 -41 145 171 142 110 46 -42 170 92 -43
2777d3Jj09R4k06j85J79J75m6l06M60P0l26K15K24l4k00J05M8K48k05k32J51K12
$$ -43 -42 -151 -57 -263 -448 -269 -94 -140 -446 14 84 -242 -27 197 163 -37 68 116 364 159 -73 78 290
2800B90m15j96J45J1j70m3M05j09p8mL72j79rM3J02l2N7l53L67k70k6O0K5j07
$$ 290 -125 -321 -176 -165 -335 -378 27 -82 -160 -164 208 29 20 63 165 133 190 -163 204 -66 -92 -32 -7 -114
2824a14j03J73m1n7j16M58J75k96m3L63Q9m19j97J36l8Qo8K49j91k93J34L96k16
$$ -114 -217 -44 -85 -142 -258 200 375 79 36 399 488 69 -128 8 -30 -22 -90 159 -32 -325 -191 205 -11
2847a1k5l43N53j70k34L63K38l14J16k1J56on43J69L17n64N31l16J33J66m50L5
$$ -11 -36 -379 174 4 -230 133 371 57 173 152 308 302 -241 -72 245 -319 212 -104 29 195 -255 -220
2869b20J08M6k52M71m52K00L0J77J34k78K6O8j61K55o1q7j71k20L48L20l11j31
$$ -220 -112 -66 -318 153 -299 -99 -69 108 242 -36 -10 58 -103 152 91 4 -167 -387 -39 281 -30 -161
2891a61M0L3k41L31n3N13m33J03pR2l41K23m1k36k02J97J43j6k75L37M10m44L
$$ -161 -121 -88 -329 2 -51 462 29 132 125 217 -124 99 58 -178 -380 -183 -40 -56 -331 6 416 -28 -25
2914b5J23K08n1l10O0L54l62j11K55j84K7j21J43K00k91q5l8L03j34L74j58j29
$$ -25 98 306 255 -55 5 359 -3 -114 141 -43 -16 -137 6 206 -85 -170 -208 95 -39 335 177 48
2936D8K06M2k92N1j50N1J26j05O6j3j62j34L54N7r3q8n6R6M26l75o2k8K65r0j09
$$ 48 254 296 4 55 -95 -44 82 -23 43 30 -132 -266 88 145 52 -36 -92 4 430 55 -7 -35 230 140 31
2961C1O2l97J54OK64l4l69J75K72J82k95M0k73J80L53m44K08j49j02K14j64K10
$$ 31 93 -304 -150 -144 120 86 -283 -108 164 346 51 91 -182 -2 351 -93 115 -34 -136 78 -86 124
2983A24P1k9l73J91j48P9k3J21L96l30j57L0m1L25J79n71J77J45K0l34J28L39
$$ 124 195 166 -207 -16 -164 -85 -108 13 409 79 -78 -48 -89 236 415 -156 21 166 186 -148 -20 319
3005C19l95j91rK76M3J39k74Q4J72j97J30J10J33l45QK5J94m11K85j86K49l59
$$ 319 -76 -267 -276 0 43 182 -92 -8 164 -33 97 207 340 -5 3 28 222 -189 96 -90 159 -200
3027b00K60J92l30j10Q5nJ50O8J24j01k04J76j29J22J14j47J22l29K8L01q1m61
$$ -200 60 252 -78 -188 -103 -108 42 110 234 133 -71 105 -24 98 212 65 187 -142 -114 187 106 -355
3049c55K64N5J3q4K80j1j1k18J47j0N7OM4k90K68J7l02K87j70k83K16k25O1M10
$$ -355 -91 -36 -23 -107 173 162 151 -67 80 70 127 133 177 -113 155 172 -130 157 -13 -296 -80 -305 -244 166
3073A66j69j4J55k05j02M70j82J8k65M76k39j52M6j39J70q6j31p1J07L87m29l9
$$ 166 -3 -17 138 -67 -169 301 119 137 -128 348 109 -43 3 -136 34 -52 -183 -254 -147 240 -189 -228
3095b28L26l4r4NQ5j00J39j62K23n0q1o2j02J89k3k80R4L4L4O7J61q9P8l57K85
$$ -228 98 64 -30 -25 60 -40 99 -63 160 110 29 -33 -135 54 31 -249 -155 -121 -87 -20 141 52 130 -227 58
3120E8k05K87J0j20l1J51K45l50k6J22j88q2O8r7L13j07j33K30k24J49o8J78O6
$$ 58 -147 140 150 30 -1 150 395 45 19 141 -47 -129 -61 -158 155 48 -85 145 -79 70 2 180 246
3143B46l26P3j08M39k13o2l48L67j14K37n48J76j56L70m85P64l84j26K28k86K21
$$ 246 -80 -7 -115 324 111 49 -299 68 -46 191 -357 -181 -337 33 -452 312 -72 -198 30 -256 -35
3164c5%j01L58j9n34K98J48r4J39l0k36K66j03j6K0j05J20pN1l4R5m15Q8J54n2
$$ -35 -35 -136 222 203 -331 -33 115 21 160 130 -106 160 57 41 61 -44 76 69 120 86 181 -234 -146 8 -44
3189d4J56k70J34K13k33Q0m9k84N08j25q1J45j47l21M29l1j41K8n2K94j97Oj96
$$ -44 112 -158 -24 189 -44 36 -13 -297 211 86 5 150 3 -318 111 80 -61 -33 -85 209 12 18 -178
3212a78L49k94L3j33K38j0m62P07l1P0k53O0j96L65m41j7J92j8o5j52J37r4K7
$$ -178 171 -123 -90 -223 15 5 -457 250 219 289 36 96 -100 265 -176 -193 -1 -19 -84 -236 -99 -193 -166
3235a66J22j02q9L35J72k31q1L8R1JJ7j76k3L2K37j24k2m5q4J81n3K1k51K64n0
$$ -166 -44 -146 -235 100 272 41 -40 -2 89 90 107 -69 -92 -60 177 53 31 -14 -98 83 30 51 -200 64 14
3260A4J54l83K33J84J24k36j66O3pJ92Pk50M6n0p1J03K19k93L55j75j50o4n4J68
$$ 14 168 -215 18 202 326 90 -76 -13 -20 172 179 -71 -25 -75 -146 -43 176 -117 238 63 -87 -151 -205 -37
3284c7J0J16k73J42q3l2J13M0l6r4j9M03k90p4J89k64K88KJ4J9k78L50J22k22
$$ -37 -27 89 -184 -42 -125 -157 -44 -4 -40 -134 -153 250 -40 -114 75 -189 99 101 115 134 -144 206 328 106
3308A06j45J07j31l8n5q1Q0k8k7j91K67j12K48J22j72J57l29K70L64n12L03k71
$$ 106 -39 68 -63 -101 -156 -237 -157 -185 -212 -403 -136 -248 0 122 -50 107 -222 48 412 -100 203 -68
3330f8kq0O0K12r8j07j36Q2j71jJ64p5L84j17j25j61K29K16j34j53pK52o3j08
$$ -68 -70 -150 -90 122 24 -83 -219 -137 -308 -309 -145 -220 164 47 -78 -239 -10 206 72 -81 -88 164 101 -7
3354gQ3N3Jj67J0j93K36n9k0n4j68K54J16m1R1j49K08k30j14K61o7q5l6j08K01
$$ -7 76 129 130 -37 -27 -220 16 -43 -63 -117 -285 -31 85 44 135 -14 194 -36 -150 111 44 -41 -77 -185 16
3379A6l8j43L66j29J17l44M27j32j23j06j04K65o5K7J97l29J39P0m20N28m03K01
$$ 16 -22 -165 201 72 189 -155 272 140 17 -89 -193 72 7 34 231 -98 41 111 -309 219 -184 17
3401A7Q0j57K00j50k05L24j04m9j0j11J33k32M6L69P3k21m7Q5mk07K14l4o6LK4
$$ 17 97 -60 140 -10 -215 109 5 -44 -54 -165 -32 -264 -218 151 224 3 -44 41 37 -170 44 10 -56 -53 -29
3426b9K95r3j68J7J30j16k42M0k1J90n4K09j2k01R2Ko6l60J95L69j03k2R9Lk38
$$ -29 266 173 5 22 152 36 -206 -166 -187 3 -51 158 146 -55 37 39 -27 -387 -192 177 74 52 151 154 -84
3451h4J15m53K88J87k43J39R5l4J4j19r2L40k46k3J92K40m68J80o6K19J66n09
$$ -84 31 -422 -134 53 -190 -51 44 10 24 -95 -187 153 -93 -116 76 316 -152 28 -38 181 347 -162
3473a62J9J32p2K8j93K2K83j58J43K9o9k8J51m8L6j5o8QK3k34J96k34K77p9k48
$$ -162 -143 -11 -83 -55 -248 -226 57 -101 42 71 2 -26 125 77 113 98 30 38 61 -173 23 -211 66 -13 -261
3498b61K20mM5r7Q6j8j0L1J64l49K42j13l0K55M4k52j42K08Q7l94M06m57O00k36
$$ -261 -41 -45 0 -97 -11 -29 -39 -8 156 -193 49 -64 -94 161 205 -47 -189 19 106 -288 118 -339 261 25
3522B5j46K32k4p5J07m71M29J82k29O9j07JqJ22j43Q6jj57J64l8j03L9O3m5P2
$$ 25 -121 111 87 12 119 -352 77 259 30 99 -8 -7 -15 107 -36 50 49 -108 56 18 -85 -46 17 -28 44
3547D4j38r1L92k56J61L0J2O2p8l40M9K4M05o53J82M54l09j31m7L49q5J37j03
$$ 44 -94 -185 207 -49 112 142 154 216 138 -202 -153 -129 276 -377 -195 259 -50 -181 -228 121 36 173 70
3570G0Q9k15N3P1J41Nj59k14Q8j58R9L3j11K11K7o0N8k05NK66k58J86J29m33M54
$$ 70 159 -56 -3 68 209 214 55 -159 -71 -229 -130 -97 -208 3 30 -30 28 -177 -172 94 -164 22 151 -282 172
3595A72o7r4J88k45k0J8j50K32j34J70K10k54n1J8j4q2j52K56J89k85J2J46J28
$$ 172 105 11 199 -46 -66 -48 -198 34 -100 70 280 26 -25 -7 -21 -103 -255 1 190 -95 -83 63 191
3618A91N9q8j83k33K57J95j64R4n7o3k1j8J03l50L86q8R8K6o5J5k77K89k69N6
$$ 191 250 162 -21 -254 3 198 34 128 71 8 -13 -31 72 -278 108 20 118 144 79 94 -183 106 -163 -107
3642a07M6J24K5k6J16q5k55K08K3J78p7m02L50o0r6m1J15J78o9l8L7q0q4Q5j0
$$ -107 -61 63 88 62 178 93 -162 46 69 247 170 -232 118 58 -38 -79 36 214 145 107 144 64 -20 65 55
3667E5j23O9J95j43j03L3n2R5m0K3l7M8p9n3j04K40J00K8j34J19l49M96p9j77
$$ 55 -68 1 196 53 -50 -17 -69 26 -14 9 -28 20 -59 -112 -216 24 124 152 18 137 -212 284 205 28
3691B8nL2rJ8O2j52R3k31J76r2j15J4L43J7m8m78N24lk23J19J86l55J76j21J36
$$ 28 23 55 46 64 126 -26 67 -164 12 -80 -195 -181 162 179 131 -347 177 174 -49 70 256 -99 77 -44 92
3716I2j6J30l59K31j20j1m6J63j66J1K90k24k0N1J31j20K90k07M8j25P1m9K42
$$ 92 76 206 -153 78 -42 -53 -99 64 -102 -91 199 -25 -45 6 137 17 307 100 148 23 94 45 287
3739B87k27o5j80oK57l23L98k37P4r7J17j87M4K03K5N7J37o3k16R5l50K25J97
$$ 287 60 -5 -185 -191 66 -257 141 -96 -22 -119 -2 -189 -145 58 83 140 277 214 -2 93 -257 -32 165
3762A65l14J61L7j95j98J76L6K41j51j01L92o44L86j25L45j91J56j48m8K9k2j28
$$ 165 -149 12 49 -146 -344 -168 -132 109 -42 -143 249 -395 -9 -134 211 20 176 28 -20 9 -13 -141
3784a41l9J01K25j41p2j33j8L36n0J36Mj06k03K46L4k65m3p3K41o8J11m64N04
$$ -141 -180 -79 146 5 -67 -200 -218 118 68 204 208 102 -101 145 179 -86 -129 -202 39 -29 82 -382 122
3807A22l88K41k0J41J35m78L86p2O8J59J43n83L58J00o75K97J20J83j87j56J96
$$ 122 -266 -25 -45 96 231 -247 139 67 135 294 437 -146 212 312 -363 -66 54 237 50 -106 90
3828I0K2j8K7k30N3J90k83J78J98J10k6l19j48K43k00M34l76RM3RQ4jk45J01N9
$$ 90 112 94 121 -109 -56 134 -149 29 227 337 311 -8 -156 87 -113 321 -55 -46 -3 6 90 89 -156 -55 4
3853Dk48L32J55j50k4r7J29j6j88P2O4J19l69L14K32l02k48PJ77J86J09k85l7
$$ 4 -244 88 243 93 69 -28 101 85 -103 -31 33 152 -217 97 329 27 -221 -214 -37 149 258 -27 -64
3876f4K06r3l5q7j74K07j43l2M01k80J54q9k54L39J12n9M4L0l06K0K63j95j35
$$ -64 142 49 14 -73 -247 -40 -183 -215 186 -94 60 -29 -283 56 168 109 153 183 -123 -103 160 -35 -170
3899a70M35k82j30NJ85l17j73L71q5K12k18K42j98jJ91k23K99j60R8j85l2n6J55
$$ -170 265 -17 -147 -142 43 -274 -447 -76 -161 51 -167 75 -123 -124 67 -156 143 -17 81 -104 -136 -192 -37
3922c7j5O6j47J36J36o6j81K5K6J54j09J0J26l9l39L76l5N6k19l2J94l0k88J16
$$ -37 -52 14 -133 3 139 73 -108 -83 -57 97 -12 -2 124 85 -254 122 87 143 -76 -108 86 56 -232 -116
3946a16J68j65K6k7J80J65r2J38m47J65j61P4J31O1l11J39M8J41l76M18q0k66
$$ -116 52 -113 -87 -114 66 231 139 277 -170 -5 -166 -92 39 100 -211 -72 -24 117 -259 159 79 -187
3968a87K83K0q9j35j26j30M72R8j99j12J62k2K89k91R6k12L01k19l43J28J72L9
$$ -187 96 116 27 -108 -234 -364 108 206 7 -105 57 35 324 33 129 -83 218 -1 -344 -216 -44 -5
3990el0j14J74k75K72J63j50K54j42l0j02j41k14K14n1K39q6j3J7k64K4L67k83
$$ -5 -35 -149 25 -250 22 185 35 289 147 117 15 -126 -340 -126 -177 62 -24 -37 -20 -284 -260 107 -176
4013a76K68l51K45M20n50L39j22OJ34pk98K7K28k36K50j86j80J60J52j87k33M00
$$ -176 92 -259 -14 406 -144 195 73 79 213 206 -92 -65 163 -73 177 -9 -189 -29 123 -64 -297 103
4035A03k02N3R2k12J27M2l55K78J07j11oN8kl8K19k17K19j34j01K73k64L15l53
$$ 103 -99 -46 46 -166 -39 3 -352 -74 33 -78 -84 -26 -28 -66 153 -64 155 21 -80 193 -71 244 -109
4058a09J8K80L2j50J71j7L1k86J40j36j54J45m2q0J54p7J46k6k29M65k02J13k54
$$ -109 -91 189 221 71 242 225 256 -30 110 -26 -180 -35 -77 -157 -3 -80 66 40 -189 276 74 187 -67
4081f7K3J23J15k63K5J34j75r0L97k75Q2j2k71L76l92J83M41n13J55l09pM84J30
$$ -67 -44 79 194 -69 -44 90 -85 -175 222 -53 29 17 -254 122 -270 -87 354 -159 -4 -313 -320 164 294
4104B94l10j7J85J7r1j03J93k11J76j10M6q3r2K84l45P9L38l17K18j08l74J50
$$ 294 -16 -33 152 169 78 -25 168 -43 133 23 69 -14 -106 178 -167 -88 250 -67 151 43 -331 -181
4126a81J85p6J72j11qK30k12j32K25q5p5p3R4l8J25R7j51M7j15J66j42j28K14
$$ -181 4 -72 100 -11 -19 211 -1 -133 92 7 -68 -141 -47 -85 40 137 -14 33 -82 84 -58 -186 28
4149B8q5J66n0P4k75K35j09j0j02O3M2K41q6rj78j60J51O0K44l49N0k2o5l1J05
$$ 28 -57 109 59 133 -142 93 -16 -26 -128 -65 -23 218 132 123 -55 -215 -64 -4 240 -109 -59 -81 -146 -177 -72
4174g2L4j21K40n3j68K97k25J97p2k05R8P5J2l19K72j89L20r8j5ml05L81j10j39
$$ -72 -38 -159 81 28 -140 157 -68 129 57 -148 -50 25 37 -282 -10 -199 121 23 8 4 -301 80 -30 -169
4198a69K96k56L94k33J8q6N1j31P5j05J59J27p6k1j16j02J73J4k8L0j06j71Q7
$$ -169 127 -129 265 32 50 -36 15 -116 -41 -146 13 140 64 43 -73 -175 -2 12 -16 14 -92 -263 -176
4221a76K48j57K28k00K10j71J8J99j84k28L14j18j12J59N6k13Q8k8K83l82J72
$$ -176 72 -85 143 -57 153 -18 0 199 15 -213 101 -17 -129 30 86 -127 -39 -67 216 -166 6
4242FJ43KQ8k74O3J49k90J95o9k44K8j49K76j31O6P2J15j1j5k95M26O4n5l95K53
$$ 6 149 151 239 -35 28 177 -113 82 13 -231 -203 -352 -76 -207 -141 -69 46 35 20 -275 151 215 160 -235 18
4267A8j80L66l8n6r8j57n9J8L12j98j97M35j27K60j89j73J89R2j34l07K35j49
$$ 18 -162 204 166 110 12 -145 -204 -186 126 -72 -269 166 39 299 110 -63 126 218 84 -223 12 -137
4289a37P7oJ17j90K7L88l98K36N2j3j80K04k38J94j63J95k80P0j6K08q8j96J39
$$ -137 -60 -66 51 -139 -112 276 -122 114 166 153 -27 177 -61 133 -30 165 -115 -45 -61 147 59 -137 2
4312BN0n8k22KJ95k27K57J37j77J6M1k71L61K8l63L32k32J41o0m3k46J93K39m28
$$ 2 52 -6 -228 -226 -31 -258 -1 136 -41 -25 16 -255 106 134 -229 103 -129 12 -48 -91 -337 -144 95 -333
4336c33N64K8j79J4p2L9q2j32M29m11N5J36k52K94k51J60j13l4j7rN23n02j5L6
$$ -333 231 259 80 94 22 61 -21 -153 276 -135 -80 56 -196 98 -153 7 -106 -140 -157 -166 357 -145 -160 -124
4360a24Q6m8m5r2L91j38rk55m6J33L67m40J20J11j69R7M3L2O0j35J17J55l13L80
$$ -124 -38 -86 -131 -223 168 30 21 -234 -280 -147 220 -220 -100 11 -158 -61 -18 14 74 -61 56 211 -102 278
4384B78k26Q0p8J93k61j77o8K09K53j47k41K16j64J61k12J60R7l09M46m7Op3k20
$$ 278 52 132 54 247 -14 -191 -259 -50 203 56 -185 31 -133 28 -184 -24 73 -236 210 163 169 96 -124
4407a24Q6j2J32n4q4k89J75jK27j14k81J13K08J18l57N82l08J97q1k03n5l7J87
$$ -124 -38 -50 82 28 -56 -345 -170 -171 56 -58 -339 -226 -18 100 -257 325 17 214 133 -70 -125 -162 25
4430B5Q2l21J64K16k45m9J5j44J80P3O0k4o3P6L6J12k46k37L47o9n8j52L6K71
$$ 25 107 -214 -50 166 -79 -128 -113 -257 -77 -4 56 32 -31 45 81 193 -53 -290 57 -12 -70 -222 -186 85
4454H5k66L43p8o5j09P4k4j1K59m85N63l71K74m25M21k92P0l23K57K26r0k40R1
$$ 85 -181 162 84 19 -90 -16 -40 -51 208 -277 286 -85 189 -236 185 -107 -37 -360 -103 123 33 -207 -116
4477a16J69k87L78k73p8J23J87l75K90J07M1m28M42j49k75J05k7K42k15j21J64
$$ -116 53 -234 144 -129 -207 -84 103 -272 18 125 166 -262 180 31 -244 -139 -166 76 -139 -260 -96
4498i6J87n7j23J92j32n8O7K83J18l39J33r0q0L75j59n0j44l48K51L09k15J03
$$ -96 91 34 -89 103 -29 -87 -20 263 381 42 175 85 5 380 221 171 27 -321 -70 239 24 127
4520A27l83J66K00l86K7K67O2j41K84J4j86n2N0n2K0k8J01l19k2M58m0j17k7r5
$$ 127 -256 -90 110 -276 -249 18 80 -61 223 237 51 -1 49 -3 17 -11 90 -229 -251 207 167 50 23 -72
4544g2R0P3k27M36m83L23k9J3R5m57K65k21J35J46m22M79n09J76J34jR5k62L10
$$ -72 18 91 -136 300 -183 140 111 124 219 -238 27 -194 -59 87 -335 144 -365 -189 -55 -56 39 -223 87
4567H7j30p0P4j20K38k70R0L5p0R7J2J06j96M1J55k09O3j39j56L35m0J84l23K33
$$ 87 -43 -113 -39 -159 79 -191 -101 -66 -136 -39 -27 79 -117 -76 79 -130 -67 -206 -362 -27 -67 117 -206 27
4591B7K00n01N23l89l6M3R1l1J83k90j9L61j52J79j25q4p5L7O2j53K82m24K43
$$ 27 227 -274 249 -140 -176 -133 -42 -73 110 -180 -199 162 10 189 64 -20 -95 -58 4 -149 133 -291 -48
4614d8L5J16j56q6j3J27p7J70Jj84J86l31L02J28OL1j80j56K70j20P4l36M09j32
$$ -48 -13 103 -53 -139 -152 -25 -102 68 69 -115 71 -260 42 170 176 207 27 -129 141 21 95 -241 168 36
4638C6k4j07J28k33K72j72K07j60p6J35Q3j32J60q9K45j03k9J13k16j71K06j18
$$ 36 12 -95 33 -200 72 -100 107 -53 -129 6 89 -43 117 28 273 170 141 254 38 -133 73 -45
4660d5r6K95j73j4l4K52l22Q2l8J12Q1k33M70k92J91J00j32l82K67j51j64R1J93
$$ -45 -141 154 -19 -33 -67 185 -137 -55 -93 19 100 -133 337 45 236 336 204 -178 89 -62 -226 -135 58
4683E8j22L66l35J08k53J69NQ7k38K65l7j71K91k01J62n7Q0n04N80l66J14K66
$$ 58 -64 302 -33 75 -178 -9 -4 83 -155 110 73 -98 193 -8 154 97 177 -327 253 -113 1 267
4705B67m24K83J4k49J84J41K0l82J21p5p4L82j44j0k17J60j0j69O5j9L34l76n2
$$ 267 -157 126 140 -109 75 216 236 -146 -25 -100 -174 208 64 54 -163 -3 -13 -182 -117 -136 198 -178 -230
4728b30L39j1J04N5k73J7Q6MRk65j6j5K25r8j3J88j39k70J53M08n03L65m8Q0k16
$$ -230 109 98 202 257 -16 1 87 91 100 -165 -181 -196 29 -69 -82 106 -33 -303 -150 258 -245 120 72 152 -64
4753f4KjK3k67J6N52m66M20k95rN2J6K22j72k05q7J08M61m24L81j37M5P3l90O1
$$ -64 -62 -63 -40 -307 -291 261 -205 215 -80 -89 -37 -21 201 29 -176 -263 -155 306 -118 263 126 171 244 -146 -85
4778h5J70k10P0K04j33J92l65O3J33j1p5K71l20o8r9L18q5O8J15K8k32k7l2MK47
$$ -85 85 -125 -55 149 16 208 -157 -94 39 28 -47 224 -96 -164 -263 55 -30 38 153 181 -51 -78 -110 -106 141
4803A41J02l50j53L88r3l2J03j10N9j55k00N5K97o0K58j47j14N8k49P8K83j74
$$ 141 243 -107 -260 128 35 3 106 -4 55 -100 -300 -245 52 -8 250 103 -11 47 -202 -124 159 -15
4825a5K28l50J35M1p5P9J18Lr1j64n5K91m0j54j19M8l42M43J20j51k1J10n1o0
$$ -15 213 -137 -2 39 -36 43 161 164 73 -91 -146 145 105 -49 -168 -120 -462 -19 101 -50 -71 39 -12 -72
4849g2L80q4k16O0k58J73mK4k36K08L43j50q1j14M0r7J28M0J27j43k56Q0J34J87
$$ -72 308 224 8 68 -190 -17 -21 3 -233 -25 318 168 87 -27 13 -84 44 84 211 68 -188 -108 26 213
4873B13n0J13k50K9Q4Kp0J10k68j9K4J94j94k39J79Q8K22n2j90j17L39Ok72J91
$$ 213 163 276 26 55 139 141 71 181 -87 -106 -82 112 -82 -321 -142 -54 168 116 -74 -191 148 154 -118 73
4897G3P6o4j20p2K80j67j13J79j39J17j84P4j30j26K33P9m8J0j86LRL33n8j33
$$ 73 149 85 -35 -107 173 6 -107 72 -67 50 -134 -60 -190 -316 -83 -4 -52 -42 -228 -225 -216 117 59 -74
4921g4J03m6l7j52J51O9q1l2J90j52j07J64L00l28P7J28j57J70l79L30P8k76J34
$$ -74 29 -17 -54 -206 -55 14 -67 -99 91 -61 -168 -4 296 -32 45 173 16 186 -193 137 215 -61 73
4944G3m8j52K26j66J69l63J85J45O5p7k01m8J43K27j6k77j52L68k86pJ51O0k39
$$ 73 25 -127 99 -67 102 -261 -76 69 134 57 -144 -192 -49 178 162 -115 -267 101 -185 -192 -41 19 -220
4967b20J0N5MK22j2m9j46J43J00j81j47J28k4L25lk26r7o3Q8l9k0J96j23R2l6
$$ -220 -210 -155 -151 71 59 10 -136 7 107 -74 -221 -93 -117 208 205 -21 -118 -181 -93 -132 -152 44 -79 13 -23
4992b3J01Ok17K77M8j64q0nN5l86K44K56M8N9l10m0L2K44j00j8R8r0jm9R2k03
$$ -23 78 84 -133 144 192 28 -52 -57 -2 -388 -144 112 160 219 -91 -131 -99 145 45 27 125 35 34 -15 77 -126
5018a26ll2J23m5j00J02J91j64Q9jJ4n8K8M8l3j63K83k58P2K14O9k36q3k8J58
$$ -126 -129 -161 -38 -83 -183 -81 110 -54 35 34 48 -10 18 66 33 -130 153 -105 -33 181 250 14 -69 -97 61
5043F1L52m41K20k67J26P5j60p2J54k97j90M09J47R9l0j44K20r8k35K05r4Lm0
$$ 61 413 -28 192 -75 51 126 -34 -106 48 -249 -439 -30 117 216 186 42 262 164 -71 134 40 43 3
5066CN5m10L59k9K1q1L5L58k95k09L04l23L10r2o3N7R3j12J69k2l12J0L96j48
$$ 3 58 -352 7 -22 -1 -82 -47 311 16 -193 111 -212 98 6 -57 0 93 -19 150 128 -184 -174 222 74
5090G4k89K01M3k4j1J95k92J36J9j61K77k71j65K22J83J9j64K25k25j39J05j38
$$ 74 -215 -14 29 5 -6 189 -103 33 52 -109 168 -103 -268 -46 137 156 -8 217 -8 -147 -42 -180
5112a80L26j14k10L58j0k38N5j51K8N2j99L56K5q3k47J98O5j43J73J43N0m06Q3
$$ -180 146 32 -178 180 170 -68 -13 -164 -136 -84 -283 73 98 15 -232 -34 31 -112 61 204 254 -152 -69
5135f9R5J0j79K86j92J35l01J20P1k1O6j0k20K38J13j84J3M1K32m32L97oj14n1
$$ -69 26 36 -143 143 -49 86 -215 -95 -24 -45 21 11 -209 29 142 -42 -29 12 244 -188 209 203 89 38
5159C8K10j10n0j43p2K17k25k2J66l8j7j58K08j2pj29K91j03J40r0n4M6K10m39
$$ 38 248 138 88 -55 -127 90 -135 -157 9 -29 -46 -204 4 -8 -15 -144 147 44 184 94 40 86 296 -143
5183a43P7J70j56j0K01j67J07j41J77k19k9J18K54j37j1k29K84L9l2k6q9J76m23
$$ -143 -66 104 -52 -62 139 -28 79 -62 115 -104 -133 -15 239 102 91 -138 146 185 153 127 38 214 -209
5206b09J31j76K26n7J70l82K49j56K76k57K02Q9j45Q0R9k64k6J38k51K58K31l27
$$ -209 -78 -254 -28 -85 85 -297 -48 -204 72 -185 17 106 -39 41 140 -124 -150 -12 -263 -5 226 -101
5228a01l28K38K61J7l0m1O3pj28J09L51m19O1j61P7o8l2J81j68l9l7K32k11O4
$$ -101 -429 -191 70 87 57 16 79 72 -56 53 404 -15 46 -115 -38 -106 -138 43 -125 -164 -201 31 -180 -116
5252a16L91m45r6L70J29m46L89m37L58p0J06J35m11K43J1P2j51J39p7k58J86Q4
$$ -116 275 -170 -266 104 233 -213 176 -261 97 27 133 268 -143 100 111 183 32 171 94 -164 22 106
5274A06Q3k23p6q9l4K3q5L75j54ko5J09M3k16J70J41k50q5K81k19N4M6R0j40J93
$$ 106 189 -34 -110 -199 -233 -210 -295 80 -74 -76 -141 -32 11 -205 -35 106 -144 -229 52 -167 -113 -67 23 -117 76
5299G6l73M25j55P7O6j93J07J36j38k54K49O0k39P8J03j57L39l03J71p2J36k65
$$ 76 -297 128 -27 50 116 -77 30 166 28 -226 23 83 -156 -78 25 -132 207 -96 75 3 139 -126
5321a26K26j76j01J06J68j37J04q9j41O5K3M8k1k47M46j59O5j51K9J46r2N2j01
$$ -126 100 -76 -177 -71 97 -40 64 -25 -166 -101 -78 -30 -51 -298 148 -11 54 -97 -68 78 -14 38 -63
5344f3L86o04K48r1J05n5j83J89J36l20K00J79m9k80J84n6K11k79J33q4J32k72
$$ -63 323 -281 -33 -124 -19 -74 -257 -68 68 -252 -52 127 78 -202 -18 -74 137 -142 -9 -93 39 -233
5366b33J93J63L6l49L94j23k23n4K01l0P3m6K27m33R3q4K23N1j94K93n5lm3J48
$$ -233 -40 123 159 -190 204 81 -142 -196 5 -25 48 2 229 -204 -111 -195 28 79 -115 178 123 120 77 225
5390B25l07M3j22J27J14j84k26N48l37N4K99k57K32L0m97N20l72MJ99Lj09p0%
$$ 225 -82 -39 -161 -34 80 -104 -330 218 -119 -65 234 -23 209 239 -258 262 -110 -106 93 96 -13 -83 -83
5413h3J3q3K62k9K6Q4k2q3J22l24L02n9N4r1k8L06k42k1l1k02L12j81j22R2J34
$$ -83 -70 -153 109 80 106 190 168 85 207 -117 185 126 180 89 61 367 125 104 73 -129 183 2 -120 -28 106
5438A06k59njJ47J08K7k0o0j44R8J15j40n0j3Q9p3K46l97K73J41j83k32K69K09
$$ 106 -153 -158 -159 -12 96 123 103 43 -101 -3 112 -28 -78 -91 -2 -75 171 -226 47 188 5 -227 42 251
5462B51l84J75k09K23m0J12j47J71j23q4m6J17p7O1K35j47j97j83L01k1J05j07
$$ 251 -133 42 -167 56 16 128 -19 152 29 -55 -101 16 -61 0 235 88 -109 -292 9 -12 93 -14
5484a4l00M87N1qr7J11l21J02J98l39J78k41J44K77k72J58l3j91Rm7J06K47l20
$$ -14 -314 173 224 216 119 230 -91 11 209 -130 48 -193 -49 228 -44 114 81 -110 -101 -148 -42 205 -115
5507a15J89j54L6r3J75l30J02L27N5j99J49M5j61J8k79L51j37O2j34J02k8L0K21
$$ -115 74 -80 -44 -137 38 -292 -190 137 192 -7 142 187 26 44 -235 116 -21 41 -93 9 -19 11 232
5530B32k74K71j95m6r7j02K85K5j68nk95L11l5J48p4M7J43j72m0R2j14j63Q4L79
$$ 232 -42 229 34 -12 -109 -211 74 99 -69 -74 -369 -58 -93 55 -19 28 171 -1 -41 51 -63 -226 -142 237
5554B37j57j2k16m9J74j90K56r0J07J84l61J20o2J60j82K8r3O4J62j97K23R0k27
$$ 237 80 68 -148 -197 -23 -213 43 -47 60 244 -117 3 -59 101 -81 -53 -146 -82 80 -117 106 196 -31
5577c1J5L7k11M14l77o3M30k83J89o3p7j23M2k02P0J80K07pj96J17J77l5j49o4
$$ -31 -16 21 -190 224 -153 -216 214 -69 120 57 -20 -143 -101 -303 -233 -53 154 147 -49 68 245 210 61 -3
5601cL36m19q7L56Q6l83K29j42J51J76m19J49r4R3l4K2L3L9k4p1J4k1K59k60n2
$$ -3 333 -86 -173 183 269 -114 115 -27 124 300 -119 30 -64 29 -5 17 50 89 65 -6 8 -13 246 -14 -66
5626f6J56k85M9J46k18L78k54K15o4j40N0j7j7N4j38J92m6m5Oj40J30J81n2K12
$$ -66 90 -195 -146 0 -218 160 -94 121 57 -83 -33 -50 -67 -13 -151 41 -5 -50 -44 -184 -54 127 75 287
5650B87n21L12K40l04j65L26P1k59k58K56j07K70Jj0Oq3j25Q7J03m53L10J32K2
$$ 287 -234 78 318 14 -151 175 246 -13 -271 -15 -122 148 149 139 145 62 -63 24 127 -326 -16 116 138
5673A38m6N0l4k00K5J37j24p9K53k37j5m6K50J47r5k49Q2J90r9n0j05K88m65N43
$$ 138 92 142 108 -92 -67 70 -54 -133 120 -117 -132 -178 72 219 124 -125 -43 147 48 -2 -107 181 -284 259
5697B59n93K03Q6J93j83p3l0m0K58k51L0Q6%j82K61J42l01l8K34j28J13j5j96
$$ 259 -334 -131 -45 148 -35 -108 -138 -178 80 -171 -141 -55 -55 -237 24 166 -135 -173 61 -67 46 31 -165
5720a65N10k78J07p1p0J10q3j84K13j85P4K10n9k01j08K59k65L47o3j56J8N4Q2
$$ -165 345 67 174 103 33 143 60 -124 89 -96 -22 188 129 -72 -180 79 -186 161 98 -58 -40 14 96
5743I6J16k16j45L09l36N15k94n45N29K31j70p8q4O3J15j71J41j85m4K31N5j99
$$ 96 212 -4 -149 160 -176 339 45 -500 29 260 90 12 -72 -9 106 -65 76 -109 -153 78 133 -66
5765f6J05J56L9l04R9J00k36K01o1j5n9K5n2j28L65j87n2J28k48K28K3p4L24l96
$$ -66 39 195 234 -70 29 129 -107 94 33 18 -41 -16 -68 -196 169 -18 -70 58 -190 38 61 -13 311 -85
5789h5K49j92J76j09J21l15J97P5l03K86k71K65m53L67k57L08nj84jJ24K10j95
$$ -85 164 -28 148 39 160 -155 42 117 -186 100 -171 94 -359 8 -249 59 54 -130 -131 -7 203 8
5811HN1J64k41J54j81J4L4j13J54r2K21k24L8l6J71J05k07j69J66j32P1J36j6
$$ 8 59 223 -18 136 -45 -31 3 -110 44 -48 173 -51 -13 -49 122 227 20 -149 17 -115 -44 92 76
5834G6K62o4k41Q3n0j09jk30K99J51l3l24J38L2N1j90n1O5J79K53k89j71J67j04
$$ 76 338 274 33 116 66 -43 -44 -274 25 176 143 -181 -43 -11 40 -150 -201 -136 43 296 7 -164 3 -101
5858a01L31m51J81K18j81k25M8L02k26K36k48j3P9m5L46k83L15k85L9J13k61K28
$$ -101 230 -221 -40 178 -3 -228 -180 122 -104 132 -116 -129 -50 -95 251 -32 283 -2 37 150 -111 117
5880A17j77mJ74j27p7j57K96j56J66k28J66L59l06LJ26l6j75O9j43j04L47Q6k38
$$ 117 -60 -64 110 -17 -94 -251 45 -111 55 -173 -7 352 46 49 175 139 -36 33 -110 -214 133 219 -19
5903a9MK43k70r1J01q6J58j87R4L1l1M35l28K3K7Jl8L1j54J61j35kj06K21J43
$$ -19 -15 228 -42 -133 -32 -118 40 -147 -53 -22 -53 382 54 77 104 105 67 98 -56 105 -30 -32 -138 83 226
5928B26l07L34j27K6p6o3j77L55j57K18pm28K67m7j19q7K28l4j59K75m19L06j78
$$ 226 -81 253 126 152 76 13 -164 191 34 252 245 -183 84 37 -82 -169 59 25 -134 141 -278 28 -150
$$ [...]
8191G6
##END NTUPLES=NMR FID
##END=
