##TITLE=1H_Pr NCS2
 CDCl3
 8 sc, 
 19.09.2022
##JCAMPDX= 6.0         $$ Bruker NMR JCAMP-DX V2.0
##DATA TYPE= NMR FID
##DATA CLASS= NTUPLES
##ORIGIN= UXNMR, Bruker Analytische Messtechnik GmbH
##OWNER= root
$$ XWIN-NMR		Version 3.5
$$ Mon Sep 19 14:14:16 2022 Russian Standard Time (UT+4h)  she@DPX200
##.OBSERVE FREQUENCY= 200.1313499994
##.OBSERVE NUCLEUS= ^1H
##.DELAY= (6, 6)
##.ACQUISITION MODE= SIMULTANEOUS
##.ACQUISITION SCHEME= undefined
##.AVERAGES= 8
##.DIGITISER RES= 18
##SPECTROMETER/DATA SYSTEM= spect
##.PULSE SEQUENCE= zg30
##.SOLVENT NAME= CDCl3
##.SHIFT REFERENCE= (INTERNAL, CDCl3, 0, 15.7039)
##AUDIT TRAIL= $$ (NUMBER, WHEN, WHO, WHERE, WHAT)
$$ ##TITLE= Audit trail, XWIN-NMR		Version 3.5
$$ ##JCAMPDX= 5.01
$$ ##ORIGIN= Bruker BioSpin GmbH
$$ ##OWNER= she
$$ F:/spectra/data/she/nmr/H-F/1/audita.txt
$$ ##AUDIT TRAIL=  $$ (NUMBER, WHEN, WHO, WHERE, WHAT)
(   1,<2022-09-19 14:12:42.00 +0400>,<she>,<DPX200>,
      <created by zg, POWCHK disabled, PULCHK disabled
       configuration hash MD5:
       00 E9 B6 7A A2 85 ED C7 34 08 36 98 17 FE 4E 26
       data hash MD5: 16K
       41 56 02 9C 2C 6A 8D F3 6C 7B 1F D1 E6 FB 3B 28>)
$$ ##END=
$$ 
$$ hash MD5
$$ 23 AB B8 6E AE D9 4C 51 1B 72 A0 B8 BC AB 32 6D
##$RELAX= 
##$RELAX= 
##$RELAX= 
##$RELAX= 
##$RELAX= 
##$RELAX= 
$$ Bruker specific parameters
$$ --------------------------
##$DU= <F:/spectra>
##$EXPNO= 1
##$NAME= <H-F>
##$PROCNO= 1
##$TYPE= <nmr>
##$USER= <she>
##$AMP= (0..31)
100 100 100 100 100 100 100 100 100 100 100 100 100 100 100 100 100 100 
100 100 100 100 100 100 100 100 100 100 100 100 100 100 
##$AQSEQ= 0
##$AQ_mod= 1
##$AUNM= <au_zg>
##$AUTOPOS= <>
##$BF1= 200.13
##$BF2= 200.13
##$BF3= 200.13
##$BF4= 200.13
##$BF5= 200.13
##$BF6= 200.13
##$BF7= 200.13
##$BF8= 200.13
##$BYTORDA= 1
##$CFDGTYP= 0
##$CFRGTYP= 5
##$CHEMSTR= <none>
##$CNST= (0..31)
1 1 145 1 1 1 1 1 1 1 1 1 1 1 1 1 1 1 1 1 1 1 1 1 1 1 1 1 1 1 1 1 
##$CPDPRG= <>
##$CPDPRG1= <>
##$CPDPRG2= <>
##$CPDPRG3= <>
##$CPDPRG4= <mlev>
##$CPDPRG5= <mlev>
##$CPDPRG6= <mlev>
##$CPDPRG7= <mlev>
##$CPDPRG8= <mlev>
##$CPDPRGB= <>
##$CPDPRGT= <>
##$D= (0..31)
0 1.2 0 0 0 0 0 0 0 0.06 0 0.03 0 0 0 0 0.0002 0 0 0 0 0 0 0 0 0 0 0 0 
0 0 0 
##$DATE= 1663582361
##$DBL= (0..7)
120 120 120 120 120 120 120 120 
##$DBP= (0..7)
150 150 150 150 150 150 150 150 
##$DBP07= 0
##$DBPNAM0= <>
##$DBPNAM1= <>
##$DBPNAM2= <>
##$DBPNAM3= <>
##$DBPNAM4= <>
##$DBPNAM5= <>
##$DBPNAM6= <>
##$DBPNAM7= <>
##$DBPOAL= (0..7)
0.5 0.5 0.5 0.5 0.5 0.5 0.5 0.5 
##$DBPOFFS= (0..7)
0 0 0 0 0 0 0 0 
##$DE= 6
##$DECBNUC= <off>
##$DECIM= 32
##$DECNUC= <off>
##$DECSTAT= 4
##$DIGMOD= 1
##$DIGTYP= 9
##$DL= (0..7)
0 120 120 120 120 120 120 120 
##$DP= (0..7)
150 150 150 150 150 150 150 150 
##$DP07= 0
##$DPNAME0= <>
##$DPNAME1= <>
##$DPNAME2= <>
##$DPNAME3= <>
##$DPNAME4= <>
##$DPNAME5= <>
##$DPNAME6= <>
##$DPNAME7= <>
##$DPOAL= (0..7)
0.5 0.5 0.5 0.5 0.5 0.5 0.5 0.5 
##$DPOFFS= (0..7)
0 0 0 0 0 0 0 0 
##$DQDMODE= 0
##$DR= 18
##$DS= 0
##$DSLIST= <SSSSSSSSSSSSSSS>
$$ [...]
##$SUBNAM2= <"">
##$SUBNAM3= <"">
##$SUBNAM4= <"">
##$SUBNAM5= <"">
##$SUBNAM6= <"">
##$SUBNAM7= <"">
##$SUBNAM8= <"">
##$SUBNAM9= <"">
##$SW= 18.0517283424941
##$SWIBOX= (0..15)
0 0 2 0 0 0 0 0 0 0 0 0 0 0 0 0 
##$SW_h= 3612.71676300578
##$TD= 16384
##$TD0= 1
##$TE= 0
##$TE2= 300
##$TE3= 300
##$TEG= 300
##$TL= (0..7)
0 120 120 120 120 120 120 120 
##$TP= (0..7)
150 150 150 150 150 150 150 150 
##$TP07= 0
##$TPNAME0= <>
##$TPNAME1= <>
##$TPNAME2= <>
##$TPNAME3= <>
##$TPNAME4= <>
##$TPNAME5= <>
##$TPNAME6= <>
##$TPNAME7= <>
##$TPOAL= (0..7)
0.5 0.5 0.5 0.5 0.5 0.5 0.5 0.5 
##$TPOFFS= (0..7)
0 0 0 0 0 0 0 0 
##$TUNHIN= 0
##$TUNHOUT= 0
##$TUNXOUT= 0
##$USERA1= <user>
##$USERA2= <user>
##$USERA3= <user>
##$USERA4= <user>
##$USERA5= <user>
##$V9= 5
##$VALIST= <valist>
##$VCLIST= <CCCCCCCCCCCCCCC>
##$VD= 0
##$VDLIST= <DDDDDDDDDDDDDDD>
##$VPLIST= <PPPPPPPPPPPPPPP>
##$VTLIST= <TTTTTTTTTTTTTTT>
##$WBST= 1024
##$WBSW= 4
##$XGAIN= (0..3)
0 0 0 0 
##$XL= 0
##$YL= 0
##$YMAX_a= 221515
##$YMIN_a= -299672
##$ZGOPTNS= <>
##$ZL1= 120
##$ZL2= 120
##$ZL3= 120
##$ZL4= 120
##$ABSF1= 10
##$ABSF2= 0
##$ABSG= 5
##$ABSL= 3
##$ALPHA= 0
##$AQORDER= 0
##$ASSFAC= 0
##$ASSFACI= 0
##$ASSFACX= 0
##$ASSWID= 0
##$AUNMP= <proc_1d>
##$AZFE= 0.1
##$AZFW= 0.1
##$BCFW= 1
##$BC_mod= 2
##$BYTORDP= 1
##$COROFFS= 0
##$CY= 11.3945322036743
##$DATMOD= 1
##$DC= 2
##$DFILT= <>
##$DTYPP= 0
##$F1P= 2.36226072786647
##$F2P= -0.459571619588291
##$FCOR= 0.5
##$FTSIZE= 0
##$FT_mod= 4
##$GAMMA= 1
##$GB= 0.15
##$INTBC= 1
##$INTSCL= 1
##$ISEN= 128
##$LB= 0.24
##$LEV0= 0
##$LPBIN= 0
##$MAXI= 10000
##$MC2= 0
##$MEAN= 0
##$ME_mod= 0
##$MI= 1.114404
##$NCOEF= 0
##$NC_proc= 0
##$NLEV= 6
##$NOISF1= 3.799351
##$NOISF2= 2.8
##$NSP= 1
##$NTH_PI= 0
##$NZP= 0
##$OFFSET= 15.70392
##$PC= 1
##$PHC0= -18032.97
##$PHC1= 8.600691
##$PH_mod= 1
##$PKNL= yes
##$PPARMOD= 0
##$PSCAL= 0
##$PSIGN= 0
##$REVERSE= no
##$SF= 200.130013532006
##$SI= 16384
##$SIGF1= 3
##$SIGF2= 2
##$SINO= 400
##$SIOLD= 16384
##$SREGLST= <1H.CDCl3>
##$SSB= 0
##$STSI= 0
##$STSR= 0
##$SW_p= 3612.71676300578
##$SYMM= 0
##$S_DEV= 0
##$TDeff= 0
##$TDoff= 0
##$TI= <>
##$TILT= no
##$TM1= 0
##$TM2= 0
##$TOPLEV= 0
##$USERP1= <user>
##$USERP2= <user>
##$USERP3= <user>
##$USERP4= <user>
##$USERP5= <user>
##$WDW= 1
##$XDIM= 8192
##$YMAX_p= 0
##$YMIN_p= 0
$$ End of Bruker specific parameters
$$ ---------------------------------
##NTUPLES= NMR FID
##VAR_NAME=  TIME,          FID/REAL,        FID/IMAG
##SYMBOL=    X,             R,               I
##VAR_TYPE=  INDEPENDENT,   DEPENDENT,       DEPENDENT
##VAR_FORM=  AFFN,          ASDF,            ASDF
##VAR_DIM=   8192,          8192,            8192
##UNITS=     SECONDS,       ARBITRARY UNITS, ARBITRARY UNITS
##FACTOR=    0.0002768,     1,               1
##FIRST=     0,             0,               0
##LAST=      2.2672688,     0,               0
##MIN=       0,             -299672,         0
##MAX=       2.2672688,     221515,          0
$$ Real data points
##PAGE= N=1
##DATA TABLE= (X++(R..R)), XYDATA
0@%%%%%%%%%%%Qj6J6j6J7k5L2m0M8n6P2q8J04j20J37j61J91k21K54k89L29l75
33a99M24m81N43o09O82p65Q56r53J060j177J305j444J596j763J945k144K363k603
51a364K868l161L485l846M253m714N240n846O553p395Q413r674J1285j3426J6426
66I097k0962K8705m5382J45124j66849k26705L38334J21372j82821j16220J00206
77a6101L7260K4488O109p6391j03057R5846J60183n3950j96752K0571J92502K4426
89A15134j71473n8125J09977Q5460m2521o4796j4571L2907M1318R996o6868n3327
101g6889P7585Q9354o9670q6057N7172N0190n2105q77M4008m7066l6672R4492
113D3465L6997j28643n3297J33598N8384j23131m2483J08531J5220q5442K1746
$$ y = [0, 0, 0, 0, 0, 0, 0, 0, 0, 0, 0, 0, 8, -8, 8, -8, 9, -16, 16, -24, 24, -32, 40, -48, 56, -64, 73, -88, 103, -118, 136, -153, 176, -199, 225, -256, 287, -322, 360, -405, 451, -502, 558, -619, 686, -758, 838, -925, 1020, -1124, 1239, -1364, 1504, -1657, 1828, -2018, 2235, -2479, 2761, -3085, 3468, -3927, 4486, -5188, 6097, -7329, 9097, -11865, 16840, -28542, 116582, -50267, -276972, 61362, 182734, -87, -116307, -16101, 21159, 45647, 51756, -24635, -127692, -31846, 128337, 74387, -122365, -101794, 90708, 115134, -56339, -114464, -4487, 80973, 38452, -26344, -40915, -8008, 33310, 43306, -23562, -76889, 696, 90050, 20380, -65677, -8505, 41685, -10420, -11297, 32711, -14355, -51027, 43465, 80462, -48181, -101478, 32120, 90504, -32627, -75110, 33421, 48641, -36801, -15055]
124a5055N0212p1802k0487J20413J3296j43056j1347J46113J4976j37450k5840
135h0027J15254L5072p6663l0184L3942P804l456J3644j9888l1769L5780N3234
147E2743l6383p1203K2359P3621j3036o5578J4568N3907j6066l2632J7952J229
159A481k3363K8464K5585m6394j6326N7414O45o3819J3118O3879k3345n5709L7310
172a060M9107m7483m4582M6072L1178m1711j3798L4277k490k4577J7457J2709
184A5099l5228p996M9842J1606n7681j6506O2084K1046o0541k3093N2767K4602
196C6001l4899j7307J5194M593N56P138j4845k0792K4067L5645k5965m6258K2450
209a4422M8285j9655m3474J6380L1888j2672j5024R580m896q950K2027J0055l2423
$$ y = [-15055, 35157, -36645, -57132, 63281, 76577, -66479, -77826, 68287, 83263, -54187, -80027, 35227, 70299, -6364, -36548, -2606, 5198, 1742, 15386, -4502, -36271, -491, 52743, 16360, -54843, -32484, 41137, 28101, -37477, -22909, 30998, 14932, -17700, 252, 1481, -21882, 6582, 32167, -14227, -30553, 26861, 27506, -36313, -23195, 40684, 17339, -38370, -1060, 48047, 564, -44018, 2054, 33232, -8479, -22277, 12000, 9510, -15067, 2390, 15099, -20129, -28125, 21717, 33323, -24358, -40864, 21220, 42266, -18275, -41368, 11399, 36001, 1102, -16205, -1011, 3582, 4138, 11276, -3569, -24361, -294, 35351, 9386, -36872, -14422, 33863, 14208, -29266, -12886, 19002, 6330, -8694, 886, -4010, -12960, 9067, 19122, -13301]
222a3301r484L8215P779l9350n727L3820J892k3958N774J6076j1291q134J5902
235H213K172j8954j13K0125p15j9878m55J7010k103j3971N545J0479j1126o129
249i900J7117O08k2846L159K6365m968k4882P785K1629p472j4609P548N804p381
263b043L123P214j1521p932J7353Q873k0758r880K1311J0671j9518j1070J5195
276A018Q715j1402n117O303J05j448O369k708j1819N789J5897p590j8326Q359
290e855J7968o742j5268N994J2082l896o446L040J425k672K804K274p146l755
304f193R481M555j1651n650J2426M916j2213m062J0516J390q426J167O081l774
318a437k482O939K36o957K430P672m151p065M868N604n461m156N051L356m723
$$ y = [-13301, -22785, 15430, 23209, -16141, -21868, 11952, 13844, -10114, -4340, 11736, 445, -7689, 8213, 10385, -8569, -8682, 11443, 10728, -9150, -9605, 7405, 5302, -8669, -3124, 7355, -3771, -9900, 7217, 7825, -15021, -11862, 14503, 9535, -15347, -7562, 14067, 6595, -8014, -466, 5338, -2043, 1080, 8294, -3227, -11159, 6194, 15067, -5691, -15571, 5740, 16411, -3107, -14177, 1018, 9733, -1669, -6786, -483, -378, -1826, 4543, 1835, -9984, -4195, 11702, 4112, -14214, -5855, 12113, 5371, -9897, -3903, 8179, 4283, -2163, 877, 2302, -370, 2434, 4708, -2438, -6193, 3288, 7843, -3808, -9458, 2968, 7884, -4329, -8391, 2125, 3515, -4911, -3744, 2337, -1437, -3919, 3020, 3256, -3701, -1271, 6401, 2250, -4815, 53, 5657, 196, -3960, 1091, 4447, -276]
333b76k154M634J104m991l73M521j620m643K602L444l905j816M738M05n272J904
349a698M731l521m191M567L545m990j888N286J704l677o79K912K86j640M80J07
365A334k085K91K590r07m122J194N012j455n709Q71M835j193l563N91J415M91
381d10R55l36k140R02L282K38k608j281J690K025p12k972o17L029K151k216j607
398f27N85K93Q56M70k929k202M458J919m522j282L343j240j228L872m11n698K129
415b214O886l138p403K755O646m34l292r8Q82J520R28k519k868J526L042N34j509
432A244l187j907M333M716n670p337O206R010m978r616J808P170M35l282n64P33
448h86K010K589j426n283j543M934M563j544n420k522O290O761p333j1409O807
$$ y = [-276, -2430, 2204, 3308, -1683, -2056, 2465, 845, -3798, -1196, 2248, -1657, -3473, 1265, 1670, -3602, -1698, 3033, -488, -4679, -112, 3433, -1557, -3445, 1841, 3545, -132, -811, 2101, 2387, 747, 1227, 1334, -751, -460, 2130, 1223, -2899, -1705, 3307, 1852, -3857, -2986, 1849, 656, -2907, -2316, -901, -410, 545, 209, -1931, -1029, 2253, 2491, -117, -1398, 292, 2317, 1605, -1367, -1984, 1045, 3196, 980, -627, -42, 251, 1107, 1577, -1352, -3554, 904, 2823, -1699, -2981, 362, -878, -2106, 1766, 1355, -4343, -2214, 4672, 1534, -5869, -3114, 3532, 3098, -194, -292, 590, 2110, 3038, 519, -2349, -823, 2219, 2753, 1244, -1943, -3850, 483, 5199, -471, -7808, -1602, 7408, 2430, -7186, -5378, 1792, 2227, -1055, -1619, -886, 1124, 3713, 2287, -2996, -4539, 395, 4958, 3414, -2006, -4528, 1762, 8523, 1190, -10219, -3412]
463c412J4525m762j2992K688P481l701k692M066k675l713Q586N871j1204j0138
477a2072P802J1500k392j0220k330J0086Q651q967j3087N515J3517j655p630J586
491C04k50l128P015L418j4890n501K0052J0326j8193j3571J0671J2689l553j2361
505f972m466J1521J2736p134j5954J549J2263J060m953L55k891o59J2337K211
519A1003k1657p772K5266J3760k1468j4464J5589J3963r633j4211J30J0755P498
532H759l807q415j535L911K907J047l971q382M753J8068j002k4893n289K4841
546F992P410k0251n556J5901N403o938l905l511k521Q258Q423o622q862L269P110
561D600J255o240j0347K287J9021M478k2053q601J9126P451j6275n128J0860M035
$$ y = [-3412, 11113, 6351, -6641, -3953, 3528, -173, -2865, 1201, -1474, -5187, 3399, 9270, -1934, -12072, -4270, 7230, 4838, -5382, -7712, 2374, 11025, 2058, -11029, -5514, 8003, 6348, -1282, 304, 54, -3074, 3941, 7359, -7531, -13032, 7020, 17346, -847, -14418, -3747, 8942, 5389, -6972, -11438, 83, 12819, 5685, -10269, -8720, 3543, 4603, -350, 5, -2886, -3545, 8792, 11003, -10654, -18426, 6840, 20600, -868, -15332, 257, 14220, 4587, -9624, -9494, 1261, 8759, 4952, -3463, -4998, -1087, 1820, 2867, -1104, -9486, -4733, 13335, 12333, -12560, -17849, 6992, 14402, -5849, -11405, 4496, 9899, 2961, -944, -4455, -6976, 1282, 9705, 3083, -5779, -2510, 4600, 5855, -385, -10732, -8445, 10576, 15054, -6999, -15600, 3526, 10977, -5298, -10426, 434, 4469]
575D469j794K061n283r579N931J2408l182j1630O37J1740N658r850j4173M698
589g889J8961k53j7779p64J5253n82j1915M61M155k987M512Q151q300j1563Q094
604b445J1119q714j0600O363J0282L85n718n350N33O734J903o768j601P195J836
619E154m396q70o10m515L478R151l112r833L073Q857l482r088K2O113L608k11
635C339m054l141K782L279k469k754J468J832K559K232n525p936O052J0892n454
650C102j0564O151R994m653q082J001K199J170L114j640n719K168O748k819p369
665e199O57N591J519j091k849k538L161M314l589n383M170O136k052l768N3O57
681b11L99J424j289k390K464L387k027l225K62R78L96J377j284k411J511K903
$$ y = [4469, 2675, 4736, -547, -10126, -4195, 8213, 5031, -6599, -5962, 5778, 11436, 1586, -12587, -7889, 11072, 10819, -6960, -7724, 7529, 6947, -4968, -4507, -352, -3339, 1173, 9324, 1024, -10539, -2445, 8674, -40, -10640, -4277, 6005, 6390, 672, -4678, -4145, 2589, 4492, -2276, -3877, 3318, 5154, 758, -112, -722, -5237, -1759, 7392, 4280, -5553, -2480, 6377, 2895, -6193, -6171, -58, 3550, 3339, -715, -3856, -1074, 2205, -264, -3018, -1550, 282, 2841, 5073, -452, -8388, -2336, 8556, 3102, -7462, -1311, 8683, 4030, -4052, -3051, -852, 318, 3432, 1792, -3927, -1759, 4989, 2170, -5199, -4542, 1049, 2568, 1477, -1372, -3910, -749, 3565, -24, -5407, -1237, 4899, 2847, -921, -868, -211, 188, 1612, 323, -2067, 397, 3784, 1757, -1468, -1206, -228, 168, 1545, 261, -2150, -639, 2264]
697B264k455l631K213L076j087n76R24j313j070K413K96l376M17M319J91l202
713e97j66J379J72p2r2j228N5K608n81l353l0K993J17j835j64N61L84N75j257
732e31k039J298K637j101k058J413J618o40r02N1l2Q38J136j667j266J910J235
749A900j950j110J843O36q14m25l26l81R22L53j906m40K146M66j695l34J022K77
767A84k66k52n83N73Q20l86r44M55J045K51o87k41L38Q86n51p22o5N11L37n35
787A68n60L28L95j39l67l12K08M4j76j95q4J31L98L9j76J20M19M1k52J21p0l15
809b34L88J73j71j73M51L66m36j63K49j26j71Qo64j4M09R9j71l11J53M15m8n56
831e27k78N73L15n09k56N95J64j24L35J5k39M25P02q12j018P42J080q90q54N02
$$ y = [2264, -191, -3822, -1609, 1467, 380, -196, 728, -585, -1655, 758, 1054, -2322, -1905, 2414, 2605, -597, -763, 616, 788, 716, 624, -604, -549, 2059, 1478, -1875, -1905, 1088, 1205, -630, -794, -233, 151, 726, -531, -2570, -1272, 1365, 264, -1794, -381, 1237, 597, -305, -254, -286, 552, 1688, 21, -1245, 665, 1900, -50, -1160, 683, 1319, 505, 80, -246, -627, 295, 648, -1258, -1698, 448, 914, -781, -1115, -93, 184, -82, -334, -917, -344, 476, 90, -854, -399, 646, 897, 210, -31, 307, 1193, 642, -80, -145, 366, 703, 168, -392, -64, 331, 192, -175, -487, -279, -235, -411, -606, -690, -559, -161, -122, -298, -178, 241, 282, 30, 151, 81, -234, 154, 327, 156, -17, 434, 800, 364, 201, 450, 324, 153, 161, -503, -517, -108, -9, -180, -491, -338, 77, 29, -527, -805, -232, 83, -426, -682, -87, 77, -47, 288, 303, 64, 489, 1191, 379, -639, 103, 1183, 293, -561, -59]
851e9O51m8m07l86O9L2K98k90o16k01P45M18q99j41Q62M36n24j19L70k21j35O34
873D69k16n31K48P44L72j167J32O99q6j054N7N57j61p13O87L11q82m81J385M13
893G83j547l73J483J62j520K34J052m23r8J002n56m95P27M24q96k62R13m17m13
912b20Q78j7j374M34J359p46j411Q56J384j330j038M39R00k90p52N91J061p18
930Fj033J038J162j737j364K817J728l246j545L535Q31l386J1L353r02k518J450
947B00J758k798j340K790J151k741k87K273lj620o17K10Q76J150r98j381J536
964A59J018j926n69J893K67j373J072J440k197j621K043J318j645j021J457J813
980B128o52k677o40K472N75k954K21L526r32l704K104L266m462k252N994K052
$$ y = [-59, 592, 544, 137, -249, -180, -148, 150, -140, -756, -957, -212, 206, -693, -834, 28, 464, -60, -179, 191, -30, -165, 469, 253, -278, -30, 714, 1086, -81, 51, 750, 664, -390, -333, 224, 63, -650, 37, 348, -534, -1015, 370, 783, -764, -1137, 346, 508, -1012, -778, 274, -149, -247, 755, 199, -296, 431, 855, -41, -303, 610, 193, -220, 658, 641, -733, -299, 1060, 314, -1097, -241, 1143, -187, -1225, -786, 114, -176, -928, -337, 724, 6, -1027, 11, 1173, -564, -1928, 889, 2617, -629, -2174, 1361, 2192, -1194, -1183, 2170, 1268, -1250, 200, 1958, -840, -2180, 610, 1761, -980, -1267, 1006, 1003, -617, -1234, -1024, -148, 1002, 4, -1377, 159, 1177, -749, -1318, 575, 842, -531, 541, 1981, -216, -1837, 206, 1524, -121, -1142, 315, 2128, 1476, -1201, -1841, 631, 1206, -1748, -1527, 1999, 1067, -2637, -533, 2733, -1729, -3981, 2013, 4065]
996D065o548q02O104n20n567J268M307q95j965J496K34j818n5R32j22m23L84L27
1014D02J153p73k967K46L499k28l297Q73L310j143k961N1J344K14O26N66o92K26
1032D49L24j391k87J080n24m75L290L98n000o33N498o63n763K111N894k514m929
1049c135K832K112m057o48N018l63l705J305L146k303l011J099K523L73j023n97
1065d34Q55Q93j511j470J431J539j264M30J611j798k310J941J357k309k33K931
1081A659o9j898Q4k74j508J573J789k385k19L419n33l930Q59L026k178j172L767
1098B010K43l966P60L489k643l213L540K892k306j702J763m0j807l47J243L15
1114B31k55O54ln63j259k17J518N71j378J6K135n10k621L49K026q51n73K298M3
$$ y = [4065, -2483, -3285, 2819, 2299, -3268, -2000, 2307, 1412, -553, 943, 1177, -641, -696, 236, 114, -309, 75, 402, 1555, 782, -2185, -1939, 1560, 1332, -1965, -1092, 2218, 1075, -1886, -1835, -491, -277, 349, 915, 223, 449, 773, -618, -905, 175, -349, -824, 2466, 2864, -2136, -2769, 2729, 2066, -3697, -1586, 4308, 1794, -3135, -303, 1809, -2248, -2896, 2122, 1759, -1946, -641, 2505, 202, -2809, -1710, 813, 1186, 163, -434, 421, 1314, -197, -1667, -236, 1303, 39, 469, 2080, 282, -2028, -87, 1270, -1039, -1272, 1659, 1590, -308, -224, -498, -2006, -433, 1356, -1029, -1248, 2171, 1638, -2292, -1433, 1593, -585, -1757, 2010, 2253, -1713, -953, 2536, -107, -3320, 220, 3112, 806, -896, 867, 827, -980, -1327, -84, 231, -24, 630, 627, 64, -1195, -1412, 106, 677, -701, -685, 1450, 940, -1681, -1332, 694, -157, -730, 1568, 1611]
1133A611k566N28J902k154j323K792J225k510J93J911j595k052K190J034k495
1148a309O46K579j501k429J610J190j752j36K218j54j617N54P15j226m67J273
1164A94N67l14k31L35l6m56o97J79J342l66q06R63K49j690m32J792j65j853J517
1183I2J527j891j350K253O9k436R97K345j124j717J863N90k179n2K337n99j519
1200g94J024J226j876o58J428K75j222N85Q65n83q20L43K68n89J6L03N37m66k86
1219d24L43M24q41k70J152L10j090O3J189o98j084J157R02j461j98J883l44k153
1237a140P63J472j106j204J824K11j373m5J461o84j302R91Q38j113l70P19M89
1254D31r05J0J031k02o02K26N06l48n70O50L63n41m02Q86K12j048j73R74R4j111
$$ y = [1611, -955, -427, 1475, -679, -2002, 790, 2015, -495, -302, 1609, 14, -2038, 152, 1186, -1309, -663, 1916, 415, -2014, -404, 786, -966, -1102, 1116, 962, -655, -101, 614, -612, -1079, 194, 761, 447, 216, 551, 515, 59, -638, -459, 883, 517, -289, 674, 923, -767, -1199, 593, 428, -1425, 92, 1619, -272, -1622, 631, 700, -1736, -739, 1606, 482, -1235, 628, 1218, -961, -1013, 1324, 725, -794, 230, 1456, -420, -1078, 350, 625, -597, -12, 853, 270, -550, -207, 61, -528, -512, -209, 328, -138, -424, -81, 343, -498, -768, 384, 694, -396, -333, 856, 158, -926, 231, 1133, -328, -526, 1357, 1013, -1140, -377, 1095, -11, -1215, 609, 820, -553, -598, 863, 179, -1123, -132, 706, -407, -777, -58, 431, -474, -464, 567, 365, -237, -11, 495, 147, -423, 227, 590, 49, -353, 533, 745, -303, -476, 498, 592, -519]
1274e19J84R06n81o33Q36J76j235L44R69l07p34N98N55p07m90N59N04p90R8O92
1294D25j74n05M80O00q53l30Q06J39q06q2P70j47q54M93L71l42n08M73K56o26
1314d14r3M93j1l95Q6N03l4n71L95O30n53k94N06J86m89j15M82Q6m90K57J37j75
1336A27m04M38m8l50j3J73J39m79N90j5l37qK71j2m03J17L83p5l48K56K89j60
1358A31r5K96K1l41O5J96k3l68J7L72j48l29J12K16k7l17J84p9p7j57J2K04k25
1381c60J03K76rj1J1J06m17K66K09k85O5L05q0j49l6L61p2k46J84J89m33j25J74
1404B6n2k46J46oK68q0k28p5K15N3n14R7P38k46n42N58M00o61p9O08J63o07M3
1427b1M68l58k80J83K36R9j47k51j7M16n34m52N65N90p55k32O99P3q88P8J048
$$ y = [-519, -335, 571, -10, -643, 193, 369, -866, -522, 447, 140, -594, 4, 559, -148, -638, -79, 425, -365, -267, 425, 251, -254, 226, 826, -27, -357, 449, 588, -218, -300, 470, 323, -531, -38, 333, -9, -517, -44, 212, -414, -507, -14, -25, -420, -334, 169, 135, -436, -41, 589, 36, -258, 248, 434, -55, -170, 312, 398, -92, 165, 302, 127, -277, 161, 113, -237, -250, -77, 62, -417, 173, 158, -179, -187, 84, 72, -331, -214, 169, 94, -254, 2, 291, 131, 36, 332, 353, 12, 77, 273, 250, -118, -101, 271, 123, -206, -94, 122, 95, -222, -38, -117, -194, -351, -339, -135, -360, -257, 19, 10, -1, 10, 116, -301, -35, 174, -111, -46, 259, 179, 30, -6, 355, 283, 37, 221, 410, -23, -148, 26, -26, -272, -126, -132, 136, 56, -172, -247, -32, 21, -493, -396, 342, 96, -446, 112, 512, -149, -228, 380, 543, -64, -21, 447, 89, -191, -8, 228, 327, 180, -71, -88, 328, -206, -658, -93, 497, -258, -490, 209, 282, -606, -528, 520]
1448E20k11r02M32Q19p16l96L51K17k00L68q9o6L88j80q39N23N21n73m92Q48L01
1469F24j315Q6J249l61j363R53J086r49p84R52P6p43P2L00M61l4j82o3K33j16
1489A82p31K51J039k85j199R98R85j428j135J544P60j468K0J354p20j053N71K75
1507d0m05j2Q24j38k74K16n75l43Q79j02n93P58J087j319q05J198L13j436L72
1526c95J646m99j227M96K99r23j37P01M53j01K2m29o9P1l63l77R20Q94j166n05
1546f89J499n30j457Q11J504j041o22J492Lj737K4J252o03m58J260J53q24j20
1564h3K88q79J18O47p8l35P86o1j095K27P58p17l09J415J76j211J27O74q75k89
1584g16J046K14k03L70j53r83K31K5l48O9J188k47r34N61N14j553j66J731p1j274
$$ y = [520, 309, -593, -161, 658, -58, -454, -103, 114, -86, 282, 193, 127, 515, 335, -504, 19, 540, -33, -525, 323, 624, -691, -605, 644, 283, -1080, -127, 959, 10, -774, 178, 254, -489, -417, -117, 344, 310, 128, 65, 298, 182, -549, -298, 741, 456, -743, 255, 1240, -188, -1323, 221, 981, -487, -467, 887, 167, -886, -315, -40, -445, -457, 367, 229, -45, 171, -404, -747, 132, 30, -563, 195, 1282, -37, -842, 356, 669, -767, -395, 1251, 752, -475, 21, 320, -603, -740, -39, 414, 313, 335, -94, -163, -92, -455, -832, 88, 982, -184, -689, 810, 280, -1177, -366, 1138, 97, -525, 967, 970, -767, -743, 509, -94, -552, 708, 861, 37, -83, 205, -674, -556, 91, 13, -322, 464, 403, -692, -465, 293, -424, -733, 682, 858, -353, -226, 448, -427, -716, 330, 544, 341, 711, 558, -425, -194, -169, -517, -448, 740, 493, -441, 120, 634, -919, -1085, 646, 575, -699]
1604f99O84Q62j375p02J280K05r38Q12Q88r27p02P52k21n58P65M21l14p9M23n30
1624D7n92N85Q1l30M17N65r56k78L90j99m88N17Q37o85j6O64r51l49Q19j0n90
1645e22O74Q54r61m82Q11k12r25Q52Q73r08m15R90l32j173L64J072n23n19J120
1664F38J0j181K90L56n11r3P08O1l04M1O9m36J56M00l00N5N02k11l71L3N5k99
1686c32K80O24l29n01P66j73j013M93N73o81l2Q45l16n71J44N09o79k16Q30P0
1706B91o44K01L81m79j32P22K8n74K33N81m90k82L54q4l28J46M58k22n5R2l43
1727a46JJ87o0k6P5ml57K65J02m28J11O08k58j84K05Q8l54r3P27l59k50L10K84
1750D44m63p3L97m4l56J18M14m59k49J67J03k92J38K78Pl66J72m3k5M6k4J5NJ33
$$ y = [-699, -15, 847, -528, -1230, 50, 255, -683, 129, 1017, 90, -612, 140, -81, -639, 126, 547, 233, 154, 577, 47, -545, 40, 121, -209, 208, 773, -183, -461, -71, -270, -758, -241, 596, -89, -105, 559, -392, -741, 78, 68, -522, 152, 1006, 45, -437, 374, 162, -763, 89, 962, 54, -361, 629, 297, -876, -512, 560, 37, -482, 638, 648, -533, -243, 113, -398, -491, 217, 278, -26, 15, 84, -352, -196, 204, -96, -41, 461, 250, -121, -88, -33, -332, -52, 572, 243, -258, 508, 335, -678, -185, 388, -293, -325, 520, 204, -367, -223, 286, -393, -609, 221, 291, -353, -152, 229, -250, -382, 340, 368, -206, 27, 608, 118, -164, 190, 106, -222, -76, 382, 160, 105, 197, -146, -145, 42, -18, -44, 31, 27, -330, -65, 37, -391, -280, 328, 70, -114, 91, 179, -175, -268, 459, 100, -150, 160, 444, -19, -92, 305, 261, -95, 23, 437, -22, -271, -104, -1, -293, -155, 123, 130, -236, -64, -107, -132, -86, -110, -95, -90, 43]
1774D3j4q9J01rJ24o6K4K5J29k59p0M4J17l04K22L1Q1j27j16L04k67l67K51K44
1798E2k52j05N46k78k39K02L59j84l89L91O6j97j01J01J84k81J96Q4M9j33l4R2
1820A29m2l48O7J91r3j13K49J10l42N2J84j95o9K53J5k36L0K86m0k20K05J09r2
1843I0k74M94j4l43nK60r5l20J59K13j08k70K03J98n42J32J90P8o9j55Q8J05q4
1866f9M8pO4j45K40m7J26k51L3J36q4M9J70o9k30J38K4j56o9K75k07k89K28R6
1890Dj13K6K02o1j47j57M04r7l13P2M28k29k64L51J93j81k44L64j0k48l3J38M6
1913A31J6M6k27J71qk27R8J12j12k09P7L13l75j25K28J12m2L5J25j65j03M9l4
1936a14L0J55j24k5K94P2l78PL56r9m45L18K96m95j58M06J80n85J73L24j99k09
$$ y = [43, 29, -60, 41, 32, 156, 90, 114, 139, 268, 9, -61, -17, 100, -204, 18, 49, 130, 3, -113, 191, -76, -443, -192, 52, -200, -305, 241, -37, -276, -74, 285, 101, -288, 103, 169, -28, -129, -28, 156, -125, 71, 155, 204, 71, 37, 129, 87, -261, -194, -3, -96, -209, 40, 150, -192, -140, 44, -151, -220, 33, 48, -188, -158, 128, 88, -132, 73, 182, 90, -184, 310, 296, -47, -52, 208, 113, -207, -48, 165, 57, -213, -10, 188, -354, -222, -32, 46, -23, -178, -90, 15, -69, -21, -28, 36, -109, 131, 84, 210, -41, -8, 128, 44, 93, 263, 194, -36, 102, 126, -30, -99, 176, -31, -320, -92, 4, -109, -83, 119, 58, -89, -246, 158, 61, -252, -180, 248, 19, -245, 106, 299, 118, -126, 238, 228, -20, -53, 85, 131, 147, 193, -34, 137, 129, -98, 0, 112, 0, -209, -132, 181, -194, -319, -91, 21, -21, 14, 139, -26, -129, -80, -114, -84, 71, -53, -78, 216, 288, -90, -83, 273, 174, -271, 47, 343, -152, -310, 96, 276, -309, -136, 188, -11, -220]
1958b20L15q9k48rJ54J01J3J49l44R6K90k50m52P45qk29r6O62k93n23L24K13l07
1981fk79N91j2n35J48pj28J44j5J86n6K25j55m47L16o0j40rQ53n18o34O71L04
2004D37n67j92O96m0l62K39l4m37P3K14L4j09N04k41o21L28J33o80L77O87m07
2025C2m48N45L22r08o3P68k1k31J68K96m21l12K61j2j56K33J87N3n5j83j84K3
2047a06J22j93j54O98P9o75j2M32l84l11P92J45o56L01L40n60l94M64J45p3K86
2068B86K90m07m79M57j71l02O06K23m77k73N27k35o49O84K08m32J1M71j95o00
2088d57J02K70n6K6M90k34N3N2m32o7K94J34k56L73L04p63k16N56n9n55M70N79
2110F08o03l41O21k29m85K25M91k61j55M05j53m31J9L72l16L6O67o4p03K57K28
$$ y = [-220, 95, 6, -242, -251, -97, 4, 17, 166, -178, -82, 208, -42, -494, 251, 243, 14, -82, 580, 287, -236, 88, 301, -6, -285, 306, 294, -241, -93, -100, -228, -84, -99, 87, 31, 256, 101, -346, -30, -90, -230, -239, 614, 96, -538, 133, 437, -130, -322, 374, 334, -28, 211, 177, -260, -187, 27, 61, -48, 456, 215, -406, -78, 55, -625, -248, 439, 32, -416, 129, 451, -457, -520, 248, 227, -4, 164, 460, 39, -273, -12, -24, -180, 53, 240, 293, 238, 55, -129, -106, 16, -177, -331, 367, 446, -229, -241, 191, -193, -504, 288, 433, -223, 78, 418, -142, -536, -72, 73, 0, 286, 576, 169, -310, 147, -24, -326, 280, 503, 26, -247, 280, 45, -604, 80, 288, -144, -133, 338, 143, -457, -355, -85, -141, -115, 375, 141, 194, 246, -186, -253, 41, 175, -81, 292, 596, -167, -383, 173, 114, -441, 29, 608, 5, -336, 285, 56, -429, -204, 287, 26, -129, 276, 123, -308, -289, 83, -233, -197, 470, 406, -297, -40, 188]
2131A88m82J59M52o0l61J55L03n35p7L14j45J0K01N7j84O8o2m31L70K47j13l17
2153b43M40l7n73K81N33n63j91O18J9n20L7M50k93l53P09R1o02M18R2l86j45L38
2175A20J15m06J70L86k96j35K37k87j33J71J86n8j21K13j93j35J34n9K07p3J44
2196A87k75J74n5j32k3J91K1k37K57M5l20j4L26J36n06j5N66k46m19L93M0l74
2218b80J49L94j35m18M03J57n19K18K91k95n8K56j54q4K56j60R8j59J69J02l31
2239a00J19o4n9J39j2k8k5K33l18J39Rj38r7K81Qk48kJ95j1j75J61J45j82n7L53
2264B66k9j92j30K39m6j45J09l3j4k6K7k71mJ51J72m5n1j36J48j68M1K71k45n
2288a16K0J33J43l76K96M7j24j7J72l1j76J2R9k5o7j16P0P9j57J42P7j64O7o7
$$ y = [188, -294, -135, 317, 257, -104, 51, 354, -181, -258, 56, -89, -79, 122, 179, -5, 63, 1, -430, -60, 187, 74, -243, 197, 160, -413, -132, 401, -162, -353, 265, 284, -236, -199, 251, -42, -395, 314, 405, -197, 221, 313, -73, -218, 120, 235, -171, -1, 385, 89, -46, 191, -96, -229, -58, 128, 70, -51, 162, -31, -166, -32, -91, 116, 43, 187, -88, 86, 31, -101, -124, 67, 88, -149, 108, 153, -167, -181, 145, 281, -225, -240, 326, 80, -339, 54, 94, -280, -131, 263, 128, -290, 113, 270, -249, -31, 260, -35, -93, 163, 9, -75, 181, 21, 119, -40, 129, 231, -100, 19, -45, -104, 35, 23, -5, -30, 203, -115, 24, 33, -105, -202, 79, 87, -161, -163, 32, 21, -154, 7, 152, -30, -87, 266, 237, 45, -85, 154, 108, -37, 72, 39, 25, -1, 26, -245, -249, -98, 74, 29, -22, -158, -10, -178, -137, 134, -111, -116, -96, 37, 180, -196, 100, 147, 23, 6, 178, 147, -29, -17, 82, 57, -10, -126, -56, 23, -134, 8, 85, -79, -12, -79]
2312g9J98j15r0J14n0j31K90j35pO2J37j50j01J15O3j68M8M4q2J1R1j6np6M6K12
2338B26k06k03R1K32l62J99j83L01k49J30R7n5j24J48J31k13P%J56m1m1O8j02
2361GJ3l7P6j38J18j06J10r8Q9J19j15l4j01J33j22N7m7Km2m0Q4M7L9l3O5r4l5
2388h3L4N7J07j76J5J36j07PN5j2r2lJ14K2k56K06J00k30K8Q3J4n2o0J46l8j8
2414cN0j66p2K27j3r2J19K3j47K7M2O2j32M9j4R8j10j28J98J7L1l2m2o8j00N4
2440a22J20N0K2m0P4j24jj05J88j23j2J95J0m7o8J37j26P0L2l8j62J26K2K3kj39
2466d0N1L0j62J68j51J4J90j12n6l0J97Rk03Q9J8J43k31J60Ok02P7J3K20k89K62
2491A71k01q7Q7J03qm2R4l20K79q3kj58K51j00o7qQ3%j4L9p4R1J17o7m9JJ0J2
$$ y = [-79, 119, 4, -86, 28, -22, -153, 137, 2, -5, 57, 194, 44, -57, 58, 121, -47, 1, 45, -37, -26, 65, 49, 44, -32, 14, 226, 20, -183, -92, 140, -222, -23, -206, 95, -154, -24, 73, 18, -106, 42, 173, -40, -33, -33, 123, 82, 41, 109, 7, 20, -17, 59, -79, 39, -67, 43, -55, 34, 153, 38, 4, -97, 36, -86, -29, -76, -74, -116, -156, -72, -25, 14, -19, 46, -48, -83, -49, 8, 115, -61, -46, 90, -17, -10, 45, 33, -59, -62, 52, 74, -182, 24, 124, -106, -78, 5, 19, -33, -93, 53, 15, -3, 47, -119, -191, 36, 23, -69, 50, 73, -74, -47, -5, 57, -75, -26, -40, 58, -52, -180, 18, 35, 66, 34, -8, -76, -176, -122, -2, 48, 70, 30, 104, -20, -21, -126, 62, -61, -73, 122, 132, 85, 17, 154, 28, 98, 130, 92, -70, 56, 78, 101, 99, -40, 11, 41, -121, 47, -104, -90, 100, -12, -68, -98, 99, 108, -95, -6, 12, 155, -76, 84, 90, -112, -35, -22, 198, -91, 171, -30, -117, -30, 73, 65, 23, 117, -203, 76, -7, -9, -167, 84, -16, -83, -91, -8, -8, -22, 17, -57, 34, 151, 84, 35, 36, 46, 58]
2519E8k91L31J8m5ok0Jj15j8J60k65K51Mp5n8J22J0k33J73m5L0r1M0l3Q1j3K5
2546dj8j6K34k59J49j20J89j66J80q2k15J33O3j1r2M6L8j60J86P5j34k18J14N4
2570c4j04J73j4n0L6J62j7k51rK26k50J30q5K77k09k32M19j37j5MM9j4p2P1j15
2595f1n6Q2J39k54K88m1j36n5J37o8q1J55k0k9J17j09j4k84L70k09P7R6J36j92
2619a2p1J12k9j86J42J30j76Q5K85m55J11%J31j86n0R6M6Q2j70J18j64N8K47n6
2643H8j95L36k37k0N0L6J7MJ44k61m9P9J18k15K38J2j75j7K1k24J94Q5n3l5k0
2668g9R2l4J4J3M6k33J78p7J77LO0k30KM7J5N6k33Q2K41m7q2Pp6J09j2k6j15L8
2696f4Q9rlN0p5L2q2R6o9r4M2J73r3j0P6q5j2K8j2M5Q3n4K9j7op3r7J8K63j51
$$ y = [58, -233, 98, 116, 71, 65, 45, 46, -69, -87, 73, -192, 59, 63, -12, -70, 52, 62, -171, 2, -43, -13, -104, -64, -97, -16, -29, -4, -22, -38, 196, -63, 86, -34, 155, -11, 169, 87, -128, 5, 68, 57, -35, 11, 49, -111, 75, 150, 16, -202, -88, -34, -138, 35, 21, -29, 7, 169, 152, -99, -108, 118, -132, -2, -87, 190, -19, -251, 168, 31, 16, 20, 69, 55, -17, 54, -61, -117, -35, 104, -150, 138, 97, -39, -94, 43, -25, -106, 49, 29, 0, 117, 8, -6, -290, 80, -129, -52, 44, 180, -12, -83, 29, 0, -186, -44, 86, -90, -5, 280, -175, -64, -64, 67, -119, -169, -73, -27, 55, -115, 3, -161, -103, 144, 88, -107, 229, -8, -28, 22, 58, 75, 79, 223, -38, -87, -8, 110, -105, 133, 145, -30, -47, -26, -250, -56, 29, -24, -59, -79, 13, -21, -7, 6, 52, -181, -3, -80, 97, 100, 160, -70, -68, -21, -6, 50, -183, -101, 140, 93, 11, 18, -58, 51, 39, 13, -102, -64, 25, 16, 13, 63, -12, 20, -62, 34, -35, -129, -87, 86, -7, -17, 59, -26, -38, -10, -22, 23, 106, 52, 81, 64, 58, -15, -112, -94, 169, 18]
2726A8k1P8o9M5M6r0n6J20j25J06qp0l1R8M9l1j07J14r3j7o0Qr5K08j58R4Q3L4
2754G0k96K46Q9J57j04l2k67J55j56P9J15j27l0O6R3j52J11O6j39K7L6L4R3j89
2778e5l6K32j51O5m5qMj92L09k40J13K5M0q2n2J71j93L1Q9o7J51j79o6O9o8J95
2804F0%Q6p4j4j09n5K25O9l4k30J14n4Q2K15l28P0mj29J38j3J01p4l4q6mJ09j41
2831a14P0Q1r7O0q5M5J14j07J63j6j14k9p6R7P8jj27J94j54m3J8j12J17J16j11
2856c3rJ69j57k0J67j84O6Q2j47j27K25Ln7o9J87p2J21k44K01j28Q6k12o1K26
2880A3o1J0J08l6O0p6J79r8k95j1J93j5L4q7J50l6J8L0j46j0J29N1p0Q1r7J02
2906A20j65J29j7j50J19r2J05M9j91J14r3M0j93J38J65K1o5r9J27j2n2J40j49
$$ y = [18, -3, 75, 6, 51, 97, 7, -49, 71, -54, 52, 44, -26, -57, 41, 90, 59, -48, 66, -27, -44, -104, -96, -191, 17, -141, -47, 36, 70, -226, 20, 109, 266, 162, 130, -137, 18, -138, -59, 56, -71, -101, -35, 58, -94, 17, 83, -56, -29, 7, 41, 134, -55, -91, 141, -10, 55, 10, 2, 6, -186, 123, -117, -4, 21, 61, -21, -73, 98, -95, -64, 25, -42, 109, -70, -136, -67, -135, 60, 60, 146, 72, 58, -51, -106, 119, 188, 154, -76, 38, -16, 66, 281, -47, 23, 19, -110, 28, 15, 116, 42, 8, -78, -82, 27, -114, -44, 37, -60, 0, -85, -40, 74, -33, 130, 114, 0, -29, -105, -8, 70, 69, -58, 136, -18, -61, -43, -155, -38, 78, -33, -42, 127, -30, -50, 117, -67, -1, 81, -66, -193, 32, 35, -22, -91, 96, 24, 145, -99, 102, -26, 60, -152, -213, 13, -48, -38, 70, 34, 94, 18, 197, 99, -196, -207, -14, -29, 5, -82, 68, 32, 50, 80, -66, -76, 53, 104, 34, 115, 18, 120, -45, 84, 67, -83, 36, -56, 49, 98, -93, 21, -72, -32, -225, -87, 78, 99, 34, -65, 62, 50, -2, 138, -11]
2929a1p9L0r0J9K79j97J3L1n0k8Q8J9Ql0J7qm2n6O0o7J86J1k04J8J52m7l4j41
2957a53J49r7J50j25P3M3k07K09q3R2r6L9M6O1n1jj25qJ17r4j4J80j32L4n9J11
2983E9j96K96j77MJ64j51j80J85J15K6j73l6M8R6j78m1J36j9p1N1n5J24j41q6
3007b00J51j30J13Q1M3o6J11rj07p9J43L4j00n0qJ58m3j60J05n5L3P0n6p4J03
3032Hn1J9J23k39OJ53P2j42j15J95R5j62J2j72L7J98o1p7J22p1N4jR2PL0j32l2
3059c2j00Q0K29q9q4j22N3K68q1j86J13p0N2m1nQ1q9k6J19k5j64L9J6J13j38L35
3085B46m5m9j70k3K3J08j38J29o5l9j1L9l4P6K2p3M1k46J91k73L13j6J97l36J56
3110B3K8o9M4N2j80L9K44k7j3j57K2r4Q2J08r2M5J7L1j26L3l0nj7rj27R7J53j23
$$ y = [-11, -90, -60, -150, -131, 148, -49, -36, -5, -55, -83, 5, 24, 32, 2, 19, 11, -31, -87, -27, -94, 92, 103, -101, -83, 69, 22, -12, -153, -4, -101, 49, -76, -3, 40, -167, 42, -41, 51, -45, -6, 40, 101, 50, 49, -76, -84, 33, -61, -75, 105, -27, 7, -52, 59, -137, 159, -18, -14, 150, -1, -181, 4, 119, 145, -28, -64, -16, 80, -98, -139, -3, -22, -93, -42, -97, 27, -114, -200, -49, -179, -66, 15, 58, -8, 103, 94, -13, -92, 51, 85, -15, -65, -73, 85, 42, -118, -13, -68, -35, 35, -21, -95, 8, -43, -24, 99, -140, -134, 19, 91, -51, -166, 29, 124, -38, -26, -198, -161, 37, -24, -101, 21, -50, 4, 3, 95, 102, 132, 0, -32, -132, -52, 177, 88, 4, -118, -65, 203, 122, -64, 49, -21, 31, -10, -15, 66, -23, -49, 70, 45, -119, -80, -64, 49, -89, 246, 201, 152, -18, -41, -18, 90, -48, 81, 16, -23, -34, 5, -29, 47, 69, -4, 37, -209, -18, -291, 22, 6, 203, -133, 23, 51, -18, 26, 78, -102, -63, 181, 154, 141, -16, 6, -88, -6, 102, 10, 55, 72, 103, -23, 10, -20, -25, -42, -51, -178, -81, 72, -51]
3138e1K5j02P1J07j65K10p2M7j85O6O4J24k13R5j12J46O9j35l4nJ88o8l5J5L0
3163H0mr5Q9n7K4n7m7J27o3pl4R7L1j89R4NL3j0o9m9J00N3N3j16J2Q7j28J11p6
3192eK20n3k63l0L47k15N2j20N1K6j15K9J21n9k0m5J59R2j79J24j26M2k04J52
3216a9m6L9J56l4j84K19k30K4j4N4J82k15K89j3l26j0N6K1P5J3M4q1k4J88k42
3241g8J09m3p1Qp1J72RJ09j20RN1j88Rk3M3K22k37K5J11q4k8k9O6j5N8j26R0J08
3269H6j57R0j20J50j04J4K4P5k4j9m5L1k3j27k7J58P1j08J35nJ2j50L8J14k77
3294a88J20K27j12l6n6L0Q5j5K6j82M3P0j35J2J51L9K5j00j7k4j1O4j43L9K08
3319A20j44o2K0l3L5oJ59k87K54o0N1o7J12r9N5r3K6J08j7Jq9J09N8j39j32K16
$$ y = [-51, -26, -128, -57, 50, -115, 95, 23, 70, -115, -49, 15, 139, -74, 21, -91, 55, 124, -11, -45, -50, 138, 70, 35, 50, 80, 76, -19, 70, 13, 37, -20, -67, 60, -3, -10, -44, 53, 84, -105, -11, -6, 27, 17, -52, -101, -1, 52, 105, -11, 1, 88, -40, 71, -5, 215, 162, -101, -131, 216, 1, 53, -67, -16, 10, -105, -76, 45, -14, -34, -79, 80, 172, -7, 117, -9, 33, -171, -19, -65, -26, 130, 96, -88, 131, -99, -75, -89, -35, 147, -68, 221, 208, -118, -128, -72, -51, 24, 37, 81, 0, -24, 164, -78, 31, -12, -83, -75, -146, 26, 35, 144, 24, 33, 84, -104, -95, -118, -75, 147, -90, -65, 46, -38, -66, -95, -29, -44, 14, -112, -22, 86, -71, 19, -101, 49, -55, -41, -17, 58, 34, 15, -30, 1, -22, -149, -176, -18, 53, -55, 80, 75, 87, -63, -25, 89, -188, -68, 159, 47, 11, -45, -15, 70, 55, 81, -101, -58, 12, -123, -111, 40, 79, 104, 4, -13, -37, -48, 16, -127, -88, 120, -24, -86, -66, -99, -64, -70, 89, -198, 56, -4, 47, -20, 92, -7, 48, -45, -19, 89, 72, 73, -16, 93, 151, 12, -120, 96]
3345I6L6j60J53j20Q8m5k37K01j07J42n5L3m0K6j27K03N6j61q0J86j22k4n2K39
3369A29j34kj1O5k24K31o1J26j79K06q0m6r3k9LJ10K18l79K27j72M1O8R0j07N2
3394D9l1j28M3o1L5J56o9l2j12K72j73N0lq4K40r2J1m0n6K18k14k0O7LJ28k70
3420a13Q8j12J09j6J9l8M9j1J46j50j33L15j68j1k8J02r0k4R0q5qk5J47rj13j8
3446h7j53K24J3K8%p4K59k41N9oK9nj67N6J92j33Jj60O4O9O2O4J4j20K8j0m2J66
3474A30k29J04K5j1K6m8J7K6n8nJ22k83J46J44k22J49jj33M0N7PN1l0N3q2k0o
3501c1J29r1J24j13r6R4p3N9k9pj16J34J24j98J23j18O7K5j01j6N1p9j4J19J28
3526I5r9l2J06J65j43j72J41J01j45j33R5p9J21j30J69Rr0j29J98j31L9O8N2O
$$ y = [96, 132, -28, 125, 5, 93, 48, -189, 12, -95, 47, -8, 25, -15, 11, -116, 87, 143, -18, -98, 88, -34, -58, -110, 129, -5, -7, -18, 47, -177, 54, -7, 119, -60, 146, 66, 20, -73, -102, -99, 11, 229, -150, 77, -95, -54, 14, 104, -3, 49, 18, -110, -67, -128, -93, 63, -6, -38, -150, 122, -51, -1, -4, -88, 152, 60, 71, 31, -25, 193, -21, -41, 26, 29, 157, -113, -25, -137, -28, -44, -25, -63, -14, -25, 121, -29, -162, 153, -15, -26, -54, 48, -42, -66, 24, -61, -69, -94, 53, 44, -69, -87, -240, -16, -3, 25, 25, -49, 210, -31, 28, 22, 51, 46, -121, -65, 127, -6, -5, -165, -101, -32, 30, 94, 108, -12, 16, 6, -36, 130, -99, 5, 30, 19, 45, -3, 14, 40, -18, -23, 99, -184, -38, 106, -116, 33, 32, -101, -61, -4, 3, 54, 24, 77, -5, -25, -31, 98, 7, 131, 18, -78, 16, -57, 2, -27, -34, -150, -16, 108, -90, 33, -85, -18, 7, -94, -110, -59, -138, -152, -33, 95, -4, -36, 70, 235, 92, -80, 61, 162, 17, -116, -21, -100, 21, -109, 60, 69, -21, -150, 48, -83, -44, 24, 76, 82]
3550H2j97J14J9q8M8J8J04R2j35l7j84J48M1j26K94j26p4k02L97k08O1N7j75l2
3574a09P3kp8K16O1k56J04Q5j07K4J2l9K5O4q2jK14k10J27j3k36K83l10L07j71
3599a9l2J6L7J24o6m3j2J26j31ml8mj6k6R7O3j36J23L5j17K3O9j69P3K5N3r3L6
3627fR9m7k8L8j77LK32j01J64j87O6J4j77l1L9J6k0N3J20j24M4l6n2K38j30R7
3653A07j37R7o0j0J02r7p0J85j4k14K7K69j29K3j77K38j5l7q2m4P3o8J20k70J90
3678GJ00j73l7J94O1m0J5n8j70M0j93J78N1J40r6o0n7N9J2q3J77j18j7J56o5m6
3704b3R2o7J97j76qk1J26Q6p5j56J4J03j00Q2K6q8m2K6N5j26J0O5m0J55j75J22
3730F2j04M4J36k55K05p4M3k2j81P6j02P8M2k9Rj05J69k5n8J3J19o0j24J09J12
$$ y = [82, -115, -1, 18, -70, -22, -4, 100, 192, 57, 20, -164, -16, 25, -101, 193, 67, -7, -209, 188, -20, 41, 98, -77, -109, -36, -38, -116, 100, 161, -95, 9, 94, -13, 11, 23, -16, 9, 73, -9, -10, 204, -6, 121, 108, -128, 155, -155, 152, -19, -51, -35, 2, 126, 60, 17, 5, 131, 0, -4, -42, -46, -62, -88, 9, 72, -64, 59, 94, -23, 0, 69, -100, -27, -2, 51, -42, -6, 93, 46, 18, 56, -121, -118, 114, 13, 177, -10, 56, 70, -107, -138, -99, -83, -103, -50, 70, -54, -10, -46, -98, 140, 10, 107, -30, 67, 7, -3, 99, 2, -68, 117, 103, -111, -84, 185, 56, 79, -98, 140, 125, 88, 6, -38, 35, -33, 87, -183, 7, 107, -66, -103, 91, 152, 112, 127, 69, -101, -61, -254, -76, -25, 115, 19, -41, -98, -39, -27, -110, 67, -51, -68, 88, 23, -23, 69, 2, 199, 23, 15, -6, 120, 206, 131, -25, -11, 92, -8, 74, 100, 12, -30, -4, 51, -75, -65, 0, -40, 115, -60, 62, -42, 2, 138, -117, 88, 14, 57, 35, -146, -70, -172, -94, -52, -81, -72, -177, -8, -33, -91, -78, 41, -19, -143, -34, 78]
3755G8m4K5l3J8m2R7l7k42J98K6M6j13R6j22J04oj03J41k67K4J80M1o6J6l7j37
3781a59J45K56l47J47j26K40k12j4o5J69J08j95J29k5j10j10L12j32J12j12j19
3802a08O4M9O0L2N0k34k1j5K2J74j24LNqml0J51r0N9M0k53J68p3P1J31j84J20
3829E5l5J06p4l2q3L7O3J07m6o9j47J52j2j81R0J6J02P3p4n9n7M1j2j7R8P8j41
3856b1K27j17j78J93o1k5l5O9n6L4O7q3R8Q2j17j71Q3Q5r0o4o2K25q9%j2j1L5
3883FK1M7j00O3Ok04O5J21L5k6O2J33j75k38L57o5O5l0l15L06k13J30L0j47J09
3908D3K2M8j0n9j90O8P5k5p3J02k2J28k4j23L0k6J15Jj87J23j25K43o9m8No1J6
3935b3L9J6n8J75j65nJ96k50J77j90J86R2j43j44K41q2r9K3J34j26J07j12M1j46
$$ y = [78, 34, 59, 26, 44, 2, 99, 62, -180, 18, 44, 90, -23, 73, -49, 55, 49, -54, 87, -180, -156, 24, 65, -1, 15, -22, -159, -14, 242, -105, 42, -84, 156, -56, -70, -135, 34, 142, -53, 76, 51, -59, -169, 143, 11, 123, 11, -108, -44, 5, 65, 97, 147, -87, -108, -123, -101, 73, -51, -48, -43, -51, -55, -85, 66, -24, 35, 75, -178, -10, -83, -12, 119, -65, 55, 20, 126, 52, 20, -63, -26, 37, 144, 98, 29, -118, 34, 22, -159, -69, -53, 49, 122, 48, -11, -68, -27, -39, -56, 42, 120, -21, 206, 89, -89, 104, 43, 18, -17, 52, -4, 30, 97, 14, 112, 194, 77, -94, -11, 74, -16, -80, -142, 83, -6, -6, -18, -29, 6, 27, 74, -26, 37, 43, -161, -96, 25, 60, 34, 96, 229, 54, -184, 173, 108, 173, 143, -172, 134, -79, 51, 81, -66, 43, 65, 113, 103, 44, -146, -78, -3, -28, -101, 1, -21, 107, 83, -40, -10, -36, 79, 80, -107, 16, -109, 134, 65, 17, 22, -39, -23, 16, 32, -26, 149, -16, -21, 175, -75, 102, -88, 98, 190, 47, -97, 144, 62, -37, -14, 120, -6, 101, -11, 30, -116]
3959a16J86j94J75J26j36j46J37j47K16J1Jn8j77J41m2Q4j42J63k18J46Ll0N1
3982C4j47L69l30m9r4J61R4J2j89J24K6J83k85J9L7J59k38K33q2J3j26J86k4o4
4006B2R4j27p4J75q4K5j01j07K38j71J74n3J39m0l3l9Qj2n3J77r8J8k58J26n6
4031a10R0Po9K09J0j70N9N5j81PR0O7j44J45k15J44p7J15n6j5L89k14k35J63p4
4056a0J3j21K03q6l7L4M1K1J5Pj8nk7j2j6R2j58o8OJ91K9o7L2j02J64j61m3J63
4084H0j49J6J41j17J40j96K73o7j39q0O8k6J65l7k44K36o5n1M4M6q6J28jk53J75
4109Aq7N8mO9M0p3k7r6K13j08k1N3m1r0K83l18L1J10j7J6P2n0j21N8J65Qj89J04
4137C9K4j47n6R7%j2J72o5l2k20K53n5M3N8k8n8qK36l26k7J51P3k14J46mJ07j29
$$ y = [-116, 70, -124, 51, 177, 41, -105, 32, -115, 101, 112, 113, 55, -122, 19, -23, 61, -81, 82, -136, 10, 13, -17, 34, -113, 256, -74, -123, -217, -56, 38, 50, -139, -15, 11, 194, -91, -72, -35, 124, -114, 119, 37, 50, -76, 110, 86, 22, 116, -11, -85, 90, 6, 31, -70, -177, 61, -110, 64, 11, 150, 110, 77, 38, 46, 34, -19, 158, 60, 78, -180, -54, -110, -20, -13, -82, 127, 137, -33, 26, 81, -100, -93, -3, 64, -80, 65, -150, -6, -83, 32, -24, -39, 350, 136, -99, 64, -10, 3, -118, 85, -1, -38, -4, 37, 58, 73, 80, 62, 57, 30, 18, 2, 94, -64, -132, -126, 65, 94, 27, 59, -43, 121, -40, -83, 80, -69, -53, 88, -29, 111, -85, 188, 121, -18, -98, -30, -56, 109, 72, -172, 64, -1, -52, -8, 38, -48, 80, 79, -174, 1, -86, -28, -32, 37, 77, 4, -23, -119, 94, -14, -35, 18, -23, -113, 170, -148, -117, -7, -24, -8, 64, 14, -107, -49, 116, 124, -65, 39, 63, -84, -140, -43, -43, -55, 117, 52, 20, -200, 53, -2, 41, 99, 71, 13, 5, 241, -85, -112, 39, 112, -102, 44, 40, 147, 18]
4164A8j26Q6k68K14J38n6p0J21K4p4P3M1o4q7M5p1J09J29k38M5J11j51Q6j26L9
4189e2J05L2p5q2J81k94J74j4M0%n3l1L0o1J43j52J77P1k14KP6j71M1K32j41j26
4215a62K73J02j31r5J22j32j46K78m4O4o4o9K07j94J87l2k13J9P3Pp4p5j9M8R2
4240B2l6o8J18j21K06r2Mk7J5m2j3lL2K9J54k67oK62j61r2K38p7j00n7P4lp2K64
4268A81m07L89j2k22J27K4r7P0j14R9L9j56O3K8j3n8J26J6j04kJ52j69J18j15
4292c7qR6N2L7j12J90k74J8J24n7J4k0o2n0M9rK37j56k3J71j14J0k5j98J49j08
4318a06J72n6K2r9J90j58j35J56J7J7Rlp5J40j14Pj02J31n4j43J83j6m6L5O6L7
4344G5j36J58j40l2K31n3k8M3j18M9jj71N0n7K21k06K09n7n8K5N3k50J44OJ13
$$ y = [18, -108, -22, -290, -76, 62, 6, -64, 57, 81, 7, 80, 121, 57, -30, 15, -56, 53, 182, -56, -11, 100, -51, 35, -91, -52, 53, 85, 10, -72, 109, -185, -11, -25, 15, 15, -38, -69, -39, -100, 43, -109, 68, 139, -75, -73, 3, -168, -127, 105, -36, -162, 111, 213, 82, -13, 109, -23, -169, 109, 65, 129, 65, -4, 203, 9, 196, 164, -49, -30, 43, 50, -24, -99, -118, -70, 22, -14, -82, 36, -85, 121, 29, 33, 6, 21, -21, -34, -37, -5, 24, 178, -89, -95, 167, 6, -86, 152, 75, -25, -82, -8, -11, -83, 181, -226, 163, 151, -71, 56, 80, -17, 53, -61, 38, 77, -79, -16, 12, -1, -59, 67, 83, -21, -23, 129, -40, 78, -37, -45, 51, 103, 140, 28, 218, -56, -38, 86, 29, 43, 23, -39, -89, -40, -49, 188, 32, 9, 180, 66, 76, 51, -147, 2, -106, 66, 10, 32, -67, 123, -35, -170, -14, 3, 20, 29, 26, -49, 91, -23, -16, -118, 13, -41, -184, -1, -17, -63, -28, 38, 75, -61, 97, -43, -75, 156, 103, 75, 118, 0, 49, 48, -123, -73, -130, 91, -115, 94, 37, -21, 4, 57, -193, -49, -43, 70]
4369G0J28j48j34lJ2J42j14K1J39m4j08O4J13k6j75pJ75Rk22J01q2L0k2J38N6
4394A13m2l2o6QP0j5Qpj41LJ18Qj53P2J35j63M5j08K49j03j9K0P3j28j1P7l6n
4422c0k6N9J5L7j73R2j16K50k78J26mo5J81j18j0MJ61p8l7L0o9J56j10j29J32
4447@k4k1j7J19Jj23p2K20j29N7k0j22J76m3N5l7L8m4J15k80K18q9P5j48Q8P4
4473F7j25M8J9J6J07Qj59P2j11R3K15k40k4J08j29K59l09J33l6l9K3J37j99M4
4497b2j9n2J90p1M8j47L6o4J55q6J01q6J7l6J24k4k62K85k03J37J48j22j94L2
4521a15K03P2r5p5j34J46j6n8J44r0P0k1n9J4m7P4j07J03j5k16J45Q0n2R4J0J07
4547A62k28K41k05p9J45j5l7K6M1k9j4O8K4j74JR0j11M5O6P9n6n9O6j6j42P1O5
$$ y = [70, 198, 50, -84, -87, -75, 67, -47, -26, 113, 69, -39, 25, 138, 112, -63, -70, 105, 114, -108, -7, -89, -59, -81, 57, 113, 71, 39, -27, -19, 51, 36, 44, 37, -104, -101, 17, 25, -128, -56, 79, -84, -39, -147, 102, -1, -20, 0, 73, -55, -66, 11, -25, -30, -56, 3, 18, 55, -118, -26, -142, 108, -170, -44, -48, -113, 68, -50, -60, -56, 105, 27, -10, 20, -49, 107, -3, -132, 0, -24, -45, -62, 57, 58, -65, -137, 83, -46, 11, -9, -131, 45, 2, 57, 20, 58, 14, 129, -151, 67, -22, 53, -95, -7, 67, -58, -10, 9, 25, 132, 140, -19, 53, -58, 35, 250, 10, -14, 94, -35, 224, -85, 48, 12, -27, -4, 133, -66, -22, -41, -93, 97, 26, 74, -73, -37, -101, 54, -32, 69, -17, 0, -36, 88, 64, -198, 87, -116, 21, 169, 47, -147, -115, 88, 160, 65, -10, -144, 2, -14, -72, 72, -18, 52, 31, -28, -14, -61, 13, -94, 9, -6, -222, -77, 3, -49, 45, 55, 162, -66, 175, -30, -109, 36, 21, -16, 10, 51, 22, 8, 76, 100, -74, -73, 17, -94, -49, 17, 96, 40, -19, 47, 31, -111, -40, 25]
4574B5p2n0M5R2nj09R3l1j3P9j15Q0P7k34n2K77j00qJ0m2J63k36j0J93j2j02J80
4601A23k0o1j29q6M6J82k3k45K11N3m3p5J9p5n8K40m0K1j03NQL1J22r0r6QO9o
4629a2j07Q9nl7J57n3L4k48K1K11r2j6K0Kj6J16p4k20K07J20m3j81K68j76L3n8
4655f0K25l35K14k7q7J13j64J12j83J62R1j39J48j52J53R6j61Q8j20q9K40n9j50
4678h4L7r6O8m1K73m1p8m6l8j7n7K18j80Q7m0n8M3MP0q0q0K7k2K08j09L7J43j99
4706e1KJ47L0k02K12j10j78N3j61K62M0N9j55P6K6j15J48k5m8j90K03J44k65J37
4730C9R1m0j27k0K54kk73J88j96P6M3o3J61p0M3k00K73k76K10j40K6Qn4J0K9j27
4756a37Q2o0J64P0j05nl3K54j59k37J03N0N0p6J76p8jk54J94j05J4n8L3J77j25
$$ y = [25, -47, -97, -52, 40, 35, -74, 19, -12, -25, 54, -61, 19, 96, -138, -190, 87, -13, -21, -11, -53, 110, -126, -136, 57, 45, -57, 123, 103, 42, -87, -173, -127, 55, 32, -213, -2, 51, 8, -67, -48, -123, -181, 59, 19, 40, -63, -58, -50, -19, 103, 13, -83, -75, -6, -12, -119, -30, -35, -72, 85, 32, 66, -182, -161, 50, -42, -58, -38, -36, -52, 64, -10, -230, -23, 97, 54, -127, 141, -35, -2, -60, 165, -170, 44, 17, -70, 43, -121, -9, -192, -30, 61, -78, 70, -82, 71, 167, 6, 94, -26, -115, 125, 66, -84, -47, -143, -75, -116, 157, 116, 38, -8, -46, -63, -120, 98, -82, 5, -35, -93, -50, -46, 24, -56, -136, -109, -131, 77, -32, 5, 148, -51, -49, 98, 128, -74, 138, 28, -150, -97, -258, 4, 44, 103, -52, 24, 50, -65, 83, 58, 10, -180, 23, 167, -98, 39, 130, 90, -37, -57, 197, 195, -78, 110, -86, -10, 33, -30, 131, 61, 104, -96, 177, -99, 111, -29, -3, 5, -49, -39, -10, -137, -55, -115, 49, 119, 14, 9, -24, 230, 71, -166, -63, -13, 37, -39, 137, 59, 58, -196, -2, -107, -93, -151, -118, 59, -66]
4781f6R3j6q0l1K60j49r3j6%J31j14J44J5m4Q4k29R8p2O4J74l10J95l2q8M8P4
4807D0J3J41j58N8l6o2j10J56L4j1j81J34k3n6J32j04Q9j0j18Pk9Q8j14J20M9
4832D9j49O0M4j5j1L0j87J07J5o2j3K05j65J02q4J72rj03j15j8J52K13k70P1J54
4857A73j10j56J57n4k0k1J25k72J04J70KM9j1j28j61N6K4Q6m4j30K34k42L08k51
4881a12o3J29n8N9J08m8q8P2Q5j01j5P0oO6R3k30R5q0N3Kj73K15NP4k01J17KR2
4909A62j89Q8k1k0o5LoL2O3k8P9m1k7P6j30rK5%N7j38K0J97j55J68j53M6k3L9
4937E0j68L0J70l4k08J84o5K15k7k65Q3q6L73k76j69K62Q1l28kJ87n1L2L7l8o6
4962g9R3n4J04j2k17J7J65O4j0k08J13M1j4R3k77Q9R5m6J24k5j03P3K0L1K1r4
$$ y = [-66, 27, 11, -69, -100, 160, 11, -82, -98, -98, 33, -81, 63, 78, 34, 118, -111, -13, -85, -21, 153, -157, 38, 6, -82, -34, 40, 53, 194, 36, 94, 58, -4, -114, 42, 76, 65, -116, 18, -5, -61, 71, -33, 56, 46, -72, -65, -94, -6, -120, 0, 49, -100, -40, 4, -11, -22, 8, -179, -72, -57, -119, -132, 73, -92, 10, -74, 98, 89, -14, -129, -147, 5, 218, -52, 19, 173, 63, -93, 64, 10, -10, -31, 94, -178, -74, 96, 98, 147, 136, 8, -153, -97, -73, 13, -31, -161, 73, -169, 139, -112, -175, -46, -104, -45, 63, 15, -73, -1, 84, -17, -32, 38, 32, 98, 191, -39, 56, -24, 29, 31, -142, 73, 78, 152, -49, 68, 70, 162, -27, 61, 40, 20, -45, -42, -48, -16, 47, 19, 98, 57, 30, 106, -24, -33, -8, -8, 49, -89, -69, 128, -27, 141, -12, 34, 11, 50, -118, -88, 82, 48, -160, 24, -41, 174, 147, -118, -35, -121, 252, -24, -193, 69, 150, -178, -180, 7, -44, -12, 25, -13, -79, 14, -40, 64, 52, -165, -148, 17, 81, 71, -137, -24, 17, 3, 96, -181, -92, 3, -43, 81, 56, -47, 26, 46, 77, 98, 4]
4988Dl6j41J19P7p7K21j3j27j8N2N3M1Qk87O8J16j25J68k15K20j23p0J28J8O5
5013A26k38O1J28o5J77k20O9q5J8J09j18K2P9p1j60J50Ql4P5j04p8J80L7j33Q8
5038B1R0j30q0LJ81j10N5j7k2M3R0o4j64J85m1j83j11L90j08k8q8p0J63O4M7j34
5064a8j01J61r9j03L46r6r2p2Q5Q6p8r6J92j29O7K0j52J02m3n8o2J33M2j31L42
5089B46j48J14k72nJ03O0j24o8K51o5j62K4J37j39J62k54K15j2m2j37K69j22k8
5112Cm9R7O7j23RN4K6j41j20K34j17K8L1J7j88J99Q4k33J01l4k1l3L5k1n8J25
5138b8J46l27K03nK13j27m3j05J06r8j38K12J13j32J4L5q1oK9J47O2k06k2P5j29
5163i2K38n0j00P3j7k6j12Q2M6M0kr1Q3k43J50M0j0R9o0j57K03n7O5r7k6J40k13
$$ y = [4, -32, -173, -54, 23, -54, 167, 154, 27, 9, 61, 114, 155, 163, -124, -56, 60, -65, 103, -112, 108, -15, -85, 43, 61, 126, -112, -51, 77, 12, 189, -31, 38, -47, -29, 80, -38, -16, 63, -8, -168, -18, -10, -44, 31, -73, -151, 29, 66, -67, 21, 111, -19, -99, -96, 85, -25, 30, 13, -9, 34, 124, 60, -104, 81, 40, -143, -254, 136, 28, 0, -88, -158, 5, 69, 116, -18, -119, 42, -57, -160, 186, 90, -2, -74, 11, 97, 19, -77, 115, -14, 53, 73, -79, 23, -20, -78, -140, -7, 35, -96, 246, 98, 212, -60, -65, 38, 98, -26, -94, 157, 92, -70, -46, 91, -48, 114, -140, 75, 63, 21, -116, 153, 31, 3, -46, 51, 118, -5, 4, 58, 84, -57, -177, 57, -60, -32, -1, 16, -172, 27, 111, -122, -21, -55, -76, -109, -74, -95, -153, -28, 118, -209, -6, -11, 202, 75, 32, -73, 33, -65, -203, 9, 122, -10, 4, 39, -42, -48, -19, 128, 190, -16, -38, 37, -92, 146, 96, -4, 69, 52, 26, -86, -4, 42, 82, 80, -11, 72, -171, -21, 19, 9, 108, 48, -109, 94, 37, 102, 5, -21, 119, -94]
5190i4J68p6M7k7q6j77L08J2j3j41J99k79J60j06j7K34j84J64q8q8O7q0P5l1J24
5215G1q2qO8j9j02K57j62L8j9K8j81L07q0r8q2O7k0K1M1R3j33M6j07R3l6m1J18
5242G8k72K38j5j12j12L57K7j39k71K34J5j66K52j33j1K17k69O2K4P1p7pl0j5
5266e4M1j02K0O1j3J06q3j04J76Q1j41O6QJ18j40r3P5qP8p3o3K9RL9j6k60M79
5293B36j93r9rNJ59j89K09K1j07m8O0j55K8J80q6k3P3K8j68k9o4J99J23j73K8
5318Fm6N6K3k9R6j11J67j55m0N2J58j94Jl2k1o0L00k41k7K8r5K22L1P6j31J1p6
5345c1n9K48r5oN5K6j46K26j60Q0J75m42J02j5J28j48r2J49J6j3K1m3or1J27Q9
5371I5j40mK3K1n4M7J28Pq4P2q4M3j00J87j75J6r1J83k58J85J13k05J15o8M8j8
$$ y = [-94, 74, -2, 45, 18, -68, -245, 63, 75, 62, -79, 120, -159, 1, -105, -122, 112, -72, 92, 4, -84, -17, -97, -22, -53, 71, -11, -19, 49, 30, -72, 185, 23, 61, 42, 70, -111, 196, 116, 18, -64, 3, -17, 4, 45, 138, 5, 51, -56, 37, 1, -40, 78, -194, 44, 29, -83, -195, 162, 189, 50, -221, 13, 28, -138, 114, -19, -30, 187, -82, -20, 4, 75, -2, -9, -39, -54, -13, -115, -95, -34, -47, 59, -24, -128, 48, 129, -12, 54, 62, 180, 40, -53, 22, 14, 92, 19, -44, -15, -6, 33, 17, -243, 236, 43, -56, -65, -60, 99, -90, 119, 140, 33, -15, 45, -110, -82, 98, 12, -11, 62, 90, -78, -107, -171, 28, 151, -22, 6, -40, 16, 39, 10, 106, -5, 162, 7, -33, 19, 177, -17, -16, -48, -69, -129, 171, -70, -97, -69, -164, 58, 89, 165, 34, 45, -31, -90, 158, 63, 57, 112, 138, -8, 218, 58, 138, 313, -129, -27, -42, 86, -62, -154, -5, 11, -2, 19, -24, -30, -121, 6, 95, -45, -49, -26, -5, -59, -12, 116, 123, 39, 111, 27, 70, -30, 157, -18, -2, -93, 90, -168, 17, 130, -75, 40, -28, 20, 2]
5397BK4k4o1J23m3m6QM0K6M6nm8m2J5j15J37J14j84J50Q4o6k06J06j75J59l4l4
5424d9K5p0J41jj10j35K40o9J2nRJ08K2pk20O3J48k38N3J95j93P3J0J3j06Q2k0
5451b9N2J05j52m5J96l17K12J23j55j01J21KK3j07R2r3J22l8j34L8K6J01Mp9K9
5476dJ3j18K32j02K9k59K71jn0q4O3N5J1Rq6r4J49K4j12r1K30j77j50K82j86L21
5502A75p6O4o7k44K03n2L2q0O6J9N4j70l1M3r8R7L9l5p0J26r4J94l20J97j22Q9
5528f1L3O9L1j73J99j19p1R4q8K08o4M9k4m4J6j09MJ79j39K3O7j22J23k71L94
5553B04k76qJ3J21K3Mp3j93L03k43J51q6L9n9M2L4j03K22k77Q0K21k75P8rM7O0
5579D0m3M7Ol0j61K23op6oN9l4k1K02k74M2J06o9J3J7P2o6N9o4K3L0j61K9N5P9
$$ y = [2, 26, 2, -59, 64, 21, -25, -17, 23, 49, 95, 90, 42, 0, 15, -100, 37, 151, -33, 117, 201, 135, -71, 35, -140, 19, -15, -49, -24, -94, 47, 46, -64, -199, 41, -28, -16, -21, -12, 96, 118, 111, -109, -46, 102, -136, -83, 112, -81, -8, 2, 15, -91, -9, -29, 23, 128, -24, -69, 127, -190, 22, 145, -10, -111, 10, 12, 35, -72, 20, -73, 49, 11, -123, -85, -59, 42, 46, -33, -4, 9, -109, 123, 21, 50, -209, 62, 61, 11, -73, -10, 45, 56, 65, -21, -115, 34, 58, -54, -145, 85, -92, -242, 40, -146, 175, 99, 163, 96, -148, 55, 3, 35, -45, 21, 40, 94, -76, -107, -64, -162, -65, -26, -61, -131, -5, -99, 95, -225, -28, -150, -61, -28, 41, 72, -101, 98, -21, -92, 2, -86, 122, 58, 107, 83, 39, 55, -54, -50, 129, -10, 13, 80, -42, 81, -190, 204, -72, -80, -67, 54, 77, 81, 8, -185, 118, -125, 26, -60, -21, -80, -38, -4, -107, 115, -162, -82, 139, -136, -58, -67, -20, 40, -3, 44, 50, 20, -141, 82, 76, 0, -6, 53, 19, -2, 200, -74, -32, 74, 5, 18, 35, 107, 41, 100, 36, 59, 89, -72, -43, 12, 91]
5608I1j28O9p7J07j75O2M2q1L8J96k2k53J65K7P9l30J54R7k84N1J34j23J74R1
5632A04L2o8j40R1J4q5R7J69k39PM4k12J44P1Qk67L05R3j92j06m4J51J82j67J52
5657A44j74j0M9n0P1j6N3m3j27J74p8q7J4Q4Kp7J40j32l5N4n7J42j53J69r4k2
5683e9O9l9j02K09r7m7O6P5j44J37p3J0r4J16m1P7q1Q0j87K02j30K13k80o3N7
5708a26mJ82k03K70p9j0k5pk06K08p1l5R1kJ18k64J22Q6M3k15Q8L9j02Q6r5K08
5734I7o8j9r1K08l7M6l5j18k12K42M8JoM5o8O9j50R0K1k71Q5J76j78Q7m9j1k4
5761a22M9K9J36j86Q4J23j62L1J21j8rj9j78P7N9j09p0K76j83J13j02lJ21M1J4
5786A13j10Qj60J74lJ15k23K06j47k1q2P5O0R0k26J16L5J46r0k89P1P4J02P2o4
$$ y = [91, -37, 32, -45, 62, -113, -51, -9, -90, -52, 144, 122, -131, 34, 61, 140, -190, -36, 61, -223, -172, -38, -161, 13, 104, 136, 68, -72, 19, 33, -52, 45, 214, -25, -18, 26, -186, -42, 29, 37, -230, 75, 168, -24, -130, -174, -23, 159, -8, 144, -30, -40, 9, -41, 30, 14, 67, 24, -103, 71, -7, -94, -80, 4, 6, -71, 69, -63, -98, -44, -101, 41, -112, 57, -37, -59, 10, -29, -131, 78, -19, -66, 0, 75, -69, 68, -5, 5, -89, 27, -14, 63, -18, 62, -125, 77, -53, 160, -120, -183, -126, -130, 52, -151, 119, 40, 30, 5, -2, -208, 0, -71, -106, -15, -17, 101, -163, -41, 45, 88, -127, -39, 0, -102, -16, -111, 97, 29, 10, -81, 127, 90, 136, 101, -17, -229, 13, 61, 62, 56, 101, 33, 102, -48, 42, 63, -208, -123, 53, -125, -38, -87, -98, -122, -73, -44, 92, -94, -10, 113, -49, -18, 103, 85, 76, 57, -121, -44, 15, -94, -164, 112, -71, 42, -60, -63, 58, 99, 113, 3, 11, -149, 25, 22, 137, -86, 120, -27, -48, -130, -55, 5, 95, -131, -15, 20, 166, 76, -213, -142, -68, 34, 106, 42]
5811D2P0r8j3K5k7m1L8om2J12m5r5O7j34R0L3Q1q6J34j58J20l8K4j5Rj6J10k05
5839f4Q5O1k26K22o5j8j64J06J73kk13K89r8q8M2o9N8k02J93j90J72K5j50J53
5863C0o3J37j45O5m5N6J31j93M0p7L6p4P6J11j09j1J52j15K0K5q1K3m8K6p8K01
5889I0k11J86l1j41J22LM1j19K58k12K5j3n0nL3R1j67O7N7p3L7j0N9jo5m3Q2M3
5917E3j83J04j64J90K02j95l9Lr6J47n2K6o7K27j89R0k3m4J18r7M7l8j29R7J49
5942A37j63l5n3P7L0J36O2j58j27J20rK8j00O5l9Q8l2p1O1j04j40M9J53QJ12k06
5968a11J70q8K9j07L7k1J32pO1l0j78R7Mj11K41k95J33J15k5j67R2Q1P4j13Q3
5993I6r2l3J25j98L26l37J68K10j79k03l6O9J64k3m7j42J99j63J61o5j19O2j07
$$ y = [42, 112, 14, 1, 26, -1, -42, -4, -10, -52, 60, 15, -80, -13, -147, -57, -24, 57, -29, 105, -53, 67, 29, 53, 38, 47, 31, 141, -64, 21, 82, -144, 78, 13, -5, -169, -63, 110, 108, -105, 184, 86, -2, 40, -29, 29, -173, 20, -170, 2, 27, -123, 30, -33, 104, -41, 24, -21, 35, 166, -27, 13, -64, -28, -102, -26, 85, -24, -35, 117, 2, 22, 47, -34, -11, -59, -33, -111, 90, -121, 65, 34, -107, 15, 18, 59, -60, 198, -14, 11, -2, -52, -57, -24, 67, -100, -33, 24, -49, -12, -22, 37, 36, -29, -72, 10, 53, -130, -26, -190, 0, 202, 7, -32, -29, -125, 22, -30, -4, -71, 156, -33, 57, 34, -10, 108, 11, 58, 20, -109, -12, 137, -26, -61, -114, -37, -7, 129, 191, 33, -94, 26, 17, 45, -55, 10, -29, 59, 27, -44, 17, -87, -227, -178, -25, -17, 95, -111, 59, -29, 0, -107, -70, -91, 41, 34, 95, 65, -113, -16, -12, -123, 118, -177, -44, 71, 46, -121, -29, 52, 126, 13, 96, 4, -29, 96, -102, 224, -113, 55, 265, 86, -117, -153, -84, 80, 57, 10, -132, 67, -96, 65, 0, -119, -57, -164]
6016a64K43j07o1J19O9r1o0Q1J10k68J32r3J11J15k31Q0j12K51n4j16o2J81k73
6039b00K90q1j19J05R3o3k55K23j37J58J07j21R6J4n2O8k66J63J1J4j12L6O1m0
6063gJ16j44JK06J4l15J64k8j04J19L0p7J32j70l0J62m4o2L7j00R9m5J03l0N5
6088H2r0j01J53r3JK07j77Lm1ll3N3J05o2l3JQ3Q4j35J7k6j28L0nJ14L2j90K16
6116F4j2R4j54q6N8N4L3j68J15q4J8J17J7M3k0nr3J31l09K90Nj00j06J40j4j07
6142g9K10j88J26j58J10J14k48J17K1n1J05L0Mj20K8R3q3k02J82K4L2k89J25J21
6166B4p2M9R4j51nk9N8J9j68J90q6Nol5q7J35J28LN8O6k04J18J09j78mM8l23J39
6194a05J7J34R3j34j18K28k95J58K9j15M03l37M7J68j51j87J42L7pk13K79k22
$$ y = [-164, 79, -28, -89, 30, 99, 8, -52, 29, 139, -129, 3, -90, 21, 136, -95, -15, -127, 124, 70, -46, -108, 73, -200, 90, 9, -110, -5, 88, 25, -230, -7, -144, 14, 121, 0, 96, 110, 58, 126, -140, 23, 34, 48, -64, -28, 33, -7, 109, -35, -34, 172, 186, -129, 35, 7, -97, 22, 52, -25, 107, -63, -93, 69, 25, -37, 0, -100, -1, -46, 57, 27, 82, -8, -109, 44, -49, -48, 159, -18, -15, -56, -59, -92, -39, 66, 4, -29, -28, 55, 139, 4, 21, -5, -133, -103, -108, 6, 38, -152, 64, 52, 146, -8, -94, -36, 18, 51, -117, -2, -86, -68, 49, 66, 109, 89, 84, -9, 122, -187, 103, 108, 8, -98, 42, 28, -79, 131, -57, 69, -89, 21, 135, -113, 4, 25, -26, 79, 109, 113, -7, 21, 114, 31, -171, 11, 35, 67, -222, -97, 24, -48, 1, 95, -56, -61, -90, -32, -13, -181, 9, -77, -72, -78, -113, -200, -65, 63, 66, 124, 190, -14, 104, 213, 35, 31, 79, -244, -105, -88, 46, 139, 5, -113, 115, -180, -22, 7, -108, 295, -42, 5, 173, 22, -165, -23, 14, 7, -206, 73, -149]
6216a49J58n4j5j4L47m56Q7R8k6L3M7LN0L2k29M0j32J99k8O7J4k5j0p9q0Q9K4
6243iN3p5Lq1m8J41m4j52K76j51oJ20l7j9L1j45L01k25J26j49L12l18P3Q7p7J8
6269Ek7J8K8k6j7m8J21kj08N1o0J7J02m0m1rk5L0M3N6j53NJ85k73K30k8j21K65
6297A78j44j05L8pJ8l2K02K2l73L6K69j68r2K32j94lJ41%Km1J41j16L0K6k34J05
6323f9M6K10k54K72j02j94J01m1o6j9J21O5n8K0O3Qj73J04J95l01J35Nm0r7J26
6348E7n8M3K1L5m9m4J47n2j07j95K03m8Q0l2kl9P1j79J83q5J03N3k7j22L2k0K41
6375B10j34m2L9j08m3J06K9J0l9o1k17K83p5%J41p6j49R2O7L5j06J4j04J98l7
6400C3R7nj28M7j6M4K7k4P6l1j98J86p8j10MM2q2J66J76l36J15J09j39J38j17
$$ y = [-149, 9, -45, -60, -74, 273, -183, -96, 2, -24, 9, 56, 59, 109, 141, -88, -48, -180, 19, -9, 58, 72, 47, 37, -42, -122, -33, -9, 44, -31, -28, -109, -157, -16, -60, -212, 64, -87, -93, 27, -10, -29, 2, -143, 158, -67, 59, -90, 222, -96, -23, 64, -13, 5, -22, -4, 24, -2, -19, -67, 54, 52, -56, -5, -65, -48, 54, 14, -27, -36, -61, -31, 12, 68, -85, -80, 105, -168, 62, 34, -87, 178, 34, -71, -33, -40, -22, -54, 148, 170, -203, -167, 102, -66, -158, 74, -120, -123, 18, 18, 20, -21, 120, 4, 34, 60, -174, -69, -23, 187, -67, 205, 103, -91, 10, -31, -97, -116, 5, 70, 12, 32, 95, 103, -70, 34, 229, -72, 63, 68, 28, -69, 57, -1, 42, 63, 98, 49, 5, 152, 100, -7, -202, 1, -47, 33, 1, -1, -40, 31, -148, 35, -50, 53, 106, 79, -43, -11, -31, 210, 76, 34, 73, -35, -78, 28, 57, 67, 28, -33, -250, 33, -42, -42, 99, 23, -126, -34, 33, 68, -38, -24, -128, 70, 33, 130, 125, -3, 44, 28, 72, 99, 75, 151, 120, -78, 108, 30, -80, -76, -34, -116, 50, 226, -110, 5, 114, -25, 113, -4]
6425dj07K30j06o4r4K42j61k7Q5O8k02R9p5K35q5J1J2j38J47j24J74k64J28J8
6449bM6k0k7L5o0q0K50j40k2K8q4J71k95Q5K05j44k7N2j15j3K57r6r3o2J02P8
6475B9j43Mj18K55q9RO1R7p7K2Q4m1mr5mK5o5L3N3N9j61k2K54k46k04L99j20p1
6503g6q7K30K4k15M30k53o2r2J93L6j09p8Lj00J38m0j11J49L9j07J72K0K7k49
6527a18R3K45K2j64k58K61j46O3R5k18J11J02L3j16j08P7J8K3J5L8jn9j4j10J80
6552F4j62N6oj32J35N2k18K20P3q0L2J2k47K79j05N9O3k49J08r4J79J69m3k48
6576h3Q0QN1J8j40N4n8J42o3Nq3J19o6L9j66m8J19N6N1p6kR2r7J18k56L01j01
6603A4k5J02L9k4k10J21l3N1M0p0o8M9o3J29L2j11J62j9j90J37m0J26j14M3J08
$$ y = [-4, -111, 119, 13, -51, -145, 97, -64, -91, -6, 62, -140, -41, -116, 119, 34, 45, 57, -81, 66, -58, 116, -148, -20, -2, 44, 24, -3, 32, -28, -108, 142, 2, -20, 8, -76, 95, -200, -115, 90, -54, -81, -29, -144, -157, 100, 4, -89, -151, -49, 29, -114, -110, -228, 27, -62, -53, 8, 105, 28, 50, 134, 93, 89, -6, -10, 15, -50, -17, 36, 95, -66, -88, 166, -80, -284, 115, -5, -76, -163, 67, 91, -124, 306, 53, -9, -101, 92, 128, 19, -59, -56, -156, -18, -58, -169, -20, 19, -88, 84, 104, 131, -118, -25, 220, 242, 78, -180, 81, -65, -2, 93, -125, -14, 88, 121, 5, -103, -26, -8, 15, 30, 68, 67, 8, -6, -116, 64, -98, -42, -48, -180, -45, 7, -211, 9, 82, 2, 34, 46, -201, 78, -27, 32, 95, -154, -46, -140, 39, 208, 165, -83, -3, 5, 56, 74, -66, -12, -70, 72, 9, 14, -69, 50, -16, 23, -143, -191, -72, -16, 35, -41, -43, 49, -48, 70, -186, 115, 14, -11, 91, 130, 106, -104, 17, -16, 35, 75, 5, -63, -14, -77, 52, 84, -27, 135, 116, -74, 63, 23, 149, 35, 78, 186]
6628A86j19k41%J75q5J95k58K12n3r1J35m5k01K04l7j13J71r2L8m1Q2J44m48K66
6652a6J29j71n0M6M5N5j26O8Q9L4j77P9k5j1K3P0o7n7Q6J0p2J20j06L6K1o4l7
6679f8K23j60O4k4O4l8q0K4J20p7l9J95k91Q1K7j55J11J94j61K8r1p6J05KK08
6704A86J3p7P0k37N1k3r4J07n5J31j06Q1n2Q1k2n6p1j4K08j45j06J55Jj22R5J33
6730A32j90j2K33j55N9k13J02NQ6n3lk1j10J86J14l22K91k37R4R5q5n7MJ65p2
6755C6k0j02o8J16PM8o0P3j44P2J24J56l93J4J76N9j61k3K3J24k23R3rN4N9m3
6781a2J59R9j58j18L0Kj9m4n6J07K19k02mo3j6J17J25j86j04J04q8J65j30Q1m6
6806c8O4j10K49k07J10k19J20M2p2l6J56n3L3l7o9N6j37N1M0J9k0K3OQ0nj44Q0
$$ y = [186, 67, -174, -174, 1, -84, 111, -147, 65, 12, -79, 56, 11, -190, 14, -23, -136, 35, -57, -19, -60, 22, 166, -282, -16, 113, -58, -108, -62, -17, 38, -88, -20, 69, 103, -74, 5, -20, -31, -8, 62, -5, -62, 24, 34, -38, 82, -24, 12, 33, -31, -68, 155, -5, 59, 35, 99, 61, -19, 5, 125, 48, 9, 204, -87, -6, 21, -134, -23, 171, 10, 38, -53, -129, -24, -22, 186, 199, 122, 192, -45, 6, -17, -111, -4, -59, 72, -34, 47, -5, 76, 54, -2, -73, -87, 121, -24, -130, 25, 26, -96, -1, 132, -58, -70, 163, 8, 67, -146, -44, -39, 47, -6, -9, -30, -140, 46, 160, -162, 129, -108, -14, 81, -4, -61, -57, 108, 36, 16, -86, -154, -38, -31, 17, -43, 30, -114, -42, 82, 238, -155, -141, 35, 94, -67, -90, -67, 57, -166, -73, -82, -28, 31, -12, 147, 246, 88, -30, 0, 2, -17, -61, -117, -10, 209, 7, 3, -60, -76, 41, 166, -20, -124, -20, -108, 57, -73, 8, -38, 26, -84, 165, -42, 68, -151, -31, 11, -61, -97, 59, 6, 39, 2, -67, -11, -148, -97, -57, -38, -58, -35, -29, 51, 46, -98, -18]
6833a8Q9m3l4N5m3P2n9nJ24j48M8j0N4j63K2J11l2n3J51q8j4k40k4J75L1N1r2
6860h3Q9m2P3l0r2J46p7J84j32j92J63q0Q1K7%k9j12nJ27P1j20J06K1j14L3m1
6886b8j07K61j39KQ4j66K69k35m6J83j13Q7Op1R4j00M9o8k9q4J91p6k4O9m0Q0
6912D9jl5Qn3K3R3n6P7j9k34J27O9o9L0M5r2M2kp2n0R1kk8J21j64R5q7K3l5J04
6942bq1J93r2j04l6JP7J58j31o9P8l3J21j4r4j3K08j95j3n8J27r7J95l4rk06R5
6969b8M7N8l4Lk6o0K7p2J40j53J33J12j26r9P1P5r4Q7r7J06Mj15m1m6R0R0J5j70
6997a03J8R3M3J0k38J62J8q9J17k6L0j5j0L8j8j15Q8j35M8K76j35j12R7j12J04
7022C4L8k69J60Q7l4Jj25M8Q2O3j45J18MJ2J3o6J57p6j22l1J05j44J61j52J06
$$ y = [-18, 71, 28, -6, 49, 6, 78, 19, 14, 138, -10, 38, 28, 82, -81, -59, 52, 20, -33, 118, 30, 16, -224, -248, -73, -42, 9, -83, 6, -36, 37, 7, -85, 61, -16, 168, 36, -156, 7, -73, 8, 35, 35, 6, -106, -111, 16, 87, -33, 73, 94, -20, 13, -28, -135, 126, -13, -11, 73, -93, 176, -59, -105, 78, -35, 52, 58, -13, 81, -19, 30, -38, -67, -151, 40, -36, -60, 9, -31, 49, 48, 13, 21, -32, -9, 84, 28, 105, 86, -148, -21, 48, -21, 9, 54, -38, 4, 2, -70, -120, -29, -31, -59, 62, -102, -7, -94, -71, -106, -2, -83, 110, 18, -86, -122, -121, -44, 114, -17, -86, -8, -41, 80, 66, -28, -41, 167, -28, -41, -99, 28, -69, 126, 92, 83, -123, -28, 19, 77, 43, 46, 20, -40, -13, -85, 55, -98, 35, 147, 21, -78, -7, 68, -26, 61, -36, 70, 74, -41, -82, -128, -38, 52, 67, -103, -85, 8, 51, 61, -177, -15, 3, -86, 31, 5, 35, 20, 10, 48, 30, -85, 3, -132, -84, 192, 57, -55, 42, -70, 34, 72, -197, -37, 50, 16, 17, -108, -60, 22, 85, -60, 58, 62, 74, 87, 21, 178, 102, -20, -51, 54, -90, 71, -81, 25]
7047B5jl2n6K37j23j39J70Qo1l8pj37K23k8k39J81k3L6p7J22j65K08K6oj90k7
7073a13J69n6Rj46J05RJ09M7j52j15J16J00j88Q7J93j82k2R3r5p7pJ77J42l40
7097a37J9M0R7Q7r8J24k3k38R1R3n8p6L9k0P7O9J29k16o3N6N6q0j7N0J05K8m6
7124H8j4j40N9o8J36J08j9j50J05qn9j6J06k9o4j9P6j54j1R5j6k8p1R7n4%K00
7151A50k49J66M0j88O4k6j83L03J63k34J04j59K9M6j21K6O3m1j26J89k1p5p9K09
7175E0J00k06K2%o1K94q8k16r8K11j91J96L0n2P2R0j65J17q8J20r0o6J3j09K28
7200A13o9R1j70L2K1qp3p4J74J69j37j61J25M4N7J8k19J18mp6j14m9L03j69K8
7225c0P3L5j45M5k8k8N5P4o2O4rP3j68M5J56j66j7O9P4k40L62l26L6kJ54j67N0
$$ y = [25, 24, -8, -64, 173, 50, -89, 81, 89, 28, -10, -17, -154, 69, 41, -198, -17, -40, -4, -81, 41, -124, 84, 110, 104, -86, -113, 56, 0, 9, -137, -32, -23, 86, 133, -19, -134, -18, 82, -106, -19, 174, -8, -30, 63, -32, -109, -116, 61, 203, -137, -118, -78, 19, 106, 8, 132, 109, -129, -38, 55, -3, -79, -40, -60, 17, 86, 215, -1, -64, -8, 48, -32, -49, 1, 106, 134, 88, 74, -66, -7, -75, 61, 169, 150, 0, 105, 97, 38, 22, 128, 99, 35, 16, 92, -62, -73, 22, 6, -22, -93, 4, -50, -50, 150, -99, 67, 107, -81, -17, -43, -226, 77, 240, 6, 110, -49, -20, 26, -95, -69, -6, -47, -173, 16, -5, -80, -159, 50, 150, -56, -34, -34, -95, 199, 111, -105, -203, 8, -183, 13, 43, -9, 63, 153, -12, 105, 17, 137, 47, -19, -6, -115, 113, 44, 135, -35, -3, 18, 10, -63, -137, 37, 206, 69, -92, 33, 77, 134, 152, -67, 51, 47, -29, -143, -192, 111, -58, -30, 43, 78, -67, -22, -50, -78, -23, 51, -11, 53, 44, 117, -51, -6, 150, -16, -33, 36, 110, -130, 232, -94, -58, -60, 94, -73, -23]
7252b3K6n1mM4k2R2M0j65K30k17J04j01K11j14o1r6K57l8k13l0l9K16j34O5L3
7277A0rJ4mK2o6J4o6N4k3M1K5N5p9m4j5J26k7K3k8n0J4J19q3J25o9k06N0J69J44
7306B36l13K57k09K5k5mM9k5m2J6Q9J6Qj51N3J59q1k37J44J3J88o6r2k28K11O7
7332E8L4j98J6Q0O0N3k70R2J92j98P1l3m7j0M3K4K4kr7K64j84Q1K4j55J43j42
7358g7P2N2j09k6l7M5L9qk6N5l4L3k11K20M4L5j12j41M19j07j59R4q0q1l7O9P1
7385Co9M3J12j37J74q5K7l7k4n4M0J41q3k7P3j03J4r2J75l5r1p5P2kR0j6j7k9
7413a2j8j16K45o4n9k5Q6M6k03J43L2O7j12j58QK58j88J57n1K1k3o8o9O5oj4J35
7440G7j0r7R6J11j46n6J73k09J09N4j20n2J75p1o6J73m6k19l7K58K9j16p7RnJ26
$$ y = [-23, 3, -48, -52, -8, -30, 62, 102, -63, 167, -50, 54, -47, 164, 50, -11, -107, 150, 112, -101, -131, -170, 46, -88, -23, 10, 1, 15, 11, 33, -33, -19, -85, -31, -54, -13, 12, 67, -12, -56, -71, 55, 28, 51, 23, -27, -13, 106, 23, 148, 79, -127, -77, 92, 236, -77, 180, -29, -4, -29, -33, 16, -9, -51, -35, 54, 70, 78, -73, -20, 139, 58, -179, -35, -22, 166, 100, 8, -220, -9, 58, 92, -106, -90, -10, 50, 103, -167, -75, 117, -81, -10, -43, -90, -100, -57, -33, -9, -11, -108, 156, -28, 53, 77, -78, 65, -77, -5, 47, -62, -88, -125, -80, -41, -49, -75, -20, -54, -21, -232, -12, 32, 67, -45, -186, 233, 126, -33, 61, -19, -100, -137, -68, 3, -66, -23, 89, -48, 126, 41, 68, 31, 7, -47, -7, 134, 51, 24, 97, -6, 8, -84, 91, 56, -35, -110, -38, -40, 50, 34, 17, -12, -30, -146, 99, 35, -24, -49, 37, 83, -120, 23, 55, 122, 10, -148, -140, 118, -70, 87, 36, 57, 34, -34, -103, -38, -44, -58, 77, 67, -30, 66, 177, 31, -25, 148, -61, 48, 102, -18, -70, 105, 34, -32, 141, 95, -124, -161, 97, 126, 10, -67, -58, -63, 63]
7466F3j25J13k4j5N9n9j21K44j76J18kM8k38j9K88j00l5j88K46q5P3n5n6Q2M8
7491H4j22kmJ81j41J9p3J97K5k42K04p4k12O9JK2K36j97j12K18r9J23j05m2jL4
7517a3K5M8r7l5J51m4J9qmRm1m4o1J07j84J28j30K65j35l7j2J27r1O3l1m0rJ95
7545A21p4j97K6J20K0q6J82%j95J09j22J57n4J00j31m1J50L3j23Q4m3l2M1N6N5
7570A56k89O2m6J50j28M3M6J11o5N9k26L8O7q5J59q8P0J12j62J10k3p6Rom2l2
7596g6Q2J28j71K5M1Pq4J20l8j0l0pK7R9j3k11N8n6J22p0L2J5m9J6R1m2NJ2qK0
7626C5j43o7J26L6J50q2j39K16j1j21k4K21k20p2O8o5J51k1j30k9J50K5m1l2Q1
7651F2J36k10r7J4L7l4K38j60N4r8J36q9j24J48o7J64P5j35Nk53K40n2j18K0l9
$$ y = [63, -62, 51, 27, 12, 71, 12, -109, 135, -41, 77, 75, 123, -115, -134, 154, 54, 19, -169, 77, -8, 65, 10, -46, 36, 84, -38, -40, -44, 137, -4, 15, -58, 139, 164, -78, 126, 52, -160, -91, -90, -68, 168, -29, -141, 77, -22, 101, -4, -46, -47, -13, 12, 60, -37, -72, 79, 35, 54, 46, 42, 51, 10, -34, -95, 12, -172, -44, -174, 91, -44, -81, -93, 34, -57, 6, -25, -65, -74, 121, 47, -150, -124, -4, 16, -70, 112, 112, -83, 26, -96, 61, 7, 107, -24, -65, 85, 118, -5, 79, 36, 4, 45, 101, 156, -133, -71, -117, 33, -95, -52, -6, 105, 40, 99, -127, -89, -22, -107, 52, -36, 34, 146, -16, 94, 71, -5, 4, -2, -44, -76, 6, 134, -37, -12, 29, 36, -48, 72, 34, 24, -6, -13, 14, 113, 100, -111, -53, -109, 13, -57, -25, -10, -59, -43, 48, 6, 11, 23, 15, 35, -108, -175, -49, -13, 137, 55, -84, 132, 121, 0, -24, 197, -23, -95, -27, -92, 59, 38, -92, -121, 29, 54, 13, -19, 62, 198, -12, -109, -95, -58, -92, 146, -14, 40, -58, 78, -11, -135, 13, -54, 110, 185, 50, 55, -198, 42, -10, -128, -108, -147]
7676a47L55j48n5n9n2K24j04r7J29lj17m6J3J8K88j44j62j23L61j18Qj0k6p4J84
7701I5j21J57j44k54K58l5N8P9k51K43m4K7J0j11l5K4o6J85J1j62K28k94R8j4
7725e8O8J0K7k45L38p5J15k96J87j25J40QJ5l1j92O0R3M1j02K1m6M3L1K0j20J58
7751H5j43J03M0m5o4Q4j45J29n2n8J14k00Q2j00J79q7O6k4M3m0K25k21M8R5j33
7776a9K1q2O0j29M1J36J4j30P0r9J64j7Q7n4j19R8j00Q3P8O7k68J4j19K92j20
7801c1L2J6j22LO7R5j07rJ22r7M2j17J86k69J27J50M4j98M9M3k3L2l8j00J09l8
7827c2j00J51R1r3N2k1M4k43J86n3Q7j61J4K82j25kj38J02J3j7q5M3J0Q0j27J68
7853A26k27q4J35Q9m5O3J6O1q4n4Q1m5p4P9n6L8J25j59R3lj25K3k7JJ89Q0k12
$$ y = [-147, 208, 60, 5, -54, -106, 118, 14, -83, 46, 43, -74, -120, -107, -89, 199, 55, -107, -230, 131, 13, 21, 11, -15, -89, 95, -26, 131, -13, -267, -9, -44, 14, 93, -158, 85, 41, 68, 78, -33, -68, -44, -110, 75, 86, -76, 152, -142, -44, -58, 10, 20, 47, -198, 140, 65, 180, -116, 71, -54, 86, 94, 109, 78, -114, -54, 39, 80, -22, -1, -47, -4, 27, 47, -73, 85, -58, 45, 85, 40, -24, 60, -85, 44, -8, -66, 48, -152, -70, -170, 9, -78, -12, -36, 7, -33, 192, -29, 19, 114, -19, 2, -80, -20, -149, -108, 28, 42, -88, -18, -117, 47, 30, 117, 63, -56, 42, -58, 25, 103, 170, -98, -84, -203, 89, -31, 1, 17, -105, -102, -35, 60, -47, -56, 66, -31, 11, -106, 80, -189, -62, 88, 132, -66, -17, 26, 3, 35, -3, -103, 6, -32, -132, 19, 110, 17, 69, 48, 92, -151, 35, -18, 69, -92, -78, 204, 79, 77, -61, 41, 54, 37, -48, -5, 5, 85, -42, 126, -101, -185, -50, 39, -6, 57, 73, 134, 50, -4, 77, 32, -42, 37, -19, 19, 144, -15, 78, 75, -50, -27, -54, -53, 136, 216, 4]
7880Dq9K42r7j49K7l7J12M4k34K69r1L5M2l0j77L46j62r4L7Q6p0m7P7nQ4j33j2
7907b2oN9Q0j6Np7n1jJ17j40J61j26M1J3K8j27l3L26j33q1j17J06P5j34J0J39
7933I6j85K4QJ99j74O9K18j84J04j95q3N7J12J09j94j78J30R9k3r4P5l2j39J64
7957a7P4R8k12L0J21j37O4L1p1o4Q8m0Q9j01P0j57L55l37J45k4l4l8R3M6k07J79
7983D4m5j85K23L0p0J37r9l7J53j17j55J95m0k1J07o1j5j43M3J34j19K76k62N6
8007B9m2j7J13l9j22O6l9J26j62M2R%n5R5J07k96J25M2j09J33O3l28K09J09j10
8032e1J24Lo4J2qN4Qo5N8M5j26J6l0J16l1j47O8J24k20J01P9j97pJ11J2q8J12
8059IQ2j86K4N5ko4K60j34l8J0j57K28kj98K55j10M2n4k1K2P4M8k16M6K4q9J31
$$ y = [4, -85, 157, 60, -89, -62, -99, 13, 57, -177, 92, 1, 36, 78, 48, -129, 217, 55, -39, -2, 84, 14, -33, 44, 39, 123, -10, -22, -28, 31, 111, 95, 100, 23, -28, -29, 88, -52, 109, -17, 24, 37, 65, -62, -95, 231, 98, 17, -100, 6, 81, -53, -43, 96, -89, -65, -57, 142, -32, 37, 255, 71, 175, -20, -103, -46, 66, 175, -19, -197, -67, 32, 9, -85, -10, -42, -181, -17, 57, 155, -57, -27, 94, -43, 21, 52, -19, -83, 5, -35, 54, -47, 23, -134, 221, -116, 29, 5, -29, -67, 26, 72, -135, 44, -1, -186, 37, 67, -3, 134, 35, -2, 151, 34, -121, 74, 34, 13, 120, 59, 44, -99, -56, 78, -41, 235, -27, 29, -13, -30, 83, 44, -78, -12, -51, 75, -87, -45, -36, -36, -91, 4, 111, -185, -60, -18, -127, 6, 69, -259, -50, 59, -51, 73, 76, 12, 24, 16, 70, 78, 13, 71, 116, -10, 6, -24, 92, 61, -86, -18, 106, -114, -13, 66, -131, -138, -27, -15, -103, 9, 91, -95, -71, -16, -18, -82, 178, 44, 6, 16, -141, 87, 85, -113, 142, 32, 74, 20, -1, 21, 95, 143, -73, -27, -3, -92, 39]
8086C9J7j61J24Q1j65n2J52k4m6J32p1P6m9j16P7p9m9J03o8Q9pm6J62j28p0N0
8112b9Q4p9L0PJ0N0R8r0j89K5J34o3J4q7NJ1J18j35L41j87o7j30J28p7M6Q1k41
8139a92L42k36J15Q9j58j62J35j34J76r8J34L4j36j59K48O5k6p6M5Qn1J8M9J5
8163D5r3L8K00k60K9K24k94R6j08l2M3O2N8j3j70P5K8m6O5J8O0r9L0J47p9q9N7
$$ y = [39, 56, -105, 19, 100, -65, -117, 35, 11, -35, 97, 26, 102, 53, -63, 14, -65, -114, -11, -79, 10, 3, -43, 119, -9, -79, -29, 55, -24, 6, 13, 23, 73, 171, 81, -108, -83, 51, -12, 2, -85, -80, -69, 49, -86, 255, 68, 1, -129, -1, -78, -32, 49, -192, 150, -86, 29, 118, -40, -202, -67, -201, -25, -123, 11, 45, -91, -250, -2, 63, 37, -39, 6, 14, -37, -19, 30, 45, -48, -10, 190, -70, -41, 183, -111, -15, -123, -155, -112, -50, 8, -5, -175, -100, -72, -118, -53, -35, 25, -74, -44, 103, 24, -65, -8]
8190hk5
8191c3
$$ Imaginary data points
##PAGE= N=2
##DATA TABLE= (X++(I..I)), XYDATA
0@%%%%%%%%%%%%%qJ6j6J6j6J6k4L2l4M2n3O1p2Q3r1J04j20J40j62J82k06K35k64
36a39K96l30L68m11M56n08N63o22O89p61Q40r26J019j123J239j365J503j660J837
55I65k036K260k518K824l184L618m154M832n729O967q784J1722j7245L0997j24471
70a03936j95736L63746J57441k48756j27450J49466P1923k8802k3136n1405n8713
81i5358R8437J31905p4204j85789L8384J95875J533j86782m2350J43588P5627
92A00866p7024p8855Q586N1143K8309j0342n5559k9648P4336P5583p5160r2514
104h0279O3311P1125n3066k5981M8986k3278m0138P1649L4346j14341m5288J34906
116D1952N7728j29211n2950J15496K9784r9305J464O7849m5248l3507R8585J4658
$$ y = [0, 0, 0, 0, 0, 0, 0, 0, 0, 0, 0, 0, 0, 0, -8, 8, -8, 8, -8, 8, -16, 16, -18, 24, -29, 32, -40, 43, -48, 56, -64, 76, -86, 96, -110, 125, -139, 157, -173, 195, -216, 240, -268, 295, -327, 362, -399, 441, -485, 534, -589, 650, -715, 788, -872, 965, -1071, 1189, -1329, 1495, -1689, 1929, -2225, 2607, -3122, 3845, -4939, 6783, -10462, 20535, -103936, -299672, 64074, 221515, -27241, -154691, -5225, 66698, 37896, 14760, -36645, -95358, 3079, 134984, 60780, -125009, -86625, 109250, 110783, -75999, -118349, 25239, 100866, 23842, -55013, -46427, 4716, 33025, 22683, -32876, -62524, 11812, 87395, 12235, -80279, -16968, 54157, 1091, -24890, 24096, 818, -39320, 32329, 66675, -47666, -92954, 41952, 99680, -29531, -82481, 33015, 62799, -36506, -35042, 32807, -12441, -45948, 52637, 67295]
128F7295j35225j1990J46100J2526j43415j8876J28701L1843r7009l4969N5159
139A40K0062j6309L876q411k2381K9008M2042l8829o3687K9636P4131j6886p0330
152c7938J2372N9990j6064m5233J6410J7093k0430J4683K5558l8544k2024N2938
164A8811Q904o0674P343O5331j7662n9874L0447N2027m3580m7431M8251L8964
176D0857m4172k2652L8299N043l0353R481J7963k6230r380M2710R108n4949j4303
189c8578O0251J8901o1896k2197N7587K4505m4682k1678K4790J1292o433J557
201C419p677j3319K1043K8619k5739m1707K4432M8411k1007m6539J7680L8303
213B5919j4772k4320J0349M647q989J3668R111k8113j0213L5499Q501l9277o756
$$ y = [67295, -67930, -79920, 66180, 78706, -64709, -83585, 45116, 76959, -20050, -55019, 140, 20202, 3893, 7769, -642, -23023, 5985, 48027, 9198, -54489, -24853, 49278, 32392, -37938, -25566, 34424, 18360, -26873, -10463, 6630, -13800, 883, 26441, -12103, -34127, 18811, 27715, -32959, -25616, 39715, 22053, -37821, -7374, 44653, 1073, -46358, 1893, 40857, -3315, -25967, 12332, 17375, -12978, -3497, 14466, -11764, -21144, 21566, 30674, -24275, -38578, 21673, 40574, -21322, -43519, 14068, 38573, -6109, -27787, -2997, 8295, 1862, 3419, -4258, -17577, 3466, 32085, 6346, -35361, -10929, 37482, 16475, -30064, -12384, 25919, 11147, -13173, -2824, 1823, -7166, 6502, 15613, -12500, -22713, 12786, 21287, -17990, -24746]
226b4746L7465M653k8547J745K0198q632j1702J3882N132j7314o91J9765m81k0093
240i366K43J8514o44j5495L504J2174q595q622J3888K996k0566J561K4987m304
254A0275k6267O590K3444q146j8760P688J0550p284j118P612p143p578J5496Q863
268A4222j9235r121K1252J0508k0744j1108J7595R730j3352p236Q861K421m032
281b39K861j074r546L831J3820p098j7243Q132J8480p385j6775O922J4069m893
295C862r063L473M000k774J115K489m720l063Q821M285j0749n116J1840N231j2429
310b798m927J1096K553r503l30P191k786m280N515J146p552J290P387l640p267
325f905M624O498m609m636N572M020m598k428M846J694m994n74M779q36m553K023
$$ y = [-24746, 12719, 17372, -11175, -9430, 10768, 2136, -9566, 4316, 9448, -7866, -8557, 11208, 10727, -9366, -9123, 9391, 8747, -6748, -3244, 8930, 335, -8287, 5601, 8597, -11969, -10408, 14579, 10275, -15992, -9402, 14042, 5896, -12864, -5176, 5374, -1910, -3028, 4584, -2559, -10137, 5359, 14222, -5013, -14134, 7118, 17626, -3118, -14226, 3369, 13099, -253, -7489, 1372, 3793, -239, 2622, 1548, -7998, -4167, 9653, 2555, -14688, -6556, 11924, 4539, -12236, -5314, 8755, 3862, -5201, -1728, 2272, -502, 613, 3102, -1618, -4681, 4140, 8425, -2324, -7440, 4400, 9631, -2798, -7725, 3371, 5924, -3579, -3909, 3282, 496, -3784, 1731, 2877, -4675, -3385, 4002, 362, -6905, -2281, 4217, -392, -5028, 544, 4564, -34, -2462, 2384, 4078, -916, -1490, 3289, 2453, -2100, -77]
341g7M048l355l122M106P93n111M05M756k986m700M142M096n084k385N437K054
357C017m549r29L428L57j999J20R43q10L17K270k51l319J059M639j648n601J200
374a756N130j183m507P09K400O5n89m88j828M38K735l40l258p24K388J628r23
391a03k240R3L496K062k687j713J229R09K13N01k068j484L896K275m972k022L981
408A366J17k815K366K73n177J021O371k770p105L148P198j253m906j71K269Q48
424G80L35k164j619K398L355m35k391j804k20L662L584n171o052N910Q110o092
440B186r812L611Q365r21m941m67J703J079N83j987m371K45N874L309l567m768
456c879l94O047M743o779q689P700J3197n948j4229L419J0276k945n037L953R3
$$ y = [-77, 3971, 616, -2506, 1600, 2393, -2718, -2313, 2443, -543, -5243, -1101, 2995, -2089, -4474, 963, 3017, -1532, -2461, 967, 1324, -675, -555, 388, -422, -105, 2165, 1914, -1405, -346, 4293, 2645, -2956, -1756, 3374, 2191, -2316, -1607, 793, 858, 269, -219, -2047, -1609, 1126, 786, -2472, -3196, -808, 820, -103, -2343, -2250, 1246, 3308, 621, -1092, 137, 1046, 1259, 1760, -308, -1792, 2104, 4379, -593, -2615, 1366, 1483, -1332, 1034, 1307, -3870, -2849, 3522, 752, -6353, -3205, 3993, 2740, -2166, -2337, -68, 780, 1115, -1049, -2668, -270, 3085, 2650, 259, -1545, -1765, 1897, 5481, 310, -5742, 168, 8278, 2186, -7626, -4015, 4350, 3429, -1512, -1979, -276, 803, 1386, -601, -4972, -4727, 1147, 4456, 889, -3879, -4273, 1774, 6517, -262, -8951, -1251, 11946, 5998, -8231, -4812, 5464, 2519, -2518, 1435, 1528]
471A528l906N721M131j0993q344R946J1024m822j1122J5J0097N548r975j1064
485a2216P634J4239l379j0864J213L671k141L673L413j0751l752J8159P822k0068
499c347j2378J4488J3222p108j2271l30J2121Q430r820j5363L883J4954L7q839
513b321n57R94m52P301J011j7132m502K4829J1326k3906j4540J8671J4272j2819
527B175j4122N184J3160M464p498q787M06O478K191j637l282m579M358J3160l394
542H277k2753k138K5528O805k2294o455J7996N570j2050n022J466J324P122N859
556I235p684r081N373P813j521o600n336N079J5248M89k1550p240K0775Q305j7685
571d380o336J4004M643o698j625k851n969O278J1720m607j2174K448J1599J985
$$ y = [1528, -2378, 3343, 7474, -3519, -11863, -1917, 9107, 4285, -6837, -6822, 3275, 8823, -1152, -12216, -4582, 9657, 6278, -4586, -3373, 298, -1843, 1830, 5243, -5508, -9260, 8899, 16721, -3347, -15725, -1237, 11985, 4877, -7394, -7724, 4397, 12827, 3007, -12356, -8473, 6481, 6518, -2321, -2878, -1884, -2336, 4965, 5976, -11156, -15658, 9171, 20497, -3409, -17949, 722, 14994, 2175, -11947, -6763, 6397, 10861, 3363, -5424, -5018, 1460, 3651, 2014, -1268, -5847, -1489, 11671, 8277, -14476, -16614, 8914, 15719, -6575, -13030, 4966, 10536, -1514, -6536, -5070, -3746, 3376, 9235, 1551, -7530, -2157, 5656, 4135, -2465, -7801, -2722, 12526, 13015, -8535, -15775, 5000, 13305, -4380, -10716, 3288, 7931, 1233, -392, -3243, -9212, -2934, 8786, 4179, -7995, -5547, 6052, 8037]
585H037j1102r614P925J7042j839j8667q38J6808J33j3959M89Q580j241L36N357
600G447p090j0703Q157J1328q509j0656P798J0743l178q574l282K833O370J283
614C967o710j631P194J633o200j565K056j494L033P304l327r978K571R395l299
629B949r129J846Q166K127l466m505k059L175L487k667k929J937K534L46l39m187
645b714n195O205J0088n378j0994N932J0479n779r342L095N512M59Q58j445m714
660b933J645O353k634p477J931O781K85l560k616r86K888L612l392m926L946O111
676E028l338n389J138K115J89J003o83j598J981K891k437l457J427K196K47L68
692A681q02j958R06K472j993l283K405L481j634k169O43n50j056J759R46k955
$$ y = [8037, -3065, -12679, -4754, 12288, 10449, -8218, -9056, 7752, 7885, -6074, -5585, 2995, 1754, 2090, 7447, 357, -10346, -2189, 9139, 630, -10026, -2228, 8515, 5337, -3237, -6519, -3686, 2684, 3967, -2743, -4374, 2820, 4453, -1747, -3312, -1256, -2750, 283, 7587, 4260, -5718, -3147, 6248, 2949, -6180, -4334, 3832, 5959, 2493, -2012, -4071, -896, 2591, -76, -3005, -1068, 1466, 1812, 1473, -2714, -7909, -1704, 8384, 3006, -7988, -2056, 8423, 2644, -6698, -3603, 1909, 2368, 3226, 1781, -2933, -1288, 5065, 2431, -5046, -3115, 3666, 3951, 391, -2225, -3211, -323, 3289, -103, -5029, -1083, 5028, 1690, -3699, -2561, -446, -257, 746, 63, -1535, 446, 3337, 900, -2557, -1130, 1066, 1313, 1681, 879, -1079, -173, 2299, 306, -2977, -572, 2909, 1275, -894, -251, -801, -1857, -98, 848, -2107]
708b107J86M352l82l840l64K406N21r05K17o57J66K204n28l131N86L335J90k214
726C5k70J088l39n1j037j138J214K517j462k346J122J746j148j174M14L97L36
743i6O66j370j220K307J476k131r08K014Q67j125o15N2Q2O82M03j487l64K011
761A244L88j871o66J098O32j081p59J70L54P82m86r67N39R59J02j014j30O52N74
780E20l26p88J36P85N17m64k99J09N83j01n85j92J93J06o7k08q2J48L06j7m91
801b17k03K69Pk68k88L37j30N9L79L4l15O72K39l61k83K19OP0J3j75R1M57K14
824H26n11k61P2M24k65q02j86N95J38n15k47N95J41k32R0k15j27K39M93l98j011
845a157J074J078o59p55N96Q62m42m58r6K17Q5Q5k27n38J72O69K42r80l23O82
$$ y = [-2107, -1921, 2431, 2049, -1791, -2155, 251, 772, -133, 84, -573, -407, 1797, 1269, -1862, -1276, 2059, 2249, 35, -235, 853, 514, 463, -574, -1712, -498, 2019, 557, -1789, -667, 1079, -69, -1243, -829, -432, -96, 570, -800, -2020, 287, 1763, -368, -1276, 738, 1605, 480, -135, -83, -1, 681, 1084, -403, -767, 1244, 1632, -239, -905, 193, 825, -256, -1015, -845, -491, 291, -195, -1162, -623, 336, 438, -576, -706, -54, 520, 194, -594, -458, 327, 844, 380, 81, 190, 773, 672, 87, -105, 88, 194, 127, -81, -163, -15, 291, 274, -217, -420, -151, -144, -412, -700, -363, -493, -434, -55, -21, -336, 336, 575, 214, -69, 150, 156, 226, 239, 64, 155, 612, 826, 315, 54, 126, 550, 285, -517, -703, -108, 30, -485, -732, -137, 4, -228, -138, -353, -480, -241, 252, -146, -1157, -83, 995, 336, -419, 177, 1039, 597, 139, 43, 260, 345, 430, 203, -335, -163, 506, 748, -232, -555, 127]
865A27L78r09n13N88l3j80L08J35m28J52O35K43r05o8R60K74j124KQ29J20m84
886A07K24M99o03q30J420L06j697m50J413J67j511K53J018k88n29Q12m45r64R07
905a91M69q63k99J115P8o65O49K82j061K92J567p15j374P80J409j170j294P39
923b52R68l46n76L83O00n08j538P66J201j340j308K282J498k835j514L144J309
940A934l372l10L565m73k673J102J971k068j267K797J168k624q74K443lk013n51
957a248R26P98N03r76j210R80J165j809q38K092M90j483M56J281j857j471K084
974a17J812j799r19J643J379j407k124j38K824P04k525n15L263n21l888J419L386
991B477l069k679N380J708o572j359O401N0n869J120N206r63l212Q16J235j553
$$ y = [127, 505, -404, -917, -329, -362, -542, -234, -99, -527, -375, 260, 503, -402, -470, 490, 764, -360, -358, 471, 591, 107, 331, 830, 227, -603, 817, 1123, -574, -1024, 389, 556, -955, -702, 316, 28, -501, 311, -134, -1098, -191, 278, -585, -884, 231, 309, -356, 293, 575, -486, -194, 1373, 658, -716, 64, 1473, 303, -991, -252, 716, 370, -206, 177, 777, 269, -1269, -503, 698, -642, -1950, 332, 1830, -1005, -2519, 625, 1934, -1438, -1748, 1817, 1344, -1329, -227, 1744, -324, -1591, 1206, 2374, -250, -1124, 1319, 1316, -697, -1248, -322, 476, 979, 3, -1207, -227, 938, -871, -1709, 383, 873, -610, -154, 1127, -730, -2201, -117, 1695, -104, -1023, 620, 1999, 592, -1532, -1670, 1154, 1858, -667, -1182, 2081, 1560, -2328, -909, 2477, -592, -3271, 2109, 3817, -2755, -4114, 2287, 2337, -3532, -2412, 2794, 1831, -1381, -565, 670, -883]
1007h83k23J605J3n29L75M82K91p83k109M52L419K7l506K59L366j262l431P60
1025a677K179J35k72L99q34o18M76p13k97J404Qm59J812L74m281o09N506J1n555
1044c011J573O080k720n524K540L592l593j057M576K88m529O88L342k241l079
1059c075J696K981k32j792n14P66P41j214j159J595J735j177n67J213j255j744
1075b002J783J929j684q52K787p9k627j50N91o38J101J699k026r79K649p9m094
1092b671O67L690j366k176L140O28m043J80L597j451l031L254L257l080k618K038
1108A5R94j990J20J714L30q09K62j14o49q22J40J609L73j506l65J340j00k601
1126b059N68K434n13j325J702M43k779M2K222j007j508K657J645k992n32K410
$$ y = [-883, -1106, 499, 512, -17, 358, 840, 1131, 348, -1761, -1309, 2110, 2137, -1369, -1110, 2256, 994, -2437, -1677, 502, 637, 365, 764, -70, -688, -212, -925, -1222, 182, 190, -269, 1543, 1917, -2364, -2973, 2533, 2544, -3011, -1438, 4642, 1922, -3602, -1062, 2530, -1063, -2120, 2456, 2744, -1785, -1097, 2245, 4, -3075, -1379, 1602, 1370, -422, -936, -170, 571, -643, -1802, -207, 1528, 351, -216, 997, -258, -2002, -219, 1710, 26, -826, 1961, 1882, -745, -895, -304, -942, 159, 1858, -168, -1147, 1502, 1423, -2671, -2004, 1686, 320, -1856, 1284, 1912, -2131, -1951, 1646, 195, -2836, 418, 3675, 595, -2023, 15, 1009, -981, -861, 853, 1183, 374, 636, 522, -127, -949, -809, 800, 1173, -333, -698, 642, 542, -2059, -1491, 943, 430, -895, 807, 1250, -1529, -1487, 735, -272, -1780, 877, 2522, -470, -1002, 1408]
1142A408r99k245K212J444k403J13K303j273k793J565K031j649o28K121k64j882
1158i39J69J000r14m76J329P13p62l33K01J54n04k50N41R20k29r18N11P64j430
1177d53o20J802L57j727Q04J407j765j702K266O76k503N05K695j298k169J648
1193g7J124k066m37K421p3j936R94J331j704q48J673O24j291L34Q48n12r46K86
1211b55M02j37j88M47L71o00m48K96L26n13k38P10L33j141j75J073k05r83O88
1230b37J042j168m74J644k41j660M61J959r85j294J482R06j731m00J515k57j575
1247a013J001R68j269n56R91L05j041mR72o5q65M31L19m85l09K89O27m76k52P67
1267C35L39p11j85P41P9j020K31Q54n67o62P97K74p75r2R56l31q51K85O89n07
$$ y = [1408, 409, -1836, 376, 1820, -583, -470, 1833, 560, -2233, -668, 1363, -286, -914, 1207, 943, -939, -770, 230, -684, -1160, 169, 882, 120, -213, -12, 142, -362, -612, -71, 849, 620, -298, 213, 977, -453, -1073, 729, 1086, -641, 163, 1570, -195, -1897, 369, 1045, -1458, -953, 1742, 444, -1725, -77, 1047, -1019, -1456, 965, 892, -1044, -50, 1281, -423, -1271, 402, 1026, -265, 69, 917, 405, -541, -255, 147, 10, -178, 269, 640, 40, -408, -112, 214, -299, -537, 173, 506, -635, -810, 263, 58, -925, -237, 805, -363, -837, 807, 566, -1094, -633, 1326, 341, -953, 529, 1435, -296, -696, 819, 562, -1013, -12, 956, -313, -869, 122, 427, -614, -618, 354, 289, -576, -145, 174, -311, -620, -331, 296, -180, -432, 335, 674, -37, -222, 519, 598, -422, -191, 663, 96, -566, 231, 505, -270, -362, 594, 263, -588, -303, 386, -121]
1287a21p23Q24L11o36j55Q80m0q80L09O74n01n90Q97K57q45j7Q45Q5p08jQ00m98
1309A67m50M47K49o31k59O62K24o93m3O96k19o85K40M44k72m98N45J69l07l46
1329e60O01K66l69R8N13l76n17N82J23n15O4M61k50k30M06j33l16j27K98J65n37
1350c53RM27r7m78M04J52M4m47K06K34k89j04J41L83m24Q8M19l6l35J74K86p1
1372C33m40pK32j3k10J24J19k65J79n0J3j21q6M7l08J04L62l03J4K36j2j10P9
1395h3M54m53k7J80K55l20n4K42J67k70lK25N4k79k99J30J13P4o56L25L80k11
1417e6n14L22P25n79l06O04J85p61l1O11j93k91L17K64Q3j64j56o4M05k94o86
1438e79O84O19o70m38M92M27r04k88J045j57q50M57N94n77o21N96M37m56J12J83
$$ y = [-121, -844, -20, 291, -345, -500, 380, 340, -540, -231, 443, -58, -648, 249, 506, -339, -356, 489, 574, -134, -135, 665, 167, -283, 164, 413, -218, -477, 185, 409, -284, -327, 369, 150, -535, -295, 149, -123, -621, -76, 93, -214, -560, 41, 307, -62, 36, 549, 173, -344, 238, 361, -154, -90, 371, 121, -109, 297, 164, -152, -279, 19, 184, -353, -344, 83, -14, -492, -88, 64, 108, -339, -133, 101, -188, -292, -151, 232, -192, -104, 315, 279, -56, 118, 404, 333, -107, -114, 118, 105, -105, 19, 138, -127, 52, 2, 15, -106, -192, -145, -453, -349, 13, -290, -276, -40, -52, -162, -83, 371, -82, -109, 71, 326, 6, -48, 194, 361, 91, 88, 313, 367, 88, -211, -81, 32, 106, -550, -225, 155, -56, -570, -248, 477, -102, -408, 196, 381, -380, -411, 200, 7, -284, 33, 297, 380, 216, 60, -4, 401, 107, -579, 105, 724, 54, -384, 108, 535, -369, -657, 388, 231, -619, -162, 432, -145, -766, -170, 267, -189, -77, 106]
1458A06Jj3N2p55N68P24n17n92Q16M59j290j49J517n29j330Q27J140r27j155J110
1478F3J57q59J60P53R9k51j73k89L59k9m29j52J343k27j137M91J121j328q07J553
1498D18P80j509k09J400o29j258O47R20p44J3P05k36n45J8k50k57Q30K13q20N57
1518D4Q78r85j099J238P81j298M5J540m61j395M78N50o96LP61M35n25m0n22K3
1538b45K83k39l17P73N61j202n36J178m2j565Q63J628q51j287J268N70j845j26
1556a131J823p8j063J006J70j039j46M34k53o1Q28N1p46O14j08j080R6R67j71
1575A13p02J150J26j366j88Q85m19k86J084K93q73J75K05o94j7O42j60O7R15k90
1595F60j100J84Q25q81m85J708J05j590K38J022j153r18J648N18j133K71R51r32
$$ y = [106, 107, 94, 146, -609, -41, 683, 166, -426, 390, 849, -441, -590, 927, 398, -932, -105, 1035, 108, -1047, 63, 220, -639, -479, 274, 373, 122, -51, -340, 19, -10, -439, -591, 752, 525, -612, -121, 1000, -328, -1135, 418, 1198, -311, -520, 880, 251, -1007, -360, 560, -184, -171, 534, 298, -247, -229, -479, -736, 94, 307, -513, 44, 922, -63, -1162, 76, 857, -441, -396, 1144, 683, -712, -234, 316, -380, -377, 384, 819, 294, 254, -268, -245, 38, -201, -518, 255, 816, -386, -922, 256, 214, -1351, -488, 1140, 289, -998, 270, 840, -1005, -1131, 692, 614, -449, 557, 727, -312, -458, -24, -277, -338, 490, 541, -205, 409, 301, -779, -683, 284, 113, -589, 561, 687, -679, -867, 18, -401, -687, 397, 690, -183, -8, 197, -497, -514, 128, -32, 35, 950, 660, -440, -256, 569, -312, -797, 911, 1016, -574, -336, 686, -467, -1385, 263, 781, -352, -81, 870, -62]
1613f2j159R57K72o03N31Q39l97n45L07k25o13P32N34l77L3M45o21m95N28M2k83
1634a60L75N70p17l75N04m96m72O87K66n02L37O66o95q17R89J00j009O15J194
1653A060j061n16Q60K68j510N42J279n61p30R78kj297J81Q44k69m80P31Q6o13
1672b10j34L77m80K6M77n1j26J97o9m25K00L00l87K57P79n51n48N26j6q03N20
1693a41O47m55k85N48J07r20K01P83n71k81P34o0q49K11Q44q60k78Q73q4m57J38
1714a55M40m10l34M77K49n13J97M79k87j90o0J19p1K08Pj81J07K3m33K57M07o15
1736b79J21M75n8o11K62J80m76k3P30j72o00L99O08n38k13K61J63l70P7N10m43
1757Ck28M78L9j49j30K53j56k05J48j01j42mJ85j57Q5j61J56J1n7L9R3N9j41p
$$ y = [-62, -1221, -264, 8, -595, -64, 775, 378, -167, 140, -85, -698, 34, 568, 191, 224, 669, 48, -447, 81, 123, -160, 215, 785, 68, -307, 197, -299, -771, -84, 182, -320, 17, 683, -12, -829, 160, 260, -749, -134, 1060, -1, -517, 343, 611, -899, -357, 922, 361, -369, 609, 607, -690, -509, 335, 66, -414, 317, 403, -210, -344, 33, -447, -421, 56, 5, -121, 76, 7, -418, -218, 82, -305, -48, 731, 180, -368, 158, 142, -661, -141, 506, 51, -234, 314, 421, -499, -298, 485, -86, -367, 367, 307, -542, -331, 513, -347, -625, 248, 164, -293, -155, 285, -125, -459, 18, 267, -246, -49, 430, 143, -47, -107, 12, -59, 149, 156, -25, 82, 105, -328, -71, 336, -279, -158, 317, 259, -352, -90, 90, -386, -409, 321, 149, -451, -52, 556, 18, -195, 66, 229, -141, -64, 446, 3, -225, 253, 292, 143, 13, 266, 110, -95, 53, -48, -190, -194, -9, -166, -81, -242, -86, -75, -132, -93, 0, 59, -82, -89]
1781h9K45l06j1J90Q7l4r4K28N1k59j6K21O9o39L72O6j18r2L39p4l57m2K33rl20
1806c59L08K45j36k82J82K10k43j94K44J74k70K39L6j49R8J98mm6j34J14q9j78
1828c6n2J20o6k09J92q8j47L12pLpj78J44J05k95J95K02k72k05N63P8l06l8K61
1852B69j76k00J15K32k81K6R8N0p4j12L73j41j97K4lk50K27l05J61K78l39L23
1874I8j64j95K85R8k06N4J56m5r8j4K24j46n1Q1J02l9o5j6J28k31k85L22J82m08
1898b33j18O36k85l14J34N12n07JL62j36n0q4K0J91r1M2O3J39j10k40Q1J56j70
1921am7K17K0k79R8J69m3k52Q0lj6k35M0J29P6R2m2o6K34o8l75k3M71K8m92N39
1947B51J20l55j78L50L2l92j3M36j87j95o5L09j42j44J38Q3J65k34j17q4M12l92
$$ y = [-89, 156, -150, -161, 29, 116, 82, -12, 216, 267, 8, -8, 213, 282, -357, 15, 81, -37, -129, 210, 136, -221, -263, -30, -39, -359, -51, 194, 58, -224, -42, 168, -75, -269, -25, 149, -121, 118, 154, 5, 103, 301, 297, 251, 117, 231, 142, -36, -88, 32, -34, -243, -51, -139, -286, 26, 19, 22, 15, -163, -19, 86, -209, -14, 188, -84, -289, 274, 352, 46, 8, 269, 93, -107, 8, 240, -41, -15, 83, 133, 59, -53, 320, 179, -18, 6, 3, -247, -20, -325, -164, 114, -225, 98, -66, -261, 24, 122, -84, -30, 126, 81, -17, -31, 193, 47, -4, 77, 179, 140, 75, 59, 187, -44, -329, -7, 175, -233, -351, 285, 0, -314, -180, 332, -175, -174, 188, 52, 2, -82, -62, 129, 38, 80, 143, 282, 172, -68, 13, 169, -1, -48, 169, 189, -90, 8, 177, 134, -118, -38, -41, -57, -292, -252, -123, -47, 45, 3, -63, 171, 103, -272, -295, 176, 204, -288, 251, 371, 16, -162, 188, 220, -172, -185, 251, 64, -131, -196, 113, -29, -173, -35, 48, 213, -21, -138, -222, 190, -202]
1969b02p9J69M92n73k01O87Op00K27N44l96j78L31J19l58j88M12j94R5K10j27
1990I6m5K1j70l02L08L53m72P0N95k48p56M35M54m64j34N91K09p54K70k7k07J12
2012f5K74r0O5J99q6p85M80J25l82J13P17k42p45M72K76p24j04O86J48o55J87
2033a36L87n73j93N00R9j25K69J18J2k40j77k2LM04k52k53N00j7m63j56O41l24
2055Bm21N46K37o47j59N93l20l38M10L45m32P7M17m59l35L82K85m31J85M75k49
2076A63m61M89L9p58P28K35k88k48M26k22n77K40L16l6J35J18j83m59J17r7RL52
2098C8J05j92J24M58o61l91N23K76n39K61O74n31n49L85J32m24J76P82l36o18
2118c07N86j13o41L07L67k84k05N58j21n29O6M90m05j6N98Q1o86K19J92m02r6
$$ y = [-202, -281, -112, 380, -193, -394, 293, 299, -401, -174, 370, -26, -204, 127, 246, -112, -300, 112, -82, 13, 223, 96, 51, 72, -98, -400, -92, 261, -211, -141, 454, 206, -550, -115, 339, -125, -259, 332, 541, -213, 57, 30, -177, -65, 209, 119, 184, 383, 297, -488, -8, 117, -265, -152, 565, 323, -422, 50, 326, -398, -502, 184, 332, -323, -136, 251, -322, -515, -15, 84, -41, 228, 346, 358, 118, -59, -81, -78, 326, 74, -179, 321, 304, -159, -315, 326, 2, -419, 127, 364, -283, -442, 151, -169, -507, -97, 248, -184, -107, 310, -149, -484, -102, 183, -248, -63, 412, 163, -298, 191, 230, -528, 200, 435, 147, -101, 325, 103, -474, -234, 82, 46, 181, 299, 116, -343, -226, -323, -314, 38, 143, -49, 75, 533, -128, -519, 4, 280, -259, 2, 676, 145, -404, -19, 113, -311, -135, 647, 311, -307, 279, 166, -475, -168, 199, -85, -290, 268, 147, -382, -316, 174, -231, -247, 351, 432, -254, -35, 157, -245, -341]
2139c41M24k5J00K21j82l05j85M99k92m8M41l68PK75O6q44K15M60j99j88L21L32
2161C84p90N7N06k20k80O70J1l89J5J86k87j40L50J98k44k9L38j35m03K53j5l63
2183c27L00L57k73o0j62J76l91M95M1k8n5j42j45J70P5k32n4M21j2j61J35K70
2205C98m89k15N81R2p35M20K93m08j77K84r8r0O0L16j78j04ON7j11o3L15j08o6
2228b0J64l0j33j92L75r5n8N9l0J39l4k36J62K3k2K8k21J93r4p6K12j4l36J37
2252i9K96l74J2K17L4k14pL89k13j29J03J21k14nK86j78k37L00k8j73Q8J88j78
2275a5j87J56K61j50o3m2M8j99j6J56J4j88J51J45J31l09K22k1n7r2k0J4L4P9
2299E2K4n4r2P4J45J7j38K7J65l02K0K36k85K12j49k2k8Q5j19K70j98K1j13N5
$$ y = [-341, 83, 58, 158, 379, 197, -108, -293, 206, -86, -134, 307, -61, -54, 221, 287, -557, -342, 118, -81, -269, 52, 384, -406, -349, 157, -63, -343, 327, 338, -51, -36, 150, -137, -277, 73, 271, 27, -2, 336, 201, -202, 51, 36, -327, -27, 330, 57, -3, -165, 11, -380, 115, 156, 128, 73, -69, -214, -44, 31, -201, -255, 166, 154, -7, 128, 398, -91, -306, 275, 367, -368, 52, 345, -63, -240, 44, -54, -144, -84, 232, 54, -50, -44, 13, -98, -161, 154, 46, -20, 144, 114, -19, -211, 164, 69, 11, 70, 40, 179, 145, -91, 71, 94, 72, 100, -121, 72, -22, -98, 114, 100, -236, -99, 197, -177, -165, 52, 86, -128, -135, 254, 41, -88, 15, 136, -78, -83, 203, 25, -212, 88, 60, -113, -25, 163, -15, -202, -46, 215, 65, 2, -40, 8, -191, -207, -51, -37, -225, -74, 71, 202, -107, 115, 94, 37, -55, -75, -61, -27, 52, 76, 22, -70, 4, 149, 166, 28, 55, 220, -82, -62, 174, -111, 101, -48, -70, -98, -13, -132, 138, -60, -39, -152, -97]
2323i7m0M8J99j25j10K30L1k36J8J52j10N7r4J23L0m9N5j27K79m00J17K79k34
2346dr5O7M1k4k7J96j85K3o7N2nN1n1K4j19R4J57j12p2K63q8p4q7J12j97K01L2
2373A06j70J83j40J10p1q8r5K82k52o7J2L03k02l8Q9Q9j82L3M9K59j22k92M17
2396B13k45OJ1N5j89O5J7J54j96O9J28q1o9J7O1o7k7J87j25K4p0K55k35m7l7J49
2422B3pJ7o7l6L8J93j73J19j51O1q7P1J39j46J53j22r5J6N4k9j15J77P5m3r7R5
2448F3mj49RK3M9m1N2J30k22p3R5J59j17P1O7r3P1k4k27p4L77r6j8J15r9k12m6
2475b14J79K7N5k10K69k07Q9j10K12r4m8o9J61M3j55J04j88J41JK1J55j92M5J17
2499A32j39L9n5J37j30l2m1R2N9j63M6L39l60M4o4J06l8J24j39n8n5L02p9j21
$$ y = [-97, -137, -89, 110, -15, -125, 105, 136, -100, -82, 70, -40, 17, -77, 46, 76, 27, 82, -45, 234, -166, -49, 230, -4, -99, -32, 9, -15, -42, 154, -31, -8, -75, -23, -28, 23, -28, -4, -123, -29, 128, 16, -56, 207, 119, 45, -42, 70, -127, 74, 106, -64, 119, -21, 89, 18, -70, -165, 117, -135, -202, -190, 113, -89, -127, -38, 51, -131, -98, -49, 210, 88, -204, 213, -32, -26, -15, 40, -149, -84, -67, 87, -109, -40, 88, 7, -62, -45, 16, -51, -78, 109, -16, 8, -62, 193, -42, -89, -126, 23, 16, 33, -34, -70, -32, 161, -12, 107, -44, 17, -70, 1, 140, -6, 147, 25, -70, -54, 0, -29, -144, 33, 108, 65, -32, 63, 59, -90, -81, -58, -9, -50, 2, 132, -90, -163, -68, 91, -26, 45, 112, 19, 90, 66, -161, -235, 142, 46, 28, 143, 44, -168, -214, -35, -8, 47, -163, 106, -101, -12, -122, 90, -4, -52, -121, 40, 83, -72, 32, -156, -15, -14, 7, 162, -30, 15, 132, -7, 32, -23, 114, -16, -48, -89, 3, 62, -101, -55, 284, -76, -32, -96, 10, -28, 96, -43, -101, -156, 146, 67, -54]
2523e4J51N3k95K42L9k13J91m3Q9j49j7jk23P1M31j34k19Q2k5j69J32K4J02o3
2547BP6p0M1j05L6R4j8j0O4j33N7l0r1J33K2Q0j43P9j04m8J57l8k29o2M05j06
2573E9j09J68k42J25R6J43k09k32L46j35j12j64M06j51o3J10J5j06l3K5O9QN9
2596G3O0k16J34O2j59kJ75q8j23N7K16j69j53K17p5n5J60j19j84J89J0mM3j72
2620a23K3K9K78j10k1j62J48m7J6n6J60j45L5J38r5j42r7K16j10K17o2o8j11J88
2644I9M1n0q1QQ0j82P5J16j19O6R6j46J21k66J8J25l9P0O4q3Q6j26lj67K68r6
2670b5q6J26q3M5K17k45P4n5Q3p3J51m3p9m6M0k9Lq7J09J63j16l8j15K37k25j1
2696a08l6J09j48J11J79o1j17O4j34K21j31P6n1l3J79j67j2l5MJ34L4q9r7O4j66
$$ y = [-54, 97, 150, -145, 97, 136, -77, 114, 71, 160, 11, -6, -7, -230, -159, 272, 138, -81, 1, -24, -193, -61, -37, 65, 2, 78, 8, 49, -56, -20, 74, 56, 46, 110, -23, 34, 4, -87, 46, 68, 148, 5, 84, -20, -68, 89, 51, -178, -240, 165, 59, -50, 118, -124, 1, 97, 240, 31, -201, 145, 10, -102, -266, 140, -11, -74, 36, 51, -55, -88, -63, 6, 14, 73, 133, -83, 51, 113, -46, -48, 127, 39, -84, -27, 189, 20, -133, 84, 9, -46, 114, -5, -189, 0, 10, 6, 49, -123, -100, -71, 207, 97, 76, -86, 62, 15, 31, -25, 135, -10, 25, 163, 68, -74, -171, 45, -65, 152, 90, 22, -89, 99, 140, 90, 9, 17, 97, -85, -10, 106, -13, 53, 149, 3, 124, -142, -124, 1, -38, 32, 96, 13, 99, -27, -30, -197, 71, -25, -111, 15, -68, -23, 194, -51, 23, -32, 51, -22, 129, 86, 7, -39, 1, -28, -25, -112, -3, 160, 44, 6, -109, 128, -97, -108, -144, -35, -183, -72, 107, 46, -71, -7, -141, 80, -51, 25, -26, -59, 120, -47, -59, -94, -90, 44, 78, -11, -108, -44, -210]
2721b10P7J54m7L1j73L25k09N4J4m4Q6j20K14j86n4J48j59K53j55l7L5K1kn9J06
2746F3j43J74o6QO3p3rk3j1J5J28j56K11o2n7p3L6k7N9r4P3j04J44l0N1j57N4
2773fn5J78j28j18J77j82J54P4op7J39o7j97J48J4Pk51L01j9j26J32k9k3k23K47
2798F4j35N8j03J44k25R2J90q2j02Q7K43m47K15o9J88j10k2k5o1J36j32J10L1
2821D5l13K28j65K04K1J67k43k0Q1o8J31j09J30j87J56k6J5Kl8j66R4N3J2oj10
2846a12Q6j3n9M4K59k31j52K26j10J79p9K1j18k9K46j75J40q8Om3j31J20o2Q8
2870A3m6QJ0q0K26j11k8N3p5j65J90J16j45j04J38l1J47k75L3O7J11j07K05j54
2894dp6Q1j26R2jJJ1L1j40R2J20l25K19l1n1j16K15j18K90L0j08j67O1Q7p7J17
$$ y = [-210, -133, 21, -26, 5, -168, 157, -52, 2, 16, -28, 58, -62, 152, -34, -88, 60, -99, 154, -1, -38, -3, 18, 16, -43, 63, -80, 94, 28, 36, 99, 26, 17, -6, -17, -2, 126, -30, 181, 119, 62, -11, 25, -2, 57, -37, 36, -68, 76, 46, 97, -60, -6, -61, 117, -11, -129, 48, -134, 20, 94, 88, 11, 150, 83, -114, 34, 48, 55, -196, 105, 86, -40, 92, 63, 40, -183, 64, -71, -13, -116, 28, -197, -105, 85, 3, -99, -12, 231, -216, -1, -70, 118, 8, -14, -39, -100, 36, -96, 14, 45, -268, -40, -205, -1, 20, 187, -56, -76, 5, -63, 68, -41, 89, -98, 58, 32, 47, 49, 11, -155, -61, -8, 4, -2, -112, -26, -39, -98, -54, 205, -26, -178, 48, -62, 117, 38, 59, -59, -88, 158, -17, 123, 35, 41, -2, -133, -13, -75, 13, -33, -25, -15, -95, 131, 20, -8, 45, -30, -195, -5, 111, -34, -138, 0, -31, 116, -159, -126, -59, 52, -55, 150, -4, -80, 1, -125, -33, -34, -33, -22, 9, -131, -39, 81, -244, -25, -56, -107, -223, -8, -126, 164, 194, 86, -81, -20, 67, -10, 107]
2920A07k5l6o1N7o6rq0P8J24n2P4j39O6o4l6N9R1j85J78O6k95K01N1n7j56j0J55
2947C6K3q7J60j33Q7j26N6j35L8J37r1J3j40J79j06J41R9k11l2K00k22J47j06
2970g3r8K08j35R0N7L1j57k09K50L0R7o6m3L3J85r0q4n5j22J15q9L37k34Q3j01
2995d0J9k3J90j45J80j62q1P3Mp3o8L40k09q1O5N4k8k3k3l0K18j68rOj51J21J13
3022F9P3p4j01N5J18k00K15p1p7j66J79p2J03j17P1j37lK00p2j24o6J61k7J53
3046I0j73J00j31J12Pj27J5K34J2k16J41m9p5n6J21R0j55O5k5M6m6LN9k09K89
3071A22n1k00J63j09o5L0K68m5j55K8q0J51q7n4J00q1J38j64k6K39m1J29k09j41
3095a40K10j5R3q6O0q9pK2j76Q8R8j09N2N9P1r9J93k55J69j82o0K25j64J10R4
$$ y = [107, 82, 46, -15, 42, -24, -33, -113, -35, 89, 37, 111, -28, 38, -26, -62, -3, 88, -97, 81, 147, -148, 53, 104, 47, -109, -119, 36, 59, -28, 132, -1, 86, -40, 16, -119, -81, 56, -35, -22, -162, 17, -89, 52, 151, -60, -92, 108, -114, 33, -73, -171, 37, -98, -8, 49, 80, -77, -286, -36, -6, 91, 25, -18, 15, 200, 110, 26, -29, -151, -36, -125, 212, -22, 61, -40, -21, -44, 146, 1, 181, 19, -62, 11, 15, -58, -126, 214, 5, -76, -11, 43, 15, -8, -31, -61, 157, -11, -20, -14, -165, -44, 69, 142, 68, -33, 22, 140, -60, 155, 84, 7, -159, 20, -52, 51, -66, 5, -132, -135, 65, -7, -131, -197, -36, -63, 90, -83, 17, -114, -2, 5, -122, -107, 127, 139, -77, 64, 15, -60, -116, 5, 95, -60, 5, -20, 26, -20, -17, 42, -167, 122, 71, -129, 34, -75, -140, -110, 158, 113, -42, -14, -94, 57, -30, -84, 16, -65, 73, -91, -117, 122, 81, 210, 1, -140, 70, 55, 148, 62, 122, 33, 26, 48, -128, -40, 58, -51, 1, 60, 131, 32, 225, -30, 139, -43, -103, 122, -42, 68, 162]
3120A62m40L91k38j47L68J0q8k90L55k0j45m5J71o5k18K04J64M5k06O4j80J92
3142D4l3K8j67P5j23J04n4K32o5j45O8j4o2J15O5N1m9J4q9k9k0l8K6kJ62k59O5
3169a00J09p9J33l5n7l2L5j16M6P6p6K76k66J10K12k20j12K19j97j17J93Q9m4
3192D7j46K00M1l11O7J22q9J20j39R5m1r4J52J29o2k7r1P4n7J5J65m4j40N3j62
3217a23K17J34k02J38k75o2L24j14qj43N4R8k6q7n1J98Q4j68R2r9R7j63J05p8
3241e8j81K87j10N5O7j71K58j69r9J50J6o5o5O0J4p5O7L9J56k54M3J8JO5q2lk2
3268e8K10j78M2J00k52O8n5M8P7K38j74m3p4J57j35jK0J66k52Q7J95j50KJ10j40
3293HR8r0n6lJ23j33J20M0k08R2j9J2m7Q0j91L07j30N0p1O9j19J56n3l8J92m19
$$ y = [162, -278, 113, -125, -272, 96, 106, 18, -272, 83, 63, -82, -127, 44, -21, -239, -35, 129, 174, -32, 32, -148, 44, 11, 39, -128, -53, -176, -72, -126, 106, 41, -104, -36, -50, -112, 3, 68, 119, 70, 84, -5, -34, -54, -92, -66, -68, 94, -165, -100, 9, -70, 63, 28, -29, -61, -26, -142, -96, -20, -96, 180, -86, 24, 236, 16, -96, 123, -74, -191, 2, 91, 47, -99, 101, 142, -169, -102, 20, -69, 51, -88, 7, -34, -128, 24, 153, 91, 64, -27, 47, -10, 5, 170, 126, -14, 39, -123, 94, 228, 26, 164, -111, -173, 151, 37, 29, -114, -60, 38, 12, -75, -126, 72, 156, -12, 80, -19, 78, -85, 20, -58, -239, 48, -62, -7, 60, -111, 147, -22, -121, 29, 45, -20, -85, -25, -11, -86, -19, 20, 176, -78, -35, -17, -16, 49, -33, -36, -58, 152, -26, 16, 116, -136, -68, -123, -75, 2, 240, 66, 23, -51, 106, -29, -30, -10, 156, -96, -9, 186, 36, 38, 148, 8, 106, 16, -40, -43, 80, -53, 67, 107, -101, -9, -28, -16, -63, 17, -174, 133, 3, 53, -18, 51, -68, 88, 35, -3, 189, -230]
3319b30J64K26k03j9M3j4R4j4k4m6O9j31R3j1J66%l02J15o1P0K1P2o0J4J9j13
3345f2p5J36J26j07O0n2o3J24k02J44O3j63J52j23k5L6P0p7J20j11J11l1m2K0
3369B9l9P8j36jJ04N4r5L6j84J13l5m7P3J61o4k2jj35J73K7rm1n6J10j74O8J72
3396A59k13J27j29J52j97O9j39K75K4j66Q1j55P0R1LL0k2QO5k81J97k3K48k42
3420C2q6K9o0O3J12q5j96K46j35RJ94o0PL2L4Jp0j12N9J16q2j23Q6p6j5J63k8
3447E5o2p5J78j58K03j31j40K43n6q2k3r7J95j6P8k08oK19k34QK21p0N6j00P0
3472F8J4j27j9Q1N3l5q8R3r7J6ON5%o9R2p1P9qn9J90j95M7j3k44L16p1l7j2j9
3501e4qJ3K25j76lOMM1q9m1P1K88l98K32r2J37j50j41J75j33J61j09M9r8j14Q0
$$ y = [-230, -66, 160, -43, -62, -19, -33, 61, 47, 23, -23, 46, -85, 8, -3, 163, 163, -139, -24, -85, -15, 6, 78, 18, 32, 51, -62, -137, -1, 125, 18, 78, 26, -37, 87, -115, 29, 92, -71, 81, -42, -67, -31, 39, -38, 82, -29, 82, 51, 9, 29, -10, 68, -68, -69, 35, 89, -6, 30, -154, -41, -76, -123, -50, 111, 47, 25, 24, -111, 62, 89, 80, 39, -17, 93, -81, -13, 159, -54, 73, -56, 96, -101, -32, -171, 104, 128, -38, 43, -112, -42, 49, 52, 82, 60, 68, 133, -148, 49, 26, 274, 32, -54, -25, -85, -22, 90, 5, -191, 55, -80, -71, 123, 63, 70, 102, 136, 137, 67, -45, 14, 130, 48, -75, 11, -65, -80, 83, 55, -7, -82, 96, -62, 141, 10, -130, 113, 57, -25, -48, -145, 50, 34, 112, -96, -102, 117, -117, -109, 112, 42, 98, -2, 68, 82, -45, -64, 17, 70, 35, -53, 40, -57, -41, -35, 20, 20, -49, 43, -28, 51, 43, -16, 174, -21, 26, 13, -231, 85, 14, -23, -35, -54, -62, -49, 176, 0, -3, 3, 7, 48, -41, -82, -11, 277, -121, 111, 19, 156, 6, -135, 40, -93, 68, -41, 8, -90, -204, -124]
3527a24K18j10n0J88j73P5j43P1J08j26J47N4r6q1J07j40J24q5J5L5q4J58j17
3550b9J02j36K7P6j02P6K9j58N6k3j3o0J54n4O5nn3J57Kj72r1K53k13jP0j5J36
3577G8r0N2Lo3J59p2p8Jn8Q0m4p5J52j1R8j39p6%M4j49J06N5m6q8QR3J51p6R0
3606A05j21M4r2J45m3m1k8J7P8n5l3j68l3L39k67J43k35K37M7j48M9J75r3j39
3630a17J92j43J62j18k3R2K3j69j1R5J15q2kk5J1OJ05j57J18k51J19p5K01j40
3654g4M4j25K10j95Q1K4M4Nk30K22J85j54j19K04j36R7p6R5p3O8n2OJ5k4n9n0
3680f7M2om8K4M9J36k31L1Pk4K5J25n5q2J01j65M3K06j34n7J44o9O4j21J71j15
3706fR8l1o3M4l3L2K5J9L6j36R0R1j41J0j33J68r7l1J6K7J04r1j50J89j52M9l9
$$ y = [-124, 94, -16, -66, 122, -51, 24, -119, -48, 60, -66, 81, 135, 39, -42, 65, -75, 49, -36, -21, 14, -70, 88, -29, 73, -63, -36, 40, -62, 14, 43, -115, -59, -82, -95, -155, -1, -55, 10, 5, -48, 109, 111, -61, -152, 101, -112, -113, -43, -58, 78, -12, 40, 43, -20, 139, 67, -11, -10, -68, 12, -32, -107, 45, 34, 132, -7, -83, -83, -39, -188, -82, -27, -73, -161, -153, -60, 91, 15, 105, -16, 28, -64, 81, 38, -3, -31, -14, 64, 9, -24, -192, -225, 114, -153, -10, -245, -8, 39, -109, -60, 115, 22, -117, 75, -68, 94, -24, -47, 45, 68, -101, -112, -17, 98, 16, 14, -11, 0, 6, 111, -46, 72, -179, -60, -135, 66, -74, -30, -155, 55, -140, -59, -35, 9, 14, -216, 6, 191, 37, -82, 122, -14, 83, 7, 102, 29, 97, 45, 51, 66, 42, -17, -67, -25, -31, -79, -55, -6, 130, -101, -70, -63, -87, -62, 63, 8, -74, 27, -138, -95, 111, -23, -80, 64, -5, 59, -62, 109, -6, 92, 61, -2, 42, 9, 41, 66, 85, 121, -15, 75, 166, 25, 35, -98, 70, -27, -58, -42, -15, 89, -2, -152, 37, -115, -66, -105]
3733a05J19o1o3J32r9l8K18j88J69j10j8P5r8P2o2L7P3J37k86K92k22M8j04kJ78
3758I4j58R3L7j08K6L20l04J7r4NRN2K1l0J00j27J43r1k1N3J4J6mj98J40J28j51
3785a8N4K3k02N6P7p3O6J21j46J0M8j26L7J70q5R8l1k26M1j9L5J02K5L2j51R0
3811Hk1o8J81r2p3j04J37p1J64j48o8J83J11k63J55j10Mp8J20J30q3M8j24J40
3835G8L6l23J98K4q5l3M0J31m1j40K71k00N6r2J94l1k26l5L2J21j61K57k09J62
3859B4p3j39K39K3k2j40Q5J0n0j7J23oK5k19P9NjJ59j79N1p9J09N9r1J25k14K41
3886A27p2j8R1J6j22r6J58q0m2Q6pR9j68o2q0J55pNK6Oq0J51j11K6n8J98j63L4
3914A2q0n9k4R6J62j47kO0j52N7O3n2J05J21m1p7K1o9L0p0n8M2J44j5n3P9k42
$$ y = [-105, 14, -47, -110, 22, -77, -115, 103, -85, 84, -26, -44, 31, -67, 5, -57, -20, 53, 190, -96, 196, -26, 22, -82, -84, 94, -64, 29, 66, -42, -16, 304, 0, 17, -77, -72, -63, -11, 10, -20, 80, -47, 96, 5, -16, 37, 51, 67, 63, -135, 5, 133, -18, 36, 59, -143, -87, -10, -83, -17, 104, -42, -32, 16, -110, -73, 97, 12, 110, 79, -147, -106, -125, -90, 12, 37, 69, -82, 8, -13, -81, 100, 8, -65, -169, -32, -103, 61, -87, -155, 28, 139, -124, 31, -79, -75, -153, -33, 97, 14, 62, -62, 78, 114, -209, -11, 13, -72, -105, -65, 66, 25, -115, 156, -44, 12, -80, 114, 83, -143, -178, -146, -25, -186, 71, -138, 24, -49, -188, 51, 74, 52, -88, -3, 7, -43, -60, 63, 57, 82, -137, -58, -53, -54, 105, -74, -23, -102, 7, 66, -25, 100, -114, 127, 55, 37, 128, 144, 22, -74, 84, 4, -38, 48, 41, 140, -28, -90, -170, -15, -22, -17, 9, 15, -65, 86, -25, 1, -57, 141, -22, 12, -68, -127, -151, -55, 107, -40, -42, 18, -134, -77, -14, -66, 39, 160, 119, 42, 63, -6, 24, -46, -104, -62, 82, 67, 14, 93, -149]
3941a49J34J00n7M1o3P5j32L8o7m3K7J19p8L8j7j89R7M0M0K24k37J78M2r8j03
3966d0L9m3p5K29k27L10j66l7mj53J90j15J64p6n3J23l6j33m3R2NL4MO7j13L1
3992b6R1j05J44r8O6q2n6Q5m1j18K22Qj19K39j92j01K6K02j75J85j06M2r8O2%
4017E5k7n5ol3J40j46J06j51M1J72q3n5oK23m8j69j13J49J19j33j64J74J37o7
4041F0m5K2p9Q2J0q7q4J96j39J54r6q3J43lj86n5L23j03j04k1L11o8o2j24J94
4066A56k25P2k0p2K31j56l2P5J50k30r7K4R2J03j57J05L4q4pM2l3l6N7j53M4K02
4092H5j20j63K77l5j38p2J34m0R8n9J55k58P6J43j11M2p8J8L1J65l08K18k77r
4116b26J20J97J6j11J04j36o7K04p1p2l6J49j59J11q9K1P4j5j03O0j4j0m3M6q
$$ y = [-149, -15, 85, 28, 69, 6, 81, -51, -13, -80, -123, -96, 23, -55, -17, -34, -223, -126, -86, -46, 178, -59, 119, 161, 63, -40, -1, -44, -119, 110, -117, 193, 27, -10, -14, -167, 23, -92, 72, -4, -57, 66, 30, -103, -146, -54, -49, -15, -11, 56, -57, -26, 65, -40, 104, 6, 72, -10, -66, 19, -22, -140, 82, 90, -29, 210, 18, -83, -57, 145, -30, 155, 49, 91, -7, 55, 55, 28, -27, -33, -66, 74, -72, 34, -117, -76, 96, 13, -42, -48, 175, 127, -42, -155, -6, 113, -20, -184, -10, 127, 60, 15, 37, -42, 40, 50, -37, -121, 75, -64, 90, -6, -89, 54, 51, -135, -190, 133, 30, -74, -95, 216, 148, 86, -38, 156, -69, 3, -17, -89, 142, -14, -46, 29, 179, -51, -148, -124, -32, 71, -86, 19, 53, -31, -38, 4, -29, -65, -8, -161, -117, 85, -35, -198, 79, 44, -94, -166, -32, -72, 26, -33, 122, -136, -60, 83, -28, 14, -64, -46, -15, 150, -158, 60, -217, -226, -106, 91, 107, -4, 100, -36, -103, 101, 30, -42, -78, 71, -88, 23, -66, -45, 29, 14, -89, -29, -43, -53, -96, -50, -58]
4141e8N0r5K30Pr8j4k6L2l0o3q6L9N5J63k9K2j08o3J6J45k1Pk42K05j03J57j51
4168e9M2PrJ17k32J28J04j57Q2l6J2n7J33j23j59K72j23J79l18K09N5Rj25Q3J40
4193A74k46P8m1k62L17qj40O6OJ57j53p6K56k93J06P7O0q8O2l9j01m3J52k28J67
4218d0J59J3j55L2J11k28Q3M5j98R1J58r7l7j9J74j17j7J34M0j17k1R9k05NJ23
4243A6pN7o4Kp5R5j37J61j84K9J47j14J2j27J10k0K11j37rJ10l2j59K90k96O8
4268e3kM6P7j01m9M3kj18J65j38P9O1M5q3J4k9p8K45k22JJ47o7J00k38K17j99
$$ y = [-58, -8, -103, 127, 134, 36, 22, -4, 28, -2, -65, -151, -112, -57, 106, 77, 99, -9, -72, -56, 89, 68, 75, -167, 38, -65, 92, -59, -17, -10, -19, 98, -134, -6, 98, -59, 23, -13, -1, -58, 75, -48, -207, 65, -58, 121, -197, 12, 67, 76, -49, 34, 174, -72, 6, -35, -297, 20, 12, -128, -62, -56, 101, -52, -128, 128, -165, -59, 18, 78, -10, 52, 13, -88, -131, 21, -207, -40, 119, 132, -23, 9, 120, -108, -25, 20, -178, -87, 71, -26, -63, -82, 92, -25, -42, 92, 132, 15, -6, 93, -112, -107, 16, 9, 66, 2, 4, -71, 24, -113, 48, -136, -107, 40, -74, -62, -189, -79, -99, 112, -25, -34, 76, 44, -115, 175, -121, -53, -55, -9, 68, -33, -82, -39, -41, -159, 6, -132, -53, 8, 53, -30, -16, -45, -123, 122, -100, -99, 48, -19, 81, -157, 60, -139]
$$ [...]
8191a3
##END NTUPLES=NMR FID
##END=
