##TITLE=1H_Pr NCS15
 CDCl3
 8 sc, 
 15.04.2022
##JCAMPDX= 6.0         $$ Bruker NMR JCAMP-DX V2.0
##DATA TYPE= NMR FID
##DATA CLASS= NTUPLES
##ORIGIN= UXNMR, Bruker Analytische Messtechnik GmbH
##OWNER= root
$$ XWIN-NMR		Version 3.5
$$ Fri Apr 15 10:58:16 2022 Russian Standard Time (UT+4h)  she@DPX200
##.OBSERVE FREQUENCY= 200.13135
##.OBSERVE NUCLEUS= ^1H
##.DELAY= (6, 6)
##.ACQUISITION MODE= SIMULTANEOUS
##.ACQUISITION SCHEME= undefined
##.AVERAGES= 8
##.DIGITISER RES= 18
##SPECTROMETER/DATA SYSTEM= spect
##.PULSE SEQUENCE= zg30
##.SOLVENT NAME= CDCl3
##.SHIFT REFERENCE= (INTERNAL, CDCl3, 0, 15.7039)
##AUDIT TRAIL= $$ (NUMBER, WHEN, WHO, WHERE, WHAT)
$$ ##TITLE= Audit trail, XWIN-NMR		Version 3.5
$$ ##JCAMPDX= 5.01
$$ ##ORIGIN= Bruker BioSpin GmbH
$$ ##OWNER= she
$$ F:/spectra/data/she/nmr/H-F/1/audita.txt
$$ ##AUDIT TRAIL=  $$ (NUMBER, WHEN, WHO, WHERE, WHAT)
(   1,<2022-04-15 10:57:06.17 +0400>,<she>,<DPX200>,
      <created by zg, POWCHK disabled, PULCHK disabled
       configuration hash MD5:
       00 E9 B6 7A A2 85 ED C7 34 08 36 98 17 FE 4E 26
       data hash MD5: 16K
       31 C8 74 F3 E8 37 B1 27 55 D3 92 D3 A5 5E 0C 2B>)
$$ ##END=
$$ 
$$ hash MD5
$$ BC E8 FB D4 6A 54 22 E6 AE 96 38 0B 97 D9 F6 32
##$RELAX= 
##$RELAX= 
##$RELAX= 
##$RELAX= 
##$RELAX= 
##$RELAX= 
$$ Bruker specific parameters
$$ --------------------------
##$DU= <F:/spectra>
##$EXPNO= 1
##$NAME= <H-F>
##$PROCNO= 1
##$TYPE= <nmr>
##$USER= <she>
##$AMP= (0..31)
100 100 100 100 100 100 100 100 100 100 100 100 100 100 100 100 100 100 
100 100 100 100 100 100 100 100 100 100 100 100 100 100 
##$AQSEQ= 0
##$AQ_mod= 1
##$AUNM= <au_zg>
##$AUTOPOS= <>
##$BF1= 200.13
##$BF2= 200.13
##$BF3= 200.13
##$BF4= 200.13
##$BF5= 200.13
##$BF6= 200.13
##$BF7= 200.13
##$BF8= 200.13
##$BYTORDA= 1
##$CFDGTYP= 0
##$CFRGTYP= 5
##$CHEMSTR= <none>
##$CNST= (0..31)
1 1 145 1 1 1 1 1 1 1 1 1 1 1 1 1 1 1 1 1 1 1 1 1 1 1 1 1 1 1 1 1 
##$CPDPRG= <>
##$CPDPRG1= <>
##$CPDPRG2= <>
##$CPDPRG3= <>
##$CPDPRG4= <mlev>
##$CPDPRG5= <mlev>
##$CPDPRG6= <mlev>
##$CPDPRG7= <mlev>
##$CPDPRG8= <mlev>
##$CPDPRGB= <>
##$CPDPRGT= <>
##$D= (0..31)
0 1.2 0 0 0 0 0 0 0 0.06 0 0.03 0 0 0 0 0.0002 0 0 0 0 0 0 0 0 0 0 0 0 
0 0 0 
##$DATE= 1650005825
##$DBL= (0..7)
120 120 120 120 120 120 120 120 
##$DBP= (0..7)
150 150 150 150 150 150 150 150 
##$DBP07= 0
##$DBPNAM0= <>
##$DBPNAM1= <>
##$DBPNAM2= <>
##$DBPNAM3= <>
##$DBPNAM4= <>
##$DBPNAM5= <>
##$DBPNAM6= <>
##$DBPNAM7= <>
##$DBPOAL= (0..7)
0.5 0.5 0.5 0.5 0.5 0.5 0.5 0.5 
##$DBPOFFS= (0..7)
0 0 0 0 0 0 0 0 
##$DE= 6
##$DECBNUC= <off>
##$DECIM= 32
##$DECNUC= <off>
##$DECSTAT= 4
##$DIGMOD= 1
##$DIGTYP= 9
##$DL= (0..7)
0 120 120 120 120 120 120 120 
##$DP= (0..7)
150 150 150 150 150 150 150 150 
##$DP07= 0
##$DPNAME0= <>
##$DPNAME1= <>
##$DPNAME2= <>
##$DPNAME3= <>
##$DPNAME4= <>
##$DPNAME5= <>
##$DPNAME6= <>
##$DPNAME7= <>
##$DPOAL= (0..7)
0.5 0.5 0.5 0.5 0.5 0.5 0.5 0.5 
##$DPOFFS= (0..7)
0 0 0 0 0 0 0 0 
##$DQDMODE= 0
##$DR= 18
##$DS= 0
##$DSLIST= <SSSSSSSSSSSSSSS>
$$ [...]
##$SUBNAM2= <"">
##$SUBNAM3= <"">
##$SUBNAM4= <"">
##$SUBNAM5= <"">
##$SUBNAM6= <"">
##$SUBNAM7= <"">
##$SUBNAM8= <"">
##$SUBNAM9= <"">
##$SW= 18.05172834244
##$SWIBOX= (0..15)
0 0 2 0 0 0 0 0 0 0 0 0 0 0 0 0 
##$SW_h= 3612.71676300578
##$TD= 16384
##$TD0= 1
##$TE= 0
##$TE2= 300
##$TE3= 300
##$TEG= 300
##$TL= (0..7)
0 120 120 120 120 120 120 120 
##$TP= (0..7)
150 150 150 150 150 150 150 150 
##$TP07= 0
##$TPNAME0= <>
##$TPNAME1= <>
##$TPNAME2= <>
##$TPNAME3= <>
##$TPNAME4= <>
##$TPNAME5= <>
##$TPNAME6= <>
##$TPNAME7= <>
##$TPOAL= (0..7)
0.5 0.5 0.5 0.5 0.5 0.5 0.5 0.5 
##$TPOFFS= (0..7)
0 0 0 0 0 0 0 0 
##$TUNHIN= 0
##$TUNHOUT= 0
##$TUNXOUT= 0
##$USERA1= <user>
##$USERA2= <user>
##$USERA3= <user>
##$USERA4= <user>
##$USERA5= <user>
##$V9= 5
##$VALIST= <valist>
##$VCLIST= <CCCCCCCCCCCCCCC>
##$VD= 0
##$VDLIST= <DDDDDDDDDDDDDDD>
##$VPLIST= <PPPPPPPPPPPPPPP>
##$VTLIST= <TTTTTTTTTTTTTTT>
##$WBST= 1024
##$WBSW= 4
##$XGAIN= (0..3)
0 0 0 0 
##$XL= 0
##$YL= 0
##$YMAX_a= 129216
##$YMIN_a= -149984
##$ZGOPTNS= <>
##$ZL1= 120
##$ZL2= 120
##$ZL3= 120
##$ZL4= 120
##$ABSF1= 10
##$ABSF2= 0
##$ABSG= 5
##$ABSL= 3
##$ALPHA= 0
##$AQORDER= 0
##$ASSFAC= 0
##$ASSFACI= 0
##$ASSFACX= 0
##$ASSWID= 0
##$AUNMP= <proc_1d>
##$AZFE= 0.1
##$AZFW= 0.1
##$BCFW= 1
##$BC_mod= 2
##$BYTORDP= 1
##$COROFFS= 0
##$CY= 11.3945322036743
##$DATMOD= 1
##$DC= 2
##$DFILT= <>
##$DTYPP= 0
##$F1P= 2.36226072786647
##$F2P= -0.459571619588291
##$FCOR= 0.5
##$FTSIZE= 0
##$FT_mod= 4
##$GAMMA= 1
##$GB= 0.15
##$INTBC= 1
##$INTSCL= 1
##$ISEN= 128
##$LB= 0.24
##$LEV0= 0
##$LPBIN= 0
##$MAXI= 10000
##$MC2= 0
##$MEAN= 0
##$ME_mod= 0
##$MI= 1.114404
##$NCOEF= 0
##$NC_proc= 0
##$NLEV= 6
##$NOISF1= 3.799351
##$NOISF2= 2.8
##$NSP= 1
##$NTH_PI= 0
##$NZP= 0
##$OFFSET= 15.70392
##$PC= 1
##$PHC0= -18394.12
##$PHC1= 13.60074
##$PH_mod= 1
##$PKNL= yes
##$PPARMOD= 0
##$PSCAL= 0
##$PSIGN= 0
##$REVERSE= no
##$SF= 200.130013532006
##$SI= 16384
##$SIGF1= 3
##$SIGF2= 2
##$SINO= 400
##$SIOLD= 16384
##$SREGLST= <1H.CDCl3>
##$SSB= 0
##$STSI= 0
##$STSR= 0
##$SW_p= 3612.71676300578
##$SYMM= 0
##$S_DEV= 0
##$TDeff= 0
##$TDoff= 0
##$TI= <>
##$TILT= no
##$TM1= 0
##$TM2= 0
##$TOPLEV= 0
##$USERP1= <user>
##$USERP2= <user>
##$USERP3= <user>
##$USERP4= <user>
##$USERP5= <user>
##$WDW= 1
##$XDIM= 8192
##$YMAX_p= 0
##$YMIN_p= 0
$$ End of Bruker specific parameters
$$ ---------------------------------
##NTUPLES= NMR FID
##VAR_NAME=  TIME,          FID/REAL,        FID/IMAG
##SYMBOL=    X,             R,               I
##VAR_TYPE=  INDEPENDENT,   DEPENDENT,       DEPENDENT
##VAR_FORM=  AFFN,          ASDF,            ASDF
##VAR_DIM=   8192,          8192,            8192
##UNITS=     SECONDS,       ARBITRARY UNITS, ARBITRARY UNITS
##FACTOR=    0.0002768,     1,               1
##FIRST=     0,             0,               0
##LAST=      2.2672688,     0,               0
##MIN=       0,             -149984,         0
##MAX=       2.2672688,     129216,          0
$$ Real data points
##PAGE= N=1
##DATA TABLE= (X++(R..R)), XYDATA
0 0 0 0 0 0 0 0 0 0 0 0 0 0 0 8 -8 8 -8 8 -16 16 -16 24 -24 32 -37 40 -48 56 -64 74 -88 97 -112 128 -144
35 -144 161 -179 202 -226 251 -282 313 -347 383 -423 468 -518 570 -628 691 -762 840 -926 1022
54 1022 -1128 1248 -1387 1542 -1725 1940 -2197 2511 -2904 3417 -4111 5112 -6690 9559 -16461
69 -16461 73259 321 -141737 5250 99907 30784 -61010 -25066 3614 13979 30532 23405
81 23405 -53954 -55587 39635 72668 -25989 -75305 161 54061 8125 -28397 -15096 -4992
93 -4992 -518 23040 11475 -32811 -26531 32362 29499 -19376 -15220 18015 3601 -6652 26963
106 26963 19447 -37954 -23015 54090 34722 -53518 -41886 43791 37036 -38756 -33954 21699 12891
119 12891 -20930 367 12790 -22128 -16623 34453 18513 -47102 -22679 51389 27260 -48683
131 -48683 -27858 42536 30882 -27382 -23298 17338 19753 4298 -2067 -11186 -7739 22568 25437
144 25437 -20531 -35327 13832 36214 -10414 -36238 -3968 17397 5 -7865 -2400 -13001
156 -13001 -10593 21681 20494 -26516 -27484 26296 33120 -16817 -25062 15141 18389 -9638 -1876 15846
170 15846 -5995 -19177 14247 29142 -10968 -30831 7583 28479 -869 -19339 -4677 3104
182 3104 -29 6678 1921 -22654 -17467 21206 21519 -22287 -29636 11986 26760 -2423 -17272 -2200
196 -2200 8380 9742 9710 -2990 -14873 2460 25037 7840 -22809 -10432 20823 11866 -15151
209 -15151 -9939 8514 2622 -6564 1490 2691 -10830 -5241 10738 2123 -15415 -5254 11122
222 11122 426 -11511 977 8302 -4810 -6321 9434 8680 -7774 -4142 12500 8938 -6343
235 -6343 -2460 8021 3324 -2587 1576 1094 -6076 -1497 7990 -2182 -14322 -1892 11960 -1026
249 -1026 -14753 -3289 9807 238 -8867 -760 3079 -1393 506 3187 -2332 -4660 5423 8997
263 8997 -3446 -6722 6978 10062 -1872 -4854 5063 6133 -2485 -1995 3688 -1036 -5278 647 2481
278 2481 -5297 -6379 1943 1330 -6422 -3557 3464 -1070 -5809 1250 5591 -1398 -5241 3182 6867
293 6867 -778 -3169 3166 4376 421 529 2803 -48 -1020 4908 3887 -4611 -4042 5516 4149 -5761
309 -5761 -6041 2429 2269 -4703 -3763 -660 -2003 -2087 -2 -1112 -4075 -636 4273 1093 -3545 554
325 554 5213 2918 -1547 1048 4494 1586 -640 2389 2040 -1424 -135 2491 124 -3022 -467 1768
341 1768 -1763 -2790 167 -485 -3455 -2432 799 -698 -4234 -2073 1994 312 -2306 -561 1622
356 1622 1137 661 1955 1915 49 2064 4446 1637 -840 1232 3230 1245 -1439 -43 568 -1731
372 -1731 -1151 349 -1336 -3078 -2128 86 -223 -2412 -2570 -1223 -408 668 -169 -1982 -1662 1256 3624
389 3624 1339 -2395 -525 3780 4536 1121 -1226 106 3124 4059 1360 -2890 -2190 2742 2996 -1832
405 -1832 -4538 -2445 489 359 -1784 -3400 -3630 -905 1501 60 -3010 -3138 1073 3491 356 -2304
421 -2304 -21 2884 2214 659 890 1390 479 1517 3116 1767 -1175 -817 2263 2700 -931 -2798 -549
438 -549 668 -422 -2541 -1914 -1170 -2219 -2199 -150 56 -2741 -3245 471 3182 458 -2781 -291 3141
455 3141 3607 925 271 1069 442 1896 4618 1640 -3795 -2880 5009 6435 -2781 -8559 -1140 6817
471 6817 3059 -6451 -7358 582 3851 401 -3634 -5092 -3025 2272 5190 -314 -7865 -4031 8003
486 8003 9429 -2424 -8923 550 11099 6494 -5029 -5797 3162 7081 2276 -2695 -3060 -1818 1179
501 1179 4217 676 -7066 -6449 3794 7227 -2644 -11391 -3675 7179 4732 -5835 -6607 1606 4362
516 4362 454 -628 140 -1388 313 5386 4944 -2976 -5111 4272 9310 568 -7116 -1681 7136 3477
532 3477 -5073 -4022 2134 1790 -3022 -2863 -2 -1017 -2913 -571 1135 -1410 -3147 -33 2473 -5
548 -5 -2629 913 3994 327 -2990 1244 6412 2135 -4956 -685 7709 4568 -4681 -4556 4092 5506
564 5506 -1920 -4586 -430 998 -794 -358 -454 -3989 -4678 2015 5153 -3428 -8808 -888 7884 3324
580 3324 -6342 -4399 4104 5828 980 -2161 -986 1574 3268 3450 707 -3571 -1716 4331 5642
595 5642 -1094 -6870 -2646 5820 4731 -4714 -8419 -784 5888 1379 -6060 -5226 342 2756 1233
610 1233 -1754 -3578 -2074 3481 6119 -278 -6025 -437 8112 5510 -3930 -4486 3980 6210 224
625 224 -2875 -807 1365 1034 386 -910 -2965 -2043 1503 745 -2816 -3574 -287 1450 -846 -2270 -1517
642 -1517 407 1002 208 -1065 71 1329 1507 821 522 1312 1995 798 965 1696 709 -74 729 1404
660 1404 -676 -1922 500 1181 -2259 -3179 37 1249 -1770 -3369 -975 632 -559 -853 -1178 -837
676 -837 199 1645 927 -1369 -728 2843 3392 247 -1518 884 3142 1998 -314 -635 283 1574 1737
693 1737 -570 -2605 -1126 1679 488 -2840 -2810 -164 -134 -1048 -1568 -1568 -705 173 610 -589 -1177 112
711 112 1907 1358 -226 384 1740 1438 981 1138 677 149 741 1734 534 -1245 -514 1062 331 -1787
729 -1787 -1562 -557 -499 -853 -1177 -1668 -1613 -320 423 -1105 -1903 -113 1458 510 -630 82 1500 1401 537
748 537 772 895 1036 1555 1497 109 -452 987 1377 -513 -1471 -206 127 -761 -1298 -1109 -744 -1101 -854
767 -854 -603 -1385 -1086 -301 -104 -262 -439 363 567 238 797 1062 731 560 1525 1633 614 123 949 1421
787 1421 430 -236 -164 -133 -73 -339 -886 -1431 -1128 -104 -853 -1831 -1233 -180 -96 -846 -1146 156 514 -51
807 -51 237 443 583 840 1361 1060 357 683 1537 1058 42 532 1009 581 -186 -344 -387 -486 -630 -486 -1350
828 -1350 -1323 -673 -582 -1100 -1190 -1115 -200 -536 -314 149 -83 30 618 910 901 30 1003 1810 889 256 856 1124
850 1124 1041 353 85 -44 -327 128 241 -1119 -1389 -300 -257 -948 -1366 -970 -376 -1103 -788 -130 -539 -339
870 -339 167 1002 135 -251 917 1541 509 762 1245 1064 406 521 1361 822 -156 -100 427 51 -513 -912
890 -912 -952 -517 -418 -698 -1532 -1390 -454 -20 -734 -1251 -781 63 113 472 235 -445 374 1930 1578 -460 -248
911 -248 1793 2502 368 -510 819 689 113 527 436 -1185 -1605 653 1061 -1540 -3017 -576 1439 -448
929 -448 -2617 -1304 450 101 -238 -210 -546 -184 1106 1564 334 -664 575 2062 1768 327 -465 313
947 313 2033 1509 -509 -1582 110 1523 -277 -2163 -932 292 -1083 -1553 -510 -70 -1911 -1680
963 -1680 1034 728 -2220 -1035 1798 1537 -1548 -311 2261 1068 -1098 684 2708 870 -1249 502
979 502 2701 431 -1502 139 1290 -37 -881 -558 -144 -1288 -1040 -17 -409 -1502 -1429 -548 125 -175
997 -175 -1213 -1437 542 1948 564 -1756 -58 2481 1392 -288 439 1361 510 70 2183 1164 -2040
1014 -2040 -937 2774 1782 -3074 -2947 2029 2202 -2491 -3018 265 310 -1325 -675 255 -1562 -1873 1411
1031 1411 1857 -1443 -2352 1076 2855 538 -1067 87 1575 1460 972 120 -464 612 1655 420
1047 420 -1195 -423 708 -536 -590 89 -1010 -1778 -380 1202 -961 -2898 -340 2049 -378 -2841
1063 -2841 84 2111 -283 -1226 1155 1791 -541 -420 2401 1444 -1158 412 2489 978 -1627 366
1079 366 2062 -632 -1571 141 884 -855 -1741 -148 -273 -1502 -556 139 -1247 -1124 420 628 -1102
1096 -1102 -858 1115 1003 -515 440 1148 460 194 1534 1681 -551 -200 2673 1299 -1536 -548 1803
1113 1803 552 -1474 -892 747 -797 -1779 40 187 -2069 -1536 950 605 -2107 -1203 1320 744 -1237
1130 -1237 128 1219 62 -149 1494 1234 -851 231 2318 984 -1017 45 1853 533 -720
1145 -720 246 301 -1110 -612 826 -700 -2313 -693 857 -969 -2095 -343 773 -812 -1140 657
1161 657 660 -578 -49 1489 369 -769 1186 2181 101 -560 1340 1831 -339 -662 1450 598 -1285
1178 -1285 104 625 -833 -1609 -38 375 -1519 -1585 163 -22 -1674 -833 659 91 -1046 53 1343
1195 1343 -259 -703 1354 1373 -371 -270 1643 1178 -520 257 1229 516 -629 622 799 -803 -863 542
1213 542 263 -1609 -1040 601 -367 -1528 -401 344 -874 -1261 220 600 -1064 -342 1340 720 -691
1230 -691 166 1846 579 -384 835 1520 121 104 868 757 -842 -243 867 -33 -1340 -323 238 -934
1248 -934 -1387 -413 73 -1213 -899 368 -331 -1289 -248 720 -70 -731 498 1343 13 -1 1341 1043
1266 1043 -276 246 1262 588 -438 292 1229 -31 -802 424 462 -765 -988 94 -185 -1158 -776 89
1284 89 -913 -1357 -236 193 -912 -761 602 489 -643 -98 994 716 -53 828 1146 464 -123 1077
1302 1077 913 -157 -205 557 287 -614 -473 444 -491 -1133 -111 -74 -783 -1113 -201 -39 -1093 -616 353
1321 353 -9 -640 132 557 121 -139 808 1178 57 319 1171 715 30 480 1029 216 -639 342 719 -757
1341 -757 -783 -44 -22 -1052 -1025 -195 -540 -1135 -501 79 -485 -807 -24 304 -126 -129 429 561 134 626 798
1362 798 518 165 641 924 97 11 730 667 -445 -94 401 -283 -1028 -391 59 -932 -1163 -198 -221 -953 -844
1383 -844 30 103 -465 -495 263 95 -215 367 841 237 221 621 984 440 185 759 586 207 392 271 -228
1404 -228 -378 144 -179 -682 -448 -51 -671 -908 -452 -428 -960 -932 96 182 -750 -163 260 213 -267 101 1027
1425 1027 781 160 462 870 588 129 504 696 -30 -456 100 262 -64 -573 -503 -92 -528 -619 -565 -506 -582
1446 -582 -551 -390 -57 55 -214 -186 355 88 194 145 667 1130 549 60 492 1012 479 200 454 618 -25
1467 -25 19 156 118 -745 -610 -92 -33 -1070 -834 -12 -293 -1007 -596 -91 -86 -583 -253 38 20 38 145 573
1489 573 659 242 442 744 596 436 241 302 705 105 -160 45 153 -186 -469 -363 6 -662 -939 -405 -271
1510 -271 -296 -560 -301 204 -364 -449 213 273 31 -116 353 840 198 128 822 811 298 332 356 788 135 -353
1532 -353 -128 193 -132 -353 -614 -490 -612 -700 -382 -397 -672 -578 -260 -94 -230 -476 65 186 251 15 41 283
1554 283 747 318 387 736 221 321 321 378 -4 -230 79 190 -433 -475 -273 -145 -380 -860 -658 -467 -386 -467
1576 -467 -75 -431 -196 -298 38 -70 -259 338 416 418 222 421 727 734 499 285 390 279 697 400 127 194
1598 194 -85 -186 -322 -350 -362 -606 -519 -340 -594 -582 -253 -86 -160 -258 -288 138 90 237 129 289 534 329 478
1621 478 590 501 388 422 154 -12 -129 266 234 -375 -156 -193 -413 -195 -476 -529 -505 -417 -258 -333 -422 -131 -255
1644 -255 -252 57 75 153 318 379 103 458 381 835 632 267 240 388 116 183 -60 451 -34 -247 -301 -386 -570
1667 -570 -519 -458 -230 -560 -822 -299 -99 -490 -500 -240 14 -2 151 -27 215 480 459 402 421 282 414 624
1689 624 308 116 353 135 129 225 -314 -144 -105 -364 -289 -635 -479 -455 -634 -361 -481 -228 -274 -303 -131 278 -77
1712 -77 380 331 395 461 268 628 692 547 561 407 386 227 -77 127 78 108 -97 169 -264 -488 -117 -209 -565
1735 -565 -476 -163 -311 -379 -356 49 -7 252 -111 327 228 253 419 627 342 572 272 524 330 233 401 369 189
1758 189 39 -126 -229 -97 -268 -350 -348 -505 -625 -373 -535 -327 -289 -96 -100 -181 113 105 342 207 133 390 723
1781 723 462 340 625 349 774 146 325 273 143 90 -139 -72 -350 -503 -246 -199 -489 -348 -320 -445 -260 -410
1803 -410 -393 42 -269 -55 86 91 6 261 184 577 398 390 605 683 332 262 551 303 124 -103 -84 4 -215 -421
1827 -421 -495 -79 -147 -542 -344 -158 -301 -609 -394 27 -232 -352 -17 5 80 -214 379 367 266 107 499 427
1849 427 206 362 471 94 -46 96 106 -191 -220 -369 -169 -280 -569 -401 -407 -437 -350 -66 -138 22 -340 -106
1871 -106 -215 -163 202 299 35 259 208 286 308 493 651 273 240 223 513 -183 -5 109 -168 -340 -582 -148
1893 -148 -289 -591 -314 -413 -280 -392 -399 -380 -413 -210 -92 23 237 233 0 21 283 370 296 232 154 493 183 105
1917 105 175 116 -83 63 112 -67 -707 -118 38 -470 -404 -488 -268 -197 -626 -421 -293 -261 -288 17 94 140 -29
1940 -29 255 429 403 561 559 355 451 429 61 241 408 -33 65 60 179 225 -433 -280 -461 -273 -484 -294 -233 -219
1964 -219 -645 -233 -45 -151 -338 -51 328 199 -15 419 609 98 200 593 505 135 2 605 163 250 -119
1985 -119 -99 85 -178 -329 -324 -45 -304 -536 -586 -360 -491 -308 20 -575 -120 -98 -156 298 88 137 117 449 569
2008 569 156 221 417 441 286 267 259 73 -55 -10 18 -117 -328 -179 -29 -55 -702 -188 -87 -589 -491 -284 -120
2031 -120 -298 -118 92 9 -20 85 415 302 213 344 408 269 236 152 214 53 54 11 -95 -40 76 -308 -431 -90
2055 -90 -294 -322 -402 -445 -92 -284 -370 -237 -83 -37 -117 38 84 9 -32 421 394 310 247 577 185 74 539 404
2079 404 34 -194 18 -128 -136 -135 -142 -158 -469 -255 -182 -163 -420 -194 -251 -104 -460 -228 38 -93 306 -16 -45 47
2103 47 512 333 255 144 580 223 322 395 131 245 -11 79 378 -288 -148 13 -167 -363 -218 -215 -254 -650 -122
2126 -122 112 -144 -212 220 235 153 184 79 575 258 -147 204 281 113 239 432 183 -78 288 209 -272 8
2148 8 -94 -22 -292 -185 -12 -457 -525 -158 -268 -324 -44 -319 74 -280 -48 294 -48 327 579 469 190 -80
2170 -80 573 475 210 107 461 197 -346 84 98 -104 -26 15 -171 -369 -267 -145 -190 -335 -306 -273 -391 -376 -104
2193 -104 129 -235 -33 282 326 272 45 176 371 -47 362 583 -67 10 208 -95 -27 -285 317 -329 -455
2214 -455 -57 92 -391 -505 -17 -86 -357 -460 -104 -157 -36 -163 206 103 -33 215 412 161 77 625 551
2235 551 119 314 401 335 52 140 514 9 -105 157 87 -315 -360 8 -189 -518 -145 -301 -238 -564 -85 -75
2257 -75 -26 -385 -208 127 -168 69 594 484 85 191 449 182 10 411 328 45 22 187 -152 -18 -203
2278 -203 8 -305 -259 -111 -158 -664 -359 -42 -337 -333 32 224 31 -282 -173 265 106 149 552 345 228 -188
2300 -188 472 525 58 34 230 119 4 27 355 -197 -510 28 -243 -341 -347 -208 -352 -239 -352 -89 -394 16
2322 16 94 -18 -73 116 158 297 82 420 355 312 203 281 359 310 211 289 177 -87 -65 -112 -284 -535 -100 62
2346 62 -158 -517 -243 -5 -268 -425 -180 17 -262 -331 129 5 -177 192 317 113 1 473 174 212 197
2367 197 481 206 55 -111 205 78 -209 235 120 -240 -548 -88 -18 -392 -199 12 -300 -298 -215 -160 -104 -225
2389 -225 -30 160 -174 107 251 258 105 293 392 226 63 185 327 106 37 -49 150 9 -176 20 10 -338
2411 -338 -277 -264 -135 -539 18 -294 -399 -122 78 1 -125 -33 121 19 -265 364 498 239 231 213 414 92
2433 92 38 251 71 -54 -11 -3 -238 -147 -312 -151 -90 -162 -288 -320 -269 -370 -154 -359 -275 -71 -80 -223 151 338
2457 338 -147 302 80 177 172 301 526 493 95 204 90 -83 -121 -93 181 -337 -238 52 -132 -594 -176 -262 -128
2480 -128 -238 -212 -167 -343 -340 -91 361 92 10 65 229 607 84 109 -50 296 262 169 173 23 56 -77 -150 -267
2504 -267 -26 74 -299 69 -249 -160 -243 -295 -43 -227 -349 -19 -119 -269 -223 -64 111 70 471 318 51 183
2526 183 230 342 222 168 314 192 174 -47 250 200 -238 -537 -187 -90 -29 -512 -332 -129 -118 -367 -229 -65
2548 -65 -217 -94 12 -263 557 261 96 105 252 153 328 158 134 196 127 254 37 37 -52 20 15 -14 -249 -176 -231
2573 -231 -428 -158 -281 -139 -135 -228 -175 -49 -427 98 92 109 274 93 172 219 174 521 153 206 109 164 200 135 -26
2598 -26 40 98 173 -182 -93 -205 -266 -364 -219 -268 -229 -126 -173 -129 -75 -194 183 179 194 323 128 204 280 366 73 435
2624 435 172 -206 236 153 167 35 36 52 -153 37 22 -123 -304 -198 -440 21 -357 -121 -143 -232 -146 76 -67
2647 -67 249 -18 100 -99 264 204 371 189 350 386 360 336 -111 284 71 108 96 -14 -89 39 -11 81 -198
2670 -198 6 -118 -180 -313 -272 -316 -298 -108 -208 231 103 -177 94 180 291 188 241 517 128 132 394 117 269
2693 269 280 191 -6 -69 53 -40 -56 115 -178 -85 -197 -647 -138 -103 -414 -90 -184 -85 125 206 -53 250 251 153
2717 153 401 232 292 255 38 158 111 184 111 -34 138 91 -142 -159 -185 -368 -132 47 -117 -279 -544 -28 -149
2740 -149 -116 -345 -183 -89 -268 372 41 189 -95 -25 46 171 229 293 224 285 103 91 227 -1 17 17 -20 -253
2764 -253 -89 -171 -204 -279 -449 -404 -139 -107 -311 -207 -190 -27 -185 -164 122 -96 50 292 346 274 306 239 520 253
2788 253 201 195 45 89 11 -9 -57 58 38 -321 -248 -53 51 -269 -96 -55 -260 -233 -217 -7 0 122 85 -38 103
2813 103 162 315 343 135 -62 158 15 239 190 344 5 -184 146 -55 -238 9 106 -84 -355 -128 -272
2834 -272 -181 -45 -144 -7 -99 -17 106 11 97 61 -76 207 270 278 210 9 -15 77 233 224 224 246 184 105 35 -18 -121
2861 -121 -211 -61 -370 -247 8 -100 -203 -135 -133 -211 -207 24 -50 176 425 140 113 184 104 175 223 45 446 76
2885 76 171 265 75 236 185 -72 -7 -161 -195 -233 -273 -331 -164 -476 -101 -205 -188 -27 -160 -143 4 -74 -44 15 208
2910 208 57 222 2 172 301 289 185 208 161 -76 -142 -319 -96 -185 99 -489 -131 -282 -16 -209 -152 113
2932 113 -299 -377 -294 -55 -108 96 -44 -6 339 297 156 184 3 339 -113 59 497 105 190 -143 -16 193
2954 193 -45 23 -289 -176 187 113 -110 -144 -209 -204 -196 -179 -81 -100 -138 51 -46 -41 18 -13 366 266 253 94 17 322
2980 322 326 289 85 387 17 15 -82 -185 -17 -224 -11 -65 -110 -435 -196 -93 -152 -215 -250 -330 114 -47 130 233
3004 233 26 118 229 269 196 119 60 359 418 -102 -28 -4 73 114 -8 -27 -157 -264 -142 -275 -236 -317 -99 -104 -154
3029 -154 -205 -44 -152 57 -142 -267 -106 -9 94 2 299 281 358 54 43 96 405 122 45 76 257 0 20
3052 20 -129 25 -95 -260 -52 -43 -110 -90 -373 -105 -216 10 -14 74 68 -134 -1 292 165 342 108 -88 438
3075 438 307 310 332 20 327 248 -72 -72 105 186 194 -264 -68 -149 -126 174 -375 -171 -102 -77 0 -95 -200 139 113
3100 113 -12 -10 114 33 -48 219 194 10 229 248 89 53 35 -155 195 -10 -57 83 -256 -173 165 -81 20
3123 20 -153 -94 -210 -376 -135 -21 -54 44 -2 66 -126 200 156 160 553 179 7 352 147 113 157 -109 -104 112
3147 112 -162 -212 33 -2 -233 -191 -121 -49 -235 -244 -239 -125 -375 -269 -191 -85 115 182 -162 204 88 61 107 225
3171 225 189 121 439 124 81 16 -158 133 59 27 -179 -126 21 -279 -223 -163 -140 -40 -138 -151 -192 -131 -136 -75 -98 -139
3197 -139 -84 67 59 -30 32 -51 242 82 104 257 19 246 147 205 157 105 -163 -155 145 -167 -257 -316 -6 0 -307 -196
3223 -196 27 -63 -99 129 -122 158 -57 20 -94 63 84 97 59 8 375 193 276 359 -129 -11 99 59 113 -113
3247 -113 -81 37 -328 -407 -106 -221 -161 -174 15 -235 -242 79 97 29 19 220 -61 -113 404 332 99 331 125 30
3271 30 81 -146 18 25 216 -93 153 14 -82 -104 128 -160 95 -118 -76 -160 -159 -77 -110 -150 30 -66 -88 46 103
3296 103 87 173 147 197 168 281 59 105 146 -39 -238 16 -72 -142 96 -110 69 -150 -212 -278 -209 106 -62 77
3320 77 -225 -124 -99 -338 -33 210 -146 0 -2 274 -106 162 23 -100 159 17 367 129 -187 73 282
3341 282 9 -101 51 70 -78 -273 -248 -222 -87 -214 -80 -123 -260 257 -57 -137 -61 -82 7 9 209 169 70 100
3365 100 209 123 105 276 307 -103 -79 136 30 270 -224 15 -19 -77 -185 -186 -219 -211 -108 -365 -247 -301 -92 62
3389 62 83 -158 172 65 142 159 131 39 275 207 190 79 321 131 157 -6 -68 86 75 170 94 -234 -110 -172 -140
3414 -140 -267 -232 -9 -229 -229 -18 -45 54 20 284 175 138 399 24 322 2 193 97 151 142 131 -146 6 76
3438 76 36 -32 29 172 16 -222 52 -204 -257 -133 -414 -173 -291 -270 -46 12 175 -92 -25 16 214 191 156 362
3462 362 147 25 327 349 19 91 70 180 208 -1 178 34 22 -393 4 -161 -41 -26 -41 -94 -159 -168 -60 -48
3486 -48 208 215 61 215 -82 102 44 167 -89 187 78 79 -84 -35 261 -49 -154 -42 -109 85 137 -147 132
3509 132 -54 -210 22 -179 16 -220 -69 -128 -29 -70 24 -122 91 74 122 101 -32 19 153 48 -68 171 168
3532 168 -211 232 146 -161 32 114 104 66 -46 -99 -185 -145 -465 -70 -250 -94 -26 62 -46 -37 -44 25 305 55 402
3557 402 -101 132 264 6 24 109 441 -96 -197 263 56 90 -274 -45 22 35 -395 -195 -15 -319 57 -137
3579 -137 -136 -258 -132 88 22 311 -17 50 134 211 264 170 69 128 365 -69 225 127 83 16 200 182 -210 -8
3603 -8 2 -205 -286 -107 -350 -155 47 -57 22 -176 -96 -145 164 80 -9 135 145 133 126 107 235 13 172 -4 -14
3628 -14 118 -32 -200 62 -130 -97 18 -204 -110 -200 -167 -168 -160 -360 49 74 -103 270 24 -27 136 -129 -119 55
3652 55 -8 -33 -206 210 222 115 165 166 271 -8 52 67 129 -164 -114 5 -48 78 -50 -109 -401 -164 -162 211 103
3677 103 -111 35 12 44 255 119 42 92 22 -19 75 -161 36 -19 191 119 157 279 -34 239 -11 -241 -50
3700 -50 -52 -55 -166 -223 -318 -434 -7 42 178 -123 -26 -146 -171 66 125 -189 180 -29 -37 88 -30 27 61 232 341
3725 341 2 101 -69 189 24 -25 -73 -150 -223 -9 -109 -183 -1 -225 -360 32 -22 -39 28 124 3 78 -38 7
3749 7 -24 192 42 21 95 124 81 245 146 421 134 -46 -66 6 -127 -25 -179 95 -30 -33 -14 174 -125 -75 -150
3774 -150 -155 -163 71 -52 -4 111 45 87 278 177 -21 327 109 118 175 -190 179 132 105 -205 127 -169 -47 -25
3798 -25 -282 -65 57 -150 -183 -176 -118 72 -224 117 -131 32 57 -60 281 -88 -67 305 165 -17 218 186 176
3821 176 389 88 120 -172 317 -79 -234 85 72 176 -166 29 -398 -73 -84 -229 -106 -236 66 -11 112
3842 112 -189 -164 -118 172 15 202 232 106 152 252 -1 130 21 -114 -109 -71 5 -157 105 99 -252 -79 -398
3865 -398 12 9 -100 -116 -7 59 -245 -74 -136 17 111 -332 82 -299 -40 -38 30 149 -117 -61 202 -117 -19 -111
3889 -111 -20 -152 -156 -90 -220 -1 -70 -252 -184 2 -48 -260 -141 119 -216 -7 26 -47 252 -31 -39 209 186 314
3913 314 -10 99 9 90 289 215 44 34 -24 127 -37 -35 4 -125 -9 -87 -3 1 14 -219 -34 37 -54 276 -203
3938 -203 4 -123 -9 -147 182 16 224 297 95 -114 -18 263 290 70 220 -153 125 40 -125 65 -165
3959 -165 88 -188 -99 -86 -303 143 -66 3 103 -20 -118 14 -230 261 96 42 -16 -70 255 80 54 1 320
3982 320 223 31 38 54 159 -107 -45 -64 -88 -33 -14 -47 -195 -164 -81 19 80 37 -23 55 -116 -13 -62 281 -15 -89
4008 -89 50 133 -1 -25 -23 -5 377 160 126 211 -115 -141 -28 -141 -1 -48 41 113 121 -172 53 -96 -197 -116 -99
4033 -99 -79 -16 20 23 94 -90 73 182 80 -113 -68 -166 59 -100 54 128 79 -158 43 -114 -206 7 60 71 71
4058 71 -327 -263 -100 -314 -23 -40 -240 114 86 -192 -18 -146 -23 -63 -377 -49 122 185 -135 54 296 30
4080 30 87 51 -13 -37 -2 -4 41 80 -251 -64 -245 -138 -236 -138 -149 -216 -54 -100 -214 -132 -206 -292 360 45 191 223
4106 223 5 15 8 -102 73 3 20 18 37 -61 -125 -116 -262 -178 -83 236 52 -249 -87 -29 -138 71 31 60 -4 -38
4132 -38 221 -32 41 2 -18 73 -80 91 18 85 167 120 154 -110 70 -122 -70 -46 110 4 -245 -54 -86 -77 93
4157 93 25 -142 -160 6 15 -23 306 -34 137 -24 149 61 20 75 -49 304 82 4 47 -40 -67 106 85 -158 -50
4182 -50 -32 -45 132 51 -93 -66 102 -241 -47 -141 -95 34 -299 -19 -206 78 239 -91 33 -194 -134 -24 205
4205 205 236 -20 435 236 -43 223 -128 115 108 54 -47 -56 18 -279 -202 65 -51 -41 -25 99 -93 -151 20 196
4229 196 -419 -200 46 -259 229 -84 -13 89 111 -140 107 -31 31 48 31 17 -7 -248 38 -134 -78 27 -250
4252 -250 -268 -130 -10 -312 -140 142 52 145 -101 91 -42 -53 -128 18 47 -148 -174 134 -45 -77 210 -169 213
4275 213 233 110 -17 185 18 -166 1 -224 99 98 -115 -180 53 -152 -138 28 -38 -78 -29 -49 36 -40 197 -111
4299 -111 25 115 13 161 -53 70 220 -27 232 101 -90 98 -93 80 -59 212 -103 -43 -192 -84 -151
4320 -151 168 51 1 -253 -80 -82 -33 -1 183 -57 54 98 87 -76 218 59 -106 110 -172 252 61 103 -74
4343 -74 28 38 137 289 45 163 8 118 -44 -70 -132 21 -33 -215 -130 -72 -96 116 113 185 281 -39 121 -228
4367 -228 175 103 -157 5 103 -40 -150 -75 98 -149 53 -97 -167 -53 -110 -170 -69 18 -90 -77 -152 19 -119
4390 -119 -91 -134 228 272 -74 359 -41 230 167 13 173 182 169 37 -190 120 -15 -78 -131 -186 -15 -88 5 -80
4414 -80 -150 38 -110 -158 -45 4 93 84 -5 201 -17 69 79 -68 46 160 -70 -52 43 2 156 -3 -97 -90 146
4439 146 48 84 122 -2 99 89 -85 -197 -199 -218 -126 -183 79 -211 -50 61 162 62 -203 157 -23 287 102
4462 102 158 98 -15 189 -11 -34 -143 -151 -62 -4 305 111 -207 -4 -17 -145 -89 -206 65 -125 -70 -145 289 -9
4486 -9 53 -67 242 -31 -4 145 53 -2 -39 190 -16 -53 122 16 -127 -151 -19 25 -36 87 -234 -116 31 53
4510 53 31 167 96 -18 -187 -104 -78 -11 -130 209 113 55 -44 -196 14 94 -3 -51 240 10 62 5 -6 -25 42 -14
4536 -14 -205 79 -243 -258 -53 -207 85 -52 96 -53 140 -102 14 -70 -134 16 57 169 19 -113 3 6
4558 6 -29 -64 4 43 -12 228 -121 -27 -106 -19 -9 -20 -93 -60 -130 -171 74 -55 -85 12 24 -82 80 -121 47 130 -26
4585 -26 33 84 27 20 90 63 216 74 35 52 256 58 -250 274 236 9 -186 -79 -28 -104 -76 -113 -70 18 10 -260
4611 -260 -74 -171 -77 -162 -56 -98 4 -90 -146 80 -36 27 116 179 82 166 -59 -6 152 389 -104 29 -87 52
4635 52 12 -137 -11 -118 46 -4 87 -170 5 -100 36 92 97 55 -55 155 -46 198 362 23 -9 -15 65 25
4659 25 -47 27 -53 -224 141 21 30 15 25 -37 -152 -384 105 -139 -117 -91 -73 -24 -166 9 160 179 -27 127 116
4684 116 158 133 19 -22 76 138 -39 80 -9 -209 124 138 184 0 -16 -4 -42 49 -87 -145 -134 -27 152 -55 -184
4709 -184 7 50 18 70 -99 20 73 34 81 -92 256 -68 221 48 114 79 -6 33 92 128 -86 17 -7 87 156
4734 156 -139 -39 -157 124 170 -73 -79 -184 -184 2 -189 -99 93 1 85 28 231 245 241 47 175 107 -65 71
4758 71 -247 112 -95 281 -121 119 193 -304 -161 -85 -137 -221 25 105 -50 25 129 -18 -4 -111 34 -29 -160
4781 -160 18 71 49 225 -40 39 61 89 191 91 -11 8 135 -152 -18 -21 20 82 -73 -120 -10 32 76 -70
4805 -70 -242 3 -86 129 -97 16 -197 64 -53 96 123 161 91 57 110 -263 170 -14 -20 144 -5 -40 106
4828 106 31 144 -220 -25 -82 -354 208 -5 -24 109 -116 -58 -96 -184 -121 143 -12 -325 45 -106 -213 14
4850 14 -12 -126 -64 75 28 -145 -12 86 86 93 -28 -181 -72 42 298 29 -137 -56 -113 43 73 155 201 28 20
4875 20 -89 -53 145 45 265 -33 50 90 -146 225 202 -23 -5 -24 170 -30 175 -24 17 -101 -89 146 -75
4898 -75 -236 75 -122 -104 51 -55 -26 175 -30 78 -156 5 47 -229 -77 -136 75 -71 0 201 -75 -78 112
4921 112 -62 56 19 72 137 -101 -76 94 124 -60 59 187 4 110 -203 -118 -144 -10 -5 -24 109 6 189
4944 189 60 88 140 172 14 -105 -211 135 -109 101 249 67 98 265 -120 267 99 39 28 22 -369 65 -164
4967 -164 -30 -21 -27 -31 116 174 344 39 167 -30 41 32 -65 -2 -44 -122 188 38 15 62 101 -44 5 -71 -72 -215 -70
4994 -70 -155 -155 172 -139 -82 0 86 162 26 -50 -87 -147 -20 -88 117 64 206 110 56 9 -13 -38 102 28 80 39 -29
5021 -29 -153 17 -80 146 56 -131 -221 142 14 -98 -148 -85 -47 -116 100 -129 -37 145 333 250 -14 125 0
5044 0 4 -112 26 -301 -158 165 -15 -270 80 -97 59 144 -34 -48 -96 65 -29 -108 -58 -253 41 31 21 -16
5068 -16 -27 62 -210 232 232 237 7 -166 -6 28 61 216 57 -50 184 -362 66 6 89 81 -178 148 -63 -23 263
5093 263 -167 -37 50 146 -178 167 -18 245 -76 -11 243 42 -132 -62 4 176 105 -104 30 -72 215 131
5115 131 -47 178 12 -5 116 -74 -129 -104 24 102 30 -76 -33 6 -18 -125 -55 -137 -97 -48 3 171 67 70 46
5140 46 254 146 215 13 -51 19 -68 67 131 151 135 32 -142 -75 170 24 61 105 86 -333 79 167 62 74 -30
5165 -30 -227 106 118 -15 -120 102 197 228 -120 95 20 -29 48 21 5 -48 285 12 220 388 24 -227 -409
5188 -409 6 -209 -186 -60 31 -132 34 258 -222 61 43 -301 -82 -172 142 50 22 110 -67 108 16 -9 103
5211 103 -158 -41 11 -189 -143 5 -122 15 -97 -160 44 -22 73 142 -16 27 -66 -32 -220 -19 79 -116 78
5234 78 -8 -159 95 85 -76 126 61 56 156 103 78 109 -118 139 -133 -104 -27 -172 -162 -91 -51 -56 57 -111 -207 -18
5260 -18 29 149 -176 -83 20 -4 96 350 206 -190 11 -61 -208 30 -151 159 -82 -107 205 29 35 -308 -103
5283 -103 3 119 190 -92 -113 21 28 -130 6 72 -157 47 32 -125 107 -13 241 337 -69 -221 35 451
5305 451 -146 -100 102 90 127 102 -152 108 -118 36 25 -73 -155 60 -25 -56 104 32 -260 -122 -170 -5 102 -161
5329 -161 14 132 13 -93 65 77 -46 191 181 -126 -58 113 -147 169 -29 -221 -26 41 -7 -213 22 11
5351 11 121 143 -81 -115 -131 9 -46 -148 131 -1 -240 -80 -45 -75 -11 -105 -3 -86 173 -49 -30 -179 -109 243
5375 243 18 -19 -66 76 79 16 178 64 -83 -30 -116 -87 29 -322 121 177 -20 -28 173 131 -160 148 -78 -114
5399 -114 -9 -63 133 19 66 -22 -130 252 -33 157 -153 -20 -143 -93 184 -82 -123 14 -82 -165 -35 47 57
5422 57 97 -318 -45 -107 167 115 292 -76 -54 143 95 -174 17 252 53 -245 98 -23 35 47 68 -134 -163
5445 -163 65 -112 -209 -131 -165 1 -189 57 -93 -95 -23 -184 -48 21 68 -124 373 84 -22 -103 -213 139 84
5468 84 147 10 -53 24 111 -31 86 135 -111 -69 -101 18 -184 -71 -185 -81 -14 72 -226 -15 31 10 242 54
5492 54 -90 239 38 99 71 4 -119 -132 -151 61 -173 101 -48 -173 245 -194 -35 -165 -19 81 -34 53
5514 53 60 22 141 -239 200 -149 157 -61 -26 110 47 184 -76 64 -74 11 147 87 82 29 -57 55 75 -63
5538 -63 64 170 -135 90 -10 -176 110 -183 129 -211 -174 68 -130 -55 95 -105 5 -9 37 -69 -61 -164
5560 -164 142 -38 -50 124 -209 54 33 -16 51 -141 11 -175 -131 0 2 130 -117 30 36 81 -149 78 -185
5583 -185 -27 131 106 -67 92 -257 80 -124 -228 -18 90 -202 29 235 299 58 190 6 13 81 -65 138
5605 138 -33 -138 -57 41 -135 -200 -203 43 -67 -83 -38 -121 -13 -130 -265 -169 -70 -13 18 -2 -10 155 45 -38 -11 -278
5631 -278 82 147 106 -103 35 -204 -32 181 65 136 -149 6 -74 45 8 -11 -151 -62 14 -166 173 -64 -245
5654 -245 -134 168 37 -90 143 130 256 -20 103 -11 33 -32 -107 31 -234 1 -95 -28 76 100 -1 -65 135
5677 135 -139 120 -414 -40 -75 101 93 -3 208 203 27 -27 -89 41 -79 -53 234 -86 196 1 -87 4 125 163
5701 163 -80 93 0 67 19 -255 -322 -181 -195 9 130 -8 -12 14 61 299 -287 140 -25 72 208 111 16 -64
5725 -64 101 -36 43 -137 -152 -18 -129 -87 200 134 37 -34 113 106 39 11 -148 -118 -101 16 195 -33 102 118 -47
5750 -47 -129 -135 -95 1 -45 -155 250 60 -35 -136 198 -59 34 130 34 108 151 49 -184 193 30 156 -74 -136 -331
5775 -331 -183 59 -14 39 20 124 2 -140 -69 -62 -79 189 60 -6 432 85 17 91 -36 -173 -32 37 241 112
5799 112 -28 0 -105 61 308 -15 73 -38 98 -7 128 -166 48 -30 334 27 -35 21 49 66 -56 1 141
5822 141 -149 202 221 -52 361 33 55 -91 -58 -226 82 4 153 27 -119 59 -251 131 -106 24 67 -30
5844 -30 91 -93 171 -295 -103 89 11 136 -225 -72 43 -27 -152 219 63 14 87 -118 -96 29 -157 48
5866 48 0 -191 -21 -166 -206 94 -24 -122 -219 -8 -198 93 309 -131 40 370 -75 -28 288 116 70 83 74
5889 74 12 -254 40 70 44 137 -175 40 245 -67 253 -108 -74 -220 -165 104 -90 -158 139 -89 -165 -34 161
5912 161 168 -59 -53 -154 2 -40 -338 -160 -64 -33 -45 160 222 11 101 168 18 -158 -219 -57 144 -25 -46 -9 244
5937 244 36 103 81 86 -45 -110 -56 242 79 -225 211 44 -197 6 97 72 162 79 61 -33 38 -88 -16 -195 76
5962 76 -22 310 -22 98 101 -97 -305 -75 -181 -12 78 -29 20 24 203 55 -119 -95 -29 -22 180 261 66 -25 -28
5987 -28 -212 -13 -157 -42 210 -20 165 11 -174 24 -52 -1 84 -28 -173 -195 11 119 -19 41 -65 -14
6009 -14 143 180 -190 -54 10 102 -110 54 -67 22 -150 45 207 168 82 -22 38 -64 56 -17 -102 148 87 -57
6033 -57 129 -192 41 -33 -75 74 191 178 116 56 33 -29 32 41 13 14 127 -79 -1 -55 -68 55 56 -68 283 -111
6059 -111 121 63 48 -262 55 253 39 29 -123 -116 39 248 105 26 24 -14 -78 -189 53 -123 71 54 -138 217
6083 217 -50 -48 -13 -160 -53 69 73 406 -10 -83 -34 -163 -76 -59 74 28 -94 159 -139 -42 32 102 164 107 -72
6108 -72 -91 -214 47 -15 -109 -172 -11 24 -62 2 -18 25 -35 59 -25 -100 -290 -136 -209 -80 -7 43 -7 152 -57 5
6134 5 21 159 47 20 72 158 50 95 -185 1 -169 220 84 199 72 93 219 -168 -48 -336 104 -10 129
6157 129 -6 -43 86 164 -70 -36 -321 -75 197 62 -37 73 -8 143 -169 83 109 155 57 -60 -74 -44 175
6180 175 106 87 39 161 -148 96 -133 -32 -92 -2 173 69 71 35 16 -110 123 17 130 -28 146 139 109 -353
6204 -353 -188 64 16 -74 -137 143 159 -171 -4 -189 47 -37 -110 -210 -115 63 -145 155 -29 -73 50 -249 -150
6227 -150 -148 -136 -127 216 -15 -70 32 172 -79 159 2 -14 167 168 280 47 148 -200 196 -175 -71 -34 99
6250 99 200 -109 -146 36 416 94 61 51 34 -273 -166 238 -214 83 178 -53 221 -87 142 63 -114 -10
6272 -10 59 103 60 18 37 -257 33 -72 112 53 207 -23 124 68 -195 -127 -202 -107 -73 61 -162 336 -147 109
6296 109 88 -331 62 -167 158 147 44 -151 -9 -235 -166 40 108 56 -54 -36 -109 -12 -88 -149 82 -221 -25
6319 -25 -37 -74 -32 160 -150 72 -19 -85 35 25 5 -84 -37 10 44 202 -142 47 6 -65 -41 28 -23 0 -54 -96 217
6346 217 -27 47 -36 -106 -150 -105 84 -264 314 35 23 -4 37 60 166 -16 -28 187 220 -126 20 96 -87 -100
6370 -100 -135 74 -8 -82 -115 127 -75 339 204 -22 -21 -16 -8 -171 -240 27 92 -4 -172 -13 -203 -58 -25 -99 -20
6395 -20 35 87 58 -2 -164 -9 64 104 17 22 -257 115 -35 189 267 -29 -99 61 21 15 108 -182 -192 -90 0 -154
6421 -154 -97 133 19 59 -11 55 201 28 34 -1 -67 54 117 -265 27 118 108 35 34 97 89 138 23 174 98 109 124
6448 124 -228 -100 134 -36 20 58 139 -75 54 79 37 -82 227 259 -174 261 -10 85 160 8 9 -75 48 -65
6472 -65 58 -9 149 -273 285 129 183 -192 -217 146 161 59 149 3 -127 -11 6 51 -93 16 98 71 182
6495 182 -196 65 60 -254 -71 171 -65 -35 1 -76 44 -100 -85 44 32 -51 -66 -208 -141 -26 -137 40 -76
6518 -76 25 -176 38 -11 -112 -48 48 10 179 518 37 127 121 87 276 10 117 26 10 44 -104 34 -121 173
6542 173 -139 -148 -115 -34 115 40 -162 -52 -84 -109 -371 6 232 -117 -33 73 -27 130 216 84 33 60 -7 -147
6566 -147 -211 122 -123 -108 -3 181 -34 -64 171 102 25 171 -17 -37 -341 10 -108 130 57 3 93 201 -116
6589 -116 -97 -24 227 28 192 7 38 48 -49 142 -42 37 -84 108 -104 36 110 6 -39 -95 -212 -255 47
6612 47 38 -21 -117 137 -54 1 -13 -115 30 -316 -74 -17 267 23 -69 115 -170 44 -152 58 195 -7 -226
6635 -226 -53 59 181 -171 68 101 -163 -69 -1 85 59 23 -36 18 92 -248 -162 48 245 -36 131 44 22 214
6659 214 -11 -125 33 107 -40 -35 -20 204 -33 47 -8 140 -171 31 34 -106 -13 -102 -118 -19 107 16 28 67 118
6684 118 -135 -216 28 61 81 -53 123 107 -182 -58 122 231 83 251 99 -171 -27 120 157 -8 221 -324
6706 -324 70 -50 42 -51 -19 -52 -171 75 73 150 172 16 -17 -187 135 14 -73 42 36 -191 -153 -57 -185 226 221
6731 221 -100 32 -30 139 -377 56 21 -336 32 -82 -137 -56 -55 -11 -2 254 -75 98 -132 67 -24 -145 -80 318
6755 318 235 305 -111 -254 -21 68 -29 53 -173 -2 -146 13 -179 -30 144 25 -111 -158 -69 -118 -16 -177 76
6778 76 119 39 7 160 124 277 -5 -58 230 -52 -79 143 99 19 -137 -39 79 -41 -127 135 -186 56 19 7
6802 7 -86 51 -34 62 -181 -34 149 83 -213 -161 -214 -127 29 -19 -3 101 238 -70 149 79 0 -176 31 183
6826 183 91 59 166 -241 77 -132 -68 64 -67 238 101 -176 -22 51 211 148 -59 -175 -109 199 29 67
6848 67 -40 167 69 169 54 -80 -151 67 190 -1 74 -303 -113 -37 -191 132 24 40 184 -223 -52 -22
6870 -22 -12 -120 -62 -185 108 7 -52 62 41 -72 -301 -55 -15 216 -118 3 -112 -111 124 24 119 43 -114
6893 -114 8 130 216 -128 -375 13 17 -28 -24 19 -498 56 -252 -76 -142 33 57 -3 10 -38 120 16 -101 -127
6917 -127 176 60 -154 -4 40 3 -83 6 41 52 -127 -97 128 -173 216 137 134 -128 28 -124 -14 113 113 -26
6941 -26 170 -341 -121 11 -273 -109 -62 136 209 82 150 120 86 236 -203 -149 76 -111 -84 -42 42 -128 -116 -63
6965 -63 106 -67 66 -127 -189 101 -69 76 36 -98 -26 -65 -120 -157 -84 157 70 101 135 -93 83 131 -68 192
6989 192 121 -236 67 -17 -128 -186 67 100 -63 -215 -219 17 91 -193 7 -192 -124 32 -5 182 -152 -19 147
7012 147 -31 -9 -214 236 -293 151 -95 -142 -230 -126 111 -66 -171 -43 -66 89 -165 -95 81 29 72 -127
7034 -127 117 -59 130 -97 -9 120 19 -182 -29 -2 -80 204 100 -29 -200 -153 -146 20 23 159 148 -122 9
7057 9 167 -77 65 -68 -116 187 13 -116 49 132 49 169 -77 -96 -83 -65 -53 -117 216 249 -247 -214 112 104 118
7082 118 -36 75 -31 347 -132 190 137 -48 -153 -140 -16 30 -208 -71 -61 150 327 61 68 -160 -45 -104
7104 -104 -13 -38 164 118 2 45 26 3 103 -4 246 80 -124 140 -86 96 -163 -129 48 31 -204 -86 62
7127 62 69 114 174 -118 133 260 5 224 -76 -126 44 -52 217 94 45 -270 -3 78 -30 -112 89 25 159 -78
7151 -78 -57 214 -240 -127 23 -101 167 121 49 34 57 -33 21 -171 -133 -37 -57 -111 34 97 -76 -182 69 143 -94
7176 -94 219 135 -52 -133 108 20 45 -110 23 71 -94 -169 120 46 -162 8 24 -146 -127 178 -208 -120 69 229
7200 229 -149 32 103 230 -108 -250 -23 29 195 103 160 -49 117 219 246 69 -73 -144 210 -66 -33 -81 7
7223 7 6 40 -124 114 -63 11 17 113 125 3 192 77 -51 -94 -16 217 -51 131 26 114 101 120 12 -144 -153 62
7249 62 -215 -16 15 -127 -10 -22 43 -57 -132 22 111 -91 -15 -86 84 -293 -42 -10 -62 -68 -331 -151 -16 -83
7273 -83 19 -35 -182 -114 -36 -136 30 -39 -17 96 -35 -15 115 -87 -85 -28 35 26 -310 210 33 112 -135 91 84
7298 84 9 78 -54 131 -45 -95 18 49 54 -65 40 -8 -106 52 -172 -246 63 -57 -26 -51 38 95 82 -39 -90
7323 -90 17 -94 102 -64 -52 -144 132 -100 82 199 -103 7 304 -94 -17 -121 -137 69 -266 21 -135 -233
7345 -233 -171 64 -23 187 150 -74 -147 40 -40 -68 -11 97 -39 -177 47 133 -41 77 158 -14 -45 -88 -37 172
7369 172 105 -134 -152 -196 -102 -104 -27 -113 -25 -102 58 -8 -23 28 -167 -77 -119 83 99 -48 20 -16 -6 85 241 10 -106
7396 -106 -68 3 -87 -76 -157 274 101 56 45 123 178 -66 -140 68 28 -105 -110 -115 -9 85 -312 101 36 -78 -42 -154
7422 -154 11 85 -116 -191 73 45 113 82 -272 -191 105 -212 -114 -76 185 88 242 41 84 282 48 -109 -124 198
7446 198 52 -97 -15 -86 -245 88 -49 45 -141 144 -386 -51 41 -34 88 31 -93 84 -90 -94 124 -29 -25
7469 -25 269 127 -152 135 -140 -25 -91 38 -22 -101 -122 8 -154 -106 -109 -262 7 154 97 -74 -126 35 -100
7492 -100 -263 24 155 -138 -162 94 1 -108 213 -58 -228 14 121 -3 108 -151 75 9 55 241 -96
7513 -96 20 110 -51 89 -267 64 101 -119 75 -21 -9 -127 -178 -309 -20 -74 -13 -67 -135 -121 -123 -35 -5 116 -1
7538 -1 -331 -26 79 152 98 -91 146 -54 40 24 34 12 -52 -134 148 -82 -114 39 -204 -214 -130 38 333 -85
7562 -85 96 159 128 115 94 -45 -103 -229 -123 153 204 -256 123 227 -350 72 -272 13 -127 -97 -53 -84 157
7585 157 -88 121 91 -159 266 92 66 -154 -86 19 -118 -11 91 -13 -60 171 -65 157 -42 126 75 229
7607 229 29 30 -114 50 -96 -2 -27 70 -311 59 16 184 8 -71 -108 80 17 -136 -1 66 32 -118 26 143
7631 143 -131 157 -6 -53 185 -9 37 172 -70 14 -33 92 -173 -42 211 -66 61 112 -91 -110 -55 -39 -25
7654 -25 -30 -93 243 -96 40 136 -180 -22 153 -45 271 182 26 120 -129 203 -141 -115 -104 -68 121 162 -12 253
7678 253 -30 171 -85 -155 7 28 280 -169 133 35 114 53 -33 146 424 -105 -128 -109 56 177 99 43 174
7701 174 77 201 -135 -183 -144 94 66 -8 26 -366 -77 -145 37 96 -14 26 300 -166 116 -58 -365 -9 156
7724 156 -64 -141 -159 -203 -13 -96 -191 315 -119 -150 142 -27 12 -21 21 28 -55 143 204 -159 -146 -54 -3 44 -187 -237
7750 -237 -112 -113 -42 34 -26 143 266 98 30 26 19 43 -21 9 168 -52 -80 119 -30 -98 -98 -8 85 238 71 -43
7776 -43 31 17 -34 -188 -178 -217 63 -82 -155 6 -37 -48 -76 192 61 -200 267 -73 25 -124 214 93 182 140
7800 140 -2 9 -74 246 28 2 -28 -146 -117 -8 42 247 -39 -124 -3 -60 96 35 77 -55 151 184 -5 -15
7824 -15 62 -173 7 -135 167 25 -236 -97 27 246 -289 -46 -46 -240 3 112 -8 -46 182 -210 68 102
7846 102 156 -58 -11 -180 72 -78 52 158 51 -218 103 59 107 67 -96 145 9 -147 -78 36 -94 -122
7868 -122 -10 64 44 61 11 37 -81 -96 65 -75 194 20 -122 -18 -200 83 57 -65 62 -43 -194 233
7890 233 46 -91 -251 -71 12 -348 -148 -48 31 1 -210 172 -7 1 50 -187 250 -43 203 161 11 197
7912 197 272 -74 36 5 -49 51 -20 54 -139 -164 -17 -98 -92 -79 118 -123 149 13 155 -98 66 54 23 6
7936 6 37 302 163 64 23 45 22 81 -116 47 135 9 68 -94 182 60 133 -11 0 148 50 -243 162 51
7960 51 152 34 -118 20 -23 -292 127 -8 -123 202 130 -126 132 -67 56 156 -160 0 60 43 -11 57
7982 57 -94 -74 -171 22 -4 9 142 58 -108 82 -69 213 101 -208 127 291 291 -132 -148 64 -197 6 359
8005 359 128 156 89 23 -148 104 -179 -32 -103 298 271 -95 -81 115 -223 -174 -328 170 122 -117 138 225 -110
8028 -110 -76 186 190 7 -201 -209 -77 -35 16 295 13 153 204 -169 -92 -62 -156 -9 -15 56 -26 -298 109 123 29 129
8054 129 -38 291 -220 -148 31 6 33 -202 -33 20 22 63 7 -89 -31 -69 -209 -167 -195 -81 59 217 86 -96
8078 -96 84 -176 -25 -20 115 41 11 43 8 -72 83 33 76 91 -214 -108 14 0 -146 5 100 28 145 34 13
8103 13 -131 -15 -262 40 -3 -26 -128 -100 71 65 87 22 45 3 141 22 -124 -208 -100 117 153 92 254 -82
8127 -82 -56 -57 -225 -14 60 96 -213 -91 -71 118 8 21 53 109 164 -95 -311 92 -102 -75 -23 64 -72 -174 52
8152 52 -40 -83 24 274 1 201 100 -279 35 -255 62 140 -61 -71 -116 -110 329 128 16 221 84 61 138
8175 138 109 -108 8 -29 217 253 -34 -96 124 -35 18 103 -69 -261 134 -182
8191a82
$$ Imaginary data points
##PAGE= N=2
##DATA TABLE= (X++(I..I)), XYDATA
0 0 0 0 0 0 0 0 0 0 0 0 0 0 0 0 0 0 0 -8 8 -8 8 -8 8 -16 16 -16 20 -24 24 -32 32 -40 44 -49 56 -63 71 -79 88
39 88 -100 110 -123 135 -148 164 -182 201 -220 242 -268 295 -326 359 -396 440 -487 542 -605 679
59 679 -770 878 -1015 1187 -1423 1753 -2255 3110 -4814 9534 -49608 -149984 19196 129216
73 129216 22190 -82518 -31784 29176 24030 19575 12352 -39132 -32353 52668 70746 -32995
85 -32995 -74579 12058 67122 4544 -43797 -15981 6891 4579 10696 1758 -34077 -23366 30908
98 30908 26841 -27851 -25450 17958 9417 -10466 11959 13823 -31674 -19099 49611 31708 -52160
111 -52160 -35999 53223 43329 -37890 -34100 32735 26346 -19230 -5393 16221 -12091 -16137 26875
124 26875 13922 -44861 -24814 45917 20894 -54748 -30958 43245 27700 -37101 -27848 22802
136 22802 23329 -4964 -8973 -5593 -93 21270 19666 -19238 -28203 20573 39339 -10050 -35822
149 -35822 4016 28253 3080 -12652 -2679 -3968 -5238 16406 13272 -27632 -27121 23835 27824
162 27824 -24646 -32833 13245 20382 -13025 -10382 12158 -1763 -15761 12789 27082 -10530 -27565
175 -27565 12868 33761 -1234 -22180 -436 13220 4441 2490 318 -15770 -10552 21558 18166
188 18166 -24401 -28154 15483 26714 -9417 -25314 -2458 11190 4595 -685 -7996 -13821 2563
201 2563 20820 3499 -23275 -7810 24429 14118 -15052 -8293 14419 9477 -4670 1398 6171
214 6171 -5279 -3735 10911 2948 -14804 -5448 11285 627 -13985 -2203 7629 -5367 -9399
227 -9399 5865 5726 -9756 -7289 9897 6949 -9288 -5300 8588 4297 -3558 1127 3847 -1596
241 -1596 1086 9521 1687 -9548 1756 15021 1395 -13115 -1179 11788 512 -11240 -2874
254 -2874 3450 -2654 -3915 -378 -3732 -6088 2169 5488 -5602 -8200 5164 8996 -3415 -6342
268 -6342 4852 7468 -1591 -2351 5241 2632 -2543 2701 5421 -2003 -3372 4281 4267 -4123 -2907 4327
284 4327 -140 -6158 -504 3516 -3690 -7756 88 4100 -4302 -6691 694 2906 -1665 -1929 1528
299 1528 802 -471 4371 4525 -2748 -1822 7418 5742 -3654 -3443 5401 5388 -2991 -2957 1793 598 -1511
316 -1511 -202 -997 -3592 -1693 2344 -799 -5950 -1780 2838 -255 -4746 -1939 2571 63 -2324
331 -2324 1170 2091 -850 900 4031 2338 -319 1744 4739 1409 -837 2191 2132 -1387 -813 1533
347 1533 -245 -3728 -2234 1377 -544 -4153 -2173 -77 -695 -2131 -1146 -248 -1631 -428 2179 -269
363 -269 -2265 654 3162 1443 -785 1383 3063 1094 973 2719 1438 -199 557 2445 1516 -1702
379 -1702 -1745 -305 -195 -785 -1867 -3297 -2895 -382 599 -1574 -4627 -2227 2397 2169 -1539 -2506 220
396 220 3519 3187 453 -1992 81 4730 4144 -610 -2313 973 3906 2507 -828 -1780 -557 1109
412 1109 2114 -824 -3664 -3062 271 1538 -2330 -5067 -1998 964 -234 -1900 -1636 -53 -78 824
428 824 2462 1232 -1100 511 3489 3673 183 -1378 1685 3414 1399 -621 -69 967 -116 -826
444 -826 531 264 -2899 -3122 417 1735 -1825 -5071 -2212 1674 796 -2471 -2657 -484 15 935 2538
461 2538 884 -3238 -575 6076 6442 -2207 -5909 2776 9232 3607 -5512 -4605 3684 5766 -229 -4435
477 -4435 -3772 -897 2672 2622 -3257 -8636 -3388 6927 5311 -6644 -10244 602 9971 3207 -8291
492 -8291 -5989 4977 7601 1217 -3493 -1510 2055 4163 4841 913 -4948 -2301 6625 7606 -2984
507 -2984 -9547 -1118 8477 3158 -8210 -7196 2011 4019 -2196 -4475 -1881 -1730 -952 2745 1917 -4518
523 -4518 -5357 4269 8201 -960 -7459 261 8831 4372 -4682 -2470 4946 4212 -1238 -1406 1681 1224
539 1224 -1352 261 1607 -1544 -3156 -618 1382 -1573 -3878 -1147 1620 -1637 -4600 -385 4020
554 4020 99 -5671 -924 7090 3619 -5054 -3205 6006 6638 -1531 -3723 2096 4142 883 175 697
570 697 -1540 -2165 3075 4737 -3765 -8226 239 7371 625 -8764 -5581 4204 3744 -2748 -5215 -1890
586 -1890 1677 2223 1060 -1201 -2897 -88 5287 5116 -1361 -5046 964 8136 4784 -4311 -5615 2693
602 2693 7703 1361 -6577 -4012 2629 3342 -671 -3866 -3801 -1494 2209 2776 -3465 -7210 -826 6326
618 6326 2531 -6124 -4988 4194 6080 -616 -3661 625 3570 2466 1172 258 -583 425 3313 2176
634 2176 -1716 -2210 1249 2347 -751 -2739 -1606 -7 217 -1212 -2485 -1724 -198 -487 -1153 -1038 -167
651 -167 537 -465 -333 854 651 113 1155 2114 541 -359 2071 2964 -129 -1168 1910 2748 -837
668 -837 -2508 52 1489 -548 -1800 -1535 -1254 -473 -228 -1206 -2909 -2400 1284 1325 -1952 -2719 439 2813
686 2813 1246 -929 -432 1214 2509 2154 254 -1203 1232 3324 1604 -1957 -1275 1792 1717 -591
702 -591 -1362 -986 -456 -47 -352 -1612 -2372 -1291 762 -449 -2076 -1375 12 610 -443 -315 385 346
720 346 1026 2059 1066 -218 756 2601 1882 -306 37 1333 756 492 -436 -925 -541 188 315 -1256
738 -1256 -2279 -363 381 -915 -2073 -1469 203 -93 -1245 -779 -202 247 665 726 -120 79 1744 1723
756 1723 815 -115 1400 2045 736 117 294 592 314 -3 -142 -846 -983 -516 -657 -1143 -1265 -821 -681
775 -681 -1216 -976 -433 -907 -610 297 410 -455 -127 637 1273 484 404 908 1104 1124 1137 571 375 774 1223
796 1223 442 -516 -563 602 -34 -1050 -1396 -902 -272 -1257 -1228 -870 -855 -770 -290 -482 -450 -181 1056 385 -579
817 -579 535 1419 987 673 625 996 1320 814 734 386 261 848 452 -81 -612 -347 -55 -632 -1049 -667 -1028
838 -1028 -1304 -611 -553 -946 -957 -296 600 -94 -615 240 811 800 1017 902 657 900 1492 1280 374 142 1167
859 1167 1322 188 -702 -200 260 -454 -745 -494 -892 -1043 -763 -405 -1011 -1280 -504 -76 -748 -729 20 19 -258
880 -258 336 865 839 -56 873 1472 1334 655 310 672 1075 661 458 -262 -673 448 412 -931 -1612 -690
900 -690 -255 -891 -928 -1111 -1349 -911 773 62 -2002 -1168 1247 1659 -504 -857 1006 1338 756 637 959
919 959 342 61 1725 2455 -397 -1799 1038 2441 -71 -2288 -898 762 -287 -1169 -1098 -1466 -976
936 -976 9 76 -1476 -1868 -278 985 557 -789 -941 460 2020 1394 -123 -685 1353 2791 786
953 786 -1012 591 2123 336 -574 460 877 -1121 -1171 1008 313 -2834 -1804 1435 24 -2658 -1607
970 -1607 1018 39 -2365 -623 1505 110 -1791 244 2818 465 -1260 829 2164 722 -420
985 -420 960 1131 130 14 1169 439 -796 -545 83 106 -364 -1419 -1465 -212 757 -1079 -2872 -945
1003 -945 1522 174 -1936 -915 1183 287 -283 1325 1229 -1542 -366 3307 2357 -2231 -1926 3322 3336
1020 3336 -1192 -2257 1512 1658 -755 -711 227 -1176 -1856 741 1118 -2239 -3101 164 1793 -900 -2717
1037 -2717 -731 1055 443 -221 -636 -254 1138 1924 810 -619 600 1956 1045 46 969 576 -489
1054 -489 679 1669 -197 -2138 -270 2126 -714 -2913 -576 1363 -916 -2613 -403 1051 -1564
1069 -1564 -1520 1114 661 -1610 -666 2282 1177 -1285 160 2719 538 -847 1058 2047 206 -484
1085 -484 664 1204 -386 -264 783 -520 -1169 352 196 -1294 -1617 430 135 -1575 -1169 181 -596
1102 -596 -961 564 569 -1110 -454 2283 1242 -1205 -145 2318 1520 -772 230 1998 509 -864 1113
1119 1113 1084 -1518 -1024 1358 832 -2181 -1345 954 27 -2112 -957 206 -894 -1428 172 168 -1223
1136 -1223 -463 1975 459 -1466 21 1982 926 -507 843 1656 100 27 1874 591 -917 10
1152 10 1639 -142 -1824 22 1163 -941 -1655 74 107 -1311 -1268 412 -408 -1718 -53 1336 -441
1169 -441 -1410 676 1551 -197 -337 1265 1345 -261 678 1748 571 -696 780 1705 -207 -1170 810
1186 810 818 -1183 -1047 447 47 -1545 -818 509 -964 -1752 405 553 -1345 -1250 856 677 -859 -238
1204 -238 1284 363 -438 1056 1574 -66 9 1371 1363 -697 -190 1344 460 -929 -93 861 -439 -1392
1222 -1392 137 292 -1450 -1037 415 -86 -1846 -889 465 -89 -1299 47 1157 -261 -578 888
1238 888 1024 -173 426 1951 1014 -317 382 1504 266 -562 528 825 -441 -734 598 -142 -1360
1255 -1360 -838 356 -676 -1790 -403 472 -970 -1229 240 552 -688 -67 834 511 -386 344 1551
1272 1551 291 -488 1034 1312 203 13 972 1034 -485 -223 914 -228 -984 127 289 -797 -1269
1289 -1269 -245 -100 -1466 -777 436 -279 -783 -370 364 -10 -606 730 1195 -4 291 1086 782 127
1307 127 367 1296 637 -275 431 604 -342 -470 357 10 -902 -717 106 -431 -1489 -352 118 -836 -886 -192
1327 -192 100 -530 -503 495 259 -485 236 1130 427 58 630 1281 569 -5 969 895 -33 -58 494 243 -535
1348 -535 -250 245 -564 -1072 -197 54 -1023 -972 -179 -282 -813 -309 227 -318 -387 133 273 -50 41 1051
1368 1051 758 -44 207 1079 402 226 262 675 406 -225 494 523 -397 -730 -94 -216 -833 -739 -363 -369 -1041
1389 -1041 -449 169 -619 -749 -48 236 10 -139 381 493 94 749 482 372 542 529 647 175 147 705
1409 705 196 -226 211 210 -644 -718 127 -93 -831 -967 -196 -395 -1034 -841 -213 -64 -644 -13 553 -183 -162
1430 -162 355 799 477 179 647 909 672 337 583 345 361 -23 89 101 32 -3 -347 -484 -258 -511 -704
1451 -704 -632 -105 -907 -1052 -95 -102 -340 -791 5 904 147 -333 87 676 353 19 858 877 314 436 974
1472 974 921 18 -369 646 548 -602 -522 30 14 -762 -622 -143 -195 -649 -589 -306 -242 -531 -435 127 300 -163
1494 -163 -236 559 691 422 113 755 772 206 458 571 627 420 -182 155 426 -94 -263 -223 -143 -663 -1065 -279
1516 -279 -164 -757 -827 -396 29 -395 -562 133 441 -306 -389 389 680 185 66 566 817 306 325 301 245 340
1538 340 217 415 168 -192 -34 -358 -34 -406 -893 -536 -235 -224 -573 -636 -117 -184 -159 -271 14 303 9
1559 9 436 352 295 282 599 541 235 294 380 862 215 97 164 147 -184 -173 -203 -483 -299 -533 -174 -218 -713 -726 -105
1584 -105 -384 -472 -244 98 51 12 -53 346 227 345 597 297 674 611 712 426 269 487 133 -31 81 68
1606 68 -274 113 -194 -297 -699 -583 -286 -208 -668 -478 -157 -337 -287 -175 -89 -144 -104 470 344 -4 152 625
1628 625 699 211 488 415 488 115 358 63 349 139 34 -90 -504 -565 -234 -602 -404 -569 -405 -307 -512 -579
1650 -579 -214 -255 -53 -47 -154 144 391 247 244 328 362 833 499 347 246 433 -132 288 306 43 -133 -10 -145
1673 -145 -464 -470 -249 -543 -691 -608 -212 -459 -613 -198 -276 -192 32 -30 229 102 21 158 690 343 551 482 491
1696 491 317 377 145 59 119 302 -85 -280 9 17 -243 -433 -480 -703 -715 -350 -462 -561 -525 -185 -227 -161 -79 119
1720 119 102 174 103 364 365 552 400 340 632 357 263 250 311 -122 344 99 142 -136 -395 -422 -579 -281 -301 -324
1744 -324 -299 -297 -442 -292 -451 -41 -131 155 266 176 106 430 278 618 398 523 355 371 386 -84 -38 26 187
1767 187 -356 -157 -272 -167 -164 -450 -690 -392 -370 -491 -502 -445 -258 -330 -260 43 123 13 25 307 541 202 344
1790 344 278 579 336 154 363 452 123 -153 47 156 -43 -266 -182 -271 -458 -390 -345 -295 -266 -478 -153 -389 -339
1813 -339 -51 -63 -93 184 12 284 279 125 283 264 618 736 182 221 335 32 304 239 358 -80 -521 -427 38
1836 38 -187 -476 -341 -128 -140 -521 -563 -256 -257 -5 -228 58 172 -138 74 171 288 212 330 482 516 460 348
1859 348 520 252 258 265 -65 -40 -318 -186 -167 -77 -369 -564 -338 -42 -561 -432 -255 -336 -162 -100 16 76 352
1882 352 73 232 521 286 417 597 383 250 4 668 248 54 263 145 -72 -211 67 -98 -416 -288
1902 -288 -282 -392 -499 -275 -374 -86 -188 -455 -192 -76 -10 429 93 144 301 661 209 283 406 270 21 72
1924 72 642 446 -24 83 234 -179 -228 -94 26 -318 -245 -148 -147 -486 -397 -265 -76 -388 -566 152 126 106 76
1947 76 290 455 426 299 403 324 614 222 379 374 308 62 234 -11 511 124 -306 -337 -241 -415 -564 -227 -66
1970 -66 -383 -391 -103 -180 -130 -108 223 77 138 72 492 385 245 135 554 704 274 186 406 553 74 156 352
1993 352 -28 -104 -130 49 -265 -441 -392 -349 -370 -268 -440 -187 -95 -475 -327 -36 16 403 -99 73 120 201 248
2016 248 135 553 187 116 295 440 239 -212 167 164 -58 -114 -51 -73 -331 -421 -223 -165 -285 -348 -192 -290 -256 -167
2040 -167 196 -230 -183 177 403 430 170 435 227 251 274 271 412 319 5 384 28 -110 146 -114 -339 -102
2062 -102 -406 -439 -408 -326 -200 -631 -240 -147 -435 -543 -79 111 -91 -275 281 513 67 -44 443 439 449 281
2084 281 621 200 210 8 376 172 -59 -267 -127 -84 -322 -22 -446 -330 -238 -197 -366 -415 -330 61 -14 -50 78
2107 78 172 105 520 274 139 89 640 638 239 201 491 174 152 47 106 189 -326 -223 55 -221 -460 -145 -291
2130 -291 -395 -660 -275 -370 -196 -376 46 -157 -175 -79 45 268 282 330 410 436 388 205 205 155 90 44 64 95 264
2155 264 52 -131 -234 59 -204 -531 -415 -284 -310 -495 -174 202 -515 -487 -34 76 -162 -339 294 257 -128
2176 -128 314 387 401 148 390 520 58 30 264 224 42 75 37 192 -187 -138 -19 -370 -393 -173 -374 -415 -171
2199 -171 -159 -288 -105 92 292 -79 42 269 152 76 189 471 404 -36 435 493 33 181 55 167 -199
2220 -199 -284 -73 23 -367 -396 -118 -210 -639 -114 -205 -300 -318 89 -110 -160 146 229 -53 -16 420 261 316 -5 440
2244 440 602 322 247 493 567 12 -23 231 -152 -407 -134 -122 -451 -281 -250 -109 -165 -276 -185 -286 -211 -122 171
2267 171 135 -387 35 115 159 80 277 436 369 141 394 313 8 234 303 -164 -121 -102 48 -63 -44 -42 -210 -567
2291 -567 -381 -137 -279 -413 41 -146 -210 -337 112 234 50 12 385 79 -124 114 322 342 -4 540 144
2312 144 116 269 220 292 165 -160 202 -56 -390 -267 -198 -507 -487 -14 -308 -513 -429 -187 -30 -354 144 49
2334 49 35 77 348 414 141 528 485 493 -102 34 249 381 -75 119 316 -144 -374 -170 -30 -228 -481 -532 -147
2357 -147 -206 -466 -299 -224 -225 -45 32 -160 26 -30 150 61 254 488 228 365 270 292 320 190 561 10 -332
2380 -332 292 253 -44 -132 16 -4 -199 -548 -34 -22 -359 -399 196 -141 -230 -317 -26 132 -213 449 234 172 184
2403 184 234 204 382 308 269 351 313 120 492 221 -147 -48 100 -443 -157 8 -381 -590 -127 -192 -149 -229 -177 -136
2427 -136 -151 154 -136 19 92 86 102 209 39 387 304 337 105 376 285 66 159 171 -29 31 18 -75 -202 5
2451 5 -21 -416 -289 -477 -20 -179 -85 -256 -108 43 -46 416 96 40 -159 302 378 167 308 222 320 163 273
2474 273 295 457 63 -68 41 -166 -329 80 -442 -321 -166 -354 -272 -425 -130 -274 -197 0 -156 -47 128
2495 128 34 414 280 202 246 269 82 549 467 151 338 46 -47 -11 132 -67 -78 -175 -119 65 -46 -222 -361
2518 -361 -10 -180 -241 -194 -232 -249 -217 65 -44 138 150 149 180 349 175 507 566 -53 234 330 375 139 2 194
2542 194 131 59 -36 -177 11 -314 -316 -291 -293 -278 -343 -140 -364 73 -156 -9 71 85 -178 194 205 407 67 174
2566 174 406 275 313 326 161 236 -16 206 131 -74 -356 -191 -178 -101 -186 -424 -169 -333 -295 -493 -402 -216 -9
2589 -9 -31 -78 65 42 20 380 311 3 266 130 204 44 -140 71 111 -107 272 140 -32 233 -284 -312 -209
2612 -209 -298 -208 -97 -305 -60 -220 -193 -214 -450 -111 173 113 -70 266 183 327 117 178 327 428 101 305
2634 305 415 139 86 53 300 -106 143 5 -176 59 -132 -293 -295 -218 -193 -64 -82 -247 -272 -11 -327 -111 76
2657 76 -45 103 348 229 179 315 260 346 146 260 374 187 -63 372 -103 42 -161 -172 -203 -41 -31 -264
2679 -264 -278 -205 -89 -256 -79 0 -257 40 81 -215 253 81 26 122 75 59 168 308 162 -6 120 207 210 -16
2703 -16 163 -40 -154 91 -80 20 24 -209 -208 -217 -284 -14 -47 -26 -398 -183 -58 -211 200 -6 123 45 254 272
2727 272 81 281 556 50 24 178 363 -95 -46 -49 20 62 -200 7 -87 -79 -461 -162 -68 -219 -261 -231 -319 -188
2751 -188 -235 -26 148 66 30 189 154 83 174 364 342 87 -28 139 -116 -138 196 4 -98 -224 -11 -85 -294
2774 -294 -352 -425 -78 -268 -174 -328 -202 -68 -41 -16 -55 93 -58 36 -59 279 124 161 252 289 274 198 307 468
2798 468 236 -52 -178 -164 117 -174 2 -149 -427 -12 -212 -169 -319 -46 -156 46 -27 -134 -250 -55 131
2819 131 -2 125 193 25 87 26 352 139 290 45 285 116 -99 -77 -11 29 91 -28 -114 -270 -15 -237 -171
2842 -171 -236 -39 -332 -155 -112 -295 -381 -151 80 -66 135 -11 218 149 221 30 273 174 265 32 7 137 -72
2865 -72 65 45 137 -167 -136 -52 -277 -88 -71 -178 -221 -207 -291 -15 -13 32 -8 -375 82 157 68 221 190 363 1
2890 1 67 115 123 408 194 83 44 -84 -17 43 -330 -56 218 -148 -220 -441 -147 -58 -257 -7 -212 67 12 -13
2914 -13 25 214 -115 131 358 100 -23 318 287 279 341 310 82 27 -25 -70 121 68 -164 -70 -59 1 -222 -346 -115
2939 -115 -301 -27 -252 -201 67 -145 -154 132 -146 137 116 259 289 104 255 445 364 212 146 129 18 334 -32
2962 -32 -149 280 -320 -377 -103 -90 -141 -354 -226 -143 -175 -337 -105 -128 -204 82 64 161 -20 11 49 128 277 245 98
2987 98 36 162 -40 210 92 65 -9 -52 175 70 -209 -147 -270 -116 -120 -432 -140 -136 -122 -410 -101 -61 45 11
3011 11 -49 -328 72 58 90 290 127 169 247 214 172 281 107 146 59 -36 355 -246 -46 -179 -134 -260 -214 -220 -105
3036 -105 7 -160 -110 47 -8 -188 -8 -60 -60 179 204 146 -86 134 191 254 241 240 238 -45 67 -65 4 170 14
3061 14 66 -64 -323 96 -160 -274 22 154 -240 -118 -193 20 -103 5 -189 122 20 46 342 102 -117
3082 -117 -80 90 247 162 159 295 84 89 -51 -4 -118 -93 -77 -460 -196 -146 -134 -204 -214 -192 -264 46 -147 -91 48
3107 48 -4 190 25 -1 -111 39 186 254 69 265 72 282 -55 -64 46 39 -154 -52 -90 -19 -371 -215 -84
3130 -84 -351 -189 -411 -108 -213 -75 -92 -66 -11 -157 -177 -33 -38 -47 22 415 199 226 134 108 260 45 57 384 147
3155 147 -55 -13 37 -72 -232 -60 -8 -253 -215 -90 -267 -99 -158 -163 -100 -14 -111 -13 -205 207 -50 215 90 117
3179 117 207 89 193 3 115 -106 260 24 33 -104 -15 93 -360 -61 -137 -82 -229 -215 -387 -105 -59 -199 109
3202 109 -252 -185 85 -156 44 -15 174 220 -73 343 132 161 180 264 452 410 262 -72 -49 40 143 -22 -307
3225 -307 -206 -157 -199 -4 -179 -164 -57 -357 -52 75 32 -23 74 -143 141 -63 -175 344 65 69 0 152 87
3248 87 90 108 250 390 -45 72 -37 -71 -164 -180 -276 -234 -278 -143 -218 -69 111 12 -190 -56 -1 126 -63 110
3272 110 -35 105 185 163 294 139 -76 174 61 26 -46 2 145 -83 -161 -126 -76 -256 94 -351 -228 -412 -70
3295 -70 -83 -38 -81 25 -120 -99 -65 66 -240 79 -40 29 271 10 -1 26 214 114 -74 188 15 35 57 243
3319 243 -157 -59 54 -58 -53 -262 48 -54 -54 -194 -137 -127 -137 -93 -211 -46 70 -169 -28 16 172 272 216 155
3343 155 23 115 73 257 302 147 -228 113 -32 -219 -163 -89 -133 -202 -117 129 -238 -121 -121 -88 -125 117 174 65
3367 65 30 -45 -80 -67 128 175 -72 329 90 282 79 14 -58 322 57 103 -75 77 -332 -84 -41 -106 -121 -188
3391 -188 -282 -203 -74 16 5 -59 8 -5 145 -143 254 -135 299 116 325 412 66 124 29 -146 160 12 84 3
3415 3 -33 14 40 -131 -22 30 -338 -139 55 -407 -299 -14 -34 103 -312 -104 202 -151 -237 85 -1 76 43 200
3439 200 80 214 172 244 139 69 0 113 -30 42 -134 -213 -199 12 -237 -215 -2 110 -108 -244 -44 -178 -273
3462 -273 -43 46 292 236 242 -98 287 169 82 90 152 235 69 162 -82 174 135 64 39 111 23 -24 113 -171 -258 -159
3488 -159 -260 -203 187 -16 70 80 -79 227 -108 -58 -103 134 -59 92 101 -179 63 -40 231 97 31 -67 -61 -6
3512 -6 -176 -106 20 -27 -162 -156 -103 82 -275 -47 -145 -86 -45 22 9 26 68 -135 359 28 186 -32 -4 254 247 110
3538 110 -47 145 236 148 155 -218 -118 11 -65 186 -123 -414 -46 83 164 -235 -153 -55 -114 43 260 -35 -44 -43
3562 -43 -56 142 198 18 103 134 142 238 145 -47 72 71 -47 167 172 -56 -83 16 -65 -134 -65 -131 -168 -79 -144 -288 -100
3589 -100 -131 -186 -7 -133 279 23 -67 132 -8 235 2 88 -104 53 -11 -113 358 -106 225 25 10 24
3611 24 -96 46 -72 -15 -84 -183 -75 -123 -63 -161 82 -211 11 7 -74 167 382 192 194 78 438 246 -142 4
3635 4 -107 -90 -56 121 25 -182 111 61 -85 -186 -127 -52 -146 -247 -195 -103 -63 -67 -76 -114 110 23 -82 190 -30 77
3661 77 -241 166 25 51 -58 -13 504 54 242 22 -28 78 -48 -237 -19 96 -100 -57 -110 32 -22 -108 -230
3684 -230 -146 -36 -129 -18 -123 88 208 34 294 75 211 149 -62 -135 190 -29 63 137 22 27 -79 36 -49
3707 -49 -156 -163 -238 77 161 -60 -251 -41 88 74 -162 45 -108 19 18 142 153 9 55 148 113 44 169 -47
3731 -47 -88 -45 214 77 8 159 157 -95 -294 -126 -178 24 -256 -247 118 -148 -56 -269 -236 112 -120 219 -75 160
3755 160 -2 19 303 188 344 339 263 18 48 178 55 -118 74 161 47 -26 -137 -63 50 -374 -39 -312 -63
3778 -63 -15 46 46 -193 38 41 27 -70 -154 193 42 204 112 99 -90 87 24 415 289 66 129 121 81 -29 -121 -208
3804 -208 -15 -145 -122 -95 -82 168 -58 -99 -83 -62 -56 47 59 -20 -59 -47 65 -110 128 12 144 239 -8 -111
3828 -111 -14 20 -1 -103 69 -126 133 -5 -63 61 -265 -150 -63 -116 -139 31 -8 -112 235 -128 10 25 74
3851 74 5 -37 -218 37 -53 -79 53 184 354 113 174 52 109 -38 143 95 59 -117 -7 135 -245 -30 -213
3874 -213 -279 -158 -141 65 43 -103 -300 -339 82 48 -122 -100 -128 27 242 134 129 -145 94 108 7 177 60
3897 60 -33 -13 -180 -19 -43 62 84 -173 35 -39 -110 -174 -192 30 -396 62 -80 -140 38 -12 247 262 75 79 -184
3922 -184 216 -18 169 291 -50 86 -26 103 -38 264 -52 26 66 159 -193 -112 66 2 -39 -112 -92 -194 12
3945 12 55 -96 -11 335 119 -53 106 -211 152 174 38 -188 112 65 -1 -56 212 -141 117 82 -86 -50 -390
3968 -390 -263 -254 -1 -61 114 -121 -1 11 38 -124 91 -244 160 123 70 102 115 -8 357 314 64 -54 226
3991 226 -64 -23 66 -264 32 -126 89 20 -51 -243 42 -59 -120 -56 -36 -126 117 31 -239 -21 -34 17 199 -44
4015 -44 310 57 84 106 59 39 204 15 157 -191 -77 109 180 -75 110 -321 -170 -47 71 -231 -234 -109 -114
4038 -114 -269 -84 59 -130 -58 -114 160 213 98 -29 163 165 31 211 149 -111 167 109 135 125 214 -80 -10 7
4062 7 -252 206 -58 -15 184 -74 -91 28 -174 -215 10 -267 -185 74 -38 25 94 -222 190 231 26 43 104 -65
4086 -65 144 407 28 167 -277 215 -58 6 179 -56 178 -183 -276 71 48 -231 -155 -71 44 188 134 88 -251
4109 -251 -40 -104 133 157 13 128 375 216 44 -78 137 -34 24 -76 125 235 82 37 -316 -47 -117 -286
4131 -286 130 -150 -145 65 -28 -120 -164 -118 -199 162 174 74 91 -38 -101 -150 239 -18 244 268 25 2 -48 21 -90
4156 -90 2 87 -81 62 138 -150 -68 -472 -88 -102 -39 -267 -386 -321 -87 -125 -45 -265 -307 98 316 79 157 106
4180 106 21 -105 -148 105 121 -70 -155 -6 73 -137 142 79 58 -111 62 -12 -173 92 -238 -152 42 -179 15
4203 15 -193 -48 -49 107 210 -135 21 91 15 -42 -54 97 105 84 20 126 108 -80 -91 247 -33 -268 -114 -117 -16
4228 -16 1 -391 -202 -97 -169 67 -56 22 -135 -148 62 72 143 0 82 14 49 293 -161 135 273 181 46 227
4252 227 1 -240 -32 -150 -48 -57 -190 55 -264 -96 -207 -29 -187 -6 -51 -101 -54 -55 119 23 77 83 -48 -51
4276 -51 81 -65 77 -216 -46 344 391 -58 207 258 182 -361 13 141 -167 -160 -111 -39 -332 -464 -213 -222 -12
4299 -12 -100 -309 -6 -94 110 100 -16 -95 22 145 146 58 -95 308 76 41 12 158 114 -94 -32 -66 -142 -18 26
4324 26 -100 25 -148 90 -85 80 -39 -73 -115 -191 -37 8 60 137 40 -50 82 -38 91 20 -18 33 29 186 72
4349 72 57 -2 -115 -120 -90 91 19 -115 48 -168 -61 -28 67 -52 -228 68 -57 56 -29 -314 257 78 -64
4372 -64 175 162 39 92 -23 125 -91 35 -108 -243 25 -138 -149 30 -160 -33 -149 66 -111 -107 317 79
4394 79 -4 -188 -25 -14 -167 -7 119 144 -79 193 70 -104 86 4 300 42 188 -5 183 -135 -114 22
4416 22 97 -63 -326 -213 96 65 -37 135 -66 -215 27 -91 -23 120 -143 96 9 40 83 -66 -125 172 83
4439 83 -186 157 151 135 -22 47 -114 82 -85 -285 -30 -197 27 -142 -281 -28 103 -152 -179 -138 4 -221
4461 -221 -26 33 -153 -48 -12 -110 -23 334 -41 142 160 28 3 316 -61 68 24 39 88 168 68 24 47 -30
4485 -30 -96 41 -49 17 27 -66 -248 110 -171 -256 -63 129 -81 -180 -251 219 37 38 330 156 58 203 106 -253
4509 -253 -45 101 46 -112 -94 138 39 -145 64 -180 -119 124 -144 -42 -16 -10 -120 52 129 -43 196 251 -38
4532 -38 -88 112 156 128 -11 300 14 -190 -45 106 -2 -107 61 60 -104 75 32 -145 -172 -49 136 56 -252
4555 -252 5 126 119 157 81 -87 133 7 110 256 166 121 242 187 85 78 114 -19 60 184 -80 -102 19 -21
4579 -21 229 -208 -36 21 -81 -214 -114 -77 42 42 36 17 -21 -113 35 -85 -94 -38 61 -98 134 55 221 -65 102
4604 102 10 -206 14 -31 -5 71 -55 -196 -90 -32 -120 18 -44 -11 -21 -134 114 159 44 30 82 -52 -114 279
4628 279 -15 22 136 -93 177 21 179 -236 53 54 17 69 -58 45 -136 -44 26 -104 -88 -254 -173 -52 -102
4651 -102 -3 -152 -260 -9 0 -236 -245 221 53 140 15 71 155 4 -26 78 17 45 94 -11 303 33 -70 12
4675 12 -100 -130 -5 -238 -101 -206 -170 118 293 -21 -357 -93 161 -156 -41 -20 -14 -320 -38 103 -44 199
4697 199 -56 55 -154 99 223 -18 -91 -9 21 67 46 -14 -76 -52 -81 -51 -154 2 60 -208 -104 52 178 93
4721 93 62 -43 -46 243 -38 -130 168 -1 -6 -93 -98 25 188 12 237 159 96 133 -63 -159 -132 -21 112 -31 -148
4746 -148 171 129 -255 -195 -2 -14 -18 -24 -164 -2 -78 -55 362 19 -128 99 180 -2 -44 94 55 10 -55 -72 232
4771 232 -46 -148 99 -36 -130 -79 -65 32 157 -142 52 -21 -88 -51 86 57 -46 -41 70 -143 186 328 166
4794 166 127 -83 52 130 21 0 206 -20 -132 -73 -14 -22 -18 137 -132 -101 -130 -15 -50 -129 10 -92 71 141 55
4819 55 17 49 22 4 -145 -47 18 38 164 -52 200 -152 -360 110 -40 11 230 -238 -104 -24 -49 -299 198 66
4843 66 -164 194 139 -85 -93 -62 -158 58 -271 -71 103 -62 50 -119 -90 -27 94 179 32 68 129 66 30 300
4867 300 105 -138 -174 93 -1 36 -121 -201 -262 -22 5 22 21 -224 66 -55 -89 85 -66 -42 7 -10 105 199 119
4892 119 -30 50 -25 -119 259 -126 -82 -29 -139 -152 -134 -84 256 95 1 -130 10 -306 -120 43 -59 -17 29 24
4916 24 148 2 120 -27 73 -40 66 -32 -41 100 253 -79 255 49 -28 13 79 20 -147 -88 72 35 -300
4939 -300 164 81 -192 109 -151 -222 -81 -55 -7 -222 43 -45 13 113 -7 -7 157 113 128 49 16 50 -106 -165 -8
4964 -8 -196 84 -142 -96 269 135 -70 -79 -30 -82 -189 10 -175 29 -72 14 100 -29 -6 351 308 2 -15 3
4988 3 62 165 -57 -61 -56 -73 264 68 104 -87 -164 197 -223 116 -139 -100 67 -1 -20 -95 75 186 96 -55 -170
5013 -170 16 -57 -76 27 8 121 41 94 358 7 -171 85 250 208 -26 127 -56 63 181 43 -143 137
5035 137 -219 -59 -221 70 38 -161 -153 -82 -60 25 291 87 -44 164 71 15 183 158 164 -108 -5 -21 64 1 -119
5060 -119 1 -113 -24 149 -216 -7 -154 127 -52 -300 99 -213 78 -6 28 -55 64 288 15 17 252 -121
5082 -121 -7 8 215 -116 60 131 101 -105 -12 396 -4 0 67 -100 139 150 105 -173 -278 -38 106 197 -16
5105 -16 -72 7 23 -8 150 77 30 132 8 51 95 -167 287 119 1 138 -104 -18 128 190 -164 58 -85 12
5129 12 102 149 160 -9 22 -120 60 -87 -35 107 -282 79 26 0 -13 -90 -162 -83 -5 269 90 184 -192 179 174
5154 174 -33 156 55 -45 -290 141 85 -95 81 -247 -23 56 -86 -36 -57 -155 -41 -55 45 229 87 194
5176 194 2 -281 155 292 30 136 -7 -64 88 135 189 56 -80 209 -139 -77 58 -17 66 72 59 101 1
5199 1 -81 -177 98 -114 -123 126 -27 193 122 228 -113 -229 144 206 211 214 63 344 -122 -49 -56 107 -12 -78 -146 -27
5225 -27 -171 89 -3 140 50 -156 282 153 -112 87 135 54 -72 355 122 -11 207 -13 57 41 47 -220 65
5248 65 111 189 5 -31 96 -121 123 -10 2 71 -132 16 -80 107 -129 -260 -66 143 55 49 -334 -186 -80
5271 -80 -95 25 80 -17 182 -124 81 3 243 -108 -238 -309 35 64 -81 97 107 -85 -8 -182 -86 -154 -209 -61
5295 -61 61 68 17 -48 -157 -78 -166 -56 -80 98 225 296 69 18 -123 128 71 176 38 131 278 108 -52 78
5319 78 97 -64 -92 10 161 11 194 43 92 -134 -387 130 -262 179 -7 184 -86 -63 -168 58 107 -154
5341 -154 -29 -143 190 -199 -72 165 -97 -61 -28 -188 25 9 -57 -134 52 179 42 -237 -228 -20 -6 -83 -88 47
5365 47 -242 -216 -26 13 54 91 -113 54 174 16 41 224 19 -165 -167 83 -114 248 -24 -29 -55 13 108 -140
5389 -140 -93 175 104 -138 -5 -81 -304 4 51 10 119 -98 7 157 253 -41 99 -42 -103 180 186 186 -103 -149
5413 -149 -139 23 -37 -148 132 -191 -29 -154 252 -24 -50 10 -30 -34 -159 -100 -33 -150 -191 12 73 7 -57 77
5437 77 84 -15 108 8 241 -34 -104 -99 203 -19 245 -129 -178 184 18 218 -4 -28 -240 -86 -61 -28 -77 -21
5461 -21 78 72 84 -171 30 133 -159 126 -88 49 -71 103 77 65 230 10 134 146 259 -168 11 177 38
5484 38 -222 -55 -2 -10 -115 -263 18 110 -109 21 -25 -3 -110 167 -109 -74 70 136 253 351 221 205 -143 -15
5508 -15 -89 174 42 114 0 -82 -143 -221 -47 97 10 18 -42 9 1 58 -50 -226 -18 100 -39 -187 60 -109 96
5533 96 -66 -260 -85 152 -39 -69 26 261 417 128 23 106 64 153 196 25 -9 -145 71 -144 -312 4 -9
5556 -9 -77 -64 50 164 -44 -266 -16 66 171 -252 -129 29 146 -32 -149 11 -60 165 127 244 -74 42
5578 42 -121 -24 -79 71 23 -184 5 -406 85 -28 -115 328 -47 255 61 -83 -104 -24 246 -74 82 -71
5600 -71 -24 -54 232 -137 101 128 -30 139 121 -157 -78 63 -47 -78 -88 52 -56 151 -103 -222 -116 97 122
5623 122 4 150 -137 -114 -18 -142 -145 -49 72 -7 79 20 233 -63 -58 197 31 81 -250 -133 -20 -50 -69 83
5647 83 111 -71 -160 145 58 18 154 -52 3 -111 -4 32 48 97 193 -72 92 102 173 -55 62 339 12 209
5671 209 -29 44 81 60 -81 102 -170 -157 49 85 40 -4 307 121 -80 55 80 -164 88 174 84 26 7 11 -180
5696 -180 7 99 -178 208 -75 141 -19 142 17 -80 -82 -70 -11 -61 -39 -195 -270 -87 138 -168 -40 -66 -16 -155
5720 -155 -195 28 114 91 -86 44 152 -133 145 -113 72 -58 27 -75 160 -43 -35 -38 221 84 -106 94 -98
5743 -98 77 29 -150 -79 -155 -25 24 -126 103 -47 -291 -25 232 -345 16 22 -14 135 52 -23 169 258 147 33
5767 33 95 -78 124 45 -190 -23 31 125 31 9 340 -19 -86 159 77 -5 -2 16 51 141 81 136 -95 8 102 161
5793 161 1 -32 61 -190 7 217 120 -38 34 -8 134 -34 -241 6 -144 51 407 -135 58 -27 -59 215
5815 215 79 -168 61 290 55 155 61 92 22 -121 -41 -102 25 -36 101 4 181 310 10 14 -58 -43 13 9 18
5840 18 -82 3 36 22 -76 46 -17 -196 -4 152 54 -57 36 343 69 214 153 125 -205 -122 11 94 110 6
5864 6 92 -75 291 -35 -102 2 -208 105 -323 -119 72 -148 64 187 -88 -84 -65 -25 -201 -12 -13 -264 73
5887 73 268 -109 75 139 234 12 27 -218 163 50 -68 23 37 77 -18 89 -64 -174 58 10 -27 28 -44 -197
5911 -197 -148 -96 -92 -82 59 83 34 250 156 -59 111 75 168 153 179 49 -7 10 -131 -130 87 13 133 -145 57 114
5937 114 -4 125 -86 191 133 -26 49 -52 -111 153 124 -67 -182 2 -133 133 -59 -39 113 16 -20 161
5959 161 -97 106 -215 1 79 169 188 94 -8 97 212 -32 38 -56 -29 -304 -163 -78 32 96 210 30 -10
5982 -10 0 -88 58 -115 16 172 171 84 119 10 289 38 -77 141 -45 108 127 -86 65 -22 -134 -46 -60 -125
6006 -125 -34 93 -142 56 11 -275 -98 -19 -15 -106 60 17 22 94 -146 -163 51 135 75 296 -176 9 -16 11 -13
6031 -13 -79 116 32 -165 231 -216 -53 -115 -71 -285 -153 -10 24 -213 -227 -112 49 -35 116 -11 -54 -42 135
6054 135 133 -71 119 1 236 196 -7 50 -108 -48 29 44 -167 190 83 -181 -474 -112 -65 -331 -66 -237 55
6077 55 185 40 -46 -147 43 125 -186 -19 -29 55 23 27 -229 -34 32 -7 137 33 -149 -99 52 -118 22 -107
6101 -107 46 -96 -202 216 51 -88 30 -65 -27 50 -76 109 51 -92 -116 140 153 -81 -47 162 -140 -188 1
6124 1 -50 -89 51 116 -19 -24 -58 182 -162 157 17 -74 -22 229 -2 -64 103 -118 -101 70 294 -289 -40 42
6148 42 41 -19 36 119 44 52 254 135 -213 -160 306 -61 -100 144 165 -46 4 -72 -121 25 -32 -15 -271 121 -10 52
6174 52 -40 -25 -85 -27 -25 -133 51 55 -63 5 32 145 11 -19 206 -109 130 -45 102 256 -255 105 158 116 7
6199 7 -130 119 86 -227 66 -47 -89 21 46 102 -66 80 -121 -33 -49 -162 112 -43 86 164 -64 330 -256
6222 -256 -90 39 -23 -92 346 -147 71 32 -174 -99 -77 245 -97 99 -311 -49 33 -224 -12 -70 -133 -119 -145
6245 -145 174 82 -144 -221 34 75 78 435 -118 61 -46 -90 -41 -37 -145 -77 70 28 299 41 -302 -71 -161 -45
6269 -45 354 67 59 80 -50 72 -110 162 -167 134 109 -178 122 -333 250 137 -56 218 -4 36 364 207
6291 207 76 -154 -325 -38 -283 -160 -52 -91 42 -35 123 -91 -192 50 -11 243 21 -9 -27 140 -98 124
6313 124 -129 94 -90 -142 3 86 -40 0 79 -99 259 5 126 50 123 150 -90 -87 -32 -61 -31 -73 -31 117 -123
6338 -123 48 102 -142 10 62 -101 30 -22 117 -212 -22 -20 -75 178 -28 -24 -106 -58 189 -85 -16 155 -89 -219
6362 -219 -1 -110 -112 80 -16 45 41 -203 203 90 -175 44 3 27 198 256 131 -81 -66 254 -18 92 175 -71
6386 -71 -101 30 194 293 15 -48 -101 -71 -187 -154 -54 -44 93 120 -146 -133 -80 97 -152 55 21 -104 46 323
6410 323 -7 53 138 -120 -158 139 178 -154 -81 -33 8 49 -195 -12 -165 131 165 37 -37 -85 -124 -149 -14 -253
6434 -253 -259 -185 45 -64 166 54 -9 -81 -125 -71 -47 122 -79 -6 -50 98 103 56 -134 320 -13 48 22 -168 -202
6459 -202 4 12 151 35 -219 95 -92 -121 207 115 291 -53 -83 110 63 -113 -240 42 -146 -2 -105 -69
6481 -69 -123 -73 -82 70 76 157 -14 -89 -83 88 -89 -200 166 -57 170 -275 -267 118 -122 -58 23 8 -55 -90 413 -103
6507 -103 -209 16 -17 -191 66 -43 -306 86 182 -3 -140 -264 -78 63 -85 37 203 140 -27 211 -35
6528 -35 -101 -6 -130 91 47 -7 -42 74 -131 -40 218 76 47 42 16 101 -366 -153 84 31 214 -104 -10 27 -82
6553 -82 -22 10 94 -87 -171 66 -121 -132 153 -140 -96 68 -251 157 1 -45 207 -48 -51 40 -38 55 119 61 245
6578 245 48 -43 -34 -334 22 91 -91 227 5 25 -23 -297 -35 44 -33 -41 -304 -96 -85 5 -60 75 -46 -27 59
6603 59 71 -27 -95 85 200 255 9 141 -36 -83 -221 -13 -95 -164 -113 79 -146 -81 -41 -80 -116 -68 -163 21 -28
6628 -28 185 -105 -160 38 -63 61 -112 203 -164 7 -38 83 197 24 203 -28 21 -165 -71 -153 56 15
6650 15 15 -12 112 -60 -157 30 96 138 0 -48 64 140 1 -93 -74 -150 -57 24 -4 79 -86 -67 -58 122 94 62 65 -70
6678 -70 -36 -46 190 -126 206 102 40 -6 25 19 110 152 13 -239 -123 -119 246 117 -66 -120 -232 240 -17 178
6702 178 -88 15 65 -131 127 -79 -149 61 -183 -147 -99 33 -11 -186 174 14 -3 130 55 24 -35 -3 -81 -40
6726 -40 247 -53 -64 -35 0 179 -177 -95 79 -83 157 106 -51 109 54 17 -137 -141 -254 68 151 -53 150 -7
6750 -7 3 242 -163 -166 -170 -30 26 -52 101 -19 91 -65 -15 184 -97 -5 -47 -34 -23 -27 26 -21 191 -238 -73 73
6776 73 85 -201 26 79 240 -148 -264 1 27 -238 12 77 -3 144 286 92 86 -91 118 -70 -118 -16 -70
6799 -70 -203 -127 16 110 -50 -183 37 -175 41 99 82 80 -32 -51 -36 -322 -130 2 87 -33 -86 303 -135 200
6823 200 -2 371 -303 24 38 -223 -37 43 67 -41 -268 206 -127 -15 27 -230 -79 151 -207 -104 -286
6844 -286 -147 -65 -94 151 -111 185 66 30 -18 -121 -77 102 26 15 -184 156 211 360 -48 201 -169 58 -44
6867 -44 2 -73 87 4 27 233 -25 38 -133 -243 -85 -179 -123 -163 -71 29 24 -2 -41 -35 -234 -6 34 -47 -232 -162
6893 -162 -28 91 22 -69 -25 289 -136 -22 -225 -9 139 35 11 50 123 -64 162 -142 -3 219 122 -285
6915 -285 116 137 101 -116 273 116 -148 -226 162 39 95 -185 13 209 -52 -165 150 117 -170 -26 23 -18
6937 -18 63 -172 -35 -54 95 204 -138 88 -127 -357 78 -115 -131 -167 216 -54 264 17 36 103 112 -66 57
6960 57 -109 187 50 -195 -46 -93 127 215 -50 -127 -15 -21 -61 -97 -152 310 347 85 -28 4 150 -77 -145 80
6984 80 60 -78 27 68 -69 150 -121 35 85 -48 -93 98 2 131 -82 -141 -232 -188 220 61 -43 42 -31 28
7008 28 -42 -112 64 77 -48 -186 -9 -74 -15 -139 130 96 -94 -37 -73 79 106 173 62 -161 120 -120 -95 57
7032 57 143 -140 -60 -85 -1 13 -1 -194 65 -109 -79 -120 299 12 -123 78 -30 -119 -134 -5 79 155 66 -26 17
7057 17 409 88 -75 -37 19 -34 -248 -93 165 53 104 157 225 -68 225 -270 -195 91 190 103 7 -185 127 -178
7081 -178 -21 88 117 141 -167 70 -96 -23 252 -96 -245 249 231 226 41 -73 -3 200 -105 271 -78 9 119
7104 119 -167 -56 -204 -84 112 -83 57 -150 69 -74 117 281 100 102 20 -121 148 136 164 37 -93 -127
7126 -127 8 -193 131 -59 14 1 114 -106 -50 168 -20 -126 -18 -192 -56 97 -144 35 -33 -200 6
7147 6 -181 -283 57 21 14 -45 -151 -52 269 -149 -130 -114 2 220 -19 278 -471 96 65 234 -9 -60 -113 172
7171 172 42 16 -84 -87 86 49 153 61 33 -55 38 109 294 308 24 159 255 -138 -81 45 129 90 -74 -164 -13
7196 -13 172 -43 -54 91 -98 -41 -45 -153 -70 110 91 -179 142 88 67 -37 -31 -191 -125 -18 133 -296 153 151 16
7221 16 11 111 94 133 -130 108 64 -127 -30 -184 168 -30 66 -63 24 -160 115 136 198 -78 94 145 -95 -156
7245 -156 55 -37 -66 -125 99 8 -197 -238 210 -71 124 -125 142 8 -41 -87 -122 -91 130 125 194 255 -5 -233
7269 -233 130 114 11 -33 -19 -5 -222 -83 54 -145 37 -32 123 151 56 -117 -175 -14 -81 118 -94 30 -173
7292 -173 -97 -137 -19 -164 -44 -84 -15 60 -9 80 70 -120 -28 -67 55 206 -77 56 25 26 0 74 91 8 -85 -69
7318 -69 -3 150 -123 -246 29 -49 -107 137 96 204 40 164 40 -101 -49 78 -143 -7 -147 -172 98 227
7340 227 261 169 230 172 -139 -99 2 71 100 -42 107 -92 -22 376 33 -131 30 48 -178 -360 81 -201 -3
7363 -3 -62 -88 6 -80 26 -103 9 13 164 109 10 -64 -151 -169 92 67 29 48 210 -29 45 24 16 -119 130 188 -66
7390 -66 204 107 -12 -132 -22 44 -131 -178 -58 -6 13 -126 5 154 65 80 -158 -180 -12 -89 -27 -194 122 -186
7414 -186 -2 213 136 -191 0 -64 -90 52 208 -5 -100 -141 46 158 22 -21 273 248 37 202 -10 -96 -98
7437 -98 -183 -169 48 37 -18 254 -31 57 -30 40 195 12 -88 287 159 -41 -78 43 -92 74 -40 -156 123
7460 123 -50 -232 38 182 62 73 -117 10 32 -119 -149 11 37 -166 -40 -127 171 63 92 85 -48 -11 157
7483 157 -113 -173 115 -146 238 -15 -112 8 -3 57 -51 26 65 -10 -157 306 -79 147 -212 -22 24 200 60
7506 60 -29 -36 -27 -249 -58 58 -74 -2 175 17 -14 -109 18 -185 105 -94 -128 222 -284 -76 -50 293 62 -230
7530 -230 -23 -121 0 143 40 6 15 -71 21 238 125 -72 125 -10 314 -62 168 -111 -7 -17 76 -95 82
7553 82 -74 -281 -103 110 91 7 144 -198 131 44 160 -91 77 85 18 2 101 58 151 -29 -109 -101 -16 -258 -52
7578 -52 -2 269 -42 10 62 65 -19 119 -109 -37 130 71 -110 119 147 -91 202 -89 162 -159 -49 -185 53
7601 53 -80 -76 6 -38 65 -46 111 -175 38 160 259 -6 119 -138 -55 -129 180 193 75 -376 -103 5 100
7624 100 -15 119 9 -89 -73 111 203 58 134 58 -388 176 34 -215 -6 -64 -174 -7 139 129 153 209 28
7647 28 -197 -20 -61 83 49 -84 -78 -75 -17 52 -69 24 39 -302 -234 -16 113 -116 -41 23 112 82 -213 126 29 -31
7673 -31 210 226 477 46 43 -115 -108 142 -9 -74 51 -92 -56 -178 115 38 158 217 22 195 122 42 120 -62
7697 -62 298 -84 -9 204 30 -122 -26 235 -134 47 -190 -65 54 72 -198 -94 91 -33 97 -11 -38 186
7719 186 9 -80 -7 -128 -106 83 -18 85 193 -122 39 -62 -103 21 43 31 -52 224 157 154 -75 -8 -66 -64 -39
7744 -39 243 86 -133 -169 -27 71 -120 -108 -16 20 220 57 71 15 -56 -33 168 -59 -89 85 19 -125 100 -9
7768 -9 -112 90 176 -17 83 112 4 54 -422 -49 120 -45 112 313 92 249 82 176 -35 -412 -93 233
7790 233 -72 -195 46 66 -41 260 -13 -44 -249 75 41 5 229 107 -33 61 -27 -93 119 54 289 -23 -186
7813 -186 -136 154 -175 286 -178 -130 34 -366 55 -43 -87 -136 94 -280 29 81 165 -87 243 37 -3 -54 16
7836 16 -123 -30 -161 95 86 -18 -118 201 101 121 -151 -7 66 105 225 -236 135 18 -108 -36 66 8 57
7859 57 88 69 -116 207 48 36 291 -138 283 207 145 -116 60 13 -162 -24 53 -101 -32 43 -293 98 -39
7882 -39 69 121 54 -57 78 -38 -27 14 244 -187 31 -31 -2 102 -199 47 -120 49 59 175 84 157 162 228
7906 228 172 -117 102 94 28 73 113 72 -62 -65 -119 -241 -54 -8 235 -43 19 -106 -27 183 -357 143 94 2 26
7931 26 53 -89 185 74 53 -210 520 -76 80 8 -142 -91 -100 -63 -139 50 -102 -69 -25 -16 24 -281 142 -127 36
7956 36 -20 -92 140 -53 111 -139 -94 -139 123 193 -67 39 -31 -21 -150 -11 180 -78 -9 150 -263 17 53
7979 53 -123 197 125 -278 66 175 -60 -142 3 -147 -13 -61 101 -38 -25 66 -278 168 15 -111 59 14
8001 14 -109 190 -64 -204 -152 -390 32 -296 -54 201 -39 111 -6 211 38 77 -117 31 14 -14 9 66
8023 66 39 -24 -23 78 42 107 -25 119 -11 105 -136 139 110 -283 -15 -7 -101 -49 -81 -111 177 126 11 33 119 -9
8049 -9 179 -104 -4 94 -95 140 112 0 31 -54 173 95 -1 109 -117 16 -282 -42 265 -72 -91 120 27
8072 27 -62 48 -150 111 -109 -448 -78 -69 115 20 -43 -183 -32 50 52 -271 -2 212 32 -7 376 -189 88
8095 88 -132 43 -3 -40 -6 54 113 -53 110 7 -143 -54 25 -30 -15 -160 236 106 -185 -31 71 -1 77 -60
8119 -60 -162 81 119 38 35 1 -277 68 -143 102 72 100 -97 -160 76 45 -151 203 -13 76 -182 87 -52 173
8143 173 -66 140 150 104 242 -136 54 103 -11 -155 -136 146 -155 226 118 -4 119 -40 -97 -33 -19 21 139
8166 139 87 100 25 14 185 -52 -226 42 -39 -38 -101 -14 -141 -123 40 -74 -76 70 -164 9 -174 40 -21 177
8190 177 27
8191B7
##END NTUPLES=NMR FID
##END=
