##TITLE=1H_Pr NCS
 CDCl3
 8 sc, 
 4.10.2023
##JCAMPDX= 6.0         $$ Bruker NMR JCAMP-DX V2.0
##DATA TYPE= NMR FID
##DATA CLASS= NTUPLES
##ORIGIN= UXNMR, Bruker Analytische Messtechnik GmbH
##OWNER= root
$$ XWIN-NMR		Version 3.5
$$ Wed Oct  4 15:50:28 2023 Russian Standard Time (UT+4h)  she@DPX200
##.OBSERVE FREQUENCY= 200.13135
##.OBSERVE NUCLEUS= ^1H
##.DELAY= (6, 6)
##.ACQUISITION MODE= SIMULTANEOUS
##.ACQUISITION SCHEME= undefined
##.AVERAGES= 8
##.DIGITISER RES= 18
##SPECTROMETER/DATA SYSTEM= spect
##.PULSE SEQUENCE= zg30
##.SOLVENT NAME= D2O
##.SHIFT REFERENCE= (INTERNAL, D2O, 0, 15.7039)
##AUDIT TRAIL= $$ (NUMBER, WHEN, WHO, WHERE, WHAT)
$$ ##TITLE= Audit trail, XWIN-NMR		Version 3.5
$$ ##JCAMPDX= 5.01
$$ ##ORIGIN= Bruker BioSpin GmbH
$$ ##OWNER= she
$$ F:/spectra/data/she/nmr/H-F/1/audita.txt
$$ ##AUDIT TRAIL=  $$ (NUMBER, WHEN, WHO, WHERE, WHAT)
(   1,<2023-10-04 15:48:55.43 +0400>,<she>,<DPX200>,
      <created by zg, POWCHK disabled, PULCHK disabled
       configuration hash MD5:
       00 E9 B6 7A A2 85 ED C7 34 08 36 98 17 FE 4E 26
       data hash MD5: 16K
       6F E3 01 50 A4 AA 6C 4D 80 A1 D4 0B 6C A0 A6 16>)
$$ ##END=
$$ 
$$ hash MD5
$$ 0F 10 F8 E1 C2 69 48 F4 AF 69 DB 7C E4 27 BC FA
##$RELAX= 
##$RELAX= 
##$RELAX= 
##$RELAX= 
##$RELAX= 
##$RELAX= 
$$ Bruker specific parameters
$$ --------------------------
##$DU= <F:/spectra>
##$EXPNO= 1
##$NAME= <H-F>
##$PROCNO= 1
##$TYPE= <nmr>
##$USER= <she>
##$AMP= (0..31)
100 100 100 100 100 100 100 100 100 100 100 100 100 100 100 100 100 100 
100 100 100 100 100 100 100 100 100 100 100 100 100 100 
##$AQSEQ= 0
##$AQ_mod= 1
##$AUNM= <au_zg>
##$AUTOPOS= <>
##$BF1= 200.13
##$BF2= 200.13
##$BF3= 200.13
##$BF4= 200.13
##$BF5= 200.13
##$BF6= 200.13
##$BF7= 200.13
##$BF8= 200.13
##$BYTORDA= 1
##$CFDGTYP= 0
##$CFRGTYP= 5
##$CHEMSTR= <none>
##$CNST= (0..31)
1 1 145 1 1 1 1 1 1 1 1 1 1 1 1 1 1 1 1 1 1 1 1 1 1 1 1 1 1 1 1 1 
##$CPDPRG= <>
##$CPDPRG1= <>
##$CPDPRG2= <>
##$CPDPRG3= <>
##$CPDPRG4= <mlev>
##$CPDPRG5= <mlev>
##$CPDPRG6= <mlev>
##$CPDPRG7= <mlev>
##$CPDPRG8= <mlev>
##$CPDPRGB= <>
##$CPDPRGT= <>
##$D= (0..31)
0 1.2 0 0 0 0 0 0 0 0.06 0 0.03 0 0 0 0 0.0002 0 0 0 0 0 0 0 0 0 0 0 0 
0 0 0 
##$DATE= 1696420134
##$DBL= (0..7)
120 120 120 120 120 120 120 120 
##$DBP= (0..7)
150 150 150 150 150 150 150 150 
##$DBP07= 0
##$DBPNAM0= <>
##$DBPNAM1= <>
##$DBPNAM2= <>
##$DBPNAM3= <>
##$DBPNAM4= <>
##$DBPNAM5= <>
##$DBPNAM6= <>
##$DBPNAM7= <>
##$DBPOAL= (0..7)
0.5 0.5 0.5 0.5 0.5 0.5 0.5 0.5 
##$DBPOFFS= (0..7)
0 0 0 0 0 0 0 0 
##$DE= 6
##$DECBNUC= <off>
##$DECIM= 32
##$DECNUC= <off>
##$DECSTAT= 4
##$DIGMOD= 1
##$DIGTYP= 9
##$DL= (0..7)
0 120 120 120 120 120 120 120 
##$DP= (0..7)
150 150 150 150 150 150 150 150 
##$DP07= 0
##$DPNAME0= <>
##$DPNAME1= <>
##$DPNAME2= <>
##$DPNAME3= <>
##$DPNAME4= <>
##$DPNAME5= <>
##$DPNAME6= <>
##$DPNAME7= <>
##$DPOAL= (0..7)
0.5 0.5 0.5 0.5 0.5 0.5 0.5 0.5 
##$DPOFFS= (0..7)
0 0 0 0 0 0 0 0 
##$DQDMODE= 0
##$DR= 18
##$DS= 0
##$DSLIST= <SSSSSSSSSSSSSSS>
##$DSPFIRM= 0
$$ [...]
##$SUBNAM2= <"">
##$SUBNAM3= <"">
##$SUBNAM4= <"">
##$SUBNAM5= <"">
##$SUBNAM6= <"">
##$SUBNAM7= <"">
##$SUBNAM8= <"">
##$SUBNAM9= <"">
##$SW= 18.05172834244
##$SWIBOX= (0..15)
0 0 2 0 0 0 0 0 0 0 0 0 0 0 0 0 
##$SW_h= 3612.71676300578
##$TD= 16384
##$TD0= 1
##$TE= 0
##$TE2= 300
##$TE3= 300
##$TEG= 300
##$TL= (0..7)
0 120 120 120 120 120 120 120 
##$TP= (0..7)
150 150 150 150 150 150 150 150 
##$TP07= 0
##$TPNAME0= <>
##$TPNAME1= <>
##$TPNAME2= <>
##$TPNAME3= <>
##$TPNAME4= <>
##$TPNAME5= <>
##$TPNAME6= <>
##$TPNAME7= <>
##$TPOAL= (0..7)
0.5 0.5 0.5 0.5 0.5 0.5 0.5 0.5 
##$TPOFFS= (0..7)
0 0 0 0 0 0 0 0 
##$TUNHIN= 0
##$TUNHOUT= 0
##$TUNXOUT= 0
##$USERA1= <user>
##$USERA2= <user>
##$USERA3= <user>
##$USERA4= <user>
##$USERA5= <user>
##$V9= 5
##$VALIST= <valist>
##$VCLIST= <CCCCCCCCCCCCCCC>
##$VD= 0
##$VDLIST= <DDDDDDDDDDDDDDD>
##$VPLIST= <PPPPPPPPPPPPPPP>
##$VTLIST= <TTTTTTTTTTTTTTT>
##$WBST= 1024
##$WBSW= 4
##$XGAIN= (0..3)
0 0 0 0 
##$XL= 0
##$YL= 0
##$YMAX_a= 375632
##$YMIN_a= -405532
##$ZGOPTNS= <>
##$ZL1= 120
##$ZL2= 120
##$ZL3= 120
##$ZL4= 120
##$ABSF1= 10
##$ABSF2= 0
##$ABSG= 5
##$ABSL= 3
##$ALPHA= 0
##$AQORDER= 0
##$ASSFAC= 0
##$ASSFACI= 0
##$ASSFACX= 0
##$ASSWID= 0
##$AUNMP= <proc_1d>
##$AZFE= 0.1
##$AZFW= 0.1
##$BCFW= 1
##$BC_mod= 2
##$BYTORDP= 1
##$COROFFS= 0
##$CY= 11.3945322036743
##$DATMOD= 1
##$DC= 2
##$DFILT= <>
##$DTYPP= 0
##$F1P= 15.7292609196834
##$F2P= 12.9074282941183
##$FCOR= 0.5
##$FTSIZE= 0
##$FT_mod= 4
##$GAMMA= 1
##$GB= 0.15
##$INTBC= 1
##$INTSCL= 1
##$ISEN= 128
##$LB= 0.24
##$LEV0= 0
##$LPBIN= 0
##$MAXI= 10000
##$MC2= 0
##$MEAN= 0
##$ME_mod= 0
##$MI= 1.114404
##$NCOEF= 0
##$NC_proc= 0
##$NLEV= 6
##$NOISF1= 3.799351
##$NOISF2= 2.8
##$NSP= 1
##$NTH_PI= 0
##$NZP= 0
##$OFFSET= 15.70392
##$PC= 1
##$PHC0= -21710.89
##$PHC1= 13.45271
##$PH_mod= 1
##$PKNL= yes
##$PPARMOD= 0
##$PSCAL= 0
##$PSIGN= 0
##$REVERSE= no
##$SF= 200.130013532006
##$SI= 16384
##$SIGF1= 3
##$SIGF2= 2
##$SINO= 400
##$SIOLD= 16384
##$SREGLST= <1H.CDCl3>
##$SSB= 0
##$STSI= 0
##$STSR= 0
##$SW_p= 3612.71676300578
##$SYMM= 0
##$S_DEV= 0
##$TDeff= 0
##$TDoff= 0
##$TI= <>
##$TILT= no
##$TM1= 0
##$TM2= 0
##$TOPLEV= 0
##$USERP1= <user>
##$USERP2= <user>
##$USERP3= <user>
##$USERP4= <user>
##$USERP5= <user>
##$WDW= 1
##$XDIM= 8192
##$YMAX_p= 0
##$YMIN_p= 0
$$ End of Bruker specific parameters
$$ ---------------------------------
##NTUPLES= NMR FID
##VAR_NAME=  TIME,          FID/REAL,        FID/IMAG
##SYMBOL=    X,             R,               I
##VAR_TYPE=  INDEPENDENT,   DEPENDENT,       DEPENDENT
##VAR_FORM=  AFFN,          ASDF,            ASDF
##VAR_DIM=   8192,          8192,            8192
##UNITS=     SECONDS,       ARBITRARY UNITS, ARBITRARY UNITS
##FACTOR=    0.0002768,     1,               1
##FIRST=     0,             0,               0
##LAST=      2.2672688,     0,               0
##MIN=       0,             -405532,         0
##MAX=       2.2672688,     375632,          0
$$ Real data points
##PAGE= N=1
##DATA TABLE= (X++(R..R)), XYDATA
$$ [...]
1957B76n57k73M76j46o29j44j24K64k6j08M46K71L2l75J43P58j69J21J81L64k7
$$ 276 -281 -554 -78 -224 -853 -997 -1121 -857 -883 -991 -545 -274 -242 -617 -474 284 115 236 417 781 754
1978G54k77N40j80l38J31K31k26q3k74j51K19n82j46j81rk73J73L11k61j19J9
$$ 754 477 1017 837 499 630 861 635 552 278 127 346 -236 -382 -563 -572 -845 -672 -361 -622 -741 -722
1999g22J08l75K43M34O0p8N98Q2J78J27J91k2k61J24K87m71R9R2p2l87J09l19
$$ -722 -614 -989 -746 -312 -252 -330 268 350 528 655 846 824 563 687 974 503 602 694 622 235 344 25
2021B5k73j39J89N9l96PK8o06J24R6P88m49j01J28Q54k83j44L21K86k51O1N72
$$ 25 -248 -387 -198 -139 -535 -528 -500 -1106 -982 -886 -98 -547 -648 -520 334 51 -93 228 514 263 324 896
2043H96K95p53L15N22m91m09R3J5n74j39J23o1m36j2P4K2j82k6J68M0k71L20j18
$$ 896 1191 438 753 1275 784 375 468 483 -91 -230 -107 -168 -604 -616 -542 -520 -702 -728 -560 -520 -791 -471 -589
2066e89J34J20L25J81M8K8K62j2J82J49J54m97k67Q19n06n02K98K00n27j86J38
$$ -589 -455 -335 -10 171 219 247 509 497 679 828 982 485 218 1037 531 29 327 527 0 -186 -48
2087d8j7n77K65k1k94k21K85P7k61J39M91ll00K03J22P60n48M09M38k59k92N37
$$ -48 -65 -642 -377 -398 -692 -913 -628 -551 -812 -673 -182 -185 -485 -282 -160 600 52 461 899 640 348 885
2109H85K90l86m85L92L7n82k40N82k10q16K81K2k42m49L51o3k83K53Q1j31J10
$$ 885 1175 789 304 696 733 151 -89 493 283 -533 -252 -230 -472 -921 -570 -633 -916 -663 -582 -713 -603
2130f03J01K90J4J75K97K12q8j92O24j84j42J11J99J4p66N26K22p33o2M33l61
$$ -603 -502 -212 -198 -23 274 486 398 206 830 646 504 615 814 828 62 588 810 77 15 448 87
2151H7m40n7J99n21k92O64k53o38M04O46K4n35K81M51j73l33O55J97N1JM34p2
$$ 87 -353 -410 -211 -732 -1024 -360 -613 -1251 -847 -201 -177 -712 -431 20 -153 -486 169 366 417 418 852 780
2173G80j36m2L95m01k32k22K32l26l52L40j37j58l39N96n12n24K64J34k63K11
$$ 780 644 602 997 596 364 142 374 48 -304 36 -101 -259 -598 -2 -514 -1038 -774 -640 -903 -692
2193f92M71J03o30M39O28k74k6O85J7n41K75J12L27m70j6M06r2m28j48K15%p68
$$ -692 -221 -118 -748 -309 319 45 19 704 721 180 455 567 894 424 408 814 722 294 146 361 361 -407
2215d07J07J77p05j34M95j95l81L50K50j23j97L67N91n47Q9M59j26RK36M60k16
$$ -407 -300 -123 -828 -962 -467 -662 -1043 -693 -443 -566 -763 -396 195 -352 -263 196 70 79 315 775 559
2236E59K1L6R8k27q6Q7K22n53Q5l1l90j83K34j3k93l36L09n1n25J14L52l3k17
$$ 559 580 616 714 487 401 488 710 157 242 211 -179 -362 -128 -141 -434 -770 -461 -512 -1037 -923 -571 -604 -821
2259h21Q94K8l03l0O75K44M2l85J74K89m50K30L99k41l61K79N2k45n52K44o1m33
$$ -821 73 101 -202 -232 443 687 729 344 518 807 357 587 986 745 384 663 715 470 -82 162 101 -332
2281c32k31J36l09l47L10J15K10n3L48l19k21O14R5k1j83L57O06k78P2L62Q7l77
$$ -332 -563 -427 -736 -1083 -773 -658 -448 -501 -153 -472 -693 -79 16 -5 -188 169 775 497 569 931 1018 641
2303F41n7J80k26k80K2j54j30j01J88l2k82j75j4J80n66K20Qk70K1K21J86K05
$$ 641 584 764 538 258 280 126 -4 -105 83 51 -231 -406 -420 -240 -806 -586 -578 -848 -827 -606 -420 -215
2325b15L6L53R8k17K79L90k92n3K78j8k19K77k32k65K43oj56l74J45k37j58j79
$$ -215 -179 174 272 55 334 724 432 379 657 639 420 697 465 200 443 437 281 -93 52 -185 -343 -522
2347e22j21J40K70m89M14p7j60n5K85J80j36R2M54Q9j27J9L13K04l66J79J81k25
$$ -522 -643 -503 -233 -722 -308 -385 -545 -600 -315 -135 -271 -179 275 364 237 256 569 773 407 586 767 542
2369E42j58k1j64m1j18M2K60o84J55M8k55j32l17J75k5k1J71J42%J7K80J69j73
$$ 542 384 363 199 158 40 82 342 -342 -187 -139 -394 -526 -843 -668 -693 -714 -543 -401 -401 -384 -104 65 -108
2392a08K19J91j08L15Q5l6r9K77j5k59j99L00j27l90NKL2m18k13N52m93q4J12
$$ -108 111 302 194 509 594 558 459 736 721 462 263 563 436 46 51 53 85 -333 -546 6 -487 -571 -459
2415d59q2Ok35M07O9k76P1J60N21j38K18K8J76M9K3M3R0r7k5K18l71k72N6J05
$$ -459 -541 -535 -770 -363 -294 -570 -499 -339 182 44 262 290 466 515 538 581 671 574 549 767 396 124 180 285
2439B85p9K26o29l5p5O3k06k45K49m3m5J3K60J44l93N50J15o6j8K7K12J29k43
$$ 285 206 432 -197 -232 -307 -244 -450 -695 -446 -489 -534 -521 -261 -117 -510 40 155 89 71 98 310 439 196
2462A96K94J56j27kJ74l22j36J20j36j82k79J18m8k90Q4QJ43j67l08K41n2J60
$$ 196 490 646 519 517 691 369 233 353 217 35 -244 -126 -174 -464 -380 -372 -229 -396 -704 -463 -515 -355
2484c55J20o9J26m2L04J30J35j39J4L21j18J41J08k49J50j92m8k31J4Q6k88j09
$$ -355 -235 -304 -178 -220 84 214 349 210 224 545 427 568 676 427 577 385 337 106 120 206 -82 -191
2506a91P0j9n14K17k10J36m41N84k53M69m99L62j73O08j16Q4K00J13J12k83N02
$$ -191 -121 -140 -654 -437 -647 -511 -952 -368 -621 -152 -651 -289 -462 146 30 114 314 427 539 256 758
2527G58j81J9j18K17l23l1k11J58l88j9k40L65k04k79j14r5N9M1J09K66l41pJ02
$$ 758 577 596 478 695 372 341 130 288 -100 -119 -359 6 -198 -477 -591 -686 -627 -586 -477 -211 -552 -559 -457
2550d57R2K46J21J91K53o4j49K43M0j25J07pj06L9l36L20L6k60j67P8p3j38k11
$$ -457 -365 -119 2 193 446 382 233 476 516 391 498 491 385 424 88 408 444 184 17 95 22 -116 -327
2573c27j28L1Q3o9K0j34J17l8J90j1J85Q8j14M04k6J45o6K79j94j20L39k39jR2
$$ -327 -455 -424 -341 -410 -390 -524 -407 -445 -255 -266 -81 7 -107 297 271 416 350 629 435 315 654 415 414 506
2597E06Om91M9Q6l64J88m39LL33l56J04k32K96j75k6J32J80j01R3O67l59j18J29
$$ 506 512 21 70 156 -208 -20 -459 -456 -123 -479 -375 -607 -311 -486 -512 -380 -200 -301 -208 459 100 -18 111
2620A11J37j07K68n3J85j49j18Q3J41j42j21nk69R3l34J71r5l15KO5K78l43J40
$$ 111 248 141 409 356 541 392 274 357 498 356 235 230 -39 54 -280 -109 -204 -519 -517 -452 -174 -517 -377
2643c77n5k10N17O7l80L73L64r2L5k0Q2J89K0J60k45m00L51N6J25k06j15Oj42
$$ -377 -432 -642 -125 -58 -438 -65 299 207 242 222 304 493 513 673 428 28 379 435 560 354 239 245 103
2666A03r8R3j57l30j6j46K34m85m3K24J89J5n4K74J31r1K30K35Lj05J84l2j77
$$ 103 5 98 -59 -389 -405 -551 -317 -802 -845 -621 -432 -417 -471 -197 -66 -157 73 308 311 206 390 358 181
2689A81Q5M56l65n2j3M9k27J00j72j43J1p0k65j26J55j5L6l28L85M1q5j35M65
$$ 181 266 722 357 305 292 341 114 214 42 -101 -90 -160 -425 -551 -396 -411 -375 -703 -318 -277 -362 -497 -32
2712c2r5J0L63k81L31L1j00K60J38r1j27m7k00n8K18l1k23k32M20n61J90k56L19
$$ -32 -127 -117 246 -35 296 327 227 487 625 534 407 360 160 102 320 289 66 -166 254 -307 -117 -373 -54
2735e4p3m13Q4J88q7k19J49M40j55m0K90lq0K51j42P3J97o1J21j63j27M26k99
$$ -54 -127 -540 -456 -268 -355 -574 -425 15 -140 -180 110 107 27 278 136 209 406 345 466 303 176 602 303
2758C03o2o7j14j56k71Q7r6J43l02J74K75m05o0K78j43l4K19J82O9l91M12K47
$$ 303 241 174 60 -96 -367 -280 -376 -233 -535 -361 -86 -491 -551 -273 -416 -450 -231 -49 20 -371 41 288
2780B88j51j1K76J50k65J49J53k26j03K73k60j88n7J72j97l08J60kk4j21r3L2
$$ 288 137 126 402 552 287 436 589 363 260 533 273 85 28 200 3 -305 -145 -147 -171 -292 -385 -353
2802c53j13R9J6r6P3n7L41P5j23R2L7K39m19N98J3r7N3L0O3k85K79k12Ml27J70
$$ -353 -466 -367 -351 -447 -374 -431 -90 -15 -138 -46 -9 230 -189 409 422 325 378 408 471 186 465 253 257 -70 100
2827A00Q6l00k42n8L64k27m25O04j31j97M16m02J5R4N56m50J4N49j75L13o9L6
$$ 100 186 -114 -356 -414 -50 -277 -702 -98 -229 -426 -10 -412 -397 -303 253 -197 -183 366 191 504 435 471
2849D71k5l47Q4L12l28K9Q9J6j25j63k52J03n0j46j03r6j51L71k1o7j70K71M5
$$ 471 446 99 183 495 167 196 285 301 176 13 -239 -136 -186 -332 -435 -531 -682 -311 -332 -399 -569 -298 -253
2872b53oQ6L28p5J19j74O4K17J55j98L90j9n72M06pk08k86K4J11k98o8j5K8K44
$$ -253 -259 -173 155 80 199 25 89 306 461 263 653 634 62 468 461 253 -33 -9 102 -196 -264 -279 -251 -7
2896gk74k47J18k5J68J14l21K31K65j88L1J39J37P4J07K9J2k18J04N63m07k61
$$ -7 -281 -528 -410 -435 -267 -153 -474 -243 22 -166 -135 4 141 215 322 351 363 145 249 812 405 144
2918A44K64J40m80J80m7n5j96J0j36J1j75l7O1l36J36J71L22k53K10PJ2J38K20
$$ 144 408 548 68 248 201 146 -50 -40 -176 -165 -340 -377 -316 -652 -516 -345 -23 -276 -66 -59 -47 91 311
2941C11j03j5R1m7K4M5O4M8OL2l26l5k4m5L2k69M2N1j46q1J62l85L84n26J50M94
$$ 311 208 193 284 237 261 306 370 418 424 456 130 95 71 26 58 -211 -169 -118 -264 -345 -183 -568 -184 -710 -560 -66
2967f6m34K03O8J09J41L9J90K30l70O3J53K71m04K14o9O6J8m02K07l76Q8l19r4
$$ -66 -500 -297 -229 -120 21 60 250 480 110 173 326 597 193 407 338 404 422 20 227 -149 -61 -380 -474
2990d74N41n09Oj43L59J32k26q7%J86J82j75M0J34O0J59r9L76k89J66P2J42j76
$$ -474 67 -442 -436 -579 -220 -88 -314 -401 -401 -215 -33 -208 -168 -34 26 185 86 462 173 339 411 553 377
3013C77k12Q8j56J25j96J89m13K98p6l84L30j48j35J12r3j51o6N67m80Q9J84J60
$$ 377 165 253 97 222 26 215 -198 100 24 -360 -30 -178 -313 -201 -294 -445 -511 56 -424 -335 -151 9
3035Ik6K39l12K86J8L58J6k20j41j14k7M23j67j39J52j85j85j32j39K73k20j12
$$ 9 -17 222 -90 196 214 572 588 368 227 113 86 509 342 203 355 170 -15 -147 -286 -13 -233 -345
3057c45J21k4q0q2P0k8R4O2J28k94N19j35J16K04L5k7l4J23LN8l17M47m83J88
$$ -345 -224 -248 -328 -410 -340 -368 -274 -212 -84 -378 141 6 122 326 361 334 300 423 426 484 167 614 131 319
3081C19k23J02j10k23J53k13N1p2J21k31Q5o9n2l5m8J09J84r6K40Q1R1J90j56
$$ 319 96 198 88 -135 18 -195 -144 -216 -95 -326 -241 -310 -362 -397 -445 -336 -152 -248 -8 73 164 354 198
3104A98J22r4O1m4m8J17J85k20j87K27k10j2l03M9l5R1q5j29R1j16l35L48K62
$$ 198 320 226 287 243 195 312 497 277 90 317 107 95 -208 -159 -194 -103 -188 -317 -226 -342 -677 -329 -67
3127f7j02j4k2j23L7P4K92J73L4O9l2p1O8l2J58j74n5j59m3J13r6k75K19j04l5
$$ -67 -169 -183 -205 -328 -291 -217 75 248 282 351 319 248 316 284 442 268 213 54 11 124 28 -247 -28 -132 -167
3152a67j78J40j37q2k37L58J17J08n7j15J00J8K07J55j03l6P7J35j74J88J10r6
$$ -167 -345 -205 -342 -424 -661 -303 -186 -78 -135 -250 -150 -132 75 230 127 91 168 303 129 317 427 331
3174C31k9P2j14r9k96K81n6l58l1J47J3k66J1J22m8m8J79j53j30K18oJ27K01Q3
$$ 331 302 374 260 161 -135 146 90 -268 -299 -152 -139 -405 -394 -272 -320 -368 -189 -342 -472 -254 -260 -133 68 151
3198A51j77KK36n8k44N52j24j6j2K2m9o7j54l1j55J72j39p5J79l13M8J8N5q6j45
$$ 151 -26 -24 212 154 -90 462 338 322 310 332 283 216 62 31 -124 48 -91 -166 13 -300 -252 -234 -179 -265 -410
3223d10M00k65J26R4KJ03j02J45J11J3J10j9m4j45J60J38k48J50j6j83j39Qj16
$$ -410 -10 -275 -149 -55 -53 50 -52 93 204 217 327 308 264 119 279 417 169 319 303 120 -19 -11 -127
3246a27P6k32J57p4J17j20J01k39Q1j66K34j21J10j91M15m9M3j41J71J23J20L5
$$ -127 -51 -283 -126 -200 -83 -203 -102 -341 -260 -426 -192 -313 -203 -394 21 -28 15 -126 45 168 288 323
3268C23j30k05K05J79k87Pl4j24P1j5j02j8q1J69l01nl28MK01N11m82K13J75K27
$$ 323 193 -12 193 372 85 92 58 -66 5 -10 -112 -130 -211 -42 -343 -348 -676 -672 -471 40 -442 -229 -54 173
3292A73j89J29nj13k3K58j62J95j8R9J35l28N6K07l63J09l70k7L47m68L79O5l22
$$ 173 -16 113 108 -5 -28 230 68 263 245 344 479 151 207 414 51 160 -210 -237 110 -358 21 86 -236
3315b36j00j24K85l56K01J47k18J32J18L07j99J47j10K90q6M7o6j9K94j52n4R3
$$ -236 -336 -460 -175 -531 -330 -183 -401 -269 -151 156 -43 104 -6 284 198 245 179 160 454 302 248 341
3337C41k23k4Rm0K8l10J46J65j23k25J30k26k24J24K32K93j42j58OL39k12K10
$$ 341 118 94 103 63 91 -219 -73 92 -31 -256 -126 -352 -576 -452 -220 73 -69 -227 -221 118 -94 116
3359A16k2O5j29O1J55k9j00K37M2j11k83K24q1j14M2j98J64r6j40J06m4l17K74
$$ 116 94 159 30 91 246 217 117 354 396 285 2 226 145 31 73 -125 39 -57 -197 -91 -135 -452 -178
3382a78K64r8l79j24M23k88M81k08j72N08j6oj13K43m5Qj54j09J22J67q8q0j83
$$ -178 86 -12 -391 -515 -92 -380 101 -107 -279 229 213 207 94 337 292 300 146 37 159 326 238 158 -25
3405b5J82k09q7L00l20j09M3l4k99K20J04j9K35k7K2J32k44K12mP9O1j35j28K79
$$ -25 157 -52 -139 161 -159 -268 -225 -259 -558 -338 -234 -253 -18 -45 -23 109 -135 77 73 152 213 78 -50 229
3429B29J14j50J13R0k36m2K2j60K0j35K57k70MJ00k3j96l3J17m13M15j56o9K12
$$ 229 343 193 306 396 160 118 140 -20 0 -135 122 -148 -144 -44 -67 -263 -296 -179 -592 -177 -333 -402 -190
3452a90J42J48q6L55j21k33J07J42k2J15k86RJ69k96R3L24k97J50k37m2l43L13
$$ -190 -48 100 14 369 248 15 122 264 242 357 71 80 249 -47 46 370 73 223 -14 -56 -399 -86
3474h6M0j01p4J57k96K32P9O4j7l5j24K34l3k4M3j7K24l6O8P3J68n48O3J90N4
$$ -86 -46 -147 -221 -64 -360 -128 -49 15 -2 -37 -161 73 40 16 59 42 266 230 298 371 539 -9 54 244 298
3499B98j50r0K26k42l09L85j16j88J03k94K6j7O1K12k46K05R6l2r7K14O7J4j79
$$ 298 148 58 284 42 -267 118 2 -186 -83 -377 -351 -368 -307 -95 -341 -136 -40 -72 -169 45 112 126 -53
3522e3K50j47K32l15J44k3K45j34P8j33r2L2q7K20m80J64j8j72m7L98j64k56K44
$$ -53 197 50 282 -33 111 88 333 199 277 144 52 84 -3 217 -263 -99 -117 -289 -336 62 -102 -358 -114
3545a14N7k68J04K18Ok56L36j44J21R0o1L35j68J26l86J70n0j45M1J24J3k69L9
$$ -114 -57 -325 -221 -3 3 -253 83 -61 60 150 89 424 256 382 -4 166 116 -29 12 136 149 -120 -81
3568h1o1J74j10m8lj73K03j69k56K18J49j74R8L36k29L7L79k43r2L61j7j11n0
$$ -81 -142 32 -78 -126 -129 -302 -99 -268 -524 -306 -157 -331 -233 103 -126 -89 290 47 -45 316 299 188 138
3591A38K49n05J69J07J65k01K97l87k02k1l08J53K06O7Kj29k63J58q3K34J8p7
$$ 138 387 -118 51 158 323 122 419 32 -170 -191 -499 -346 -140 -73 -71 -200 -463 -305 -388 -154 -136 -213
3613b13J60m0j83L15k2J52n6L39k64m7J04j4R6k94J37j75K53m3j02j18L9j53N3
$$ -213 -53 -93 -276 39 17 169 113 452 188 141 245 231 327 33 170 -5 248 205 103 -15 24 -129 -76
3636g6m6k29J58j30K05J90k24L0K49j95l08M13K55l92K70j8J15k81P6J55j4j83
$$ -76 -122 -351 -193 -323 -118 72 -152 -122 127 -68 -376 37 292 -100 170 152 267 -14 62 217 203 20
3658B0J46J18j83K12l02j33K27j11L7k13Nl4l6K86mr5j50nQ7j15P9K41K06k65
$$ 20 166 284 101 313 11 -122 105 -6 31 -182 -177 -211 -247 39 35 -60 -210 -215 -128 -243 -164 77 283 18
3682A8j2K88J00j83r7J9q8J65J53j06k98J0J12k3L5M2l76J72p2L03m99Q2%l69
$$ 18 6 294 394 211 114 133 45 210 363 257 -41 -31 81 58 93 135 -241 -69 -141 162 -337 -255 -255 -624
3706f24N07O8pJ09k52L39p1J02J43J0j04o5J7k48J54K17l5o7N5k20J12k58%K1
$$ -624 -117 -49 -56 53 -199 140 69 171 314 324 220 155 172 -76 78 295 260 193 248 28 140 -118 -118 -97
3730i7L7N6j14k81L81o9m0j32j4K61j63K23k95L18m6q6j02K27K22k2k57M36j85
$$ -97 -60 -4 -118 -399 -18 -87 -127 -259 -273 -12 -175 48 -247 71 25 -61 -163 64 286 264 7 443 258
3753B58M8k79J12m2q4J54k60K96k83K49n9k59Lj50N4K88m80L81N0l0K03j99n4
$$ 258 306 27 139 97 13 167 -93 203 -80 169 110 -149 -146 -296 -242 46 -434 -53 -3 -33 170 -29 -83
3776h3J44J09K6rPo1k0k0R9J68k89J64L8j75J29j40q1j25J36k2j83J58j21n2l11
$$ -83 61 170 196 187 194 133 113 93 192 360 71 235 273 98 227 87 6 -119 17 -5 -188 -30 -151 -203 -514
3801e14L96q4j09J71J96Rk79K54mO4J59o2p1m1J52J46j69r3Q3k1k9j83P7J28m25
$$ -514 -118 -202 -311 -140 56 65 -214 40 36 100 259 197 126 85 237 383 214 121 204 183 154 -29 48 176 -249
3826b49K00r8J09L8m68K18kK19k17q6J00j38P2j9K73m8J52Q6P9l27L78Ok19L35
$$ -249 -49 -147 -38 0 -468 -250 -252 -33 -250 -336 -236 -374 -302 -321 -48 -96 56 142 221 -106 272 278 59 394
3850C94jk96M4N3Oj59j40R5k01J82k84K12j97pJ25J4j53K29M4Q0m65N36n4j72
$$ 394 393 97 141 194 200 41 -99 -4 -205 -23 -307 -95 -292 -299 -174 -160 -313 -84 -40 40 -425 111 57 -115
3874a15L47o0j07L7j8L61j47o5k04L53p9k08n8k47L34j11n5j41J03j69L9J03j87
$$ -115 232 172 65 102 84 445 298 233 29 382 303 95 37 -210 124 13 -42 -183 -80 -249 -210 -107 -294
3897b94r6J31p2K09J37k32K70J53l40J56n0%J32k28N26q6j55kJ95k28Q0K9l49
$$ -294 -390 -259 -331 -122 15 -217 53 206 -134 22 -28 -28 104 -124 402 316 161 159 354 126 206 235 -114
3920a14l2o5J50J27j64j74K86n1l13M9n3J14O5R4j5Q4J46mN3r8N4j44L06k78J57
$$ -114 -146 -211 -61 66 -98 -272 14 -37 -350 -301 -354 -240 -175 -81 -96 -12 134 130 183 85 139 -5 301 23 180
3945A80j06O4N2n8Q4j23j60K27m00J48j06K5k2k28J48J07k07N2L27l88J90j3R6
$$ 180 74 138 190 132 216 93 -67 160 -240 -92 -198 -173 -195 -423 -275 -168 -375 -323 4 -384 -194 -207 -111
3968a11J3J71k09K68n4J0P8j20K69Q0l17J27j60P3p1R9o5j62L2k09K49mP0l51
$$ -111 -98 73 -136 132 78 88 166 46 315 395 78 205 45 118 47 146 81 -81 -49 -258 -9 -13 57 -294
3992b94L5J37k10L4o0J36Q8q1L5K3N1J48k3J08J03J01j98l5K89j64k88K61j29
$$ -294 -259 -122 -332 -298 -358 -222 -134 -215 -180 -157 -106 42 19 127 230 331 133 98 387 223 -65 196 67
4015F7j06R1j64K47l06j08k8R0J90j28j59J13rJ83r4P2o2rK1K25L1l91M25r9J91
$$ 67 -39 52 -112 135 -171 -279 -307 -217 -27 -155 -314 -201 -210 -27 -121 -49 -111 -120 -99 126 157 -234 191 92 283
4040B83K2Ok19n8K74l17J8j06O4J58m39L81j3j84J05p4k02N45m18J72k75RK01
$$ 283 305 311 92 34 308 -9 9 -97 -33 125 -314 67 54 -130 -25 -99 -301 244 -174 -2 -277 -268 -67
4063f7j20O7k4J71K99k37K08r4K04k37n9m3J35n0k9P0j56J10K00m22L6j51J12
$$ -67 -187 -120 -144 27 326 89 297 203 407 170 111 68 203 153 124 194 38 148 348 -74 -38 -189 -77
4086g7l1k24l2K27J90q0R1l58n8K94J26P3j03j17K27j58K63n8J87j71J40m3j46
$$ -77 -108 -332 -364 -137 53 -27 64 -294 -352 -58 68 141 38 -79 148 -10 253 195 382 211 351 308 162
4109A62O1J64l32R5j14K3j20j22O3L03k75j28N3r3oJ81L4j04m7N1J13J48j09K33
$$ 162 223 387 55 150 36 59 -61 -183 -120 183 -92 -220 -167 -260 -266 -85 -51 -155 -202 -151 -38 110 1 234
4133B34m7j14K24j87J72j87J2m1M2J4R5m4j3j87N5k6r2m8l31J70M5K05q6n7R2
$$ 234 187 73 297 110 282 95 107 66 108 122 217 173 160 -27 28 2 -90 -138 -469 -299 -254 -49 -135 -192 -100
4158a00L8j22L2J25j90J06k3R4m9J74J55L6O4k52N1LK58l57j17O8R4j98P4l3j89
$$ -100 -62 -184 -152 -27 -217 -111 -134 -40 -89 85 240 276 340 88 139 142 400 43 -74 -6 88 -110 -36 -69 -258
4183b58J76J20j61j97J66j32L73r3Lr3Q8P6j60J07j02J16K62j56j14K45j35o3
$$ -258 -82 38 -123 -320 -154 -286 87 -6 -3 -96 -8 68 -92 15 -87 29 291 135 21 266 131 68
4205F8Rk00K94l7k34j30M16k91j36K38m8M7k71O3j48L26m5J04j11m8j6J27lo3
$$ 68 77 -123 171 134 -100 -230 186 -105 -241 -3 -51 -4 -275 -212 -360 -34 -79 25 -86 -134 -150 -23 -26 -89
4229h9J23J17p2J17k24J56R5n7j89M52n31K5K80k17J64k50O3l4j31K23k38L8k62
$$ -89 34 151 79 196 -28 128 223 166 -23 429 -102 -77 203 -14 150 -100 -37 -71 -202 21 -217 -179 -441
4252d41L98j68m2J54j8O6m4J47J07j68LJ31M27j74l04P0q9K66k64NJ10P5k86o8
$$ -441 -43 -211 -253 -99 -117 -51 -95 52 159 -9 -6 125 552 378 74 144 55 321 57 62 172 247 -39 -107
4276a07m9J77k8l00L34N5l59J04J02n2Q5P3j07q2J46j78L86m7Oj58J09P9r5k60
$$ -107 -156 21 -7 -307 27 82 -277 -173 -71 -123 -38 35 -72 -154 -8 -186 200 153 159 1 110 189 94 -166
4300a66J26oJ66j05J99m12J57m3N5j50J25j72L57k21J11j97L82j87J6J2j45J92
$$ -166 -40 -46 120 15 214 -198 -41 -84 -29 -179 -54 -226 131 -90 21 -176 206 19 35 47 -98 94
4322I4j79j05K8M01j54L7q7K45j1l11K20k12L84j00m61L53l99M06j72J49l96J39
$$ 94 -85 -190 -162 239 85 122 35 280 269 -42 178 -34 350 250 -211 142 -257 149 -23 126 -270 -131
4344a31N1j24J49J34l72L40l03K36Qm9K9L0o9O1J39n9j20K01O9j94j4K3L10m26
$$ -131 -80 -204 -55 79 -293 47 -256 -20 -12 -61 -32 -2 -71 -10 129 70 -50 151 220 26 12 35 345 -81
4368h1J18J6q4K18j53l74K90J12M9j57j92L4M4p7L62k43p4J80R0q1Q1J80j05K63
$$ -81 37 53 -31 187 34 -340 -50 62 111 -46 -238 -204 -160 -237 125 -118 -192 -12 78 -3 78 258 153 416
4392D16m05J31j77M12j67m29L07j63Q0M15l80j44j08K4J17M5K4j22J75P4l98N0
$$ 416 11 142 -35 377 210 -219 88 -75 5 420 40 -104 -212 -188 -71 -26 -2 -124 51 125 -273 -223
4414b23k04N12k10k1l3K80J09M5k49rL43l49J13nq7J18J15o7l43M1J74j93K56
$$ -223 -427 85 -125 -146 -179 101 210 255 6 -3 340 -9 104 99 12 130 245 178 -165 -124 50 -143 113
4437A13j35k45K18k5l15K58R0K53o13M55j19j2m8K87l31K20j08J15j49K23J7J10
$$ 113 -22 -267 -49 -74 -389 -131 -41 212 -401 54 -65 -77 -125 162 -169 51 -57 58 -91 132 149 259
4459B59J29l21J76K8r3k72NQ6J44m86L06Q2k77L8K3j04k8N5J63n3m4J20J4QJ75
$$ 259 388 67 243 271 178 -94 -89 -3 141 -345 -39 43 -234 -196 -173 -277 -305 -250 -87 -140 -184 -64 -50 -42 133
4484A33L7l05J58k00K74K29k27q9j35M73k97j1J06l5J26j47j42j3j23m4J44n9
$$ 133 170 -135 23 -177 97 326 99 10 -125 348 51 40 146 111 237 90 -52 -65 -188 -232 -88 -147
4506a47J40mj83N3o6J98K19J15l80K84j97j38J05J38N2j13Q1j32J86j63K42j8
$$ -147 -7 -11 -194 -141 -207 -9 210 325 -55 229 32 -106 -1 137 189 76 157 25 211 48 290 272
4528B72p5j11n0Q7k93L39P1l52L15k86k07N9K07l19K95l01K79Oj3q6K02r0o1J85
$$ 272 197 86 36 123 -170 169 240 -112 203 -83 -290 -231 -24 -343 -48 -349 -70 -64 -77 -163 39 -51 -112 73
4552G3J01J57k21Q7j73J80J4k13J57j10J44l28Q9o6l2J65M2j69M9j13J48p3L7
$$ 73 174 331 110 197 24 204 218 5 162 52 196 -132 -43 -109 -141 24 66 -103 -54 -167 -19 -92 -55
4575e5K46k17j66J68j12M33j86k25j8J48K63n7k5m01M53j31r5j7o0Q0j33J77q4
$$ -55 191 -26 -192 -24 -136 297 111 -114 -132 16 279 222 197 -204 249 118 23 6 -54 26 -107 70 -14
4598a4K69m90L78l18J46o3M6Q5m08M36k94N4K27P9j09o9J69J01j49p6L87j25l71
$$ -14 255 -235 143 -175 -29 -92 -46 39 -369 67 -227 -173 54 133 24 -45 124 225 76 0 387 262 -109
4621a09M02k93K10P0m2j42r0m2r1J02k8k3k14K24l56J02J44JJ91k40L08j74J12
$$ -109 293 0 210 280 238 96 6 -36 -127 -25 -53 -76 -290 -66 -422 -320 -176 -175 16 -224 84 -90 22
4644B2r7L3P2j17R9n3K19j22Q5L3P4q5m36J99J51J22k01ql77L32j2n4M4J56J8
$$ 22 -75 -42 30 -87 12 -41 178 56 141 174 248 163 -273 -74 77 199 -2 -10 -387 -55 -67 -121 -77 79 97
4669I7l15PO8NO6l11O32k02J26l00L63m38K02m2M9J67J31j03n9r9J94j90J53j70
$$ 97 -218 -211 -143 -138 -72 -383 249 47 173 -127 236 -202 0 -42 7 174 305 202 143 44 238 48 201 31
4693C1j69L02j17j24l08M44k0n0k15Q1L0J67j02n2q3L44j69k09L84k1k26K33R
$$ 31 -138 164 47 -77 -385 59 39 -11 -226 -145 -115 52 -50 -102 -185 159 -10 -219 165 144 -82 151 160
4716A60l1M1R6k75p2J07jk01q4J86J84p1j57L3J44m0k25J94J70k89J59k19m4L41
$$ 160 129 170 266 -9 -81 26 25 -176 -260 -74 110 39 -118 -85 59 19 -206 -12 158 -131 28 -191 -235 106
4740A06lk68J87L08p9n5j77J32p8L9l24L04M7r9K46l78J11k18K86j55K78k66k6
$$ 106 103 -165 22 330 251 196 19 151 73 112 -212 92 139 40 286 -92 19 -199 87 -68 210 -56 -82
4763h2k80J52J02j27K41q0j55m1M72l46l6M37p3j47L63k18k51J95M8j76j5L04
$$ -82 -362 -210 -108 -235 6 -74 -229 -270 202 -144 -180 257 184 37 400 182 -69 126 174 -2 -17 287
4785B87k57K43l73K3L02j93k80L04qk26K13l09K38k00j24L50l02K89Pj47K57K8
$$ 287 30 273 -100 -77 225 32 -248 56 48 -178 35 -274 -36 -236 -360 -10 -312 -23 -16 -163 94 122
4807A22P7l09QJ56J25l03K72kp6P0J06k1k78P2k01K09R5m04l6O1K75J39l82K07
$$ 122 199 -110 -102 54 179 -124 148 146 70 140 246 225 -53 19 -182 27 122 -282 -318 -257 18 157 -225 -18
4831a8k11L4k7K26J49j04k28J14k7Q0j58Q7K15j22q1j38K62j85K44L8k59K71j02
$$ -18 -229 -195 -222 4 153 49 -179 -65 -92 -12 -170 -83 132 10 -71 -209 53 -132 112 150 -109 162 60
4854F0kj44J58j50J6l3K10k9j35l2j69K17N9Q1k0k69P3p6L99k44j4K34r9m6J29
$$ 60 58 -86 72 -78 -62 -95 115 86 -49 -81 -250 -33 26 107 87 -182 -109 -185 214 -30 -44 190 91 45 174
4879A74Q4l7l20L86Qk72p7K2o5L3L2j86j82J48L43k43J93k83K27N1l11J39K08
$$ 174 258 221 -99 287 295 23 -54 -32 -97 -64 -32 -218 -400 -252 91 -152 41 -242 -15 36 -275 -136 72
4902G2R9L0k9j01R9k56N18n22K92j85Ok8N7J19k98J76k48PK03J40k13o7m2J34
$$ 72 171 201 172 71 170 -86 432 -90 202 17 23 -5 52 171 -127 49 -199 -192 11 151 -62 -129 -171 -37
4926c7k6j5j34L29m70L20J65J73l66n7k6N8J25k2j19n7J83L06k84K00q3jj73J04
$$ -37 -63 -78 -212 117 -353 -33 132 305 -61 -118 -144 -86 39 17 -102 -159 24 330 46 246 163 162 -11 93
4950I3K2Ml6k84L37l52K62k25J57j09Q9j34J29p1l9J84J52K2j99m3qR4nM4o2L31
$$ 93 115 119 83 -201 136 -216 46 -179 -22 -131 -42 -176 -47 -118 -157 27 179 201 2 -41 -49 45 40 84 22 353
4976C53j42k77J90j64n3l1n8L16l2l92J83N7l41N20l3k14K37k14k5K38j56J3j67
$$ 353 211 -66 124 -40 -93 -124 -182 134 102 -290 -107 -50 -391 129 96 -118 119 -95 -120 118 -38 -25 -192
4999a92J74j3K76j12q5m9Q9j0p2J84r7l9l9L8Kk90J81l5K2k89K71N0j51R4K27
$$ -192 -18 -31 245 133 48 -1 88 78 6 190 93 54 15 53 55 -235 -54 -89 -67 -356 -85 -35 -186 -92 135
5024A35l19k34L83R2P9k83m7J62J02j04p8K29J01j72o8J09n8L33o51K16K50j00
$$ 135 -184 -418 -35 57 136 -147 -194 -32 70 -34 -112 117 218 46 -22 87 29 362 -289 -73 177 77
5046G7m2k45J80K2KQ4l34L33j17j4m4m1J6LJ44j73K62q5q9j4L45k21Q3qR9j93
$$ 77 35 -210 -30 -8 -6 78 -256 77 -40 -54 -98 -139 -123 -120 24 -149 113 28 -61 -75 270 49 132 124 223 30
5072C0rJ36N9j85P4o1r1J89k69m5N5j53J67R4l31J33L03m01K13M5j59L39j5r8
$$ 30 21 157 216 31 105 44 -47 142 -127 -172 -117 -270 -103 -9 -340 -207 96 -305 -92 -47 -206 133 118 20
5096B0o9j82r7L13K18l11J42o8p3K13p7j86M74m60K02n7p5P6k91k9J19N6J34j61
$$ 20 -49 -231 -328 -15 203 -108 34 -34 -107 106 29 -157 317 -143 59 2 -73 3 -288 -317 -198 -142 -8 -169
5120a69K9K22j49k5L2k5J10m0p6k1J50K17j01m4j54K52j83j58O7J87K05l92K82
$$ -169 -140 82 -67 -92 -60 -85 25 -15 -91 -112 38 255 154 110 -44 208 25 -133 -66 121 326 -66 216
5143B16k96M9j85J90Jj62Q9j30JJ41J40l17J89j41K50Q5L9j33j75K11L38k29J17
$$ 216 -80 -31 -216 -26 -25 -187 -98 -228 -227 -86 54 -263 -74 -215 35 120 159 26 -149 62 400 171 288
5166B88k64N5P8J2k58j1j3J39l2j35m0k3L81l58R5J56j34M1J8j83J50j75K36k56
$$ 288 24 79 157 169 -89 -100 -113 26 -6 -141 -181 -204 177 -181 -86 70 -64 -23 -5 -188 -38 -213 23 -233
5190b33M43l42K15L4%j08P2j83K81k38Q5J38k9o0l50K99K16k91L22k98J68k26
$$ -233 210 -132 83 117 117 9 81 -102 179 -59 26 164 135 75 -275 24 240 -51 271 -27 141 -85
5212h5K03k73J6nn8J50k08J69K9J39n0j08J93J3p4J53k2j42j27K26N0j29K40m32
$$ -85 118 -155 -139 -144 -202 -52 -260 -91 -62 77 27 -81 112 125 51 204 182 40 -87 139 189 60 300 -132
5236a32J53J06l42J46k05J85j14J92J28l57K55l7k1k36J06j9J16j41M33l71K51
$$ -132 21 127 -215 -69 -274 -89 -203 -11 117 -240 15 -22 -43 -279 -173 -192 -76 -217 216 -155 96
5257I6r9QJ28j31K2J86j17l2M2k6j90J31J53k61J53N0j08J50j47k32K18J6J13
$$ 96 -3 5 133 2 24 210 93 61 103 77 -113 18 171 -90 63 113 5 155 8 -224 -6 10 123
5280A23l41M8j31K34J83k30L5J32m7k79K07Oj9J65p0K40k32K24j59p1n4J95l38
$$ 123 -218 -170 -301 -67 116 -114 -79 53 6 -273 -66 -60 -79 86 16 256 24 248 89 18 -36 159 -179
5303a79J1M69M2l74n4m6K84l73L25k58m4J59J31l19J75j76K90l5%o6lQ1j58L9
$$ -179 -168 301 343 -31 -85 -131 153 -220 105 -153 -197 -38 93 -226 -51 -227 63 28 28 -38 -41 40 -118 -79
5327g9K74l19jJ85M0K6k43L69k53J23k19mQ6J12k83J63M3N5k79j5J64j7p9J79
$$ -79 195 -124 -125 60 100 126 -117 252 -1 122 -97 -101 -15 97 -186 -23 20 75 -204 -219 -55 -72 -151 28
5351B8l54L87o7K19j94j8r0J01J80l7m7L31l81j3p7N3p2j58L04j41j37R1%J7J49
$$ 28 -326 61 -6 213 19 1 -89 12 192 155 108 439 58 45 -32 21 -51 -209 95 -46 -183 -92 -92 -75 74
5376G4R7j78R5k63Q8o9M11l27J12Q5j04K03k96L06j35J20j51J45j07J22k69J45
$$ 74 171 -7 88 -175 -87 -156 255 -72 40 125 21 224 -72 234 99 219 68 213 106 228 -41 104
5398A04K9q9K3r5n3j4o2J41k8j46j62K74n1N8K6J92k31K69j78j19L44m60K77M8
$$ 104 133 44 67 -28 -81 -95 -157 -16 -44 -190 -352 -78 -129 -71 -45 147 -84 185 7 -112 232 -228 49 97
5422I7J09j46j24L84k44J01k01K22k17L3l44L53j46n0jK34pl31K03J02NQ9Mm9
$$ 97 206 60 -64 320 76 177 -24 198 -19 14 -330 23 -123 -173 -174 60 53 -278 -75 27 32 121 125 76
5446G6J01j58P7n3K16l09L42k73QK53k87J22o5j63K84j39j68q7P9L56j00j9k69
$$ 76 177 19 96 43 259 -50 292 19 27 280 -7 115 50 -113 171 32 -136 -223 -144 212 112 93 -176
5469a76L08l34J59j18J81l08k8J15P0q9j13J47J48K71j99Q9Oo4Q6j14J33K66m92
$$ -176 132 -202 -43 -161 20 -288 -316 -201 -131 -220 -333 -186 -38 233 34 123 129 65 151 37 170 436 -56
5492e6L3P8N5k08J63K93l69O5n6M6k19n6O4J41j56L5J78j99o0J50K2k7J37k1J32
$$ -56 -23 55 110 -98 65 358 -11 54 -2 44 -175 -231 -167 -26 -182 -147 31 -168 -228 -78 -56 -83 54 33 165
5517A65P3O9j80M5q1n8J59M8k38R7k1k50n2J27J66j8m9Q7K5r3J90r0j70j03J21
$$ 165 238 307 127 172 91 33 192 240 2 99 78 -172 -224 -97 69 51 2 89 114 21 211 121 -49 -152 -31
5542c1l30M12j44ML86m04J50l19K43m3Q2N1j36J64p6J4l89K79K31k74%j7J29L3
$$ -31 -361 51 -93 -89 297 -107 43 -276 -33 -76 6 57 -79 85 9 23 -366 -87 144 -130 -130 -147 -18 15
5566A5q4q7J59j89Q0Q7j31M4N4j47J13K36N9k71K63k03J28m9L22k54k07R4N7r7
$$ 15 -69 -156 3 -186 -106 -19 -150 -106 -52 -199 -86 150 209 -62 201 -2 126 77 399 145 -62 32 89 -8
5590hP0J68k10k0K7j76M8j9J64k18j0J85l12L59k35K29m2j5j3j50N0n0K89Q6k31
$$ -8 62 230 20 0 27 -149 -101 -120 44 -174 -184 1 -311 48 -187 42 0 -15 -28 -178 -128 -178 111 197 -34
5615c4J79Q0k62K52M9n9Jk52j38J90N2L9j27LJ7l19L19K56n35J12K82j67Lj9k25
$$ -34 145 225 -37 215 264 205 206 -46 -184 6 58 97 -30 -27 -10 -329 -10 246 -289 -177 105 -62 -59 -78 -303
5640c03L56j28K94k39r5J23M7k05N7J41J31J14k62J65j2k33K15p0n7j22m2L2Q2
$$ -303 53 -75 219 -20 -115 8 55 -150 -93 48 179 293 31 196 184 -49 166 96 39 -83 -125 -93 -11
5663a1PO8n2m3n5k10K74k00K21j5q6L16m97N28p3n3J3r9j2P0l0N4j07J0q5j90
$$ -11 -4 64 12 -31 -86 -296 -22 -222 -1 -16 -102 214 -283 245 172 119 132 33 21 91 61 115 8 18 -67 -257
5689b57L33k4j81P6m8P9Q2j55JK7R9j40j43M21j63m8qj13J03L07j5j24j34M2R
$$ -257 76 52 -129 -53 -101 -22 60 -95 -94 -67 32 -108 -251 170 7 -41 -49 -162 -59 248 233 109 -25 17 26
5714B6P5q8J64o7j5p1j54J59j11K04j84L6n8J72n8l39L97Qk68j24K11J5j74J24
$$ 26 101 13 177 110 95 24 -130 29 -82 122 -62 -26 -84 88 30 -309 88 96 -172 -296 -85 -70 -244 -120
5738a20K78j61M6j00K52k57Q3p4K71j49Q8o2K9k17J60R3m13J53J74r0L1k59K50
$$ -120 158 -3 43 -57 195 -62 21 -53 218 69 157 95 124 -93 67 160 -253 -100 74 -16 15 -244 6
5761Fq2j7kK9k37K65O0m1m6M7K50k26J49k88O6N4K0J96j63K58jk55l4J7K1j72
$$ 6 -76 -93 -95 -66 -303 -38 22 -19 -65 -18 232 6 155 -133 -67 -13 7 203 40 298 297 42 8 25 46 -126
5787a26J25kml9j83J08R4O3O8j25j4n7K15R4k59j11N1L24j99P0j97J61Q9j16O1
$$ -126 -1 -3 -7 -46 -229 -121 -27 36 104 -21 -35 -92 123 217 -42 -153 -102 222 23 93 -104 57 146 30 91
5812I1o7J03m3k05j6J05K50l21L29n9l8q6j32Q8j6j37J50k5j17j73K06m7L5J34
$$ 91 24 127 84 -121 -137 -32 218 -103 226 167 129 43 -89 -1 -17 -154 -4 -29 -146 -319 -113 -160 -125 9
5836IQO6k8M0o9r3J55K3r0P3l3p2J01k60J76J93j82l0p8K35l64K00j24j41J68
$$ 9 17 83 55 95 26 -67 88 111 21 94 61 -11 90 -170 6 199 17 -13 -91 144 -220 -20 -144 -285 -117
5861a17J36j70J36k7j56K97j38kj38R5J00J30j28J8j07O2k8K51j01k55L91k13
$$ -117 19 -151 -15 -42 -198 99 -39 -41 -179 -84 16 146 18 36 -71 -9 -37 214 113 -142 249 36
5883C6j53p1K81n6m6k15J3J5J15K3r7J35J57p3jo0K4o9j91K05J72k04lK0J28j7
$$ 36 -117 -188 93 37 -9 -224 -211 -196 -81 -58 -155 -20 137 64 63 3 27 -42 -233 -28 144 -60 -63 -43 85 68
5909F8R2j58K7j56K5J91j74KJ26J10m54J1M49k19J75K76k95j17k23K72J06j9N1
$$ 68 160 2 29 -127 -102 89 -85 -83 43 153 -301 -290 159 -60 115 391 96 -21 -244 28 134 115 166
5932A66j31K07k86n6J64J95k48K36k33n8p2M1L2R7j97m7J36k15K76j32n5N7L7
$$ 166 35 242 -44 -100 64 259 11 247 14 -44 -116 -75 -43 54 -143 -190 -54 -269 7 -125 -180 -123 -86
5955h6J26J92k77m2j15J35O4k8l1J26k67M87j24q9l9j62K13k27qL04o4M5J00j5
$$ -86 40 232 -45 -87 -202 -67 -3 -31 -62 64 -203 284 160 71 32 -130 83 -144 -152 152 88 133 233 218
5979B18l77J06K91m03r8K39q9R9k27O3Q5Q4K86L3j79l04J54p3J55J63l74J06K58
$$ 218 -159 -53 238 -165 -263 -24 -113 -14 -241 -178 -93 -9 277 310 131 -173 -19 -92 63 226 -148 -42 216
6002B16r4L9j07J45j51J11j02n8RQ4j02j08J33K82m09J77j02k74K33p7jJ84j68
$$ 216 122 161 54 199 48 159 57 -1 8 92 -10 -118 15 297 -112 65 -37 -311 -78 -155 -156 28 -140
6025a40J87k69K78K30m52k9M31q4j68P2j27J39L2J59l36K41k00J18M7q7p9K3J81
$$ -140 47 -222 56 286 -166 -195 236 152 -16 56 -71 68 100 259 -77 164 -36 82 129 42 -37 -14 167
6048A67P6l97J14j0k55N31m63M35j45N3j50k5LJ28n5J16j2l84K43J46K09k52j07
$$ 167 243 -154 -40 -50 -305 226 -237 198 53 106 -44 -69 -66 62 7 123 111 -273 -30 116 325 73 -34
6071c4K50k50k68K05K61K0k04q3Q4j09o4P4J73J70l22j07J46j5K96k35PM5j39
$$ -34 216 -34 -302 -97 164 184 -20 -103 -19 -128 -192 -118 55 225 -97 -204 -58 -73 223 -12 -5 40 -99
6094i9K76j83M0Mj9J86j27r8K54j67q9n2K14j21M5jjJ20M9k54r4R1L8k16k0J45
$$ -99 177 -6 34 38 19 205 78 -20 234 67 -22 -74 140 19 64 63 62 182 231 -23 -117 -26 12 -204 -224 -79
6120g9J30K03k71lk06L40k18J8J16R3K7m05K80j17J91k26N8K36K2k25R4O6l61
$$ -79 51 254 -17 -20 -226 114 -104 -86 30 123 150 -255 25 -92 99 -127 -69 167 189 -36 58 124 -237
6143b37K28j00J42j26o7k5r9L80Q5k76K07j67J70j49O1J29o6j11J29J8j19K84
$$ -237 -9 -109 33 -93 -160 -185 -284 96 181 -95 112 -55 115 -34 27 156 90 -21 108 126 7 291
6165B91o4n5mj60R0j63p2J3J5L37j63l05M71j87k20J10j31K58j41%M0J87j97J0
$$ 291 227 172 168 8 98 -65 -137 -124 -109 228 65 -240 231 44 -176 -66 -197 61 -80 -80 -40 147 -50 -40
6189d0n4r2K49K34k85j3M2J89o1k00J01N2k56J71p8K08j83J11l18J89r2K76rl06
$$ -40 -94 -186 63 297 12 -1 41 230 169 -31 70 122 -134 37 -41 167 -16 95 -223 -34 -126 150 141 -165
6213a65K17k28P8J63q3M6q1K03k49L02l10L92Ll15k9K65L3j68j31M5k4n4Q9q6
$$ -165 52 -176 -98 65 -18 28 -53 150 -99 203 -107 285 288 -27 -56 209 242 74 -57 -12 -36 -90 -1 -87
6237h7J2K22o2l76K81m10K94m7N6K8l5M3L82k51O7l84K35J15n1p2J4J80M5l85
$$ -87 -75 147 85 -291 -10 -420 -126 -173 -117 -89 -124 -81 301 50 117 -267 -32 83 32 -40 -26 154 199 -186
6261a86L46o8M2j41q9J49J67j88J08n70L90K28m25J89J59j52j06K3K04l09L51
$$ -186 160 92 134 -7 -96 53 220 32 140 -430 -40 188 -237 -48 111 -41 -147 -124 80 -229 122
6282A22j81J31j73J12K19k85J49k38J48k00K34k7k06K84r3j19K55k36K88Rl04
$$ 122 -59 72 -101 11 230 -55 94 -144 4 -196 38 11 -195 89 -4 -123 132 -104 184 193 -111
6303a11K3q1J01k8L00Ml59l9J27j04L44j47j46R9j45K83Qj20k0o3j52J17J48j31
$$ -111 -88 -169 -68 -96 204 208 -151 -190 -63 -167 177 30 -116 -17 -162 121 129 9 -11 -74 -226 -109 39 -92
6327i2N3qJ16J91j52j93K14l9O1j43k5J24j43J72j19j81K02J05k41k5J89k27K06
$$ -92 -39 -47 69 260 108 -85 129 90 151 8 -17 107 -36 136 17 -164 38 143 -98 -123 66 -161 45
6350D5p6K6k80L76j55J52j62K5Mm4P3J9K3k0O9Nl55J62J97j99Rj35L17k89K86
$$ 45 -31 -5 -285 91 -64 88 -74 -49 -45 -89 -16 3 26 6 75 80 -275 -113 84 -115 -106 -241 76 -213 73
6375G3kq7m6j93L03nk86L54K13k91j42j58N62j44j4J6N1j23j7J08j29j3j04o1
$$ 73 71 -16 -62 -255 48 43 -243 111 324 33 -109 -267 295 151 137 153 204 81 64 172 43 30 -74 -135
6399a35n6J33N2J5j20nK6ml3Q8K0k34n8L4O11l31l6O3k7M0m3L1Kp3K42j64j99
$$ -135 -191 -58 -6 9 -111 -116 -90 -94 -127 -39 -19 -253 -311 -277 334 3 -33 30 3 43 0 31 33 -40 202 38 -161
6426a61N2J83L6ok39L22k73O4k37J84J30j90J18J51k80r6l9K41l9r1L13j68J48
$$ -161 -109 74 110 104 -135 187 -86 -22 -259 -75 55 -135 -17 134 -146 -242 -281 -40 -79 -170 143 -25 123
6449A23j20Kj9K22j89J35j75j2%l4j32K75k6r2J35j35k2Q9Q0k08K89k85J4k03
$$ 123 3 5 -14 208 19 154 -21 -33 -33 -67 -199 76 50 -42 93 -42 -64 25 105 -103 186 -99 -85 -288
6473b88L68N3l29J13K93l66J08J54l3P2k43o1K89j31R8k68j3J69J00K4k87M7K1
$$ -288 80 133 -196 -83 210 -156 -48 106 73 145 -98 -159 130 -1 97 -171 -184 -15 85 109 -178 -131 -110
6496a10K84l58oL34k4k92J76j37J53q8K05j18j57P3J12K0k8k15J15o4L12k66N0
$$ -110 174 -184 -190 144 120 -172 4 -133 20 -68 137 19 -138 -65 47 67 39 -176 -61 -125 187 -79 -29
6519b9J2K60l97q1L56k49K0QP9r9j2L19m94J32K49j48k9R0q8P2Q7Qk4N6m9k28
$$ -29 -17 243 -154 -235 121 -128 -108 -100 -21 -120 -132 187 -307 -175 74 -74 -103 -13 -101 -29 58 66 42 98 49 -179
6545a79K72j18K1Q3Q7L2r4j99r0J76J03l3p0M64l53k39JL48n21J98J70K4j20J
$$ -179 93 -25 -4 79 166 198 104 -95 -185 -9 94 61 -9 455 102 -137 -136 212 -309 -111 59 83 -37 -36
6569c6k1k67K21n0L57ll66J42K6M6k2J5J3J3j80K08M9p7k4j70K74j11k9r1k5J62
$$ -36 -57 -324 -103 -153 204 201 -165 -23 3 49 27 42 55 68 -112 96 145 68 44 -126 148 37 8 -83 -108 54
6595E4L5l14L33rl47J66Q3p2m4N3L2N5K0K3k55j05L04Q4J43l68l7L21L5j48o6
$$ 54 89 -225 108 99 -248 -82 1 -71 -115 -62 -30 25 45 68 -187 -292 12 96 239 -129 -166 155 190 42 -24
6620b4J17k29K86qj00P4k94M1j02K79j7K53m29J10J73j73J98J5l6q8k22K66j0
$$ -24 93 -136 150 142 42 116 -178 -137 -239 40 23 276 -153 -43 130 -43 155 170 134 46 -176 90 80
6643H0j05L32m73N75k43j40k3l79K39K52m7j8J09m46L94p3n0qMm7L6j60J43J27
$$ 80 -25 307 -166 409 166 26 3 -376 -137 115 68 50 159 -287 107 34 -16 -24 -20 -67 -31 -191 -48 79
6667G9q1j51k3j77J41L86j00K46p9k67K42j72K97l14k15L67K00m10oO0j20J28
$$ 79 -2 -153 -176 -353 -212 174 74 320 241 -26 216 44 341 27 -188 179 379 -31 -37 23 -97 31
6689C1k3Kk52Q3M2j38J58J00oL6Ol2p8M4N4M4m20M45L0k63K11j30j06M14k7k72
$$ 31 8 10 -242 -159 -117 -255 -97 3 -3 33 39 7 -71 -27 27 71 -349 96 126 -137 74 -56 -162 252 225 -47
6715d7j9K02j25l5Lk1j52L28j10j15K10P5M1l91J11m2K64K3n50J92O9k27L26K2
$$ -47 -66 136 11 -24 -21 -42 -194 134 24 -91 119 194 235 -156 -45 -87 177 200 -350 -158 -89 -316 10 32
6739C2o2K00j61n3R8o6J9j44J70P1r9J72q4l43N5j8L18p1p8m3L31q0j40Q8r3K00
$$ 32 -30 170 9 -44 54 -12 7 -137 33 104 5 177 93 -250 -195 -213 105 34 -44 -87 244 164 24 112 19 219
6765B19k63O8K73m27K70k77J84J33j79nj14L8K21Q0j09k71K41m4Q1j21J38j27
$$ 219 -44 24 297 -130 140 -137 47 180 1 -4 -118 -80 141 221 112 -159 82 38 119 -2 136 9
6787Ij06O4j4jj66K85k57M7l3Q8l2J12j64J25j46L92J4k11l3P0k21K56J0j37K25
$$ 9 -97 -33 -47 -48 -214 71 -186 -139 -172 -84 -116 -4 -168 -43 -189 203 217 6 -27 43 -178 78 88 -49 176
6812A76l15J20j37K77l30J48k41M54k14J04L1l07J21K45m3J05m22J32J49j11N2
$$ 176 -139 -19 -156 121 -209 -61 -302 152 -62 42 73 -234 -113 132 89 194 -228 -96 53 -58 -6
6833fR4j2j10k6J98l02O6m1k2K03J09k13L65k39K65k16k25L2J50N6j67o5j21K22
$$ -6 88 76 -34 -60 138 -164 -98 -139 -161 42 151 -62 303 64 329 113 -112 -80 70 126 -41 -106 -227 -5
6857ej70R8J5l2L1l5J22p6J87N0k68j05K76J21k2k63K8Q1k61K27R8J50j38l3p3
$$ -5 -175 -77 -62 -94 -63 -98 24 -52 135 185 -83 -188 88 209 187 -76 -48 33 -228 -1 97 247 109 76 3
6882CJ91l99K9K85k46K61j77K73q1l9k32Q7l9J26m2j18K76j16m2j69L33l66L48
$$ 3 194 -205 -176 109 -137 124 -53 220 139 100 -132 -45 -84 42 0 -118 158 42 0 -169 164 -202 146
6905A46j57j21q6L55o3L5k11K0L1J98o0k19O0K07j53J10j21J85m87M61j23K00
$$ 146 -11 -132 -218 137 74 109 -102 -82 -51 147 87 -132 -72 135 -18 92 -29 156 -331 130 7 207
6927B07k7m16L43N3k2j59J87m29K97J18J10k12k25L29k47J7J02l4J65K5k04o2
$$ 207 180 -236 107 160 138 -21 166 -263 34 152 262 50 -175 154 -93 -76 26 -8 157 182 -22 -84
6949h4J86j20m6m0k25J08j12L70l51K50l3Q9j30J68K18j12k63J48L9l7Q7j95K08
$$ -84 102 -18 -64 -104 -329 -221 -333 37 -314 -64 -97 -8 -138 30 248 136 -127 21 60 23 110 -85 123
6972A23j00J61j84J37j25m4j09K48J32j70m77M54m6Q3m3k33K01j00J38p8nQ2l84
$$ 123 23 184 0 137 12 -32 -141 107 239 69 -408 46 0 83 40 -193 8 -92 46 -32 -37 45 -339
6995c39N08l70M2K80n0Q4k06j10K82r5p2k57K21J1Q1pk1Kn7k9LJ72j32K52k43
$$ -339 169 -201 -159 121 71 155 -51 -161 121 26 -46 -303 -82 -71 10 3 -18 -16 -73 -102 -99 73 -59 193 -50
7020e0J39j12L7r4O3R7j92J0J21M4J91l40J74j54j3J14j99K19l22L93j42p7r0
$$ -50 89 -23 14 -80 -17 80 -112 -102 19 63 254 -86 88 -66 -79 35 -164 55 -267 126 -16 -93 -183
7043a83K2M3K80k35q7Q0J14k59J36J65o4p3K19j16k7j02K14p3j82M28J5m65P4
$$ -183 -161 -118 162 -73 -160 -80 34 -225 -89 76 12 -61 158 42 15 -87 127 54 -128 300 315 -150 -76
7066g6j7P0J3r3K3j10N5N0R0J40j24L4k3Op2q1RN4Nr9L49l49N8J91M0k9P2j82
$$ -76 -93 -23 -10 -103 -80 -190 -135 -85 5 145 21 55 32 38 -34 -115 -106 -52 -47 -146 203 -146 -88 103 143 114 186 4
7094Dj00J93j9k62J64j99J55K71j98k6J23j11p9k1M2K80l60J07j01J88j44n8j58
$$ 4 -96 97 78 -184 -20 -219 -64 207 9 -17 106 -5 -84 -105 -63 217 -143 -36 -137 51 -93 -151 -309
7117c09r9M27j8J80k85o4l6M72m00P2K10J51Q2k86l6k80O4qR1j1K41kl64J81J32
$$ -309 -408 19 1 181 -104 -168 -204 268 -132 -60 150 301 383 97 61 -219 -155 -163 -72 -83 158 156 -208 -27 105
7142A05j93p5J96j09kq6O9R9m3n2J8K85l42J30J08l79K26n3K51k26o4KQ7K71n00
$$ 105 -88 -163 33 -76 -78 -164 -95 4 -39 -91 -73 212 -130 0 108 -271 -45 -98 153 -73 -137 -135 -48 223 -277
7167b77L24M8J46l74L21o3k82qJ13k2j22K69l6j16Q0P4j30j96K40k30R7L8pPJ4
$$ -277 47 95 241 -133 188 125 -157 -165 -52 -74 -196 73 37 -79 1 75 -55 -251 -11 -241 -144 -106 -113 -106 -92
7192i2J93k92K42J5rj92K19k02K09j67J65o7l9k40K16P8j84J05j66p1K36J4j67
$$ -92 101 -191 51 66 57 -135 84 -118 91 -76 89 22 -17 -257 -41 37 -147 -42 -208 -279 -43 -29 -196
7215a96K49l9l6m8j7qq2K95R9l50K33k44K89j09l3J81m5O7k00m1K02J29n47J58
$$ -196 53 14 -22 -70 -87 -95 -177 118 217 -133 100 -144 145 36 3 184 139 206 6 -35 167 296 -251 -93
7239i3j60K11l0k6J85j96K32r5k25K7qQ0Q4j40L22k47K25J22k61K0J13k30J49
$$ -93 -253 -42 -72 -98 87 -109 123 28 -197 -170 -178 -98 -14 -154 168 -79 146 268 7 27 140 -90 59
7262E9n0M3o8R3k15K02k0k08J71j12J12Qo7J99j43J46P5k81M6K28k85m8M15l48
$$ 59 9 52 -16 77 -138 64 44 -164 7 -105 7 15 -52 147 4 150 225 -56 -10 218 -67 -115 300 -48
7286d8L62k01j59J22K43m91M9j8M09k49l86L80M3J29l67K78k4j79J41j71K41k19
$$ -48 314 113 -46 76 319 -172 -123 -141 268 19 -367 13 56 185 -182 96 72 -107 34 -137 104 -115
7308a15J76Op8J0q9%n1J41j92K07J42j77J51j08q5J33Q0J36k09ok8q0l6J63j02
$$ -115 61 67 -11 -1 -90 -90 -141 0 -192 15 157 -20 131 23 -62 71 151 287 78 72 44 -36 -72 91 -11
7333a1R7Ll03k07M47J5J31j95m0n8j86J32L03K01n85L9K57n4j81N8J52J51k25
$$ -11 86 89 -214 -421 26 41 172 -23 -63 -121 -307 -175 128 329 -256 -217 40 -14 -195 -137 15 166 -59
7356e9L3K16j21j26J10j18M3j12K65o3k85K5K26k23J12p9J17k1j3j48J01K68k89
$$ -59 -26 190 69 -57 53 -65 -22 -134 131 68 -217 -192 34 -189 -77 -156 -39 -60 -73 -221 -120 148 -141
7379a41K8J3K05j59J3K74j32o8J31m21M34o9J77k05Q6j62q6j02L98L8j12j60o
$$ -141 -113 -100 105 -54 -41 233 101 33 164 -257 177 108 285 80 166 4 -82 -184 214 252 140 -20 -26
7402b6P0k3o9N9m9Q8k31J61J51k43l1M1m1o6J06j10L12l36M37j26k20K86%l19
$$ -26 44 21 -48 11 -38 50 -181 -20 131 -112 -143 -102 -143 -209 -103 -213 99 -237 200 74 -146 140 140 -179
7426a79J64Q5j45K08k49Q3L9j15j26J82M7L17k04k54N3K5L61k89j56K99j96J30
$$ -179 -15 70 -75 133 -116 -33 6 -109 -235 -53 -6 311 107 -147 -94 -69 292 3 -153 146 -50 80
7448H0k32J87N7j68K22K9k94K99j39NK50l31J68j23J12j20l77L79k9j08O2j39
$$ 80 -152 35 92 -76 146 175 -119 180 41 46 296 -35 133 10 122 2 -375 4 -25 -133 -71 -210
7470b10K44J32j48o6K15k93J63Q2r3R1k40J37l5l5nK23j66O0Q4k65J06J83k57
$$ -210 34 166 18 -48 167 -126 37 119 26 117 -123 14 -21 -56 -61 162 -4 56 140 -125 -19 164 -93
7493i3K81Q1j37j50r1K18j02k32J48p7J25J9j68M04l19J68J33k22M8k16Q9k3J18
$$ -93 188 269 132 -18 -109 109 7 -225 -77 -154 -29 -10 -178 226 -93 75 208 -14 34 -182 -93 -116 2
7516BR4j53J22J27k45K26N3l63J80M4j30K84k42K56j36n0J7Pj61Q4K15k57p3J14
$$ 2 96 -57 65 192 -53 173 226 -137 43 87 -43 241 -1 255 119 69 86 93 -68 16 231 -26 -99 15
7540A5j26N8L3J8P3J01j88K34k86K57l2K22m56LJ51R1k16p2K03K26k17Q3j69j01
$$ 15 -111 -53 -20 -2 71 172 -16 218 -68 189 157 379 -77 -74 77 168 -48 -120 83 309 92 175 6 -95
7564i5m2o6K08Jl3j39oL37n4k52K72oj80J33j48k6K09j45K36n3k00J19R8j62j1
$$ -95 -137 -203 5 6 -27 -166 -172 165 111 -141 131 125 -55 78 -70 -96 113 -32 204 151 -49 70 168 6 -5
7589eJ36l7J1j22K05k62r8j05K69J81Q5k04Q1l21J43m0J53Nl01L68j04Pp2j12
$$ -5 131 94 105 -17 188 -74 -172 -277 -8 173 258 54 135 -186 -43 -83 70 75 -226 142 38 45 -27 -139
7613a39J73kJ35q2N1P8j64N0P7j69k82N10j33j36M5j7m1J39q6j7R0k89O0L23m36
$$ -139 34 32 167 85 136 214 50 100 177 8 -274 236 103 -33 12 -5 -46 93 7 -10 80 -209 -149 174 -262
7638b62J13n3K27J65k42LN5j3k19K49M5J1j6l97M13q8J24k34K36k07K53l79J56
$$ -262 -149 -202 25 190 -52 -49 6 -7 -226 23 68 79 63 -334 79 -9 115 -119 117 -90 163 -216 -60
7661f0j79Q0L11j63J25l87L41m2j20J18j79J23j85L72j36m5J26j0J80rk47K58
$$ -60 -239 -159 152 -11 114 -273 68 26 -94 24 -155 -32 -217 155 19 -26 100 90 270 261 14 272
7683B72m9j91o3j18M8K68Rj51r1P5M9k25J29J0M2J08o8O0K19r3k37O5K0M2k18
$$ 272 223 32 -31 -149 -101 167 176 25 -66 9 58 -167 -38 -28 14 122 54 114 333 240 3 68 88 130 -88
7708h8K57j0l22K88j33J99K0j32j88J44k08%M08l88OR7L10l00p2K8K26p3m47O00
$$ -88 169 159 -163 125 -8 191 211 79 -109 35 -173 -173 235 -153 -147 -50 260 -40 -112 -84 142 69 -378 222
7732B22k84j17J8K05q6QR8k09J43j1l3M5r6P0l4J77k6o6K64n0k13o6k20K13K05
$$ 222 -62 -179 -161 44 -42 -34 64 -145 -2 -13 -46 -1 -97 -27 -61 116 90 24 288 238 25 -41 -261 -48 157
7757A57j19M3j46N0L3Q8J47o2n7k41P1R3N3pj04N1l7J85l68L15o4j1k8k26J36
$$ 157 38 81 -65 -15 18 106 253 191 134 -107 -36 57 110 103 -1 50 13 198 -170 145 81 70 42 -184 -48
7782d8P4k28J16LJ66j15J74j34j63J13J63j60K91k78lN9N0p3j27L7R2j2L23j96
$$ -48 26 -202 -86 -83 83 -32 142 8 -155 -42 121 -39 252 -26 -29 30 80 7 -120 -83 9 -3 320 124
7806A24l28J25K40j91j7J5j45K10J62l81L54j22Q5m04J92K10l07j49K37J91K0
$$ 124 -204 -79 161 -30 -47 -32 -177 33 195 -186 168 46 131 -273 -81 129 -178 -327 -90 101 121
7827A21r4m0r8L75n69L09J53j41j7q7J9J94m6Pp6J57L0k56K63j98M3k13N0LJ04
$$ 121 27 -13 -111 264 -305 4 157 16 -1 -88 -69 125 79 86 10 167 197 -59 204 6 49 -164 -114 -111 -7
7852goj21J52p0n0j16N32j96r1M5j51J59j07O0j53K27k89K40J96J4l15N6P2j44
$$ -7 -13 -134 18 -52 -102 -218 314 118 27 72 -79 80 -27 33 -120 107 -182 58 254 268 -47 9 81 -63
7876f3p0K74L2k45KO6K3j42oJ95j67K30k37j18M21l25J80l5j15M5M2j2j79N6K08
$$ -63 -133 141 173 -72 -70 -4 19 -123 -129 66 -101 129 -108 -226 195 -130 50 15 -100 -55 -13 -25 -204 -148 60
7901F0j87P4P6J21k56J78m4j08l4L58k33k2j95L08j68j28K27P1L3p7K4j60j13
$$ 60 -127 -53 23 144 -112 66 22 -86 -120 238 5 -17 -212 96 -72 -200 27 98 131 54 78 -82 -195
7924a95J57K45P5j99%m3j28L0j3P7J0j53L09j63J89k06R1j37Q4L9j02P3j2q4o2
$$ -195 -38 207 282 83 83 40 -88 -58 -71 6 16 -137 172 9 198 -8 83 -54 30 69 -33 40 28 -56 -118
7949a18Qq9J91J43n1j0Nk92J87J94l35J33q3J14M1J4j61P9m5j30L65j83MR9J27
$$ -118 -110 -199 -8 135 84 74 79 -213 -26 168 -167 -34 -117 -3 38 52 -109 -30 -75 -205 160 -23 -19 80 207
7974B07j91QK5k18J26K17l69K75j20j37J76q6j68K50n7J96J6r7J20j0q2k21K63
$$ 207 16 24 49 -169 -43 174 -195 80 -40 -177 -1 -87 -255 -5 -62 134 150 53 173 163 81 -140 123
7997A23j96K30j60M5J42k05J4lj02J63j58n5j61K91r4K25J8j83O5J8m18M46j87
$$ 123 -73 157 -3 42 184 -21 -7 -10 -112 51 -107 -162 -323 -32 -126 99 117 -66 -1 17 -401 45 -142
8020a42J16K3q7L1P8j7jj68K63J51k40L56l25j97L45P3j09k78K59R6k1K4j9m93
$$ -142 -26 -3 -90 -59 19 2 1 -167 96 247 7 363 38 -159 186 259 150 -128 131 227 206 230 211 -282
8044b82j6J54j02L07j79L8R4l0J66k33lj55M14l01K50l01j76M68L4J04l44K27
$$ -282 -298 -144 -246 61 -118 -80 14 -16 150 -83 -86 -241 173 -128 122 -179 -355 113 147 251 -93 134
8066A34j65J83M3O0l31L1n9J24J86q2j13j26J07n6K9j18L02j02r6K18o9k65K09
$$ 134 -31 152 195 255 -76 -45 -104 20 206 124 11 -115 -8 -64 -35 -153 149 47 -49 169 100 -165 44
8089D4l7K54j17j82m6K86j96Q4jk87J23J65k23p8L0J43N1j59K72k90L45j26O7
$$ 44 7 261 144 -38 -84 202 6 90 89 -198 -75 90 -133 -211 -181 -38 13 -146 126 -164 181 55 122
8112A22j82R6j73J47r0P1R3k04K60k77Q5K81k58j62K15j4Q9j30l9J59r3L4ooJ13
$$ 122 -60 36 -137 10 -80 -9 84 -120 140 -137 -52 229 -29 -191 24 10 99 -31 -70 89 -4 30 24 18 131
8137A31jk49J53j7P6O8l34L54l26Q1J08k21J54j27J75j70L18p1l6P9l32N15j12
$$ 131 130 -119 34 17 93 161 -173 181 -145 -64 44 -177 -23 -150 25 -145 173 102 66 145 -187 328 216
8160B16j38o5K4J33j13L9p3P6j31m0Q7k08j51K28n2M26k95k9K69l37L73m16L49
$$ 216 78 13 37 170 57 96 23 99 -32 -72 15 -193 -344 -116 -168 258 -37 -66 203 -134 239 -177 172
8183A72k23J93j77j70J91j6P3j43
$$ 172 -51 142 -35 -205 -14 -30 43 -100
8191a00
$$ Imaginary data points
##PAGE= N=2
##DATA TABLE= (X++(I..I)), XYDATA
0@%%%%%%%%%%Qj6J6j6K4l2M0m8N6p2Q8j04J21j45J76k08K40k74L15l63M17m78
$$ 0 0 0 0 0 0 0 0 0 0 0 8 -8 8 -8 16 -16 24 -24 32 -40 48 -56 65 -80 96 -112 128 -146 169 -194 223 -255
32b55N44o16O96p85Q84r92J110j239J379j534J706j892K093k312K553k817L105
$$ -255 289 -327 369 -416 468 -524 586 -653 726 -808 898 -994 1099 -1213 1340 -1477 1628
49A628l421L767m152M578n047N572o163O830p594Q479r516J0748j2240J4099j6486
$$ 1628 -1793 1974 -2178 2400 -2647 2925 -3238 3592 -4002 4477 -5039 5709 -6531 7568 -8918
64h918J9676k4183L1076m3063O9708k35765J27753M39348l47557k73242J79821
$$ -8918 10758 -13425 17651 -25412 44296 -191469 -63716 375632 28075 -245167 -65346
75f5346K31925j49834j17005M9263P2561J9576O1605p3379j63050K8464K44660
$$ -65346 166579 16745 -100260 -50997 21564 41140 102745 29366 -133684 -105220 139440
86A39440K3615k28405o3419K02949N1104j69679o0129J26490N1818m9674l3441
$$ 139440 163055 -65350 -128769 74180 125284 -44395 -104524 21966 73784 24110 -9331
97i331l6437l7369Q9423R7322r7244j24644R6116J07044j00396q5754J02551O7240
$$ -9331 -45768 -83137 6286 103608 6364 -118280 -22164 84880 -15516 -101270 1281 68521
109F8521o6403k3324K9744l7263q149R6197K1040j10216k2844J01989K16j03769
$$ 68521 2118 -21206 8538 -28725 -36874 59323 80363 -29853 -52697 49292 49508 -54261
121e4261K6043J12005m1863j07720N4870P6435r7245n7130J44011N2794j77046
$$ -54261 -28218 83787 41924 -65796 -10926 65509 -31736 -88866 55145 107939 -69107
132f9107o1697J71546M8953j56260k2643J46191R053j24420j977Q5157n622k9587
$$ -69107 -130804 40742 89695 -66565 -89208 56983 66036 -58384 -60361 24796 19174 -10413
144a0413L6174l404o0050J7643O8732k2125n6990L9212N1521n3791n4878M7517
$$ -10413 25761 22357 -37693 -20050 48682 26557 -30433 8779 60300 6509 -48369 -852
156h52M1594m0107j6446L9152j6964n4359K7830N4106l2322l7713M0836J6776
$$ -852 40742 635 -15811 23341 6377 -47982 -20152 33954 1632 -36081 4755 21531
168B1531n5766p804N7332L757l9703J6353K9482l5575k4086M8763K6109l9480
$$ 21531 -34235 -42039 15293 19050 -20653 -4300 25182 -10393 -34479 14284 40393 913
180I13j0718L2960j1815l4004K8240L3136l6569k3333M6886N492p0940k873Q5577
$$ 913 -9805 23155 11340 -22664 5576 38712 2143 -21190 25696 31188 -39752 -42625 42952
193D2952O162q9850j2343P4470M032o3071M194N3066k611l4107J504Q455n356
$$ 42952 49114 -40736 -53079 21391 25423 -37648 -33454 19612 17001 -17106 -15602 -7147 -12503
206a2503J7568K1805k4834k7584K7674K7856k9747k1139L8235K2737l7577k2116
$$ -12503 5065 26870 2036 -25548 2126 29982 235 -20904 17331 40068 2491 -19625
218a9625K6115P256j9413R677J6654k5980k0596K8504J2530l3101m396L8061k48
$$ -19625 6490 13746 -5667 4010 20664 -5316 -25912 2592 15122 -17979 -22375 15686 15438
231A5438m1885l258L3487L397j7560O038J1010j1071n040J4035K562q381J1207
$$ 15438 -26447 -29705 3782 7179 -10381 -4343 6667 -4404 -9444 4591 7153 -1228 9979
244I979J0788k0698j6370K4084J7781k3077j1837K5481L803l3444m697L1573J572
$$ 9979 20767 69 -16301 7783 25564 2487 -9350 16131 19934 -13510 -18207 13366 14938
257A4938k5828J728J4085j2941j1787J6217R652j3608j715J1241o050j1584J1117
$$ 14938 -10890 -9162 4923 -8018 -19805 -3588 6064 -7544 -9259 1982 -4068 -15652 -4535
270d535J5627p875r963Q837N627j0348O89J5966M22j3734K858Q833j1457j0202
$$ -4535 11092 3217 -6746 2091 7718 -2630 -1941 14025 14447 713 3571 12404 947 -9255
284i255J7526J0524k1059j1380J6496L609j7772P87J6912k359j6149J58P491k203
$$ -9255 8271 18795 -2264 -13644 2852 6461 -11311 -10524 6388 4029 -12120 -11962 -4471 -6674
298f674M30P322j122o767L873O202n033k451J2730O939j3651r397J1729R135r487
$$ -6674 -6244 1078 -44 -6811 -2938 3264 -1769 -4220 8510 15449 1798 -7599 4130 13265 3778
313C778l711J0428k1j2650o55Q170m022m722O693q71j2731j394J1124j43p649
$$ 3778 67 10495 10474 -2176 -2831 5339 1317 -3405 3288 2417 -10314 -11708 -584 -727 -8376
328h376L338O193n317o153M674O541q27o83K795j563l546M438O785j841l462M132
$$ -8376 -5038 1155 -4162 -10315 -5641 900 73 -610 2185 622 -2924 1514 8299 6458 2996 7128
344G128K689q448n050R438M258q315l491M412j959o461K159M883k238l246K02
$$ 7128 9817 1369 -3681 5757 10015 1700 -1791 2621 662 -5799 -3640 1243 -995 -4241 -4039
359d039k761k607M499M786k436l156K572L676j869j217M082M629j589k753L56
$$ -4039 -6800 -9407 -4908 -122 -2558 -5714 -3142 534 -1335 -2552 1530 6159 4570 1817 2173
374B173L47m5M143L296n445n432M513L745o681m609N109L814n732o055j073K998
$$ 2173 2520 2475 6618 9914 4469 -963 3550 7295 614 -3995 1114 4928 -804 -6859 -7932 -4934
390d934M881M48o715k896O217M392n002n537N092Q955P17r131l250Q792Q659k445
$$ -4934 -53 395 -6320 -9216 -2999 1393 -3609 -9146 -4054 4901 5618 -3513 -6763 2029 10688 8243
406H243o782j032M443L046k340o107p33P458L062r407p785M187P479j27o673n077
$$ 8243 1461 429 4872 7918 5578 -529 -1262 6196 9258 -149 -7934 -3747 3732 3605 -3068 -8145
422h145J130N949J06o154k296O522O254k930p395j90Q397O876l707p725P24P608
$$ -8145 -7015 -1066 -960 -7114 -9410 -2888 3366 436 -6959 -7149 1248 8124 4417 -3308 -2584 5024
438E024L556m077m688N97P260L891p984j0125L628J1420K69j2274p033N498R385
$$ 5024 8580 4503 -185 412 7672 11563 3579 -6546 -2918 8502 8771 -3503 -10536 -5038 4347
453D347q60j1591m978J0548J0104p947j3956K350J5662O143j2051j0258P974J5126
$$ 4347 3487 -8104 -13082 -2534 7570 -377 -14333 -11983 3679 9822 -2229 -12487 -4513 10613
467A0613r60j2762j832J1396O571o233r834j157R779P356p163j2436J181J1897
$$ 10613 9653 -3109 -4941 6455 13026 6793 -3041 -4198 5581 12937 5774 -6662 -5481 6416
481F416J320j0851n860N976O379l132q000k391N683N617j708m733j227L982M594
$$ 6416 7736 -3115 -8975 -2999 3380 248 -7752 -10143 -4460 1157 -551 -5284 -6511 -2529 2065
496B065M93l821j894M418M319j364l401o01L229L934O55o397m159M877N311l381
$$ 2065 2558 -1263 -3157 1261 5580 4216 815 214 3443 7377 8032 1635 -2524 2353 7664 4283
512D283p012j829L416M232j766q726l397J0731Q315j0630j3981O985J6944j745
$$ 4283 -2729 -4558 -1142 3090 1324 -7402 -10799 -68 8247 -2383 -16364 -9379 7565 5820
526E820j5691k208J4881P509r739p707O765Q579k44n198l666P62N486M618o513
$$ 5820 -9871 -12079 2802 10311 572 -7135 -370 8209 7965 2767 -899 -137 5349 9967 3454
541C454r803N094J1585l499j3276n89J1096P36j0052m183N749M795k835l249o09
$$ 3454 -6349 -1255 10330 6831 -6445 -7034 4062 4798 -5254 -9437 -3688 1107 -1728 -4977 -5586
556e586K865J449k44j95L73J235J331P28o01j079O82L239J358j642j376K26L95
$$ -5586 -2721 -1272 -1516 -1711 -1338 -103 1228 1956 1355 276 958 4197 5555 3913 2537 2763 3158
573C158p9l27o34k706j063L206R19o333m500P118P224q326j0720P780J1721o306
$$ 3158 3079 2752 2118 -588 -1651 1555 2474 -3859 -8359 -1241 5983 -2343 -13063 -5283 6438 132
589A32j1941N249J1917k802q943L510P538j57l294O37L76q94K534K485l905l826
$$ 132 -11809 -6560 5357 2555 -6388 -2878 4660 4503 1209 1846 2222 1328 3862 6347 2442 -1384
605a384L783M558m617o497L305O582l811q022J102N399j614n039J557L716n54
$$ -1384 2399 6957 2340 -4157 -852 5730 1919 -6103 -5001 398 -1216 -6255 -4698 -982 -1536
620a536k319J1J532K326L93k698j9M470J513l051j246L556K636r91k522j271J553
$$ -1536 -3855 -3844 -2312 14 407 -2291 -2310 2160 3673 622 -624 2932 5568 4577 2055 784 2337
637B337L535j323o740r82P034O88p972l776O886N369o374q087L293Q370j981p027
$$ 2337 5872 4549 -2191 -3173 3861 4549 -3423 -7199 -313 5056 -1318 -9405 -6112 2258 277 -6750
653f750R05O413j69l056R16J528L66L015J904m273k682N410L205m274l011K702
$$ -6750 -5845 568 399 -2657 -1741 -213 153 3168 5072 799 -1883 3527 6732 2458 -553 2149
669B149L054j746k864j243J405J411j448l105p35J002P13r48j653J11J945R34
$$ 2149 5203 3457 593 -650 755 2166 718 -2387 -3122 -2120 -1407 -2355 -4008 -3897 -1952 -1018
685a018k187p54K528J650j364K00J059P2N68K460l46j178J446O80j150m59L90
$$ -1018 -3205 -3959 -1431 219 -1145 -945 114 186 754 3214 2868 1690 3136 3816 2666 2207 2597
702B597j145j93J031j129l106K23K341m76k511o47R87L93j638q48J310J299q46
$$ 2597 1452 1259 2290 1161 -1945 -1722 619 143 -2368 -3015 -2028 -1635 -3273 -4121 -2811 -1512 -2358
719b358m61J583J136k84K07J786j32m49J173M96j053M89J130m89o55K89m81j258
$$ -2358 -2819 -1236 -100 -384 -177 1609 1477 1028 2201 2697 1644 2133 3263 2774 2119 2408 1927 669
737F69R53k55k239r21P78j10j241q25O86P12j79p60j88J439N09q59M61J367L02
$$ 669 1622 1367 -872 -1793 -1015 -1125 -2366 -3191 -2505 -1793 -1972 -2732 -2920 -1481 -972 -1831 -1370 -3 299
756B99l38M48J297R70M87l73p66M63O68j100o79M70J78j132o62l19k97p41O13
$$ 299 -39 409 1706 2676 3163 2790 2024 2487 3155 2055 1376 1846 2024 892 230 -89 -386 -1127 -514
775e14q51j322j5K68j76k19j71L92J486o4q07J571J777m37q02J028R88K32l71
$$ -514 -1365 -2687 -2702 -2434 -2610 -2829 -3000 -2608 -1122 -1186 -1993 -422 1355 918 116 1144 2132 2364 1993
794A993j45L94J084j39j355m89N70J81j574j176L8K19p88j530L81R05n48n83n9
$$ 1993 1848 2242 3326 3187 1832 1343 1913 2094 520 -656 -618 -399 -1187 -2717 -2336 -1431 -1979 -2562 -2621
813b621P41P6l80L62O06M98N25M01k28R68J751R6j113O20M85k93n10j08l6n75
$$ -2621 -1880 -1804 -2184 -1822 -1216 -718 -193 208 -20 948 2699 2795 1682 2302 2787 2494 1984 1876 1840 1265
833A265j77l67l27o85j62l86m76n66m93L21o54k22O65N98lj16J233L28k97P55
$$ 1265 1088 721 394 -291 -453 -839 -1315 -1881 -2374 -2053 -2707 -2929 -2264 -1666 -1669 -1785 -552 -224 -521 234
853B34Q52m8j26O40M82PJ10L88k91J08n5m34j461k03Q73o33k099o08J429L84j611
$$ 234 1086 1038 912 1552 2034 2041 2151 2539 2248 2356 2301 1867 406 203 1076 443 -1656 -2264 -835 -451 -2062
874b062p94J045N53j036j01O87j63L24J036J92m69J346J735n88j007J436J005
$$ -2062 -2856 -1811 -1258 -2294 -2395 -1708 -1871 -1547 -511 -319 -788 558 2293 1705 698 2134 3139
891C139q69r70Q65p6o88J68M7q74j105J136J43k164j303J271O51j912p78J740
$$ 3139 2270 1300 2165 2089 1401 1569 1616 742 -363 773 916 -1248 -2551 -1280 -629 -2541 -3319 -1579
909a579J41j072N73J456j020m30K140J416k213m58K655R85j561k33J938M74j412
$$ -1579 -1438 -2510 -1937 -481 -1501 -1931 209 1625 -588 -1046 1609 2594 1033 800 2738 3212 1800
926A800n47Q01l8p99m52j77q95n59O05l53j307n6P56l02j112P29J23k42O78N28
$$ 1800 1253 2054 2016 1217 765 588 -307 -866 -261 -614 -1921 -1977 -1221 -1523 -2635 -1906 -1783 -2025 -1347 -819
946h19q02K73K221J12j245J403J828j401j540K444J411k709j710L104J452l340
$$ -819 -1621 -1348 873 985 -260 1143 2971 1570 30 2474 3885 1176 -534 2570 4022 682
962F82k196K954J311l409j517K015k09k440L67K276k076k028L250K060l933j433
$$ 682 -1514 1440 2751 -658 -2175 -160 -369 -2809 -2442 -166 -2242 -4270 -1020 1040 -2893 -4326
978d326N116J770m268r81M401J036k734m69K832Q21j198l87M81l28k87N57o16
$$ -4326 790 2560 -1708 -2689 1712 2748 14 -455 2377 3198 2000 1613 2094 1766 1479 2036 1420
995A420j735o26Q67O51j196j003L45o7J15l61j162j92J870O24j731P7K499j50
$$ 1420 -315 -941 -74 577 -619 -1622 -1277 -1344 -1229 -1590 -2752 -2944 -1074 -450 -2181 -2104 395 245
1013B45j316J854J813k161n81L028O81l940k16N286j0n593l01M724k38m652p60
$$ 245 -1071 783 2596 435 -146 2882 3563 -377 -593 4693 4683 -910 -1211 3513 3275 -1377 -2137
1030b137L545m36l287K83J256k231l57L817n06m243R16N251p06m998J146N284
$$ -2137 1408 972 -2315 -2032 -776 -3007 -3364 453 -53 -4296 -3380 1871 1165 -3833 -2687 2597
1046B597m26l757Q05L156L21j246L67K02q89R49R98k015j745J531J227k489j598
$$ 2597 2171 -1586 -781 2375 2696 1450 1817 2019 1130 2079 3077 1062 -683 848 2075 -414 -2012
1063b012J381Q23j319j44j39j358L1J949j37k489Q22L331l96k796J663K580j197
$$ -2012 -631 192 -1127 -1271 -1410 -2768 -2737 -788 -925 -3414 -2592 739 343 -2453 -790 1790 593
1080E93q07K498J19k767Q48L407j122l637J513L522j928l648R77K728j853k344
$$ 593 -214 2284 2403 -364 484 3891 2769 -868 645 4167 2239 -1409 -432 2296 443 -1901
1096a901J075K38k220N88K634k137k434K917K702l321k267L934K558l307j337
$$ -1901 -826 -588 -2808 -2220 414 -1723 -4157 -1240 1462 -1859 -4126 -192 2366 -941 -2278
1111b278K943J056j127L39J598j312m80K403k02l036k95K996k00l215k48K051
$$ -2278 665 1721 594 933 2531 1219 739 3142 2940 -96 -391 2605 2405 -810 -1058 993
1127I93l93k789R45J533j684j228J978n34k619J443K572j247j767K769J932k532
$$ 993 600 -2189 -1244 289 -1395 -2623 -645 -1179 -3798 -2355 217 -1030 -2797 -28 1904 -628
1143f28n90K707Q04k397P80K421j207j691J537J595k652j128K102M75k412q95
$$ -628 -1218 1489 2293 -104 676 3097 1890 199 1736 3331 679 -449 1653 2128 -284 -1179
1159a179J931p37k532J067J671k069j563K783Q69k842m84L151J71k337R19K922
$$ -1179 752 15 -2517 -1450 221 -1848 -3411 -628 241 -2601 -3085 66 237 -2100 -1181 1741
1175A741j387j374K203J585k051j54K754m04k543K83K193j643j861J343J073j856
$$ 1741 354 -1020 1183 2768 717 563 3317 2913 370 653 2846 1203 -658 685 1758 -98
1191i8j359J897k59k078j87J926r53k139J426J762j737j031K608J001j988k5K897
$$ -98 -1457 440 181 -1897 -2084 -158 -1111 -3250 -1824 -62 -1799 -2830 -222 779 -1209 -1234 1663
1208A663o41j817J437J979j474j308K056J152k016o27J864n18k068N15J158j860
$$ 1663 1022 -795 642 2621 1147 -161 1895 3047 1031 404 2268 1750 -318 197 1355 -505
1224e05j544J410P66k439j40K085m37j827Q32J951j257j435J436J626j281q3K217
$$ -505 -2049 -639 127 -2312 -2452 -367 -804 -2631 -1799 152 -1105 -2540 -1104 522 -759 -842 1375
1241A375M58j877P35J846m34j939R73J935k304r05J348M24j842M4J166j128j694
$$ 1375 1833 -44 691 2537 2103 164 1137 3072 768 -137 1211 1635 -207 -163 1003 -125 -1819
1258a819J050J077k235j131J872N43j872K78J831L4j174P12J808r78n22J427P20
$$ -1819 -769 308 -1927 -3058 -1186 -643 -2515 -2237 -406 -372 -1546 -834 974 -4 -526 901 1621
1275A621j166j0J790J02j739K69J643q30j569Q59M14j550q65J115k79j605N74
$$ 1621 455 445 2235 2337 598 867 2510 1680 111 970 1384 -166 -1031 84 -195 -1800 -1226
1292a226J040j002r39Q64P37r99n48J393K71j170P99J312O3p59P50J229n51n71
$$ -1226 -186 -1188 -2127 -1263 -526 -1525 -2073 -680 -409 -1579 -780 532 595 -164 586 1815 1264 693
1310F93J068N55j336K5P43l72j429O21M98j281p39J083j32j594k78J272n13j135
$$ 693 1761 2316 980 1005 1748 1376 -53 568 1066 -215 -954 129 -3 -1597 -1875 -603 -1116 -2251
1328b251O22R97n97l87J029O69m23j76J276j20p26O38J115k37o59O56Q13q46n58
$$ -2251 -1629 -632 -1229 -1616 -587 82 -341 -517 759 639 -87 551 1666 1429 770 1426 2239 1393 835
1347H35N08r6j012k74M78m19q34j15N14n69n65M13J17n24j1N37l85j03O65O29
$$ 835 1343 1247 235 -39 439 20 -814 -929 -415 -984 -1549 -1136 -1019 -1543 -1554 -1017 -1402 -1505 -840 -211
1367b11q7J80R16K07k51JM16J46M7l75N39l99o8L43m23p21J7L34n72j293L90J92
$$ -211 -298 -118 798 1005 754 755 1171 1317 1364 989 1528 1129 1061 1404 981 260 277 611 39 -1254 -864 -672
1389f72m78o29M49L68k71j81N11K34j55J51N22p4K27K05R32j68l54K61Q49L52
$$ -672 -1150 -1779 -1330 -962 -1233 -1414 -903 -669 -824 -673 -151 -225 2 207 1139 971 617 878 1727 2079
1409B079o75o70L12K05m58m92k59L7j18j88o16M9k52l85K36R0o58K17N08K54m59
$$ 2079 1404 734 1046 1251 793 301 42 79 -39 -227 -843 -794 -1046 -1431 -1195 -1105 -1763 -1546 -1038 -784 -1243
1430a243K9J409O77n75j8M73N63j82k71K28J27O7q6k40K16k67j63J99q67q08R8
$$ -1243 -1214 195 872 297 279 752 1315 1133 862 1090 1217 1284 1198 958 1174 907 744 943 76 -732 -634
1451f34O40n49j100l14J309l91o46J12R30M03q94j1J108K24m17L02J128r8o17
$$ -634 6 -543 -1643 -1957 -648 -1039 -1685 -1573 -643 -240 -1134 -1145 -37 187 -230 72 1200 1102 485
1470D85N05J332q85j219J145Q69j436j037M56R85r96j118P10j03m74l15JK06q09
$$ 485 990 2322 1437 218 1363 2232 796 -241 215 1200 204 -914 -204 -307 -781 -1096 -1095 -889 -1698
1489a698j7R92L6r23n3J898L28j199j7J818K58j022K16O11M47n29n72L20L22k4
$$ -1698 -1715 -723 -687 -1610 -1663 235 563 -636 -653 1165 1423 401 617 1228 1675 1146 574 894 1216 1192
1509A192m11K80K4j059p09R53k85j363j00J230l09j648K83J860n68j087L54J428
$$ 1192 781 1061 1085 26 -683 270 -15 -1378 -1478 -248 -557 -2205 -1922 -62 -630 -1717 -1363 65
1527F5l31n44P34R44m12m32R60R69n85p04J014N01j363j182J287N80j376m86R04
$$ 65 -266 -810 -76 868 456 24 984 1953 1368 664 1678 2179 816 -366 921 1501 125 -361 543
1546E43l52j082R6M04m59p92O00K02m93l24L21N27K61J00J27N94N26o61p0J021
$$ 543 191 -891 -795 -391 -850 -1642 -1042 -840 -1333 -1657 -1336 -809 -548 -448 -321 273 799 138 68 1089
1566A089rj71k33O11k9k56k00M2n2n39k86L67k70p41l56O36k53j406M24J171J79
$$ 1089 1080 909 676 1287 1258 1002 802 844 792 253 -33 334 64 -677 -1033 -397 -650 -2056 -1632 -461 -282
1587b82j413O37R18r04j93J160L21k79O6J222K22j008L1R60K75j002j41O41l1
$$ -282 -1695 -1058 -140 -1044 -1237 -77 244 -35 31 1253 1475 467 498 1458 1733 731 590 1231 1200
1606A200j222K9O31l33r66L34L01j042k50P42l29q71O08L83N8n42N47N04l89P54
$$ 1200 -22 7 638 305 -661 -327 -26 -1068 -1318 -576 -905 -1776 -1168 -785 -727 -1269 -722 -218 -607 147
1626A47J90j0K14L10r3j65K73O5K36l74M45r6l71m59K4o7n99k82L82k6j021K36
$$ 147 337 327 541 851 758 593 866 931 1167 793 1238 1142 771 312 336 269 -330 -612 -230 -256 -1277 -1041
1648a041O74o39n35P30M01p84M7P16K71n06M49Q71j17j63N10O39m62m36L55N02
$$ -1041 -367 -1006 -1541 -811 -410 -1194 -1147 -431 -160 -666 -217 654 537 374 884 1523 1061 625 980 1482
1668A482o47k28J33P6m89n16O55k94j030M2M31k27r42O70J27q20L00P54j78K4
$$ 1482 835 607 740 816 327 -189 466 172 -858 -816 -385 -612 -1554 -884 -757 -1577 -1277 -523 -701 -677
1688f77M18M93m94L41O49j05l43K00Q04k40j09K3K03k23k21k53l8l91l78M41p81
$$ -677 -259 234 -260 81 730 625 282 482 1286 1046 937 960 1163 940 719 466 428 37 -341 100 -681
1709f81k63R2Q04o10l93K50K39q44K63Q15J33n57m5R82J6R6J37P32l56q8M66j17
$$ -681 -944 -852 -48 -658 -1051 -801 -562 -1406 -1143 -328 -195 -752 -797 185 201 297 434 1166 810 722 1188 1071
1731A071j95k55L68jn24j35L29l62o07N9m5n12k14J08j38l79L44K22j02J21K53
$$ 1071 876 621 989 988 464 329 658 296 -311 -252 -297 -809 -1023 -915 -1053 -1432 -1088 -866 -968 -847 -594
1752e94M34j27K21L7L95k02R6N00O4k37N21j19k00k26N99j39p55l24M07l95o52
$$ -594 -160 -287 -66 -29 366 164 260 760 824 587 1108 989 789 563 1162 1023 268 -56 351 -44 -696
1773f96L27J90o47j21M28j24o30K17L36m0p3N80L68m84M69K69M34k24l14P28o1
$$ -696 -369 -179 -826 -947 -519 -643 -1273 -1056 -720 -760 -833 -253 115 -369 100 369 803 579 265 993 932
1794I32k70k0M47l54l35M09L00j145j42L82k09o43k57N04n67l34L77J68k80j10
$$ 932 662 642 1089 735 400 809 1109 -36 -178 204 -5 -648 -905 -401 -968 -1302 -925 -757 -1037 -1147
1814a147N81J01n8L13L39j5q7J92N02j14k85Q06R5l25k78O65k51o53J51n8n61
$$ -1147 -566 -465 -523 -210 129 114 27 219 721 607 322 1128 1223 898 620 1285 1034 381 532 474 -87
1835h7j47J28J09m18l91R5P4m24J80K10j98j90L28K58l5L31N43J6K6m0O35k50
$$ -87 -234 -106 3 -415 -806 -711 -637 -1061 -881 -671 -869 -1059 -731 -473 -508 -177 366 382 408 368 1003 753
1857G53l8M17n9j92l58L13j15k67o4J30m06n24j0K24q36J8J39K17J7j47K13k73
$$ 753 715 1132 1073 881 523 836 721 454 390 520 114 -410 -420 -196 -1032 -1014 -875 -658 -641 -788 -575 -848
1879h48k9M24L63j0l48L95L68j79K85O31m9m22K31M95k75m90J31N2n47m38L51
$$ -848 -877 -453 -90 -100 -448 -53 315 136 421 1052 1003 581 812 1307 1032 542 673 725 178 -260 91
1900I1j41n16k20L54j72k67j08J71j32m1M27K2k54M95nL21p4M16J41Q2K08o9J74
$$ 91 -50 -566 -786 -432 -604 -871 -979 -808 -940 -981 -554 -532 -786 -291 -296 25 -49 367 508 590 798 729 903
1923I03k84J15L10l41mJ23k64j16l09j71j76m33K7k7o7m9L5O4l52L41K97J8k07
$$ 903 619 734 1044 703 699 822 558 442 133 -38 -214 -647 -620 -647 -714 -763 -728 -664 -1016 -675 -378 -360 -567
1946e67k80R60J05r5J07M39J60l15N80j15qrO3l39k16k20K19k89l23l22K71m34
$$ -567 -847 113 218 123 230 669 829 514 1094 979 971 962 1025 686 470 250 469 180 -143 -465 -194 -628
1968f28k7l2Mj30k94J82J85J6l9K74L58R1Q5K26L45q5k16L21P8J01j04J26M8J07
$$ -628 -655 -687 -683 -813 -1107 -925 -740 -724 -763 -489 -131 -40 45 271 616 531 315 636 714 815 711 837 885 992
1992I92k73m09J08j14n39rj21j57k4J48n03P7j04K14M7k05M77j48K07K92k4j23
$$ 992 719 310 418 304 -235 -244 -365 -522 -546 -398 -901 -824 -928 -714 -667 -872 -395 -543 -336 -44 -68 -191
2014a91K63M77q8K36N8k4j61l4P1L3l32J68j2k33k39k92M68l11l68m7q8k06m54
$$ -191 72 549 461 697 755 731 570 536 607 640 308 476 464 231 -8 -300 168 -143 -511 -558 -646 -852 -1306
2037a306J94R25n91J6M65K33m62L11N74%o38Q27M78l75j50N15P6n84J67J47j83
$$ -1306 -1112 -187 -778 -762 -297 -64 -526 -215 359 359 -279 548 1026 651 501 1016 1092 508 675 822 639
2058F39p0m53P7k48k37R3k68n1j75J25J39j48l32K84J16k9J44M03l91L19M57J39
$$ 639 569 116 193 -55 -292 -199 -467 -518 -693 -568 -429 -577 -909 -625 -509 -538 -394 9 -382 -63 394 533
2080E33l32O01K01k77o0k3K62n53r5L96l31j36P8K1m14o10K59R3l04j64K53J03
$$ 533 201 802 1003 726 666 643 905 352 257 653 322 186 264 285 -129 -739 -480 -387 -691 -855 -602 -499
2102d99m30p6Q80j96l00L88L87N0k52K66L11k52K8O12k7m11J20L57n02n3J16j46
$$ -499 -929 -1005 -125 -321 -621 -233 154 204 -48 218 529 277 305 917 890 479 599 956 454 401 517 371
2124C71l20k04J42n53QJ56j18k57J05M9k52p8qN18j24j12N13L45Nj05K66L19J0
$$ 371 51 -153 -11 -564 -556 -400 -518 -775 -670 -621 -873 -951 -959 -441 -565 -677 -164 181 186 81 347 666 676
2147F76j99O35l99m24K27K39l23m45M98n8m34j77L36m68p88K05K91j82j05K25
$$ 676 477 1112 713 289 516 755 432 -13 485 427 -7 -184 152 -316 -1104 -899 -608 -790 -895 -670
2167f70K91k15j00L54J38m4O0L77Q7m8J74O3J73k63P72q3k77j78J85n18l49L11
$$ -670 -379 -594 -694 -340 -202 -246 -186 191 278 230 404 467 640 377 1149 1066 789 611 796 278 -71 240
2189B40p3k42m55L15k57k31K61P4l40j30K06K02m45J64L94K33q8J95L96n6p1M85
$$ 240 167 -75 -530 -215 -472 -703 -442 -368 -708 -838 -632 -430 -875 -711 -317 -84 -172 23 419 363 292 777
2211G77L5j78k66K74J68k21m04L35j5n80M4K14l31k97j64J44j97l01J79K48k95
$$ 777 812 634 368 642 810 589 185 520 505 -75 -31 183 -148 -445 -609 -465 -662 -963 -784 -536 -831
2232h31O7L60n0l5N12L61l71j65Q11k24k16J25N13k40k39K46J10k3l67l1K86n26
$$ -831 -764 -404 -454 -489 23 384 13 -152 659 435 219 344 857 617 378 624 734 711 344 313 599 73
2254G3k44L16l07n78K05J10j94l90M74R3j49M9K37J29l03L85K57k5k42M26J44
$$ 73 -171 145 -162 -740 -535 -425 -619 -1009 -535 -442 -591 -542 -305 -176 -479 -94 163 138 -104 322 466
2275D66N4n5J19M7k14J59J86mm41q0J24l29l33K85j97o63K13L07k66j45L03J73
$$ 466 520 465 584 631 417 576 762 758 317 237 361 32 -301 -16 -213 -876 -663 -356 -622 -767 -464 -291
2297b91l31K25L75j27j86J33K61K68r3J55K10qj00R2M25l02k17j43J96m44k75
$$ -291 -622 -397 -22 -149 -335 -202 59 327 234 389 599 591 491 583 1008 706 489 346 542 98 -177
2318a77L14l86r9j06L60l08r2r6rJ00n9L0J27Lr4N08j33K05L23JJ03k56M00l56
$$ -177 137 -249 -348 -454 -94 -402 -494 -590 -599 -499 -558 -528 -401 -398 -492 16 -117 88 411 412 515 259 659 303
2342C03L68p7M7k36j34L56j02n08l8jl47m61K08M59n12j32K19R2l07%M10N6k43
$$ 303 671 594 641 405 271 627 525 17 -21 -22 -369 -830 -622 -163 -675 -807 -588 -496 -803 -803 -393 -337 -580
2365e80K53M18j20N2L80j27K36j1L23j24k60J11L7q3l39o0J87k01m53N7R9N0j62
$$ -580 -327 91 -29 23 403 276 512 501 824 700 440 551 588 505 166 106 293 92 -361 -304 -205 -155 -317
2388c17J16r1o11K56N3q4J01L68N9k6O3J48J83j50J51K03L83k50R8k08j8rL88
$$ -317 -201 -292 -903 -647 -594 -678 -577 -209 -150 -176 -113 35 218 68 219 422 805 555 653 445 427 418 806
2411H06l00k92J6j9k97k99K28j40j91N1M2K47l28j38M8K54J84k87L71n5l8L34
$$ 806 506 214 230 211 -86 -385 -157 -297 -488 -437 -395 -148 -476 -614 -566 -312 -128 -415 -44 -99 -137 197
2433A97O7j65L73O4J71k39J35oj18r9J71j38m29J58r0Kl97O6q8j9n6k11J9k52
$$ 197 264 99 472 536 707 468 603 597 479 380 551 413 -16 142 52 54 -343 -277 -365 -384 -440 -651 -632 -884
2457h84J21N05q0p0R3L04M5KL34J7l0J61J5L8o1P9K4k79J73l24J39J10p15J48
$$ -884 -763 -258 -338 -408 -315 -11 34 36 370 387 357 518 533 571 510 589 613 334 507 183 322 432 -283 -135
2481a35J1k08qk7NJ20m52J4O2R7J65j00R2N85k64L9J25K11oQ1K48j20J44O9j37
$$ -135 -124 -332 -340 -367 -362 -242 -694 -680 -618 -521 -356 -456 -364 221 -43 -4 121 332 326 407 655 535 679 748 611
2506F11j78q9j87L32l17k7J4m32Q3k52l36M81m41K49k91K99j72L7J64K66J91l8
$$ 611 433 344 157 489 172 145 159 -273 -190 -442 -778 -297 -738 -489 -780 -481 -653 -616 -452 -186 5 -33
2528c3K20k50M67j98J4J98P2J45n4k75K12p1O7k80P5m62QK98m10j67M5R8j98j0
$$ -33 187 -63 404 206 220 418 490 635 581 306 518 447 514 234 309 -153 -145 153 -257 -424 -379 -281 -479 -489
2552d89L14l9l36j23L73j07N7J95J9M03j49N87j91J72k29o0J54J34k91L5L05n93
$$ -489 -175 -214 -550 -673 -300 -407 -350 -155 -136 267 118 705 514 686 457 397 551 685 394 429 734 141
2574A41J43J2l9l94o8L4m6l64J36o0k65M4M36NJ05J90m70K66K77J24q2J33K57
$$ 141 284 296 257 -137 -205 -171 -217 -581 -445 -505 -770 -726 -290 -285 -180 10 -460 -194 83 207 125 258 515
2597E15j63j44K83L62k64p0J73L9j84n07m4J99l20mj55L17n40k04M10q3m40J19
$$ 515 352 208 491 853 589 519 692 731 547 40 -4 195 -125 -129 -284 33 -507 -711 -301 -384 -824 -705
2619g05N20l77NM01j08M35k7Q7o8Q7K16K0J44M0m69J42J51n8l29J83k93Q9j72
$$ -705 -185 -562 -557 -156 -264 171 144 231 163 250 466 486 630 670 201 343 494 436 107 290 -3 86 -86
2642h6q2k12Q4l3p6j84K84k63M1K67k7J25j88M64j10ql03M42J18j35K67J4R9n5
$$ -86 -168 -380 -296 -329 -405 -589 -305 -568 -527 -260 -287 -162 -350 114 4 -4 -307 135 253 118 385 399 498 443
2666D43M8P1k26R6k41K83l25l50L9J59m45J53j20Ok45K93k7k90J85L29j54K5l4
$$ 443 491 562 336 432 191 474 149 -201 -162 -3 -448 -295 -415 -409 -654 -361 -388 -678 -493 -164 -318 -293 -327
2689c27N72k74q3L03K11j65J60j7q8j88K05J18k43O8n3r9jk27j78J33m13K21R9
$$ -327 245 -29 -112 191 402 237 397 380 292 104 309 427 184 252 199 100 99 -128 -306 -173 -586 -365 -266
2712b66j83k09J85K26k86J22J84J81m07L12N17r5j94J89K37k51R7K45R0m80J38
$$ -266 -449 -658 -473 -247 -533 -411 -227 -46 -453 -141 376 281 87 276 513 262 359 604 694 214 352
2733C52L5Jm35K14j2k24M2M6l49j52O5J32k8o2k61K42K76l68O6M81j05M8J67j6
$$ 352 387 388 -47 167 155 -69 -27 19 -330 -482 -417 -285 -313 -375 -636 -394 -118 -486 -420 61 -44 4 171 155
2757A55kK25L21j61l77J51M24l42j88J84J10j26n92L2R0j46j47J58n0p9k4j0J33
$$ 155 153 378 699 538 161 312 736 394 206 390 500 374 -218 -186 -96 -242 -389 -231 -281 -360 -384 -394 -261
2780b61NJ40j20p5L4K62k31J91L80j02J15j6M11l89R6j08N6K3J3j7K1n00LJ35
$$ -261 -256 -116 -236 -311 -277 -15 -246 -55 325 223 338 322 733 344 440 332 388 411 424 407 428 -72 -69 66
2804F6r4k66l6K73j3l06J2J67l00r9K83K64j94K23o1N28n37J98L7K43r6J18m8
$$ 66 -28 -294 -330 -57 -70 -376 -364 -197 -497 -596 -313 -49 -243 -20 -81 447 -90 108 145 388 292 410 362
2827C62J98o5j12l4k33J56q1m04K99l4k79j21l7O8%j34j20N7J88M2J23r0O3j8
$$ 362 560 495 383 349 116 272 191 -213 86 52 -227 -348 -385 -317 -317 -451 -571 -514 -326 -284 -161 -251 -188 -206
2851b06L95L1j74K56K02k4k63l9L01k81J73j24J75m08j7J71j6k01qM3l72J84j97
$$ -206 189 220 46 302 504 480 217 178 479 198 371 247 422 14 -3 168 152 -49 -57 -14 -386 -202 -399
2874c99J13l08K16L59m79L27j32J23J78j26J28K39K19m58N23k4k46n7j39L08J62
$$ -399 -286 -594 -378 -19 -498 -171 -303 -180 -2 -128 0 239 458 0 523 499 253 196 57 365 527
2895E27J26k82l44m9r2J24k58M7q5j55Q9J10o5q7j61M40l74L55P3J18r0j23L51
$$ 527 653 371 27 -22 -114 10 -248 -201 -286 -441 -352 -242 -307 -394 -555 -115 -489 -134 -61 57 -33 -156 195
2918A95P3J60m5k19K89j2l26R1L6K50m03M8Q0k53K1n6K0k85M7q9Q6l41K0J73Q1
$$ 195 268 428 383 164 453 441 115 206 242 492 89 137 217 -36 -15 -71 -51 -336 -289 -378 -292 -633 -613 -440 -359
2943c59J53M4J19p3L06k58L63rl07R6K02L09k92J07J12Q0r7l41J43l56k50K26
$$ -359 -206 -162 -43 -116 190 -68 295 286 -21 75 277 586 294 401 513 593 496 155 298 -58 -308 -82
2965h2K1k47k4L3J32j92J69j82O6j02N0K72M6k8j41M28j41J55k24M31o3J13J9
$$ -82 -61 -308 -332 -299 -167 -359 -190 -372 -306 -408 -358 -86 -40 -68 -209 219 78 233 9 440 377 490 509
2988E09J9k16j51k6L22j81l68J54K4k13k77J76J1k60J42l3q9r6K25o0l0L47m9
$$ 509 528 312 161 135 457 276 -92 62 86 -127 -404 -228 -217 -477 -335 -368 -457 -553 -328 -388 -418 -71 -120
3011a20M8R3N0j17L85k70L94j54J65o4Q9J4j62j5l77J35N0k63O5j53j34L61l80
$$ -120 -72 21 71 -46 339 69 463 309 474 410 499 513 351 336 -41 94 144 -119 -54 -207 -341 20 -360
3034c60o6P1J9m5Q8M5N7j20J94J23j24L3K74Jk6M13l13j30M15j39O1n1j48K1J17
$$ -360 -426 -355 -336 -381 -293 -248 -191 -311 -117 6 -118 -85 189 190 164 577 264 134 549 410 471 420 272 293 410
3059D10l36Q9k07j11j21J4K2L0k18N9J4j7K38k17J03K11j39K61P9j05J05p1L03
$$ 410 74 163 -44 -155 -276 -262 -240 -210 -428 -369 -355 -372 -134 -351 -248 -37 -176 85 164 59 164 93 396
3082C96j8P4j24j54O1o6j28L32k09p2n4j07j39J00qk01L0J34k13P4K47m07J75
$$ 396 378 452 328 174 235 169 41 373 164 92 38 -69 -208 -108 -116 -317 -287 -153 -366 -292 -45 -452 -277
3105b77m0K5M5J22N67m95J89L53l81J29m4N7J5J61p3q8J5L4k40j18Q3p3l19J48
$$ -277 -317 -292 -247 -125 442 -53 136 489 108 237 193 250 265 426 353 265 280 314 74 -44 39 -34 -353 -205
3129b05m0k52p0O38n03OL24j5j87O4L66N0k77r8K06L25m00L91L2q6K68m29Q5N0
$$ -205 -245 -497 -567 71 -432 -426 -102 -117 -304 -240 126 176 -101 -199 7 332 -68 323 355 269 537 108 193 243
3153B43k4k59J81R3o26K73oj36k16R3K4J6K8k19J67J44p9J0K02j97K09Q7l8L68
$$ 243 219 -40 141 234 -392 -119 -125 -261 -477 -384 -360 -344 -316 -535 -368 -224 -303 -293 -91 -288 -79 8 -30 338
3177C38k41J18o4q4K10m0L00k98Q2J21k56p8j2j50k23o2J53l0j04K98j79k17J60
$$ 338 97 215 151 67 277 237 537 239 321 442 186 108 96 -54 -277 -339 -186 -216 -320 -22 -201 -418 -258
3200b58L81p16M59J98m15P6L43r2K63q1j00L99j79K2n7j8k5o0l0J12k75J1m6J21
$$ -258 123 -593 -134 64 -351 -275 68 -24 239 158 58 457 278 300 243 225 200 140 110 222 -53 -42 -88 33
3224C3j40k04L04m36P9J37k29K31j87R4K79R9k56J83P8R9mM39k38n9L2J53k94
$$ 33 -107 -311 -7 -443 -364 -227 -456 -225 -412 -318 -39 60 -196 -13 65 164 160 599 361 302 334 487 193
3247A93K27K4k48K22m49K80m16K01l33Qj82J43j55K46r6P0P3n3j98M16r6Q5O7
$$ 193 420 444 196 418 -31 249 -167 34 -299 -291 -473 -330 -485 -239 -335 -265 -192 -245 -443 -27 -123 -38 29
3270B9J02Q1j24K17K3j37J05Q3j79n0j13J40N7j34p1O5K6l94L1R1k73L9J53j0
$$ 29 131 212 88 305 328 191 296 379 200 150 37 177 234 100 29 94 120 -274 -243 -152 -425 -386 -233 -243
3294b43MJ37n5r8qL01j41J5k4L4K43j73j0J78J51r6R5l9j0K25k79k78k1K16m1
$$ -243 -239 -102 -157 -255 -263 38 -103 -88 -112 -78 165 -8 -18 160 311 215 310 271 261 486 207 -71 -92 124 83
3319H3l76J92k79K09R9j52K65k65k21R3J70L1j24K4L56j40j53M30J09o7j8K22
$$ 83 -293 -101 -380 -171 -72 -224 41 -224 -445 -352 -182 -151 -275 -251 105 -35 -188 242 351 284 266 488
3341D88k00j84J97l44K77j32j33K04k23J28K2m88K73j87j81K29j73J74LO2J25
$$ 488 288 104 301 -43 234 102 -31 173 -50 78 100 -388 -115 -302 -483 -254 -427 -253 -250 -188 -63
3362f3k63K77J22n9K13n5O3o6k40L29K6k81N06k61o3P6j63J05j12L8j49m9j99
$$ -63 -326 -49 73 14 227 172 235 169 -71 258 284 3 509 248 185 261 98 203 91 129 -20 -69 -268
3385b68J39p0k10J08j80L62j93j84K08P2M8O0r8K97q0J2J68j7J55J8mq9j40L95
$$ -268 -129 -199 -409 -301 -481 -119 -312 -496 -288 -216 -168 -108 -206 91 11 23 191 174 329 347 343 254 114 509
3409E09l49j9K36l10J15R2p0j09m21J92k61L6K15m5j0l76N22k64J45M3K54J40
$$ 509 160 141 377 67 182 274 204 95 -326 -134 -395 -359 -144 -189 -199 -575 -53 -317 -172 -129 125 265
3431B65j26k58L0K00J46J11J95l5k41j75L28l33K44j91m24J65rr7K01k05j3J4
$$ 265 139 -119 -89 111 257 368 563 528 287 112 440 107 351 160 -264 -99 -108 -205 -4 -209 -222 -208
3453b08p4K82j20j78O4J88k55J73Q7QkJ38L92j68m5K85l05K38j40m1P8l88J66
$$ -208 -282 0 -120 -298 -234 -46 -301 -128 -41 -33 -35 103 495 327 282 567 262 500 360 319 397 9 175
3476A75j14J54m8k16q3N4j53k49J28k3N9O1n7m6R1J55m5K4L31p8Q5Q9oj4j66J91
$$ 175 61 215 167 -49 -132 -78 -231 -480 -352 -375 -316 -255 -312 -358 -267 -112 -157 -133 198 120 205 294 288 274 108 299
3502B99L1q7J6j7l13M73j91l38J65O8k81M4J37k24R6j32J8r9r5Q8o7K00J85n1
$$ 299 330 243 259 242 -71 402 211 -127 38 106 -175 -131 6 -218 -122 -254 -236 -335 -430 -342 -409 -209 -24 -75
3526g5J32j94J29J76J09j05J07q6J91q6k94J42j59L04R8k36j11R3j40O6l05J9
$$ -75 57 -137 -8 168 277 172 279 193 384 298 4 146 -13 291 389 153 42 135 -5 61 -244 -225
3548b25m3rK94j14j90J85K74l80m3j45M60J0J90l04%K27J17n5L2j2J44k28J28
$$ -225 -268 -277 17 -97 -287 -102 172 -208 -251 -396 64 74 264 -40 -40 187 304 249 281 269 413 185 313
3571C13l09K19M3k58J10k41l8K01k81N2R4k34j8K59O4q8j07J22l3J46j47K58O
$$ 313 4 223 266 8 118 -123 -161 40 -241 -189 -95 -329 -347 -88 -24 -112 -219 -97 -130 16 -131 127 133
3594A33p3J1K45Q6KL4j28j31j64R4l5r7o5K13Q0o4n03J64j6J21l10J42K04n60
$$ 133 60 71 316 402 404 438 310 179 15 109 74 -23 -88 125 205 141 -362 -198 -214 -93 -403 -261 -57 -617
3618f17K67L10k1J49j71K9K64p3J44L0k72J47J96Qj42j4J1k04K7j1R9jj07O1L5
$$ -617 -350 -40 -61 88 -83 -54 210 137 281 311 39 186 382 390 248 234 245 41 68 57 156 155 48 109 144
3643A44k39k64J10pM8p1L6P6q9J47p8J59J86ok02J42j46QR8K14j71rN1K5R4l65
$$ 144 -95 -359 -249 -256 -208 -279 -243 -167 -256 -109 -187 -28 158 152 -50 92 -54 -46 52 266 95 86 137 162 256 -109
3669a09L43k22j79J38p9j13PK65l16J15j03m5Q7j82M05K12j48L1j06k33O5L42
$$ -109 234 12 -167 -29 -108 -221 -214 51 -265 -150 -253 -298 -211 -393 12 224 76 107 1 -232 -167 175
3691A75k5R7J98k12J39jr1j35J57k23N1J49j43j70j75m5K11jp1K44m11N0L5J57
$$ 175 150 247 445 233 372 371 280 145 302 79 130 279 136 -34 -209 -254 -43 -44 -115 129 -282 -232 -197 -40
3715d0k77K31o3QQ0J33j67O7J42J63j88M4L0k06L49l00J65j07J39j37p9J4k51
$$ -40 -317 -86 -149 -141 -61 72 -95 -28 114 277 89 133 163 -43 306 6 171 64 203 66 -13 1 -250
3738b50K98k30K0k65K06J39j24J79p5k04J72O9j01J19J51k5K0j59L32kj50K06
$$ -250 48 -182 -162 -427 -221 -82 -206 -27 -102 -306 -134 -65 -166 -47 104 79 99 -60 272 270 120 326
3760C26J14j72j70K41l75j22P5J39N8J7l08K60k73K84n30K14k8J21j22K04L8n5
$$ 326 440 268 98 339 -36 -158 -83 56 114 131 -177 83 -190 94 -436 -222 -250 -129 -251 -47 -9 -64
3782f4N23o35J16k0L4J94K04m80M15j93K90l90J4N5K88o24L60L6j52l20L02j85
$$ -64 459 -176 -60 -80 -46 148 352 -128 287 94 384 -6 8 63 351 -273 87 123 -29 -349 -47 -232
3804b32L59k63M9M5j81j00K44o8q6M5o6K66m0P8L16M3m60L00k1J5k66M66l78J14
$$ -232 127 -136 -87 -42 -223 -323 -79 -147 -233 -188 -254 12 -28 50 366 409 -51 249 228 243 -23 443 65 179
3828A79k16J85j66o5J76J08k85k05Q8N9J01l32J89J1p7J35Q7m4K05l23K74p8J00
$$ 179 -37 148 -18 -83 93 201 -84 -289 -201 -142 -41 -373 -184 -173 -250 -115 -28 -72 133 -190 84 6 106
3851A06L41n41L94j24M5j42J62L0k57K30k1J35l08j53k4J67O6k05o5%MNJ6l5k
$$ 106 447 -94 300 176 221 79 241 271 14 244 223 358 50 -103 -127 40 106 -99 -164 -164 -160 -155 -139 -174 -176
3876a76M4L9R4j79M36J26l59L0J36j10L72l26pJ16j64J80q8O8k27q8J74j50o1
$$ -176 -132 -93 1 -178 258 384 25 55 191 81 453 127 120 236 72 252 164 232 5 -83 91 -59 -120
3899a20R5R5m09K37j74k0l2j46M14j72p8K05L7Q3Q9k73L71o2q8J74K4j37K12J56
$$ -120 -25 70 -339 -102 -276 -296 -328 -474 -60 -232 -310 -105 -68 15 104 -169 202 140 52 226 250 113 325 481
3923D81l46J83j56j09J39m0n2m40J11r4L1K09m2l7o6RL5R1j86J30k24K49M18m23
$$ 481 135 318 162 53 192 152 100 -340 -229 -323 -292 -83 -125 -162 -228 -219 -184 -93 -279 -149 -373 -124 294 -129
3947a29K3K91j38N5n3R5QK70k35m6j55O5J12j05p1j6M8kq7j46R6o0K60l50J38
$$ -129 -106 185 47 102 49 144 152 422 187 141 -14 51 163 58 -13 -29 19 17 -70 -216 -120 -180 80 -270 -132
3972a32k32M78k89J99J51j96L44m16N38m48L26j01p5L64n82K07ll1M3K0j9l7l52
$$ -132 -364 114 -175 24 175 -21 323 -93 445 -3 323 222 147 511 -71 136 133 102 145 165 146 109 -243
3995b43L06k37j20j17M90K3l35PJ61l70K74Q0mM4k03J39M33k75K28l24J95P8q4
$$ -243 63 -174 -294 -411 79 102 -233 -226 -65 -435 -161 -81 -85 -41 -244 -105 328 53 281 -43 152 230 146
4018A46p2K9J02j54NQ3K22k01k61O3j94J87J2j66M3K7M1j86R9J84j59o3L44p3
$$ 146 74 103 205 51 56 139 361 160 -101 -38 -232 -45 -33 -199 -156 -129 -88 -274 -175 9 -150 -213 131 58
4042E8q4J56j24P4N6j12K83j84J9J61K5K35n78m8R1J12J2n5l90M36k04J65j18
$$ 58 -26 130 6 80 136 24 307 123 142 303 328 563 -15 -63 28 140 152 97 -293 143 -61 104 -14
4065a4k77J79p3j21K7K57j17M8j71K39J55rJ35k33o0J42J23n2j65J12k0L0pq5
$$ -14 -291 -112 -185 -306 -279 -22 -139 -91 -262 -23 132 123 258 25 -35 107 230 178 13 125 105 135 128 43
4089D3P7l33J96N1j87R0k44L42k54J17J6P3k82K26M1K07l50K2K26j72L6K4J50
$$ 43 120 -213 -17 34 -153 -63 -307 35 -219 -102 -86 -13 -295 -69 -28 179 -171 -149 77 -95 -59 -35 115
4112A15J39n3Q1J27k25Oj37K28l03j37j03J13N1R1j78r9J00j17K69O6k03N7r6
$$ 115 254 201 282 409 184 190 53 281 -22 -159 -262 -149 -98 -7 -185 -284 -184 -301 -32 34 -169 -112 -208
4135b08R4mqO0L9L11k10m5O1kmJ62n7o9k77L48p2p5J95m33J89p8L7p4n7N5j95
$$ -208 -114 -118 -126 -66 -27 284 74 29 90 88 84 246 189 120 -157 191 119 44 239 -194 -5 -83 -46 -120 -177 -122 -317
4162c17n9J52J93k80Q6M0L0Q0NJ63j08N7L30l20J45oK1L4j82q8J56k73K73qrj19
$$ -317 -376 -224 -31 -311 -225 -185 -155 -75 -70 93 -15 42 372 52 197 191 212 246 64 -24 132 -141 132 124 115 -4
4188dj28K03j85J58k19K12m72J37K51k11L08j31r9K27l4r1O0J65q9P8J00J6k62
$$ -4 -132 71 -114 44 -175 37 -435 -298 -47 -258 50 -81 -180 47 13 -78 -18 147 58 136 236 252 -10
4211a0K53k96P5K01p2R8l28J34j10J1K4m1k4N9Q4o2j61M0O1J42k04K8J67J84l57
$$ -10 243 -53 22 223 151 249 -79 55 -55 -44 -20 -61 -85 -26 58 -4 -165 -125 -64 78 -126 -98 69 253 -104
4236a04K82p8J6o1O7l0N5m8O9R1j05N0l89J83L6j71j30J75J6J17p3k88ok4J59
$$ -104 178 100 116 55 122 92 147 99 168 259 154 204 -185 -2 34 -137 -267 -92 -76 41 -32 -320 -326 -350 -191
4261a91L4j03l0J22j19K29Q3O5m5K37j91O0l8K8m9J35R6j44m3K8j36M1k59j03
$$ -191 -157 -260 -290 -168 -287 -58 25 90 45 282 91 151 113 141 92 227 323 179 136 164 28 69 -190 -293
4285b93J53K80m0j79j82J67M3j52J89j26j0J92l34K76j30l4J40M2L80j66l00K68
$$ -293 -140 140 100 -79 -261 -94 -51 -203 -14 -140 -150 42 -292 -16 -146 -180 -40 2 382 216 -84 184
4307A84R4k87K60ll69M59m04J0J54j20M1j81J6Q4l1M8J26r8J79k35PM5k57J48
$$ 184 278 -9 251 248 -121 338 -66 -56 98 -22 19 -162 -146 -62 -93 -45 81 -17 162 -73 -66 -21 -278 -130
4331a30K59K76k89j26K4m6K9N6J76j2j53J6N5o6k8k95L01M0o3k26K13L5l16R9
$$ -130 129 405 116 -10 14 -32 -3 53 229 217 64 80 135 69 41 -254 47 87 24 -202 11 46 -270 -171
4355a71N4R9j73j2N8j6m5j49L72J85l24J33M48l62J90j42K34k25J31R5l36j66
$$ -171 -117 -18 -191 -203 -145 -161 -206 -355 17 202 -122 11 459 97 287 145 379 154 285 380 44 -122
4377a22j7K33P5j3k79m3k5J5k2l6L14j08k83l4K66L69m65J62J40qN7j33n1J17
$$ -122 -139 94 169 156 -123 -166 -191 -176 -198 -234 80 -28 -311 -345 -79 290 -175 -13 127 119 176 43 -8 109
4401A09N4k17J62O0om5j55K58j82M8J18m34o8K91k50P1N2op8K03j69J67j63J34
$$ 109 163 -54 108 168 162 117 -38 220 38 86 204 -230 -298 -7 -257 -186 -134 -140 -218 -15 -184 -17 -180 -46
4425d6j48J77J42l43M08q8o9Q6j58K15o4J6m0k62L19k95J00k6J64j44pk34J02
$$ -46 -194 -17 125 -218 190 102 33 119 -39 176 112 128 88 -174 145 -150 -50 -76 88 -56 -63 -297 -195
4448a95O2n2j16Q6n0M10k10k7o7m2J85q9Q9K4K9Q3L9K04l70J42j86J04M89o34
$$ -195 -133 -185 -301 -215 -265 145 -65 -92 -159 -201 -16 -105 -16 8 37 120 159 363 -7 135 -51 53 542 -92
4472i2O2q3K69q9J52k63J22r5M3j26jj45K53k03K56J0k18J20J34j17k26J45J03
$$ -92 -30 -113 156 67 219 -44 78 -17 26 -100 -101 -246 7 -196 60 70 -148 -28 106 -11 -237 -92 11
4495A1p9K74p3j5O7q7J21l82k8K88J57n3r1k9l0M5j11j09l7J1R6J27k88J72j03
$$ 11 -68 206 133 118 185 98 219 -163 -191 97 254 201 110 81 51 96 -15 -124 -161 -150 -54 73 -215 -43 -146
4520a46M7J80On6q1K15j95K94Nk37J06k30K01L1m7l4J32J18p2Ok73k60L45q9j65
$$ -146 -99 81 87 31 -50 165 -30 264 269 32 138 -92 109 140 93 59 191 309 237 243 -30 -290 55 -34 -199
4545a99N1l6O1jj8L7j32R2K22J49l7j28o4k58N14k79L18l77J69q0L28l92J31j51
$$ -199 -148 -184 -123 -124 -142 -105 -237 -145 77 226 189 61 -3 -261 253 -26 292 -85 84 4 332 -60 71 -80
4569h0l4J81j96J95j09Q9j34l2j35K90l18R9M5J73O7o1j47j35L24q4j75J24O7
$$ -80 -114 67 -129 66 -43 46 -88 -120 -255 35 -283 -184 -139 34 101 40 -107 -242 82 -2 -177 -53 14
4592A4Q1j1kR8J97k54J48j07k93R8J3j13K92kk51o7M8J05r6J09k21K2J4J53j44
$$ 14 95 84 82 180 377 123 271 164 -129 -31 -18 -131 161 159 -92 -159 -111 -6 -102 7 -214 -192 -178 -25 -169
4617a69J76J96k93L6j62L91j42j51R7J25J03j16Q6j9L8k67J97q7L4j7m1j84O5
$$ -169 7 203 -90 -54 -216 175 33 -118 -21 104 207 91 177 158 196 -71 126 39 73 56 15 -169 -104
4640a04j1m6m8Q7M0J86m47P2J53J63n1j55plM65n7l8lK6k18j32L22O5M1m58L91
$$ -104 -115 -161 -209 -122 -82 104 -343 -271 -118 45 -6 -161 -168 -171 294 237 199 196 222 4 -128 194 259 300 -158 233
4666B33m3k02n9N3N9j16Q3j39K6q8j36L60j90l1J99j24L13m11K21N9k54mL94l47
$$ 233 190 -12 -71 -18 41 -75 8 -131 -105 -193 -329 31 -159 -190 9 -115 198 -213 8 67 -187 -191 203 -144
4690a44L33l37J79R7l7L6k53K48J32k03P8j40j45L56k79k1R8J40j57P0l75K72
$$ -144 189 -148 31 128 91 127 -126 122 254 51 129 -11 -156 200 -79 -100 -2 138 -19 51 -324 -52
4712e2j77L52k32k14K61K41n2k9J03O8n1j23J74l05P5J41m1M0j85jo2J58k22j32
$$ -52 -229 123 -109 -323 -62 179 127 98 201 269 218 95 269 -36 39 180 139 179 -6 -7 -69 89 -133 -265
4736b65O00m52n0j6J34k54L41o4j28O6m1J01K2M3k42L75k12L09N0o8j43J17O8
$$ -265 335 -117 -167 -183 -49 -303 38 -26 -154 -88 -129 -28 -6 37 -205 170 -42 267 317 249 106 223 291
4759B91j72L2j62K32l8q0O3O9m39K56l80k6K09Mo8K98k67J39M8j68L87k19j42
$$ 291 119 151 -11 221 183 103 166 235 -204 52 -328 -354 -145 -141 -209 89 -178 -39 9 -159 228 9 -133
4782a33M05l36J79J26l15K99m54J25J80J27ok75n2K23j50l6l3O0J17n2p6J95j09
$$ -133 272 -64 115 241 -74 225 -229 -104 76 203 197 -78 -130 93 -57 -93 -126 -66 51 -1 -77 118 9
4805Il0j49J90k37L5J87J58r6O7k15K13k30K29J69k33L69k87o1O7j40n1p3K86
$$ 9 -21 -170 20 -217 -182 5 163 67 134 -81 132 -98 131 300 67 436 149 88 155 15 -36 -109 177
4828A77k10L7j4R3N9j94O0k22R5M0k66K57n3N7K55m22K77J6q8J38P1q9K7j70J78
$$ 177 -33 4 -10 83 142 -52 8 -214 -119 -79 -345 -88 -141 -84 171 -251 26 42 -46 92 163 74 101 -69 109
4853A09L56m50n9L4l6J97j82J86k63K66r4J33k72M3%m5o3K3m5jJ42J67j13M7K8
$$ 109 465 15 -44 -10 -46 151 -31 155 -108 158 64 197 -75 -32 -32 -77 -140 -117 -162 -163 -21 146 33 80 108
4878A08N9j6j04r8J48P4k67J54M20l69k2k0JQ3k13L8qq1J28j34M5J89q2k1k32
$$ 108 167 151 47 -51 97 171 -96 58 478 109 87 67 68 151 -62 -24 -32 -113 15 -119 -74 115 33 12 -220
4903b20M09m18K02k6l4L9n7j0J03J99j66K18k57R0j22J74pQ7m8K9l6j89K27k66
$$ -220 189 -229 -27 -53 -87 -48 -105 -115 -12 187 21 239 -18 72 -50 124 117 204 156 185 149 -40 187 -79
4927g9L9RL4k34K40q8j10K49m3M6k88J80o7J62k2r9J75q8o2L56l12J74j6j6L5
$$ -79 -40 -31 3 -231 9 -79 -189 60 17 63 -225 -45 -112 50 28 -71 104 16 -46 310 -2 172 156 140 175
4952A75j54R7q4k01K01M5M1m26K08rj00jK08j52P3K1L8j90P6K54M3Mj86J11k34
$$ 175 21 118 34 -167 34 79 120 -306 -98 -107 -207 -208 0 -152 -79 -58 -20 -210 -134 120 163 167 -19 92 -142
4977a42J08J68j06j71J11K35j17J26j74j95J31K02k86J84j93o0J36M4J18l18%
$$ -142 -34 134 28 -143 -32 203 86 212 38 -157 -26 176 -110 74 -119 -179 -43 1 119 -199 -199
4998a99J33J53k54Q8J63j80L6O9l00L55Q4n8Jk3M3m0M4j07P7P9m7q0J11q3k06
$$ -199 -66 87 -167 -79 84 -96 -60 9 -291 64 148 90 91 68 111 71 115 8 85 164 117 37 148 65 -141
5023a41K70j87j98L33Rj84K56j16k13L97k13j80k3K85R5l92J75p9q3K50O1j64
$$ -141 129 -58 -256 77 86 -98 158 42 -171 226 13 -167 -190 95 190 -202 -27 -106 -189 61 122 -42
5045d2L19j98O0Rj00Nq2L6O6J51l01j76l5N8J62L2o9P8p3K85j95j9qJ26j24O3
$$ -42 277 79 139 148 48 53 -29 7 73 224 -77 -253 -288 -230 -68 -36 -105 -27 -100 185 -10 -29 -37 89 -35 28
5071B8j3J19O5o5N2m12K67J7K30j88j31L03r1k92J18k97L38Nm9k17J9K02m01L15
$$ 28 15 134 199 134 186 -226 41 58 288 100 -31 272 181 -111 7 -290 48 53 4 -213 -194 8 -393 -78
5095g8J29j9k40K44j42K04k99K98J60k93o1J58K22m20L52m10K28L2J36l9j36k06
$$ -78 51 32 -208 36 -106 98 -201 97 257 -36 -97 61 283 -137 215 -195 33 65 201 162 26 -180
5117a80L93k5k84K96k06k13J5p6K25J45j17j57J84Ln2L8k5J65k11P1k8L93l83
$$ -180 213 188 -96 200 -6 -219 -204 -280 -55 90 -27 -184 0 3 -49 -11 -36 129 -82 -11 -39 354 -29
5140b9Q5R4o5j41J68j32jN0Jj09O2r8j2L62l14k2j40L00p3j0k91K46K66j16r1
$$ -29 56 150 85 -56 112 -20 -21 29 30 -79 -17 -115 -127 235 -79 -101 -241 59 -14 -24 -315 -69 197 81 -10
5165a0J14j11l06N38j58q8J21n7l1j43J79J35J45k87J82j62j56k39L38k0j5j2
$$ -10 104 -7 -313 225 67 -21 100 43 12 -131 48 183 328 41 223 61 -95 -334 4 -16 -31 -43
5187d3l29J07O6J97P5p3R0j38o4M9k2j70J92K43n9j2j97R5J41j38r3K53j38J97
$$ -43 -372 -265 -199 -2 73 0 90 -48 -112 -63 -85 -255 -63 180 121 109 -88 7 148 10 -83 170 32 229
5211B29j07L06k25j20Q0p9j33k52K47k2L6oj41J10j0k6J57J48k98j60K84q6J41
$$ 229 122 428 203 83 163 84 -49 -301 -54 -76 -40 -46 -187 -77 -87 -113 44 192 -106 -266 18 -68 73
5234G3j86L03K87k06k73K77j31J2J27j48Oj28j28Q7j92L54q2k26j7J68k10L04
$$ 73 -113 190 477 271 -2 275 144 156 283 135 141 13 -115 -28 -220 134 52 -174 -191 -23 -233 71
5256G1r4r4J65k01J13p0O0R8L5k39K13j67J73KJ14k04Q8L6Lj40LJ12Jk78J59J43
$$ 71 -23 -117 48 -153 -40 -110 -50 48 83 -156 57 -110 63 65 179 -25 63 99 102 -38 -35 77 78 -200 -41 102
5282A02k9k99J26J55l88J98K24j78Mr6L17k83K19K0j01N0M1k7q4J6O8K2J39l11
$$ 102 73 -226 -100 55 -333 -135 89 -89 -85 -181 136 -147 72 92 -9 41 82 55 -29 -13 55 77 216 -95
5306i5m0J87Q1k86O6K35j33J31q4k29L20j83O4j64j09R7l4K81k52l2J41l2J63
$$ -95 -135 52 133 -153 -87 148 15 146 62 -167 153 -30 34 -130 -239 -142 -176 105 -147 -179 -38 -70 93
5329I3P5l26L66j64l1R5j57N5ML09l57O1J84j31l21K93J05j13J39j69J58j51j78
$$ 93 168 -158 208 44 13 108 -49 6 10 319 -38 23 207 76 -245 48 153 40 179 10 168 17 -161
5352a61p9R6J6L15J9j10O0k92K29j40J55M27l20l28K66R0k2K11k17j10K2j97L04
$$ -161 -240 -144 -128 187 206 96 156 -136 93 -47 108 535 215 -113 153 243 221 432 215 105 127 -70 234
5375B34m75J47L27l02J06L6n2j88k5M3J1J63oK1M9%j52O2p3R7P5j1k7l10J93J97
$$ 234 -241 -94 233 -69 37 73 21 -167 -192 -149 -138 25 19 40 89 89 -63 -1 -74 23 98 87 60 -250 -57 140
5401A40j56J2k22P8j17K59LO5j9k44K51q1j57L1j72O5J04J19j9Op6J05pk8J38
$$ 140 -16 -4 -226 -148 -265 -6 -3 62 43 -201 50 -31 -188 -157 -329 -264 -160 -41 -60 -54 -130 -25 -32 -60 78
5426G8j23J04J23j75p4n8L96j05P6j71L6j17n7K35j08m26M25Rj62J86j97P3k09
$$ 78 -45 59 182 7 -67 -125 271 166 242 71 107 -10 -67 168 60 -366 59 68 -94 92 -105 -32 -241
5449b41L13p3J28k44o6R2J81M4l28K32j82L50j32j70J10K03j6k95K14N9j53J83
$$ -241 72 -1 127 -117 -183 -91 90 134 -194 38 -144 206 74 -96 14 217 201 -94 120 179 26 209
5471B09p2k30Q4j41Q6K02p4l5q9j36K26m9J44j15j21l8J32M2L7J52R7l42p9K86
$$ 209 137 -93 -9 -150 -64 138 64 29 -60 -196 30 -19 125 10 -111 -149 -17 25 62 214 311 -31 -110 176
5495A76j96J6L3J40r7J25j43J52k83L34l33j09N03l59Pqln1n5Q6K77l16L9J55
$$ 176 -20 -4 29 169 72 197 54 206 -77 257 -76 -185 318 -41 -34 -42 -45 -96 -151 -65 212 -104 -65 90
5519I0M1q0j55K63j32J99q9j60J79l15L52j31k40L65k79J27j83M48l54j4k1J01
$$ 90 131 51 -104 159 27 226 137 -23 156 -159 193 62 -178 187 -92 35 -148 300 -54 -68 -89 12
5541A2n0o3Q5qp8J18j44K31j39J78l69L0J70l1L08m68J67N4o4m5L63l07K99k94
$$ 12 -38 -101 -16 -24 -102 16 -128 103 -36 142 -227 -197 -27 -58 250 -218 -51 3 -61 -106 257 -50 249 -45
5565d5P8N5J39j40k62K11M0p0J13q6j81K44j34R2q8k4k26J91j01J96n7L9L32m20
$$ -45 33 88 227 87 -175 36 76 6 119 33 -148 96 -38 54 -34 -58 -284 -93 -194 2 -55 -16 316 -104
5589a04J1M48k15j66k50K71N7J7J5k27pK08j08L52l09R4j10o6O9j23k7J90K9Q6
$$ -104 -93 355 140 -26 -276 -5 52 69 84 -143 -150 58 -50 302 -7 87 -23 -89 -20 -143 -170 20 49 135
5613A35k06%K33m85J53M01k15j75K98j45j3J49j01J09M9k27k2l9Q4kp4L53q2J46
$$ 135 -71 -71 162 -323 -170 231 16 -159 139 -6 -19 130 29 138 187 -40 -62 -101 -17 -19 -93 260 178 324
5637C24m09L49k25J51k70K10K5J42j66j17J12K2J28k58J72j31Pp8K02j55r0P5
$$ 324 -85 264 39 190 -80 130 155 297 131 14 126 148 276 18 190 59 66 -12 190 35 -55 20
5659B0L7j2J8l3p9j13J14K81q3k35k62O4K30m7K65q2j19P9m6J04r8k3N3j23O8
$$ 20 57 45 63 30 -49 -162 -48 233 150 -85 -347 -283 -53 -100 165 83 -36 43 -3 101 3 -20 33 -90 -22
5684b2L58k61q1j21J72K32n1k05o2L9J67q0j52N0J39r0n9K10k96J44j07k29J43
$$ -22 336 75 -6 -127 45 277 226 21 -41 -2 165 85 -67 -17 122 32 -27 183 -113 31 -76 -305 -162
5707a62J19j14j8k5j83N29j96l5NJ27k32K62j26L3J24K6n3n0J1m0Q9k3M7r5J4
$$ -162 -43 -157 -175 -200 -383 146 -50 -85 -80 47 -185 77 -49 -16 108 134 81 31 42 2 91 68 115 20 34
5732C4k48J46j00R2J82j70P9l2o9K26l08l70N48q6k4K07l58L60l9K6J99m30L7
$$ 34 -214 -68 -168 -76 106 -64 15 -17 -86 140 -168 -538 10 -76 -100 107 -251 109 70 96 295 -135 -98
5755i8p6L23j66O9J99m22J54J28j91j9J15j9j10K0j6J11PK03j81J97m64J17K95
$$ -98 -174 149 -17 52 251 -171 -17 111 -80 -99 16 -3 -113 -93 -109 2 9 212 31 228 -236 -119 176
5778A76j88J85m1j52J86j56j8J18j94O7r8K46r8r7N6M2l2j32J85o7q2J78l24K78
$$ 176 -12 173 132 -20 166 10 -8 110 -84 -17 -115 131 33 -64 -8 34 2 -130 55 -12 -94 84 -240 38
5802C8j88M7k8J17j8n3Q1K40m80J49J68J79k31j24M27k01q0K2K52l19K01j25R6
$$ 38 -150 -103 -131 -14 -32 -85 -4 236 -244 -95 73 252 21 -103 324 123 43 65 317 -2 199 74 170
5825A70j24Q7k09J42o1J2k50L21j23J30l8k62J87Jk32L49j97K39J06k35J53k47
$$ 170 46 133 -76 66 5 17 -233 88 -35 95 57 -205 -18 -17 -249 100 -97 142 248 13 166 -81
5847h1K7j71M62j25j44J33q4L05k30j32Q3j35J30K53l41j23J67n3k16K40jJ05
$$ -81 -54 -225 237 112 -32 101 17 322 92 -40 43 -92 38 291 -50 -173 -6 -59 -275 -35 -36 69
5869F9j27KJ27j4j48K73L8k03J2j82K22J41j71q4J31r5J77Nj62K2J63p1l55J19
$$ 69 -58 -56 71 57 -91 182 220 17 29 -153 69 210 39 -45 86 -9 168 173 11 33 196 125 -230 -111
$$ [...]
8191c6
##END NTUPLES=NMR FID
##END=
