##TITLE=1H_Pr NCS-sf
 CDCl3
 8 sc, 
 3.10.2024
##JCAMPDX= 6.0         $$ Bruker NMR JCAMP-DX V2.0
##DATA TYPE= NMR FID
##DATA CLASS= NTUPLES
##ORIGIN= UXNMR, Bruker Analytische Messtechnik GmbH
##OWNER= root
$$ XWIN-NMR		Version 3.5
$$ Thu Oct  3 14:10:15 2024 Russian Standard Time (UT+4h)  she@DPX200
##.OBSERVE FREQUENCY= 200.1318
##.OBSERVE NUCLEUS= ^1H
##.DELAY= (6, 6)
##.ACQUISITION MODE= SIMULTANEOUS
##.ACQUISITION SCHEME= undefined
##.AVERAGES= 8
##.DIGITISER RES= 18
##SPECTROMETER/DATA SYSTEM= spect
##.PULSE SEQUENCE= zg30
##.SOLVENT NAME= DMSO
##.SHIFT REFERENCE= (INTERNAL, DMSO, 0, 15.7039)
##AUDIT TRAIL= $$ (NUMBER, WHEN, WHO, WHERE, WHAT)
$$ ##TITLE= Audit trail, XWIN-NMR		Version 3.5
$$ ##JCAMPDX= 5.01
$$ ##ORIGIN= Bruker BioSpin GmbH
$$ ##OWNER= she
$$ F:/spectra/data/she/nmr/H-F/1/audita.txt
$$ ##AUDIT TRAIL=  $$ (NUMBER, WHEN, WHO, WHERE, WHAT)
(   1,<2024-10-03 14:08:50.75 +0400>,<she>,<DPX200>,
      <created by zg, POWCHK disabled, PULCHK disabled
       configuration hash MD5:
       00 E9 B6 7A A2 85 ED C7 34 08 36 98 17 FE 4E 26
       data hash MD5: 16K
       66 D0 C9 11 E2 2E CD A7 15 DD 04 89 1E 67 33 F1>)
$$ ##END=
$$ 
$$ hash MD5
$$ 91 52 86 D6 A4 73 ED EB CF F4 5B 42 16 E8 B9 42
##$RELAX= 
##$RELAX= 
##$RELAX= 
##$RELAX= 
##$RELAX= 
##$RELAX= 
$$ Bruker specific parameters
$$ --------------------------
##$DU= <F:/spectra>
##$EXPNO= 1
##$NAME= <H-F>
##$PROCNO= 1
##$TYPE= <nmr>
##$USER= <she>
##$AMP= (0..31)
100 100 100 100 100 100 100 100 100 100 100 100 100 100 100 100 100 100 
100 100 100 100 100 100 100 100 100 100 100 100 100 100 
##$AQSEQ= 0
##$AQ_mod= 1
##$AUNM= <au_zg>
##$AUTOPOS= <>
##$BF1= 200.13
##$BF2= 200.13
##$BF3= 200.13
##$BF4= 200.13
##$BF5= 200.13
##$BF6= 200.13
##$BF7= 200.13
##$BF8= 200.13
##$BYTORDA= 1
##$CFDGTYP= 0
##$CFRGTYP= 5
##$CHEMSTR= <none>
##$CNST= (0..31)
1 1 145 1 1 1 1 1 1 1 1 1 1 1 1 1 1 1 1 1 1 1 1 1 1 1 1 1 1 1 1 1 
##$CPDPRG= <>
##$CPDPRG1= <>
##$CPDPRG2= <>
##$CPDPRG3= <>
##$CPDPRG4= <mlev>
##$CPDPRG5= <mlev>
##$CPDPRG6= <mlev>
##$CPDPRG7= <mlev>
##$CPDPRG8= <mlev>
##$CPDPRGB= <>
##$CPDPRGT= <>
##$D= (0..31)
0 1.2 0 0 0 0 0 0 0 0.06 0 0.03 0 0 0 0 0.0002 0 0 0 0 0 0 0 0 0 0 0 0 
0 0 0 
##$DATE= 1727950130
##$DBL= (0..7)
120 120 120 120 120 120 120 120 
##$DBP= (0..7)
150 150 150 150 150 150 150 150 
##$DBP07= 0
##$DBPNAM0= <>
##$DBPNAM1= <>
##$DBPNAM2= <>
##$DBPNAM3= <>
##$DBPNAM4= <>
##$DBPNAM5= <>
##$DBPNAM6= <>
##$DBPNAM7= <>
##$DBPOAL= (0..7)
0.5 0.5 0.5 0.5 0.5 0.5 0.5 0.5 
##$DBPOFFS= (0..7)
0 0 0 0 0 0 0 0 
##$DE= 6
##$DECBNUC= <off>
##$DECIM= 24
##$DECNUC= <off>
##$DECSTAT= 4
##$DIGMOD= 1
##$DIGTYP= 9
##$DL= (0..7)
0 120 120 120 120 120 120 120 
##$DP= (0..7)
150 150 150 150 150 150 150 150 
##$DP07= 0
##$DPNAME0= <>
##$DPNAME1= <>
##$DPNAME2= <>
##$DPNAME3= <>
##$DPNAME4= <>
##$DPNAME5= <>
##$DPNAME6= <>
##$DPNAME7= <>
##$DPOAL= (0..7)
0.5 0.5 0.5 0.5 0.5 0.5 0.5 0.5 
##$DPOFFS= (0..7)
0 0 0 0 0 0 0 0 
##$DQDMODE= 0
##$DR= 18
##$DS= 0
##$DSLIST= <SSSSSSSSSSSSSSS>
$$ [...]
##$SUBNAM2= <"">
##$SUBNAM3= <"">
##$SUBNAM4= <"">
##$SUBNAM5= <"">
##$SUBNAM6= <"">
##$SUBNAM7= <"">
##$SUBNAM8= <"">
##$SUBNAM9= <"">
##$SW= 24.0689170037331
##$SWIBOX= (0..15)
0 0 2 0 0 0 0 0 0 0 0 0 0 0 0 0 
##$SW_h= 4816.95568400771
##$TD= 16384
##$TD0= 1
##$TE= 0
##$TE2= 300
##$TE3= 300
##$TEG= 300
##$TL= (0..7)
0 120 120 120 120 120 120 120 
##$TP= (0..7)
150 150 150 150 150 150 150 150 
##$TP07= 0
##$TPNAME0= <>
##$TPNAME1= <>
##$TPNAME2= <>
##$TPNAME3= <>
##$TPNAME4= <>
##$TPNAME5= <>
##$TPNAME6= <>
##$TPNAME7= <>
##$TPOAL= (0..7)
0.5 0.5 0.5 0.5 0.5 0.5 0.5 0.5 
##$TPOFFS= (0..7)
0 0 0 0 0 0 0 0 
##$TUNHIN= 0
##$TUNHOUT= 0
##$TUNXOUT= 0
##$USERA1= <user>
##$USERA2= <user>
##$USERA3= <user>
##$USERA4= <user>
##$USERA5= <user>
##$V9= 5
##$VALIST= <valist>
##$VCLIST= <CCCCCCCCCCCCCCC>
##$VD= 0
##$VDLIST= <DDDDDDDDDDDDDDD>
##$VPLIST= <PPPPPPPPPPPPPPP>
##$VTLIST= <TTTTTTTTTTTTTTT>
##$WBST= 1024
##$WBSW= 4
##$XGAIN= (0..3)
0 0 0 0 
##$XL= 0
##$YL= 0
##$YMAX_a= 199377
##$YMIN_a= -189273
##$ZGOPTNS= <>
##$ZL1= 120
##$ZL2= 120
##$ZL3= 120
##$ZL4= 120
##$ABSF1= 10
##$ABSF2= 0
##$ABSG= 5
##$ABSL= 3
##$ALPHA= 0
##$AQORDER= 0
##$ASSFAC= 0
##$ASSFACI= 0
##$ASSFACX= 0
##$ASSWID= 0
##$AUNMP= <proc_1d>
##$AZFE= 0.1
##$AZFW= 0.1
##$BCFW= 1
##$BC_mod= 2
##$BYTORDP= 1
##$COROFFS= 0
##$CY= 11.3945322036743
##$DATMOD= 1
##$DC= 2
##$DFILT= <>
##$DTYPP= 0
##$F1P= 15.6554695791079
##$F2P= 12.8336369535428
##$FCOR= 0.5
##$FTSIZE= 0
##$FT_mod= 4
##$GAMMA= 1
##$GB= 0.15
##$INTBC= 1
##$INTSCL= 1
##$ISEN= 128
##$LB= 0.24
##$LEV0= 0
##$LPBIN= 0
##$MAXI= 10000
##$MC2= 0
##$MEAN= 0
##$ME_mod= 0
##$MI= 1.114404
##$NCOEF= 0
##$NC_proc= 0
##$NLEV= 6
##$NOISF1= 3.799351
##$NOISF2= 2.8
##$NSP= 1
##$NTH_PI= 0
##$NZP= 0
##$OFFSET= 15.70392
##$PC= 1
##$PHC0= -26155.74
##$PHC1= 13.38747
##$PH_mod= 1
##$PKNL= yes
##$PPARMOD= 0
##$PSCAL= 0
##$PSIGN= 0
##$REVERSE= no
##$SF= 200.130013532006
##$SI= 16384
##$SIGF1= 3
##$SIGF2= 2
##$SINO= 400
##$SIOLD= 16384
##$SREGLST= <1H.CDCl3>
##$SSB= 0
##$STSI= 0
##$STSR= 0
##$SW_p= 3612.71676300578
##$SYMM= 0
##$S_DEV= 0
##$TDeff= 0
##$TDoff= 0
##$TI= <>
##$TILT= no
##$TM1= 0
##$TM2= 0
##$TOPLEV= 0
##$USERP1= <user>
##$USERP2= <user>
##$USERP3= <user>
##$USERP4= <user>
##$USERP5= <user>
##$WDW= 1
##$XDIM= 8192
##$YMAX_p= 0
##$YMIN_p= 0
$$ End of Bruker specific parameters
$$ ---------------------------------
##NTUPLES= NMR FID
##VAR_NAME=  TIME,          FID/REAL,        FID/IMAG
##SYMBOL=    X,             R,               I
##VAR_TYPE=  INDEPENDENT,   DEPENDENT,       DEPENDENT
##VAR_FORM=  AFFN,          ASDF,            ASDF
##VAR_DIM=   8192,          8192,            8192
##UNITS=     SECONDS,       ARBITRARY UNITS, ARBITRARY UNITS
##FACTOR=    0.0002076,     1,               1
##FIRST=     0,             0,               0
##LAST=      1.7004516,     0,               0
##MIN=       0,             -189273,         0
##MAX=       1.7004516,     199377,          0
$$ Real data points
##PAGE= N=1
##DATA TABLE= (X++(R..R)), XYDATA
$$ plain form
0 0 0 0 0 0 0 0 0 0 8 -8 8 -16 16 -24 24 -32 40 -48 54 -64 72 -88 100 -114 134 -153 174 -198 225 -256 287
31 287 -324 364 -407 455 -507 565 -627 699 -772 856 -949 1049 -1161 1287 -1427 1584 -1762
48 -1762 1964 -2197 2471 -2797 3189 -3677 4299 -5123 6277 -8009 10932 -17076 55231 -160456
62 -160456 -141609 197803 32533 -155188 -6694 131086 -23434 -92608 22884 53565 -1077
73 -1077 -11047 -48061 28190 80618 -64127 -83202 88120 63976 -97802 -61986 112271 37489
85 37489 -129816 8569 125521 -41730 -86419 39702 57610 -21449 -47288 9951 31731
96 31731 -9743 -24690 -12316 39943 29899 -72156 -10716 90921 -21612 -68751 38664
107 38664 37125 -37877 -23859 28856 6109 -20400 14494 -6493 -12766 42494 -16518 -45641
$$ packed form
0@%%%%%%%%Qj6J6k4L2m0M8n6P2q8J02j18J36j60J88k14K48k87L27l72M23m81N43
31B87o11O88p71Q62r62J072j192J326j471J628j805J998k210K448k714L011l346
48a762L726m161M668n268N986o866P976r422J1400j4286J8941k8008P2307k15687
62a60456J8847L39412j65270j87721J48494J37780j54520o9174J15492L0681n4642
73a077r970l7014P6251N2428j44745j9075J71322k4144j61778L5816J74257p4782
85C7489j67305J38385J16952j67251m4689J26121J7908p9059k5839N7239K1780
96C1731m1474j4947J2374N2259j0044j02055O1440J01637j12533m7139J07415
107C8664j539p5002J4018N2715k2747k6509L4894k0987o273N5260n9012k9123
$$ plain form
119 -45641 54677 24824 -64784 -7368 54703 -3455 -52146 19038 43172 -42593 -14272 47441
131 47441 -13068 -16831 22618 -12475 -12763 26334 4589 -40174 1619 54461 -29789 -54145 64491
144 64491 27313 -72028 9227 58903 -23117 -43074 25637 31747 -32672 -15161 26365 -11894
156 -11894 -2930 18556 -21425 2797 27363 -21648 -15714 27974 11207 -31803 -12204 36777
168 36777 -3448 -36071 20649 16789 -20976 1592 7959 678 1881 -6470 85 3895 1959 -5207
182 -5207 -14642 15656 13340 -27909 3315 23674 -14200 -7346 14159 3366 -10787 -5245 12432
195 12432 -3675 -9426 14307 -9492 -12513 24391 -1871 -19967 12730 11794 -10914 -9246 12996
208 12996 6789 -20442 4161 14625 -15297 2654 8007 -13618 9499 10930 -15383 -4145 14742
$$ packed form
119d5641J00318k9853q9608N7416O2071n8158m8691P1184K4134q5765K8321O1713
131D7441o0509l763L9449l5093k88L9097k1745m4763M1793N2842q4250k4356J18636
144F4491l7178r9341Q1255M9676q2020j9957O8711O110o4419J7511M1526l8259
156a1894Q964K1486l9981K4222K4566m9011N934M3688j6767m3010J9599M8981
168C6777m0225l2623N6720l860l7765K2568O367p281J203q351O555L810j936p166
182e207r435L0298k316m1249L1224K0359l7874O854K1505j0793j4153N542J7677
195A2432j6107n751K3733k3799l021L6904k6262j8096L2697r36k2708J668K2242
208A2996o207k7231K4603J0464k9922J7951N353k1625K3117J431k6313J1238J8887
$$ plain form
221 14742 5399 -19335 -2260 25856 -13512 -22407 23509 8325 -18158 -1865 9417 6532 -8945
234 -8945 -5329 11257 -1952 -4144 -436 -5362 12544 -114 -20645 11911 16116 -14554 -10659
247 -10659 12883 14308 -17057 -12920 24297 -37 -21474 8287 8577 -3196 -4481 -5808 10699
260 10699 6216 -11640 -2219 7286 6494 -9647 -11015 19818 2689 -24294 8628 15739 -9471
273 -9471 -8364 4774 11567 -6228 -11504 12467 2177 -9337 3694 -1436 2101 2875 -9542 4191
287 4191 7511 -4876 -2998 -464 8047 -864 -12956 10702 5569 -14611 4426 6375 -4266 -798
301 -798 -1134 4316 -681 -4380 6235 -3741 -2103 7406 -7789 321 7481 -7792 548 4271 -2163
316 -2163 352 -2885 3949 1613 -7656 6599 698 -7964 7295 -477 -4813 4471 -1692 330 -244
$$ packed form
221A4742r343k4734J7075K8116l9368q895M5916j5184k6483J6293J1282k885j5477
234h945L616J6586j3209k192L708m926J7906j2658k0531L2556M205l0670L895
247a0659K3542J425l1365M137L7217k4334k1437K9761K90j1773j285j327J6507
260A0699m483j7856R421R505p92j6141j368L0833j7129k6983L2922P111k5210
273i471J107J3138O793j7795n276K3971j0290j1514J3031n130L537P74j2417J3733
287D191L320j2387J878K534Q511q911j2092K3658n133k0180J9037J949j0641L468
301g98l36N450m997l699J0615r976J638R509j5195Q110P160j5273Q340L723o434
316b163K515l237O834k336r269J4255n901q662J5259p772m336R284o163K022n74
$$ plain form
331 -244 -1132 5611 -6024 -1627 8704 -6809 -1316 5855 -4560 1109 403 -1172 3522 -4013 1579
346 1579 2534 -5010 4969 -1590 -5204 8167 -3241 -4723 6316 -1729 -1337 153 738 4141 -6712
361 -6712 263 7865 -7341 -162 4979 -4603 1918 -546 -1209 4438 -4141 594 2847 -3517 3877
376 3877 -2445 -3281 7436 -4546 -3444 6039 -2253 -702 -173 684 4507 -6376 83 7029 -6293
391 -6293 283 3212 -4035 2926 -1327 -1935 4570 -2988 -14 1541 -1863 4017 -3767 -2433 7302
406 7302 -4755 -2590 5142 -2690 105 -181 -232 4061 -4709 -38 4997 -4754 1189 1608 -3656 3242
422 3242 -1725 -1669 3935 -2949 572 1426 -1963 3812 -2921 -1914 5849 -4336 -1518 4214 -3192 294
438 294 159 -524 3121 -3673 679 3781 -4076 1930 699 -3370 3788 -2218 -2018 4133 -2812 -257
$$ packed form
331b44q88O743j1635M397J0331j5513N493P171j0415N669p06j575M694p535N592
346A579R55p544R979o559l614J3371j1408j482J1039q045L92J490N85L403j0853
361f712O975P602j5206P179N141r582O521k464o63N647q579M735K253o364P394
376C877o322q36J0717j1982J102R483q292J551N29Q57L823j0883O459O946j3322
391f293O576K929p247O961m253o08O505p558K974J555l404N880p784J334R735
406G302j2057K165P732p832K795k86n1M293q770M671N035r751N943M19n264O898
422C242m967N6N604o884L521Q54l389N775o733J007P763j0185K818N732p406L486
438B94j35o83L645o794M352L102p857O006j231m069P158o006K00O151o945K555
$$ plain form
454 -257 1504 -1174 3221 -2757 -1192 5213 -3797 -1025 3119 -2634 1032 -1108 -1226 4121 -3097 -584
470 -584 3286 -2479 2125 -358 -3084 4547 -1838 -2987 3162 -1258 79 -638 -1258 4812 -2438 -2704
486 -2704 4760 -1576 -463 957 -2649 3145 -966 -3603 3822 -534 -1261 730 -1536 3945 -410
501 -410 -4281 4035 221 -1914 618 -2269 2946 -57 -5045 4144 1637 -3006 623 -507 3414
516 3414 36 -5714 3936 2165 -4343 480 17 1670 -249 -4453 4400 2190 -4244 1411 38
531 38 1241 1504 -5430 1942 3711 -4196 -607 977 2002 384 -5869 4135 5455 -6627 -832
546 -832 3716 493 -1264 -4277 3636 3287 -6627 1027 3733 -1113 312 -3050 2106 4989 -5336
561 -5336 -1693 3285 266 -148 -4416 1600 5912 -6105 -2187 6124 538 -2468 -3404 3593 5292
$$ packed form
454b57J761k678M395n978J565O405r010K772M144n753L666k140j18N347p218K513
470e84L870n765M604k483k726P631o385j149O149m420J337p17o20O070p250k66
486b704P464o336J113J420l606N794m111k637P425m356p27J991k266N481m355
501d10l871Q316l814k135K532k887N215l003m988R189k507m643L629j130L921
516C414l378n750R650j771o508M823m63J653j919m204Q853k210o434N655j373
531C8J203K63o934P372J769p907L589J584J025j618o253J0004J320j2082N795
546h32M548l223j757l013P913l49r914P654K706m846J425l362N156K883j0325
561e336L643M978l019m14m268O016M312j2017L918Q311n586l006r36O997J699
$$ plain form
576 5292 -7864 -1684 6640 -2619 -2259 329 1199 2966 -4298 -589 5325 -1770 -1242 -939 -83 4500
592 4500 -3879 -3448 4785 -191 -1447 -1491 772 6102 -5212 -4702 8978 42 -6454 311 2956 1950
608 1950 -4875 -1268 5917 -2646 -1940 2611 -1135 2832 -1202 -4596 4883 1422 -3273 -1421 -777 5437
624 5437 -1303 -7225 6091 3776 -6046 -791 4238 2995 -6174 -3802 9372 -923 -7666 3416
638 3416 1366 56 126 -3353 3806 1875 -4499 999 1788 1329 -2203 -5358 5576 3651 -6732 -1271
654 -1271 3461 3586 -2574 -6292 7598 4003 -10245 1201 6986 -2036 -4560 -1385 5832 1040 -6624
669 -6624 2214 3265 -1328 42 -2134 2498 2365 -5430 374 2977 -252 -522 -4625 2972 6667 -7066
685 -7066 -2794 7430 182 -5219 -1075 6578 299 -9503 3340 7032 -5134 -1909 1388 1296 2462
$$ packed form
576E292j3156O180Q324r259L60K588Q70J767p264L709N914p095N28L03Q56M583
592D500q379M31Q233m976j256m4K263N330j1314N10J3680q936o496O765K645j006
608A950o825L607P185q563P06M551l746L967m034l394R479l461m695J852O44O214
624E437o740n922J3316k315r822N255N029j243r169K372J3174j0295o743J1082
638C416k050j310P0l479P159j931o374N498P89m59l532l155J0934j925j0383N461
654a271M732J25o160l718J3890l595j4248J1446N785r022k524L175P217m792p664
669f624Q838J051m593J370k176M632j33p795N804K603l229k70m103P597L695j3733
685g066M272J0224p248n401M144P653o279r802J2843L692j2166L225L297r2J166
$$ plain form
700 2462 -3528 -724 3488 -1087 -744 -1791 971 4515 -5764 -3421 7606 1165 -5221 -2222 5057
715 5057 4415 -7763 -1432 8306 -3360 -4955 3038 2292 -277 -4397 333 5907 -2076 -2837 1415
730 1415 864 2185 -2911 -2385 4992 -1066 -3965 1238 2144 1971 -4450 -2703 7928 272 -6832 1314
746 1314 4270 215 -5359 -418 7461 -3528 -6382 5550 2995 -2926 -2126 409 4181 -921 -3427
761 -3427 1648 325 299 -640 -2640 3998 511 -5542 2446 4172 -1185 -3404 -728 5809 -852 -6494
777 -6494 3846 2858 -4435 -470 2404 1597 -2602 -2310 4627 592 -2882 762 -1049 1414 1651 -4411
793 -4411 921 2826 -2454 -472 804 1639 179 -3627 2144 3006 -2847 -1017 45 1287 694 -3560
809 -3560 1665 2300 -3394 1258 1492 -1163 1251 -1393 -425 2090 -1319 -343 -466 -421 2122 -1905 -523
$$ packed form
700B462n990K804M212m575L43j047K762L544j0279K343J1027o441o386K999P279
715E057o42j2178O331R738j1666j595P993p46k569m120M730N574p983p61M252
730A415n51J321n096N26P377o058k899N203R06j73o421J747J0631p656p104Q146
746A314K956m055n574M941P879j0989k854J1932k555n921Q00K535L772n102k506
761c427N075j323k6r39k000O638l487o053P988J726n357k219K676O537o661n642
777f494J0340r88p293L965K874q07m199K92O937m035l474L644j811K463K37o062
793d411N332J905n280J982J276Q35j460l806N771Q62n853J830J062J242n93m254
809c560N225O35n694M652K34k655K414k644R68K515l409R76j23M5K543m027J382
$$ plain form
826 -523 2608 -1496 -171 703 -36 1755 -3063 -1096 4566 -2166 -2528 2191 84 -18 -745 258 2082
843 2082 -1908 -347 1511 -791 1298 -1822 -2086 4069 -809 -2818 1736 267 664 -592 -1173 3036
859 3036 -1045 -2616 2309 271 -729 -1072 -803 2892 -1219 -1865 2682 -942 -228 1155 -1519 1696
875 1696 -268 -2733 2360 191 -1434 212 -737 1784 -107 -1853 2456 -283 -1210 1295 -1088 1127
891 1127 58 -2788 2304 534 -1865 1131 -679 765 980 -1883 1442 261 -1600 1367 -999
906 -999 70 885 -2471 1468 1039 -1762 1357 -596 -110 1701 -1950 651 866 -2032 1065 -100
922 -100 -657 1036 -1741 1052 1437 -1995 1237 109 -967 1620 -1484 30 1326 -2130 815 463
938 463 -1012 1350 -1326 221 1940 -1947 566 743 -1446 1301 -888 -579 1575 -1841 429 1222
$$ packed form
826e23L131m104J325Q74p39J791m818J967N662o732l62M719k107j02p27J003J824
843B082l990J561J858k302K089l120k64O155m878k009M554j469L97j256n81M209
859C036m081j571M925k038j000l43K69L695m111o46M547l624P14J383k674L215
875A696j964k465N093k169j625J646r49K521j891j746M309k739r27K505k383K215
891A127j069k846N092j770k399K996j810J444K15k863L325j181j861K967k366
906i99J069Q15l356L939m29k801L119j953M86J811l651K601K15k898L097j165
922a00n57J693k777K793L85l432L232j128j076K587l104J514J296l456K945l52
938D63j475K362k676J547J719l887K513J77k189K747k189L09K154l416K270P93
$$ plain form
954 1222 -1296 1231 -381 -539 1838 -1495 147 1136 -1827 1024 17 -1004 1633 -1408 -79 1902
970 1902 -1567 655 570 -1108 1263 -896 -330 1267 -1854 575 738 -1398 1269 -585 -492 1908 -1327
987 -1327 188 1152 -1587 910 -110 -784 1273 -1372 26 1294 -1400 849 249 -792 1511 -1049
1003 -1049 -200 1367 -1791 475 654 -1205 1111 -646 -284 1647 -1283 274 948 -1188 874 -356
1019 -356 -558 1258 -1541 129 1223 -1470 854 173 -886 1442 -822 -117 1226 -1445 412 338
1035 338 -984 1000 -848 -331 1361 -1316 431 796 -1232 959 -266 -497 1176 -1371 70 930
1051 930 -1421 822 80 -791 1315 -772 3 1090 -1225 523 267 -1007 1052 -948 -294 1323
1067 1323 -1257 424 810 -1060 917 -173 -455 1059 -1293 100 856 -1179 728 -88 -714 1338
$$ packed form
954A222k518K527j612j58K377l333J642R89k963K851j007j021K637l041J329J981
970A902l469K222q5j678K371k159N66J597l121K429J63k136K667j854R3K400l235
987a327J515R64k739K497j020o74K057k645J398J268k694K249o00j041K303k560
1003a049Q49J567l158K266J79j859K316j757L62J931k930J557O74k136K062j230
1019c56k02J816k799J670J094k693K324o81j059K328k264P05J343k671J857p4
1035C38j322J984j848N17J692k677J747L65k028K191j225k31J673k547J441Q60
1051I30k351K243p42q71K106k087P75J087k315J748k56j274K059k000O54J617
1067A323k580J681L86j870J977j090k82J514k352J393P56k035J907q16o26K052
$$ plain form
1083 1338 -787 -71 1180 -1133 525 203 -818 1061 -903 -430 1175 -1099 273 564 -904 1083
1099 1083 -315 -547 1240 -997 35 549 -1073 1016 -446 -988 1496 -645 -370 976 -743 625
1115 625 -7 -808 1275 -792 -565 994 -941 595 248 -1273 1370 -28 -854 1057 -575 297 190
1132 190 -1252 1270 -208 -1276 1268 -430 -96 695 -1010 1100 288 -1161 1065 -299 -279 486 -1185
1149 -1185 982 323 -1683 1168 281 -650 777 -637 556 393 -1372 996 -72 -772 882 -1018
1165 -1018 295 1083 -1534 564 809 -716 422 -638 517 702 -1869 923 863 -1631 740 29
1181 29 -246 839 -1082 504 704 -1018 800 -441 -426 1227 -1560 -63 1390 -1154 133 109 55
1198 55 1050 -1397 244 1446 -1481 136 558 -705 715 -949 -195 1437 -1101 59 500 -527
$$ packed form
1083A338k125P16J251k313J658l22j021J879j964M73J605k274J372K91j468J987
1099A083j398k32J787k237J032N14j622K089j462n42K484k141K75J346j719J368
1115F25o32q01K083k067K27J559j935J536l47j521K643j398q26J911j632Q72j07
1132A90j442K522j478j068K544j698L34P91j705K110q12j449K226j364K0P65j671
1149a185K167o59k006K851q87r31J427j414J193j63j765K368j068p00J654j900
1165a018J313P88k617K098K45j525J138j060J155J85k571K792o0k494K371p11
1181B9k75J085j921J586K00j722J818j241J5J653k787J497J453k544J287k4n4
1198E5R95k447J641J202k927J617M22j263J420j664P54J632k538J160M41j027
$$ plain form
1214 -527 996 -954 -551 1455 -1229 -269 798 -881 757 -396 -756 1610 -528 -705 597 -136
1230 -136 708 -955 -617 1879 -1275 -942 1704 -565 -180 158 -280 1260 -800 -568 1229 -928 157
1247 157 386 -1203 1049 76 -1109 790 113 448 -418 -936 2061 -588 -1941 1878 -3 -1356 455
1264 455 30 456 -406 -589 1348 -487 -351 816 -1104 663 502 -1343 861 68 -638 543 -588
1281 -588 794 424 -1608 1156 731 -1176 254 -98 465 -44 -1313 1110 281 -1213 795 33 165
1298 165 381 -1188 918 501 -1336 716 -140 -498 870 -746 -70 677 -452 344 -407 440 827 -1824
1316 -1824 351 1602 -1660 -291 935 -394 -25 -366 769 446 -1340 889 664 -1104 663 -202
1332 -202 -636 755 -363 -150 -34 -194 970 -891 -173 1809 -1232 -732 1490 -259 -553 -337 208
$$ packed form
1214e27J523j950M03K006k684R60J067j679J638j153l60K366k138j77J302p33
1230a36Q44j663L38K496l154L33K646k269L85L38m38J540k060K32J797k157J085
1247A57K29j589K252r73j185J899o77L35q66n18K997k649j353L819j881j353J811
1264D55m25M26q62j83J937j835J36J167j920J767j61j845K204p93p06J181j131
1281e88J382l70k032K764m25j907J430l52N63n09j269K423q29j494K008p62J32
1298A65K16j569K106m17j837K052q56l58J368j616O76P47j129P96p51Q47L87k651
1316a824K175J251l262J369J226j329L69l41J135l23j786K229k25j768J767q65
1332b02m34J391j118K13J16j60J164j861P18J982l041N00K222j749k94K16N45
$$ plain form
1349 208 841 -1088 120 970 -967 423 482 -714 781 -236 -558 690 -369 51 -167 -575 1043
1366 1043 -268 -604 1049 -371 -107 370 -581 635 -325 -892 1014 -161 -569 316 -194 587 -341 -539
1384 -539 1243 -472 -684 858 -466 0 222 -775 499 12 -159 451 -695 676 634 -1278 611
1401 611 688 -1051 24 205 280 -344 -783 1231 -29 -1009 1197 -234 -730 990 -288 -336 257 -510
1419 -510 201 -274 138 511 -1031 494 941 -1053 328 407 -506 241 -410 269 355 -1111 632 493 -684
1438 -684 560 -192 -194 816 -584 -51 246 -421 447 -537 -31 847 -1052 266 897 -824 527 141
1456 141 -642 797 -221 -250 280 -501 256 -202 -213 827 -754 -42 1122 -772 93 474 -580 357
1474 357 -184 -304 481 -818 170 506 -659 683 -28 -631 872 -147 -209 70 -443 585 -359 -564
$$ packed form
1349B08O33j929J208Q50j937J390N9j196J495j017l22J248j059M20k18m08J618
1366A043j311l36J653j420K64M77r51J216r60n67J906j175m08Q85n10P81r28j98
1384e39J782j715k12J542j324M66K22r97J274m87j71O10j146J371m2j912J889
1401F11P7j739J075J81P5o24m39K014j260r80K206j431m96J720j278m8N93p67
1419e10P11m75M12L73j542J525M47j994J381P9r13P47o51O79Q6j466J743j39j177
1438f84J244p52kJ010j400N33K97o67Q68r84N06Q78j899J318O31j721J351l86
1456A41p83J439j018k9N30p81P57m58j1J040j581P12J164j894Q65L81j054R37
1474C57n41j20P85j299R88L36j165J342p11o03J503j019o2K79n13J028r44k05
$$ plain form
1492 -564 1069 -688 -342 1064 -675 67 366 -544 379 -128 -72 252 -714 543 247 -873 826 -8
1510 -8 -568 868 -226 -132 321 -514 511 -237 -467 812 -563 -118 748 -647 299 341 -456 470 -92
1529 -92 -24 307 -769 476 227 -835 741 -34 -522 782 -307 84 403 -504 412 -179 -287 629 -809
1548 -809 -22 638 -703 353 320 -516 508 -93 -44 337 -603 375 98 -699 723 -286 -369 805 -378
1567 -378 -8 423 -384 350 -58 -160 400 -706 171 491 -796 436 193 -530 590 -58 -29 374 -479
1586 -479 341 -15 -571 640 -327 -405 623 -353 4 332 -300 394 -169 -137 495 -639 102 382 -847
1605 -847 352 208 -528 463 -80 29 253 -355 387 -21 -439 575 -383 -340 555 -503 66 312 -321
1624 -321 454 -104 -112 400 -472 116 294 -606 341 19 -413 475 -181 -43 317 -336 350 34 -340 510 -387
$$ packed form
1492e64J633j757L46J406j739P42K99r10R23n07N6L24r66J257k96j120J699q34
1510hn60J436j094R4M53q35J025p48k30J279j375M45Q66j395R46M2p97R26n62
1529i2O8L31j076J245k49j062J576p75m88J304j089L91L19r07R16n91j08R16j438
1548h09P87O60j341J056l3q36J024o01M9L81r40R78k77p97J422j009q3J174j183
1567c78L70M31q07P34m08j02N60j106Q77L20j287J232k43p23J120o48K9M03q53
1586d79Q20l56n56J211r67p8J028r76L57L28o32O94n63L2O32j134P41K80j229
1605h47J199j44p36R91n43J09K24o08P42m08m18J014r58M3Q95j058N69K46o33
1624c21P75n58qN12q72N88J78r00R47l22m32Q88o56J38L60o53O86l16l74Q50q97
$$ plain form
1645 -387 -246 493 -542 -12 259 -329 322 -11 -45 361 -368 173 201 -619 379 -20 -471 439 -277 -114
1665 -114 326 -293 266 54 -288 465 -247 -221 427 -485 93 231 -353 279 -63 -67 376 -414 206 240 -423
1686 -423 465 -88 -475 407 -280 -96 290 -289 236 20 -197 451 -270 -48 492 -514 142 232 -425 351
1706 351 -60 -140 388 -404 167 180 -402 379 -75 -391 398 -286 -152 237 -357 213 117 -251 486 -280 -14
1727 -14 446 -438 128 127 -505 332 -65 -218 380 -279 197 257 -360 416 -39 -221 404 -276 -52 250 -372
1748 -372 210 -17 -281 422 -157 -6 367 -396 217 134 -429 374 -204 -235 307 -354 186 214 -339 439 -50
1769 -50 -232 417 -327 -34 253 -372 185 9 -278 346 -278 -32 349 -372 234 133 -326 281 -221 -197 264
1790 264 -449 190 216 -325 388 -88 -120 472 -288 44 216 -453 200 -71 -304 327 -245 108 362 -291 260
$$ packed form
1645c87J41P39j035N30K71n88O51l33l4M06p29N41K8q20R98l99m51R10p16J63
1665a14M40o19N59k12l42P53p12K6O48r12N78J38n84O32l42mM43p90O20L4o63
1686d23Q88n53l87Q82o87J84L86n79N25k16k17O48p21K22N40j006O56R0o57P76
1706C51m11q0N28p92N71J3n82P81m54l16P89o84J34L89n94N70r6l68P37p66K66
1727a4M60q84N66jo32Q37l97j53N98o59M76O0o17P76m55j82O25o80K24L02o22
1748c72N82k27k64P03n79J51L73p63O13q3n63Q03n78l1N42o61N40K8n53P78m89
1769e0j82O49p44K93K87o25N57j76k87O24o24K46L81p21O06j01m59O07n02K4M61
1790B64p13O39K6n41P13m76l2N92p60L32J72o69O53k71k33O31n72L53K54o53N51
$$ plain form
1811 260 70 -297 384 -235 -156 297 -386 104 116 -328 398 -78 -120 431 -312 39 188 -341 176 -102 -194
1832 -194 348 -318 -46 233 -347 279 24 -219 434 -243 -86 226 -431 194 64 -383 364 -215 -165 404
1852 404 -226 131 197 -381 339 -93 -185 308 -267 -38 214 -297 265 1 -227 378 -231 -15 250 -335 181
1873 181 89 -310 229 -211 -151 363 -237 190 142 -316 316 -83 -132 211 -257 55 164 -343 247 -57 -207
1894 -207 292 -157 51 239 -288 90 -28 -307 245 -226 -47 298 -305 171 100 -179 227 -105 -21 292 -342
1915 -342 73 139 -366 125 22 -185 205 -158 94 263 -345 266 -33 -249 202 -197 -128 246 -215 90 53
1936 53 -175 297 -144 -134 333 -269 -25 185 -218 111 -106 -134 306 -196 -9 315 -251 217 51 -209 168
1957 168 -209 -93 129 -244 113 5 -285 365 -29 -112 210 -152 64 187 -202 193 -139 -277 215 -167
$$ packed form
1811B60j90l67O81o19P9M53o83M90J2m44P26m76m2N51p43L51J49n29N17k78r2
1832a94N42o66K72K79n80O26k55k43O53o77J57L12o57O25j30m47P47n79N0N69
1852D04o30L57O6n78P20m32r2M93n75K29K52n11N62k64k28O05o09K16K65n85N16
1873A81r2l99N39m40O0N14o00M27m8m58O32l99m9L43m68L12J09n07N90l04j50
1894b07M99m49K08J88n27L78j18k79N52m71J79L45o03M76p1k79M06l32Q4L13o34
1915c42M15O6n05M91j03k07L90l63K52J69o08O11k99k16M51l99O9L74m61L05l7
1936E3k28M72m41J0M67o02K44K10m03L29k17k8M40n02J87L24n66M68j66k60L77
1957A68l77J16K22l73L57j08k90O50l94q3L22l62K16J23l89L95l32j38M92l82
$$ plain form
1977 -167 -35 147 -83 222 25 -176 283 -155 -9 204 -328 46 162 -212 150 -30 -59 171 -126 209
1997 209 151 -242 205 -34 -202 139 -190 17 95 -177 290 80 -163 243 -46 -137 244 -182 22 -66 -125 157
2019 157 -195 -12 264 -257 48 276 -233 158 21 -119 182 -245 -62 158 -202 156 128 -161 204 -83
2039 -83 51 168 -230 118 5 -301 267 -109 -208 167 -144 40 144 -126 141 -68 -62 111 -198 -75 87
2060 87 -185 193 30 -147 263 -146 16 198 -135 52 116 -186 149 -127 -97 168 -201 118 148 -146 256
2081 256 -98 -98 276 -112 -28 92 -190 175 19 -121 181 -120 85 185 -97 189 22 -107 129 -146 -85
2102 -85 116 -323 72 155 -156 119 28 -76 132 -131 53 -49 -254 210 -48 -133 196 -180 39 194 -106
2123 -106 113 30 -76 156 -75 47 63 -211 180 80 -132 178 -78 11 278 -173 104 103 -155 73 -32 -119
$$ packed form
1977a67J32J82k30L05j97k01M59m38J46K13n32L74J16l74L62j80k9K30k97L35
1997B09n8l93M47k39j68L41l29K07P8k72M67k10k43M06k89r1L81m26K04q8n9K82
2019A57l52J83K76n21L05K28n09L91j37j40L01m27J83K20l60L58k8k89L65k87
2039h3J34J17l98L48j13l06N68l76r9L75l11J84J04k70K67k09OJ73l09J23J62
2060H7k72L78j63j77M10m09J62J82l33J87O4l02L35k76L0K65l69L19L0k94M02
2081B56l54%L74l88Q4J20k82L65j56j40L02l01K05J00k82K86j67j29K36k75O1
2102h5K01m39L95Q3l11K75r1j04K08k63J84j02k05M64k58q5L29l76K19J55l00
2123a06K19q3j06K32k31J22J6k74L91j00k12L10k56Q9K67m51K77jk58K28j05q7
$$ plain form
2145 -119 156 -102 18 105 -151 106 -20 -96 180 -162 -55 98 -208 98 23 -272 149 -128 -146 211 -99
2166 -99 79 122 -122 179 -138 -42 148 -322 28 61 -223 148 12 -129 193 -61 11 97 -187 45 -4 -138
2188 -138 156 -90 -95 140 -73 100 53 -168 223 -34 -112 162 -217 -6 124 -162 -28 -2 -32 194 -97 44
2210 44 116 -162 169 -41 -176 177 -120 -79 134 -191 26 80 -71 162 -54 -45 107 -147 37 8 -188 50
2232 50 -74 -112 185 -88 60 117 -132 154 79 -162 148 -83 -83 168 -125 15 43 -71 216 -83 21 144
2254 144 -193 57 39 -133 119 8 -114 95 -37 57 98 -90 179 14 -81 104 -216 -41 13 -222 -12 -36
2276 -36 -70 76 33 -25 171 -167 -17 89 -78 67 -33 -52 63 -70 44 39 -125 152 -2 -27 138 -118 -65
2299 -65 105 -115 -11 47 -54 108 15 45 146 -54 200 43 -89 94 9 -82 75 -48 -38 -2 -48 163 90
$$ packed form
2145a19K75k58J20Q7k56K57j26p6K76l42J07J53l06L06p5k95M21k77j8L57l10
2166i9J78M3k44L01l17R6J90m70L50L3k84L71j36j41L22k54P2Q6k84K32m9j34
2188a38K94k46nK35k13J73m7k21L91k57p8K74l79K11J30k86J34K6l0K26k91J41
2210D4P2k78L31k10j35L53k97M1K13l25K17N4j51K33k16RJ52k54J84k9j96K38
2232E0j24l8K97k73J48N7k49K86p5k41L10k31%K51k93J40K8j14K87k99J04J23
2254A44l37K50j8j72K52j11j22K09j32R4M1j88K69j65r5J85l20J75N4k35K10k4
2276c6l4J46m3n8J96l38J50J06j67J45j00j9J15j33J14nj64K77j54k5J65k56N3
2299f5J70k20J04N8j01J62r3L0J01k00K54j57j32J83q5r1J57j23J0L6m6K11p3
$$ plain form
2322 90 -36 141 -135 59 52 -150 -62 51 -100 33 -43 -33 77 -56 136 72 -54 35 31 -83 111 -105 -35 -45
2346 -45 -77 106 3 -94 134 -10 11 135 -68 1 55 -132 52 -51 -21 67 -117 79 52 -58 125 21 -76
2369 -76 96 -67 -46 44 -62 50 -18 -104 181 -88 -58 165 -72 -49 81 -87 21 -33 -34 75 -103 95 73 -84
2393 -84 78 -27 -26 63 -94 -72 -6 -103 43 -86 -117 126 -67 -29 97 -38 -9 115 -117 48 -84 -68 -26 -61
2417 -61 40 -3 -85 67 3 -44 157 -5 -30 54 -21 9 -36 -81 127 -33 7 80 -139 153 85 -31 103 -42 -87
2442 -87 33 -144 32 -31 -94 102 -36 -55 53 -53 -27 89 -47 62 -71 -57 60 -122 3 25 -147 136
2464 136 51 -61 156 -38 -23 4 -101 53 0 -89 61 -14 30 89 -16 83 66 -66 20 18 -26 50 -120 18 46
2489 46 -145 27 64 -88 47 0 -31 42 -81 4 -87 -88 71 -68 -18 99 -37 -55 107 -39 85 -31 -9 36
$$ packed form
2322I0j26J77k76J94pk02Q8J13j51J33p6J0J10j33J92o4j26Q9mj14J94k16P0j0
2346d5l2J83j03r7K28j44K1J24k03O9N4j87J84j03L0Q8j84J96k7j10J83j04r7
2369g6J72j63K1R0j06J12o8q6K85k69L0K23k37K3J30j68J08n4jJ09j78J98k2j57
2393h4J62j05JQ9j57K2O6r7J46j29l1K43j93L8J26j35K9J24k32J65j32J6M2l5
2417f1J01m3q2J52o4m7K01j62k5Q4p5L0m5m5K08j60M0P3k19K92o8j16J34j45m5
2442h7J20j77J76o3o3J96j38j9J08j06K6J16j36J09j33J4J17j82J25K2j72K83
2464A36q5j12K17j94J5K7j05J54n3q9J50p5M4N9j05R9j7j32Q6km4P6j70J38K8
2489D6j91J72L7j52J35m7l1P3j23Q5r1jJ59j39N0J17j36j8J62j46J24j16K2M5
$$ plain form
2513 36 -123 6 58 -89 50 49 -41 92 -59 46 58 -16 -7 -19 -45 84 -35 -39 67 -12 -57 96 -7 113 10
2538 10 -5 101 -57 -21 18 -73 32 18 -41 127 -63 -8 82 35 16 15 -131 28 -78 -54 65 -165 -45 80 -86
2563 -86 96 37 -91 37 5 42 -42 -72 71 -37 -128 19 -66 4 -24 -5 78 -14 -59 66 -20 -79 41 -114 -83 120
2589 120 -56 -47 77 68 29 -53 80 39 -62 64 58 -75 32 -67 -3 59 -20 88 56 -71 52 99 -28 8 -63 -52
2615 -52 -21 35 47 -119 0 75 -73 -25 168 -11 -46 44 -62 7 -115 -68 85 -27 70 100 -63 4 23 5 2 -32
2641 -32 -24 82 -181 43 58 -105 142 56 -4 53 3 11 27 -75 72 -57 -35 68 -38 47 0 -59 133 -10 -4 137
2667 137 -44 -56 141 -78 -62 -35 -83 25 -40 18 62 -87 52 121 -113 -8 -23 -123 -22 -95 30 -48 -169 90
2691 90 27 -66 58 -94 6 115 -25 -4 -75 -67 89 -69 -74 100 -71 47 145 -58 -8 -28 10 36 -90 48 84
$$ packed form
2513C6j59J29N2j47J39jr0J33j51J05J2p4Rj2k6J29j19mJ06p9m5J53j03J20j03
2538A0j5J06j58L6L9r1J05j4n9J68j90N5R0m7j9jj46J59j06K4J19k30J20J25j66
2563h6J82n9j28J28l2L7q4l0J43j08r1J47q5P0k8J9Q3r2m5J25q6n9J20j55L1K03
2589A20j76RJ24rl9q2J33m1j01J26oj33J07r9O4O2p9J08l2j27J23M7j27L6p1J1
2615e2L1N6J2j66J19P5j48M8J93j79l5R0j06O9j22M7J53j12R7L0j63O7J9j8ll4
2641c2QJ06k63K24J5j63K47q6o0N7n0QJ6j02J47j29K2J03j06Q5m7n9J92j43OJ41
2667A37j81j2J97k19J6K7m8J08o5N8M4j49J39O9k34J05j5j00J01p3J25p8j21K59
2691I0o3r3J24j52J00J09j40K1p1QJ56j58nJ74j71J18R8k03N0k0L8K6j26J38L6
$$ plain form
2716 84 -119 136 119 -32 17 46 -32 53 -39 -61 -77 -49 69 -86 -50 57 -92 20 73 -38 79 -32 -76 97
2740 97 32 -17 -8 -55 72 25 -84 123 -18 14 133 -84 49 -40 -80 33 -49 10 81 -140 -2 126 -43 89
2764 89 86 -75 14 37 -10 -104 -38 163 -103 -65 91 -97 -19 156 -49 19 3 -81 -18 -105 37 -66 -130 42 102 -87
2790 -87 -68 -32 61 77 -68 112 -4 -106 89 -20 -148 103 -42 -66 72 -7 15 -5 77 39 -40 71 -52 -146
2814 -146 116 41 -48 116 -50 -65 136 29 -14 30 11 -50 -1 59 9 -161 2 69 -86 59 -45 -67 24 -11 -87
2839 -87 35 -99 66 0 -78 62 15 -61 39 90 16 -20 -5 111 -16 -24 70 -186 -52 172 -94 -43 25 -26 51
2864 51 39 10 -65 -28 15 -14 -66 51 25 -75 85 -45 42 61 -22 67 -33 -26 12 -61 -98 58 -73 -23 2 -43 40
2891 40 12 46 64 -34 55 -19 -93 14 -30 -178 39 -52 -36 82 43 117 -19 21 32 -104 21 35 -135 2 -8 -12
$$ packed form
2716H4k03K55j7j51M9K9p8Q5r2k2j6K8J18j55L6J07j49J12N3j11J17j11m4J73
2740I7o5m9Rm7J27m7j09K07j41L2J19k17J33q9m0J13q2N9P1k21J38J28j69J32
2764H9lj61Q9K3m7r4O6K01k66L8J56j88P8J75k05O8j6q4O3q7J42j03o4J72O0j89
2790h7J9L6R3J6j45J80j16j02J95j09j28K51j45k4J38p9K2k0Q2l8p9J11j23r4
2814a46K62p5q9J64j66j5K01j07m3M4j9o1M9O0n0j70J63O7j55J45j04k2R1l5p6
2839h7J22j34J65o6p8J40m7p6J00N1p4l6J5J16j27qR4k56J34K24k66N1O8n1P7
2864E1j2k9p5L7M3k9n2J17k6j00J60j30Q7J9q3Q9j00PL8p3l7J56j31N0K5m5Q3
2891D0k8L4J8r8Q9p4p4J07m4j48K17r1J6J18l9P4j36M0J1j36J25J4j70J37j0m
$$ plain form
2917 -12 -12 14 8 16 -61 98 -37 -148 63 -67 -87 94 -58 -39 73 48 36 -63 -8 83 -45 34 168 -96 -24 31
2943 31 -114 27 30 -24 74 -76 111 91 -94 71 -40 -69 67 -62 -58 55 -109 31 56 -23 62 -112 50 -16
2967 -16 -146 53 31 -134 44 -22 -139 13 -25 18 -22 -41 74 -87 -116 122 -64 -24 12 -102 35 3 -34 103
2991 103 -77 67 66 -102 52 87 -74 -4 -45 -49 5 -33 2 -89 -11 114 -36 1 151 -116 -43 3 -71 43 38 -17
3017 -17 68 -67 12 88 -70 70 -55 -151 69 -101 -51 16 -70 -37 31 -44 138 -89 54 157 -69 -4 50 -68
3041 -68 4 -15 -60 24 -100 88 32 -39 109 -29 -35 104 -48 -42 80 -72 17 19 -7 89 -81 22 81 -91 42 81
3067 81 -97 113 -28 -71 57 -100 49 -6 0 108 -57 -63 58 -24 10 43 -90 -70 -1 -40 118 -40 86 93 -61
3092 -61 104 24 -1 118 -86 -31 52 -29 -3 0 -92 103 -2 -9 139 -69 -33 104 -136 7 -53 -27 43 -7 0 30 -34
$$ packed form
2917a2%K6oQp7J59j35j11K11j30k0J81j52J9J12k5j2r9N5R1j28P9J34k64P2N5
2943C1j45J41Ln4R8j50J87k0j85J65j11k9J36j29MJ13j64J40K5p9Q5j74J62o6
2967a6j30J99k2j65J78o6j17J52l8M3m0j9J15j61k9K38j86M0L6j14J37l2l7J37
2991A03j80J44jj68J54L5j61P0m1mN4l8L5r1P8J25j50L7J50k67P3M6p4J14nn5
3017a7Q5j35P9P6j58J40j25r6K20j70N0O7q6L3O8p5J82k27J43J03k26O5N4j18
3041f8P2j9m5Q4j24J88n6p1J48j38oJ39j52OJ22j52Q9Kk6R6j70J03N9j72J33L9
3067H1j78K10j41m3J28j57J49n5OJ08j65oJ21q2L4L3j33K0O9l9J58j58J26Pj54
3092f1J65q0k5J19k04N5Q3q1K6Lr2J95j05pJ48k08L6J37k40J43o0K6P0n0PL0o4
$$ plain form
3119 -34 52 38 -59 64 -3 -123 -13 1 -50 -26 -47 83 30 -26 153 -40 34 22 -28 46 -16 -53 41 -50 10 20 -41
3146 -41 83 32 -73 31 -37 -27 23 -17 56 -3 -94 20 31 -16 45 -28 109 76 -70 36 67 -117 72 -66 -49
3171 -49 52 -73 73 37 -31 103 -20 -16 74 -33 16 -42 -72 -18 -51 -64 161 -20 -9 127 -62 -47 15 -1 30 -113
3197 -113 -46 38 -78 -1 -27 -20 73 24 -12 119 -80 113 58 -5 53 -13 -58 97 -29 17 94 -45 80 59 -50 75
3223 75 -56 -24 106 -21 -55 -61 -22 104 -31 -5 79 4 -4 84 -44 -20 12 -2 50 -135 73 -15 -37 100 45 -50 66
3250 66 -23 11 70 -82 17 -85 -75 67 -31 18 112 -116 77 58 -45 112 12 9 76 -88 5 56 -63 7 56 -67
3276 -67 125 -27 48 93 -105 66 -27 -17 26 -96 -71 82 -112 41 76 -86 134 -51 -94 116 -6 -66 -54 -61
3300 -61 18 -30 19 142 -95 -10 71 -86 67 -28 15 74 -164 -51 89 -43 95 70 -75 76 31 31 74 -47 53
$$ packed form
3119c4Q6j4r7J23o7j20J10J4n1K4k1J30n3n6J79j93P4j2n0P4o2l7R4r1O0J0o1
3146d1J24n1j05J04o8J0N0m0P3n9r1J14J1m7O1p3J37l3j46J06L1j84J89j38J7
3171d9J01j25J46l6o8J34j23MR0j07M9n8l0N4l3j3K25j81J1J36j89J5O2j6L1j43
3197a13O7Q4j16P7k6PR3m9l6J31j99J93n5o3N8o6m5J55j26M6P7j39J25k1j09J25
3223G5j31L2J30j27l4oL9J26j35K6Q4p5qQ8j28K4L2j4N2j85K08q8k2J37n5r5J16
3250F6q9L4N9j52R9j02J0J42r8M9R4k28J93j9j03J57j00lO7j64R3N1j19P0M9j23
3276f7J92j52P5M5j98J71r3J0M3j22K5J53j94J53L5j62K20j85m3K10j22o0J2p
3300f1P9m8M9J23k37Q5Q1j57J53r5M3N9k38J13J40j32J38k5j45J51m5%M3j21J00
$$ plain form
3325 53 -5 -65 56 -83 -64 77 25 29 -3 -87 90 -54 -24 66 -97 -19 72 -93 36 -30 -36 94 -51 -22 53 -154
3351 -154 44 66 -98 13 -27 9 47 -119 15 95 -23 30 37 -81 70 -68 -72 -39 -61 123 -83 -25 57 -55 18
3376 18 52 -73 45 27 -52 62 -33 -12 53 1 82 42 -83 39 28 -76 72 -97 77 -43 -57 43 -24 -116 46
3401 46 -23 -88 82 -61 -17 -8 -56 33 -2 25 48 -86 29 -21 -161 76 -2 -78 98 -43 -80 39 -34 33 -2 -27
3427 -27 61 -34 -32 70 11 57 68 -63 106 -66 -55 46 -40 61 59 -78 111 19 -72 133 13 -6 25 9 65 -40
3453 -40 -30 98 -107 57 90 -133 -14 76 -33 97 56 -94 40 -35 -39 31 -92 31 -26 -36 36 -43 31 71 -48
3478 -48 10 17 -78 45 16 -30 74 -141 -14 124 -74 87 -14 -17 80 -48 19 35 -105 47 -42 -31 99 -1 -25
3503 -25 83 -56 47 51 -32 66 -17 -5 33 -89 66 74 -130 10 32 53 100 -54 68 3 -83 118 -1 -131 102
$$ packed form
3325E3n8o0J21j39J9J41n2Ml2q4J77j44L0R0j63P8R1j65J29o6oJ30j45K9P5k07
3351a54J98K2j64J11m0L6L8j66J34Q0j18N3Pj18J51j38mL3k2J84k06N8Q2j12P3
3376A8L4j25J18j8p9J14r5K1O5n2Q1m0j25J22j1j04J48j69J74j20j4J00o7r2J62
3401D6o9o5J70j43M4Rm8Q9l5K7K3j34J15n0j40K37p8p6J76j41l7J19p3O7l5k5
3427b7Q8r5KJ02n9M6J1j31J69j72J1J01q6J01kj37J89r2r1K05j20j9L1j6N6j05
3453d0J0J28k05J64L3k23J19R0j09J30m1j50J34p5mP0j23J23n7j0P2p9P4M0j19
3478d8N8Pr5J23k9m6J04k15J27J38j98J61j01lR7j28O7J6j40J52q9J1J30j00k4
3503b5J08j39J03Mq3R8q3J2L8j22J55Qk04J40K2K1M7j54J22o5q6K01j19j30K33
$$ plain form
3528 102 -107 -21 110 -58 46 32 -51 41 -92 -15 -11 -91 105 -30 -20 27 -74 49 54 -55 36 65 -101 91 -28
3553 -28 -82 149 -47 -70 21 -106 60 -17 1 80 -33 -39 60 -115 72 -45 -115 102 -85 -79 27 -6 41 52 -38 50
3579 50 -101 20 86 -190 36 1 -119 102 25 -86 34 -42 18 99 -56 3 54 -109 25 -44 -61 -20 -85 14 -37
3604 -37 -56 104 -144 -36 116 -96 -24 48 -144 57 59 26 27 -119 44 48 -71 81 -8 -44 95 -43 55 23 -78
3629 -78 105 -42 -45 116 -40 -77 28 -85 49 68 -111 56 -56 -26 18 -51 111 9 -46 152 -10 -73 79
3652 79 -20 -42 25 -61 45 7 8 97 -83 54 104 -69 56 -12 -60 103 -27 -42 57 -24 25 31 10 112 45 -48 102
3679 102 -96 -19 77 -39 -21 38 -12 46 -35 -3 55 -124 69 11 -95 52 -11 -73 12 -112 27 37 -72 39 5
3704 5 -46 100 -26 -33 20 -65 29 -60 8 17 -133 24 3 -10 82 15 -86 27 29 -3 48 -9 36 8 -58 48 -59 -15
$$ packed form
3528A02k09Q6J31j68J04j4q3R2j33P7Mq0J96j35J0M7j01J23Nj09R1K9j66J92j19
3553b8n4K31j96k3R1j27J66p7J8P9j13oR9j75J87j17p0K17j87OJ06l3M7J1r0Q8
3579E0j51J21O6k76K26l5j20K21p7j11J20p6O0Q1j55N9N1j63J34o9j7M1o5R9n1
3604c7j9J60k48J08J52k12P2P2j92K01Kl3Jj46J63Mj19J52q9l6J39j38R8l2j01
3629g8J83j47lJ61j56l7J05j13J34J9j79J67j12L0M4o9J62j02n5J98j62o3J52
3652G9r9k2O7q6J06l8JQ9j80J37N0j73J25o8m8J63j30j5R9q1M9Ok1J02o7r3J50
3679A02j98P7R6j16J8N9n0N8q1L2N8j79J93n8j06J47o3o2Q5j24J39J0j09J11l4
3704En1J46j26pN3q5R4q9O8Rj50J57k1j3R2o7j01J13Kl2N1n7M5k8o6J06j07M4
$$ plain form
3732 -15 105 -75 -17 77 -61 71 4 4 8 -51 24 36 16 33 30 -75 67 -39 -89 73 4 55 -7 -84 43 -24 -115
3759 -115 4 -51 48 50 -74 24 54 -81 33 3 7 -15 -65 91 -53 -36 124 18 2 -25 20 -7 36 -97 60 2
3785 2 -24 91 -74 61 116 -66 52 16 -35 -5 -40 18 10 -14 53 -19 -75 145 -55 -38 101 -68 40 1 -124 21
3811 21 -40 -128 94 -32 12 56 -70 -8 35 -68 85 -23 -18 53 -96 41 9 -75 155 -96 -12 42 -49 52 17
3836 17 -9 36 -21 -40 53 -81 60 95 -51 87 -45 -71 1 -33 -2 -26 -50 16 -28 -53 122 3 -50 52 -88 -11
3862 -11 -72 -23 71 -34 -33 95 -117 -17 14 -98 89 57 -17 118 -23 26 13 -122 166 8 -38 71 -87 38
3886 38 34 6 47 4 -56 74 -49 -24 126 -100 72 41 -107 50 20 -26 62 -80 23 9 -31 10 -13 -77 93 -103
3912 -103 -23 96 -99 70 -74 -71 92 1 -5 43 -106 14 -21 -78 58 -28 -17 104 -72 -18 47 -57 58 -58
$$ packed form
3732a5J20j80N8R4j38J32o7%Mn9P5J2k0J7lj05J42j06n0J62o9N1o2p7J27o7r1
3759a15J19n5R9Kj24R8L0j35J14l0Mk2n0J56j44J7J60j06j6k7M5k7M3j33J57n8
3785Bk6J15j65J35N5j82J18l6n1L0l5N8qk4O7p2n6K20k00J7J39j69J08l9j25J45
3811B1o1q8K22j26M4M4j26O2M3j03J53j08NP1j49J37l2q4K30k51Q4N4r1J01l5
3836A7k6M5n7j9R3j34J41L5j46J38j32k6P2l4L1k4k4O6m4k5J75j19n3J02j40P7
3862a1o1M9R4j05JJ28k12J00L1j12J87l2p4J35j41M9j3j35K88j58m6J09j58J25
3886C8mk8M1m3o0J30j23K5J50k26J72l1j48J57l0m6Q8j42J03j4m0M1k3o4J70j96
3912a03Q0J19j95J69j44LJ63r1oM8j49J20l5n7J36q6J1J21j76N4O5j04J15j16
$$ plain form
3936 -58 -107 82 -81 -15 15 -61 13 33 13 46 15 47 -2 -62 20 23 -82 99 -53 -43 43 -15 61 -23 24 50 -10 -75
3964 -75 34 -26 -1 118 -64 64 5 -31 58 -81 -36 50 -61 51 -17 -51 78 -68 -58 8 -83 71 26 -67 52
3989 52 -67 55 76 -105 4 78 -131 56 45 -111 81 -50 32 2 -76 58 72 -36 110 -33 -12 61 -75
4012 -75 14 51 -15 34 60 -49 111 -70 -81 36 -120 63 -44 16 88 -103 -24 48 -144 81 8 -113 83 -54
4036 -54 -91 -3 -25 43 38 -96 96 18 -63 -7 -31 42 61 -17 108 -77 -43 62 -86 -22 20 9 89 13 -67 92 -84
4063 -84 3 91 -59 -57 44 -94 3 4 -36 30 -82 76 37 -72 25 5 -33 66 -71 15 -60 -76 78 51 -92 76
4089 76 -47 -37 73 -105 -2 -49 -78 38 -15 -34 107 -61 91 73 -40 33 -11 -83 32 -74 -39 47 -81 66
4113 66 103 -78 -23 -61 -22 92 -70 82 -21 -43 107 -87 -94 121 -44 -28 45 -5 36 -5 37 113 -24 7 -16 -62
$$ packed form
3936e8m9J89j63O6L0p6P4K0k0L3l1L2m9o0Q2Lj05J81j52J0Q6n8P6q4M7K6o0o5
3964g5J09o0K5J19j82J28n9l6Q9j39M5Q6j11J12o8l4J29j46J0O6r1J54m5r3J19
3989E2j19J22K1j81J09P4k09J87j1j56J92j31Q2l0p8J34J4j08J46j43K1P3j36
4012g5Q9L7o6M9K6j09J60j81j1J17j56J83j07O0P2j91P9P2j92K25p3j21J96j37
4036e4l7Q8k2O8nj34J92p8q1N6k4P3J9p8J25j85L4J05j48O4M2j1Q0p6q0J59j76
4063h4Q7Q8j50KJ01j38R7Jm0O6j12J58l9j09R7k0l8R9j37Q6p5j6J54k7j43J68
4089G6j23J0J10j78J03m7k9J16n3j9J41j68J52j8j13P3m4p2J15j06L5Q6j28J47
4113F6L7j81N5l8L9J14j62J52j03k2J50j94pK15j65J6P3n0M1m1M2P6j37L1k3m6
$$ plain form
4139 -62 15 -46 -114 37 -30 -10 145 -109 -3 19 -85 42 3 -80 41 -12 30 31 -5 17 -110 3 67 -68 76
4164 76 -7 -107 92 15 -58 105 -3 -3 53 7 -12 -66 -31 80 -73 14 61 -58 78 13 -61 82 -28 -7 27 -78
4190 -78 41 18 -60 73 38 -17 -7 -53 10 31 -39 90 -72 -20 108 -23 -11 -5 -96 72 104 -90 67 18 15 38 -80
4217 -80 -9 21 -29 108 -52 -94 25 -50 -73 16 -76 -12 -34 12 65 -30 -13 58 -64 15 -45 -61 24 14 -27 101 -88
4244 -88 14 -20 -56 42 17 -111 6 -38 -47 59 -80 14 36 29 31 -73 11 45 -61 -2 -20 -91 24 -35 -51 70 -52
4271 -52 3 -25 -62 58 -41 -88 10 -67 -47 3 -4 79 26 -9 2 -53 40 62 -43 37 -55 -60 79 -13 -14 52 -50 -10 40 -58
4301 -58 72 2 -18 -9 -54 14 55 -35 59 17 -39 87 -76 15 38 -65 40 20 -76 30 -24 29 48 -6 20 35 23 86
4329 86 5 -18 99 -48 4 62 -98 50 -39 35 -1 -98 33 59 -65 54 53 -81 34 42 -6 2 -83 27 -9 12 84
$$ packed form
4139f2P7o1o8J51o7K0J55k54J06K2j04J27l9q3J21n3M2Jl6K2j27J13O4j35J44
4164G6q3j00J99p7p3J63j08%N6m6j9n4L5J11j53Q7M7j19J36o5p4J43j10K1L4j05
4190g8J19k3p8J33l5n5J0m6O3K1p0J29j62N2J28j31J2Or1J68L2j94J57m9lK3j18
4217h0P1L0n0J37j60m2J19p5k3Q9r2O4k2M6N3r5J7P1j22P9o0j6Q5j0m1J28j89
4244h8J02l4l6R8k5j28J17m4rJ06j39R4K2pKj04Q4L4j06N9j8p1J15n9j6J21j22
4271e2N5k8l7J20r9m7R8p7K0N0pQ3n3l5J1n5R3K2j05Q0r2nJ39r2jO6j02M0N0r8
4301e8J30p0k0Rm5O8M1r0R4m2n6J26j63R1K3j03J05k0r6J06n4N3J9n4K6J5j2O3
4329H6q1k3J17j47N2N8j60J48q9P4l6r7J31K6j24J19jj34J15Qm8Qq5J10l6K1P2
$$ plain form
4356 84 -45 0 107 -81 -5 45 -4 65 -27 -22 -10 -72 29 26 -73 -12 44 -86 47 -5 -26 75 -53 52 38 14 36
4383 36 -74 -35 20 -41 6 53 -16 -5 -16 -45 -2 -65 19 -3 -112 1 -93 -17 93 -63 -7 83 -37 -51 -36 -5 91
4410 91 -38 38 37 -59 25 -7 -43 82 -32 -50 65 -78 7 57 -42 27 -3 -19 28 -102 -40 4 -52 -17 -31 -57 32 -59
4438 -59 -43 50 -85 38 10 -47 54 -21 -154 87 -45 59 60 -64 30 -9 -13 40 -64 -70 98 -14 35 3 23 14 -71
4465 -71 -27 51 -96 56 38 -74 64 39 19 107 -20 -11 -29 3 39 -19 -1 105 -41 -1 103 -3 -15 6 -23 61
4491 61 -76 -3 38 -71 -21 10 -39 105 -24 -31 116 -83 -20 -3 -61 107 -18 -31 70 -61 -24 57 -68 69 46
4516 46 -13 79 -72 -7 28 -61 77 -49 -29 78 11 -75 -37 -21 102 -31 -60 77 -52 -39 -20 -72 -32 33 -39 37
4542 37 7 -48 34 -72 37 11 -91 107 16 -64 130 -14 -32 26 -4 15 -21 -75 71 4 -59 83 64 -57 39 -50
$$ packed form
4356H4j29M5J07j88P6N0m9O9r2NJ2o2J01lr9O1N6j30J33n2k1J01j28J05j4k4K2
4383C6j10L9N5o1M7M7o9J1j1k9M3o3Q4k2j09J13r4P6J10j56N6R0j20j4J5L1R6
4410I1j29P6jr6Q4l2l6J25j14j8J15j43Q5N0r9O9l0j6M7j30O2M4n6L5j4k6Q9r1
4438e9J6R3j35J23k8n7J01p5j33K41j32J04Jj24R4l9mN3j04oJ68j12M9l2K0rq5
4465g1M4P8j47J52j8j12J38k5k0Q8j27Rj8L2L6n8J8J06j46M0J04j06j2K1k9Q4
4491F1j37P3M1j09N0L1m9J44j29pJ47j99O3J7n8J68j25j3J01j31L7Q1j25J37k3
4516D6n9R2j51O5L5q9J38j26K0J07o7q6L8J6J23j33k9J37j29J3J9n2M0O5p2P6
4542C7l0n5Q2j06J09k6j02J98r1q0J94j44j8N8l0J9l6n4J46o7o3J42j9j21R6q9
$$ plain form
4568 -50 27 -18 -16 60 -18 45 28 -78 34 -35 -49 80 14 -3 -52 -81 65 13 -50 61 0 7 77 -151 -10 41 -55 39
4596 39 9 -11 -21 -29 72 5 -98 5 -60 -69 69 -15 -42 -4 -89 7 -2 -27 -3 2 -7 51 -6 82 13 -33 46 -43 38 12 -58
4627 -58 30 22 11 33 30 -18 22 -29 -33 36 -15 13 -64 -38 -26 -95 -29 99 12 -5 -31 -82 111 -13 -26 35 -66 -14 42 -80
4657 -80 52 -65 24 8 -16 15 -55 -117 -23 16 -37 66 -81 -31 56 44 -3 4 -20 -14 1 -51 3 -61 2 -17 -55 22 76
4686 76 -50 20 31 -44 63 -102 92 84 -40 22 -44 -33 11 -31 -18 95 -94 64 13 -42 32 -13 33 135 -69 -23
4712 -23 23 -25 11 -13 13 80 -41 21 -5 -47 22 -57 -93 68 -15 -5 36 -37 -56 -27 -56 32 24 17 -1 8 97 -32 -31 48 -87
4743 -87 1 75 -111 51 77 -38 23 7 16 71 -53 -43 22 -62 58 -62 -32 29 -58 7 93 -68 38 -35 -81 84
4769 84 -8 -24 53 3 61 25 -50 -26 -41 49 56 -8 38 -2 -104 91 89 -11 46 -10 -53 134 -27 -28 -10 18 77 13 59
$$ packed form
4568e0P7m5KP6p8O3j7j06J12o9j4J29o6j7m9k9J46n2o3J11o1PP0k28J41N1r6R4
4596C9l0k0j0qJ01o7j03J03o5rJ38q4k7L8q5R6rk5K4NrN8n7Q8o9m6P9q9Q1k6p0
4627e8Q8qj1K2lm8M0n1mO9n1K8p7K6J2o9O6J28q7j7k6n1J93j24j3O1j01N2N6j22
4657h0J32j17Q9j6k4L1p0o2R4L9n3J03j47N0Q7j2m7Pk4OJ5n2N4o4O3j9l8P7N4
4686G6j26P0J1p5J07j65J94qj24O2o6J1M4m2J3J13j89J58n1n5P4m5M6J02k04M6
4712b3M6m8L6k4K6O7j21O2k6m2O9p9l6J61q3J0M1p3j9K9k9Q8qpj8RQ9j29JP9j35
4743h7Q8P4j86J62K6j15O1j6RN5j24J0O5q4J20j20L0O1q7O5Q6j61J06p3m6J65
4769H4r2j6P7n0N8l6p5K4j5R0Po4M6m0j02J95kj00N7n6m3J87j61jJ8K8N9o4M6
$$ plain form
4798 59 -4 -77 106 28 -56 88 -81 -59 101 -78 -50 48 -55 51 30 -31 4 -53 101 52 -76 -31 -54 -43 119
4823 119 -41 -69 68 -141 38 91 7 -2 -62 -5 38 -31 28 14 -102 42 26 -42 55 -21 68 81 -70 108 0 -62
4849 -62 112 -11 -82 40 -13 -10 -17 32 22 -83 65 36 -27 48 -50 -43 48 -29 -58 -45 -40 70 60 -58 37 -13 -47 27 -22
4878 -22 -14 -15 14 26 -33 6 19 -3 -9 13 -25 -86 -42 -57 56 -64 -64 83 -19 47 -25 -75 2 -66 22 70 15 51 -24 -55
4908 -55 48 -20 29 -39 -68 -11 -23 -32 18 26 34 75 -36 10 15 8 -29 40 27 -5 26 -1 26 -43 26 14 -129 52 30 -48 55
4939 55 37 12 18 23 -11 57 -48 10 -22 -25 12 -78 27 10 -34 90 -97 -38 24 -109 -9 35 25 1 -5 -23 38 -34 -31 9
4969 9 33 16 34 -65 43 0 13 47 -87 14 65 -8 28 -2 -4 56 -22 5 -36 1 22 -18 -2 54 20 0 93 5 51 -29
4999 -29 -54 67 8 -45 7 -66 -11 14 -57 -27 -7 -40 -29 -26 20 -1 -64 39 4 -36 34 3 31 84 -65 -12 41 -122 12
$$ packed form
4798E9o3p3J83p8q4J44j69K2J60j79K8R8j03J06k1o1L5n7J54m9j28M5k3J1J62
4823A19j60k8J37k09J79N3q4ro0N7M3o9N9j4j16J44j6o8R7p6Q9J3j51J78j08o2
4849f2J74j23p1J22n3LpM9j0j05J48k9o3P5r8PR1p7k9J3NJ10j0j18R5n0l4P4m9
4878b2QjK9J2n9L9J3k2oK2l8o1M4j5J13j20%J47j02O6p2n0P7o8Q8M8n5L6p5l1
4908e5J03o8M9o8k9N7j2rN0QQM1j11M6Npl7O9j3l2L1k7K7o9O9j2j43J81k2p8J03
4939E5j8k5ONl4O8j05N8l2lL7r0J05j7m4J24j87N9O2j33J00M4j0k4oj8O1p2LM0
4969IK4j7J8r9J08m3J3L4j34J01N1p3L6l0kO0p8K7m1L7K1m0J6N6l4k0R3q8M6q0
4999b9k5J21n9n3N2p3N5K5p1L0K0l3J1LM6k1o3J03l5m0P0l1K8N3j49N3N3j63J34
$$ plain form
5028 12 -11 -4 56 -66 5 16 -97 96 52 -6 28 -37 -14 38 -18 12 -40 -53 93 -10 5 76 -66 -41 -18 -27 41 -90
5056 -90 38 33 -71 -38 -12 -47 2 -37 -28 55 -91 -7 4 -61 51 -44 -62 97 2 -39 21 -15 45 -28 -51 20 -28 37 49
5085 49 -35 -2 30 -6 5 -22 53 61 -20 51 -62 -62 39 -36 -28 42 -57 -42 17 13 31 28 -49 75 -54 -32 -37 -98 79 -31
5115 -31 -59 5 -23 -104 75 -53 32 -29 -61 13 -77 -68 21 -66 58 42 -34 46 -42 -38 54 -88 2 4 -58 34 -43 -27 -31 -59
5145 -59 -35 29 0 47 -4 -43 86 2 -32 47 -54 -41 8 -6 41 18 9 55 -59 -33 -39 -15 29 7 -56 -17 -45 -17 -2 -75
5175 -75 3 -2 -21 17 -32 -64 17 -18 9 13 -39 7 51 -15 29 -48 -37 39 -8 -23 -3 -34 3 10 16 42 -34 53 -9 -57 47 -53
5207 -53 -16 47 -30 39 49 4 -18 35 -11 -14 -22 37 -7 7 52 -36 -5 55 -46 -9 -1 -24 8 -56 -48 72 -31 -50 21 -47 33
5238 33 11 -58 28 12 -8 129 -70 11 35 -90 37 -49 -66 102 6 -85 66 -80 15 -22 30 1 -35 -43 37 -36 -29 -24
$$ packed form
5028A2k3PO0j22P1J1j13J93m4n8L4o5K3N2n6L0n2j3J46j03J5P1j42K5K3rO8j31
5056i0J28nj04L3K6l5M9l9RQ3j46Q4J1o5J12r5j8J59r5m1O0l6O0p3k3P1m8O5J2
5085D9q4L3L2l6J1k7P5Qq1P1j13%J01p5QP0r9J5N9mJ8lp7J24j29K2no1J77j10
5115c1k8O4k8q1J79j28Q5o1l2P4r0RQ9q7J24j6p6Q0q8MR2j42R0Ko2R2p7J6mk8
5145e9K4O4k9M7n1l9J29q4l4P9j01J3M9j4M7k3rM6j14K6oK4M4k2o3L9k8K8J5p3
5175g5P8nj9L8m9l2Q1l5K7Mn2M6M4o6M4p7J1P6m7j5K0l1L7POK6p6Q7o2m8J04j00
5207e3L7O3p7O9J0m5k2N3m6lqN9m4J4M5q8L1O0j01L7Qk3L2o4QJ20j03j9P1o8Q0
5238C3k2o9Q6j6k0J37j99Q1K4j25J27q6j7J68r6r1J51j46R5l7N2k9l6qQ0p3PN
$$ plain form
5266 -24 -8 83 40 1 71 -11 -12 34 -8 56 21 -59 15 -26 -78 52 -34 -13 14 -17 59 -49 -23 42 -33 15 46 -78 73
5295 73 99 -85 12 17 9 46 -87 43 38 -47 -2 -1 10 -37 -60 2 79 -21 26 -10 12 65 -37 28 34 -62 25 -17 -42 12
5325 12 -57 -52 -54 -40 72 77 -69 119 -45 32 40 -65 8 3 -31 19 -57 -67 37 -22 23 44 -76 31 10 -105 -3 23
5353 23 5 45 -41 44 -33 -75 64 -27 28 59 -74 59 13 -38 68 -26 -64 115 -70 17 64 -51 97 -58 -45 -16
5379 -16 -112 -18 22 -46 74 7 -66 13 -27 -30 118 -129 38 47 10 10 -56 46 -4 46 90 -15 -50 88 37 -117 105
5406 105 -77 7 11 -62 10 -18 -75 78 -21 -12 26 -46 25 47 -71 -54 -78 20 75 -42 62 -11 -47 42 5 -65 47 -45
5434 -45 -18 39 3 7 -31 31 34 52 26 -2 -6 5 -71 -58 5 -77 -43 52 -15 -5 12 -46 17 8 12 2 -94 39 -11 -10 -34 -56 -76
5467 -76 87 -61 78 13 -69 16 11 -39 -72 -68 47 80 14 10 -31 -7 35 6 26 24 27 0 21 3 20 -30 -51 97 -55 47
$$ packed form
5266b4J6R1m3l9P0q2jM6m2O4l5q0P4m1n2J30q6K1K7l1P6j08K6O5p5M8L1j24J51
5295G3K6j84R7NqL7j33J30nq5M5JJ1m7k3O2P7j00M7l6K2N3j02O5Or6Q7m2k5N4
5325A2o9NkJ4J12Nj46J88j64P7Qj05P3nl4N0p6j0J04n9M5K1j20J07k1j15J02K6
5353B3j8M0q6Q5p7m2J39r1N5L1j33J33m6n1J06r4l8J79j85Q7M7j15J48j55J3K9
5379a6r6R4M0o8J20o7p3P9m0lJ48k47J67Rl7%o6J02n0N0M4j05l5J38n1j54K22
5406A05j82Q4Mp3P2k8n7J53r9RL8p2P1K2j18J7k4R8N5j17J04p3l6Q9l7p0J12r2
5434d5K7N7l6Ml8O2LJ8k6k8mJ1p6J3O3q2L4R5o7J0J7n8O3rMj0r6J33n0Jk4k2k0
5467g6J63j48J39o5q2Q5nn0l3MJ15L3o6mm1K4M2k9K0kLk7K1j8J7n0k1J48j52J02
$$ plain form
5497 47 24 -108 43 -17 -3 31 -72 -4 58 -3 30 -25 -47 44 -44 23 58 -72 -9 19 -126 -28 -14 -81 13 7 -50 22
5525 22 -3 -16 66 -27 30 -103 1 72 -16 83 6 -78 13 111 40 73 -38 19 62 12 -2 26 -4 -25 -8 -39 41 -82
5553 -82 62 14 -26 90 -77 -67 115 -37 31 12 -102 -20 -20 -74 56 -29 -6 10 -74 48 -43 -51 52 -49 5 -42
5579 -42 -43 36 15 -65 -8 -49 12 92 -43 11 60 -5 -7 -8 -35 86 -24 -3 16 -33 88 64 -42 128 15 10 0 -83 -21
5608 -21 2 18 56 -16 72 75 -30 33 -5 -96 74 -10 -61 76 -84 22 2 -10 135 -16 -85 87 -26 -80 50 -55
5634 -55 19 -71 -43 24 -97 -45 -3 -87 31 1 -6 47 2 45 18 -58 120 -31 -58 85 -25 -29 99 -63 10 -18 -75
5661 -75 63 -45 -10 32 -62 -35 6 -45 62 17 -47 143 36 52 78 -28 7 1 2 -12 -49 -83 113 -52 -42 42 -20
5688 -20 1 -49 -5 35 -68 16 -7 -66 58 -35 20 25 -30 23 -22 -55 10 -56 -28 44 -42 -43 -8 -8 -23 37 -89 31 48 -27
$$ packed form
5497D7k3j32J51o0J4L4j03O8O2o1L3n5k2R1q8O7L5j30O3K8j45R8J4o7R4on7P2
5525B2k5j3Q2r3N7j33J04P1q8R9p7q4R1R8p1L3j11N7M3n0j4K8l0k1J7l1Q0j23
5553h2J44m8m0J16j67J0J82j52O8j9j14Q2%n4J30q5K3J6q4J22r1qJ03j01N4m7
5579d2jP9k1q0N7m1O1Q0j35N4M9o5kjk7J21j10K1J9m9J21k4j06J70j13nj0q3O2
5608b1K3J6L8p2Q8Lj05O3l8r1J70q4n1J37j60J06k0j2J45j51o9J72j13n4J30j05
5634e5P4r0K8O7j21N2M2q4J18l0pN3m5M3k7p6J78j51k7J43j10mJ28j62P3k8n7
5661g5J38j08L5M2r4K7M1n1J07m5o4J90j07J6K6j06L5oJj4l7l4J96j65J0Q4o2
5688b0K1n0M4M0j03Q4k3n9J24r3N5Nn5N3m5l3O5o6K8P2q6jL5%j5O0j26J20J7p5
$$ plain form
5718 -27 -29 -34 51 -37 -65 -47 2 11 91 -42 -2 -20 -42 -36 -49 -18 78 -66 -10 -30 -22 21 -50 -6 40 -59 8 24 -1 37 -39 -139
5750 -139 36 -80 21 41 -47 -36 16 14 20 65 32 -17 -32 -9 58 -73 3 22 -61 96 -18 -13 11 -26 59 21 -112 82
5778 82 23 22 35 -19 34 -25 -48 21 45 -19 36 -38 -50 10 -16 -14 20 -48 46 -25 -48 39 -15 74 24 -46 65 0 -19 15 -75
5809 -75 -47 59 -15 59 45 32 40 -34 21 42 -66 40 50 -20 -21 10 34 8 17 -34 -30 -32 94 -68 9 53 -21 -39 57 -48
5839 -48 53 3 -52 46 -19 7 41 -42 -56 26 -90 18 0 -10 60 -31 -48 1 0 2 0 -82 63 26 0 30 23 -31 -65 -57 39
5870 39 -43 -10 58 -57 75 19 -126 79 16 -29 109 -44 -10 -28 -12 69 38 -40 36 71 -90 114 -89 -8 42 -41
5896 -41 -39 -50 27 75 -162 59 -2 49 8 -34 -73 65 16 -7 -24 -25 104 19 -49 37 -42 23 -62 -64 70 -4 -17 77 16
5925 16 32 -25 -105 37 -18 -7 89 20 -30 25 -71 -5 -9 -32 50 -27 26 44 -36 17 54 -85 95 -56 7 63 -14 44 60
$$ packed form
5718b7knQ5q8k8J8M9RQ0j33M0j8k2Oj3L1R6j44N6k0QM3p1M4M6r9O7J6k5L8p6j00
5750a39J75j16J01K0q8J1N2kOM5l3m9j5K3O7j31P6J9q3J57j14NK4l7Q5l8j33J94
5778H2n9jJ3n4N3n9k3O9K4o4N5p4j2O0k6KL4o8R4p1k3Q7n4Q9n0p0J11o5j9L4r0
5809g5K8J06p4P4j4j3Qp4N5K1j08J06J0p0jL1K4k6Rn1MkJ26j62P7M4p4j8R6j05
5839d8J01n0n5R8o5K6L4q3j4Q2j16J08j8j0P0r1j7M9jKkq2J45l7k6L0pn4l4QR6
5870C9q2L3O8j15J32n6j45K05o3m5J38j53L4j8J6Q1l1p8P6L5j61K04k03Q1N0q3
5896d1Kj1P7M8k37K21o1N1m1m2l9J38m9k3j7jJ29q5o8Q6p9O5q5kJ34p4j3R4o1
5925A6J6n7q0J42n5J1R6o9n0N5r6O6mk3Q2p7N3J8q0N3L7j39J80j51O3N6p7N8J6
$$ plain form
5954 60 -53 5 -14 -8 72 -43 -12 18 -55 -20 35 -99 72 -21 13 92 -63 -8 17 -47 78 4 -30 88 -54 33 -35
5981 -35 -43 98 -3 10 43 -76 3 65 -4 30 -18 -78 23 -51 28 24 15 82 32 -24 41 -28 -94 94 -13 52 6 -74 4
6010 4 -42 -27 55 -15 -31 -57 -39 17 -22 -45 49 -41 -100 21 -89 6 5 -58 -10 -39 -34 31 -37 -15 3 -14 46 1 -12 -7 -74
6041 -74 10 72 -55 79 44 -51 -50 -59 15 65 -25 -13 4 -17 36 43 -30 60 -56 -8 52 -23 70 -17 5 97 -49 -54 -50 -39 32
6072 32 -29 -9 68 -66 9 -23 -111 -8 -12 -75 44 9 9 -38 -39 -28 -14 24 26 -17 5 40 -26 43 22 -61 29 46 -13 45 -36
6103 -36 8 82 -108 4 -11 13 58 -16 -50 96 -4 -41 -12 -127 6 -7 -9 69 -20 -38 38 -65 -13 -40 34 25 21 0
6131 0 41 -19 29 31 -73 85 -30 -63 46 19 11 11 -65 52 -6 -38 -21 -35 13 52 26 -3 16 -4 -7 16 -55 9 -39 -25
6161 -25 14 -4 8 -23 0 6 -116 -13 43 -110 -19 26 -50 2 -73 29 70 -23 32 8 -60 32 38 6 94 -67 -12 3 13
$$ packed form
5954F0j13N8j9OQ0j15L1L0p3L5N5j34J71r3L4P9j55N5K5o4J25p4l4J18j42Q7o8
5981c5qJ41j01J3L3j19P9O2o9L4m8o0J01p4P9mrO7n0n6O5o9o6J88j07O5m6q0P8
6010Dm6J5Q2p0j6k6J8N6l9k3R4r0n9J21j10R5jo3M8k9NO5o8K2J8j7O0m5j3No7
6041g4Q4O2j27J34l5r5JrP4N0r0J2J7k1N3Pp3R0j16M8O0p5R3q7K2R2j46nMJ1P1
6072C2o1K0P7j34P5l2q8J03mo3J19l5%m7jJ1J4L8Km3K2L5o6O9k1q3R0J7n9N8q1
6103c6M4P4j90J12j5K4M5p4l4J46j00l7K9j15J33j3kP8q9j8P6j03N2k7P4rmk1
6131@M1o0M8Kj04J58j15l3J09k7q%p6J17n8l2J7j4M8L9k6k9J9k0lK3p1O4m8J4
6161b5L9j8J2l1K3Oj22J03N6j53R1M5p6N2p5J02M1r3N5k4o8R2Ol2Q8j61N5J5J0
$$ plain form
6190 13 -28 -35 -40 48 -77 -11 -28 -38 23 -47 -31 -6 -73 -5 -9 -36 14 24 -107 2 20 54 5 -76 93 39 -7 73 -26 23
6220 23 94 -22 -22 17 45 27 32 -22 52 49 35 62 -49 -27 10 -60 54 -141 -26 41 -69 60 -19 -27 13 -83 -54 35 -127
6249 -127 -22 -47 56 1 -50 -37 1 -25 42 3 -107 78 -23 -19 62 8 43 -22 -32 26 -80 7 127 -6 -22 -12
6275 -12 -72 -5 4 -39 -22 -88 -23 27 -109 -8 2 -118 74 11 -1 69 -72 -18 -75 -18 38 37 37 89 -78 8 2 -55 50
6304 50 6 -62 31 -70 10 13 -85 63 31 -66 -14 -69 -57 -37 7 61 -81 -104 10 0 -21 62 -59 30 59 -66 3 5
6332 5 -33 103 -27 7 62 -32 -20 47 8 136 8 29 -24 -9 33 53 -107 70 -47 -70 18 -13 -37 5 -16 19 -57
6359 -57 41 27 -32 -15 16 -17 29 21 -46 92 0 12 34 -58 -33 -7 -49 53 -65 -52 77 -40 -34 5 -14 -45 -2 -50 78
6388 78 -20 -15 13 -67 46 32 -34 48 23 17 15 3 4 49 2 111 -31 -45 46 -15 -14 -35 -26 -8 -15 39 45 -23 -22 37 -48 23 -10
$$ packed form
6190A3m1pnQ8j25O6j7j0O1p0J6K5o7O8mk7N0J0j31J09J8L4m9q1J69n4m6Q0r9M9
6220B3P1j16%L9K8j8Nn4P4lj4K7j11K2L7p0J14j95J15O7j10J29p9qM0r6K9Q9j62
6249a27J05k5J03n5n1J3L8k6O7l9j10J85j01MQ1n4L5o5j0N8j06Q7J20j33j6J0
6275a2o0O7Rm3J7o6O5N0j36J01J0j20J92o3j2P0j41N4n7N7N6j%N2j67Q6on7J05
6304E0m4o8R3j01Q0Lr8J48l2r7N2n5J2K0M4N4j42k3J14j0k1Q3j21Q9K9j25O9K
6332El8J36j30L4N5r4J2O7l9J28j28K1n3J5M2K0j60J77j17k3Q8l1k4M2k1L5p6
6359e7R8j4n9J7L1l3M6qo7J38r2J2K2r2K5K6m2J02j18J3J29j17OL9j9l1M3m8J28
6388G8r8NK8q0J13j4o6Q2k5okj2JM5m7J09j42j4R1o1Jk1RJ8pN4Oo8JN9q5P1l3
$$ plain form
6421 -10 -51 60 -10 19 33 -76 -67 -40 -8 28 -31 5 68 -23 -16 33 -68 49 -6 -1 32 -7 -14 48 25 59 34 -45 17 -43
6451 -43 11 10 -69 54 83 -12 64 -40 30 52 -54 13 16 -53 84 -14 -2 96 -26 6 31 -8 32 -28 -64 62 -64 11
6479 11 45 -93 -54 65 -67 27 -52 5 9 -24 -2 18 -50 -51 6 -31 42 0 2 3 -28 74 36 -87 33 -39 31 65 -20
6508 -20 18 -24 -84 49 -41 2 92 -104 16 -41 -80 64 48 -46 29 -66 -28 -24 -35 39 -19 22 77 -83 -54 43 -27 70
6536 70 -2 31 24 -68 11 50 -72 -20 18 -37 63 -82 -87 -8 -41 45 95 -29 63 55 21 7 -18 -44 7 -17 30 32 27 10 12
6567 12 12 13 -65 50 37 32 31 11 -47 5 -26 42 52 -22 4 47 5 66 -24 -3 20 -31 111 -64 -11 -3 -17 21 -39 -14 70
6598 70 2 -27 72 -66 -32 9 -31 -28 4 12 -11 35 -4 19 34 7 -2 10 13 29 -46 27 -31 3 -7 -36 94 -6 7 68 -39
6629 -39 -15 0 -59 26 -57 -66 68 -23 -60 88 39 22 81 -6 35 -86 -39 32 16 -25 13 28 13 -12 -16 13 -27 -1 33 -59
$$ packed form
6421a0m1J11p0K9J4j09RK7L2L6n9L6O3r1PM9j01J17n5NL3l9pO2k3L4k5p9O2o0
6451d3N4jp9J23K9r5P6j04P0K2j06O7Lo9J37r8J2R8j22L2K5l9M0o0l6J26j26P5
6479A1L4j38L9J19j32R4p9N7Ml3K2K0o8jN7l7P3m2KJl1J02l8j23J20p2P0L4q5
6508b0L8m2o0J33r0M3R0j96J20n7l9J44j6r4P5r5L8Mj1P4n8M1N5j60K9R7p0R7
6536G0p2L3pr2P9L9j22N2L8n5J00j45nP9l3Q6N0j24R2ql4j4k5k6N1k4M7Knj7K
6567A2%Jp8J15j3njk0n8N2l1O8J0p4K6M3m2O1r0K1K3n1J42j75N3Qj4L8o0K5Q4
6598G0o8k9R9j38L4M1m0LL2Qk3M6l9K3J5k7rJ2LJ6p5P3n8L4j0k9J30j00J3O1j07
6629c9K4J5n9Q5q3rJ34r1l7J48m9j7N9q7M1j21M7P1j6m1L8J5j5k5mK9m0K6L4r2
$$ plain form
6659 -59 21 -23 -24 62 -49 12 4 -10 34 14 4 14 23 -14 4 -34 -2 21 1 48 -13 -9 43 -24 17 19 -26 48 -29 23 74 -87
6691 -87 44 2 -58 10 13 -45 32 -108 36 54 -29 10 -44 -29 32 -13 -54 0 -20 25 -26 -37 77 8 -46 86 -52 52
6719 52 22 -5 -7 -49 -31 93 -66 -10 83 -3 -41 -4 20 93 12 -39 26 -40 58 55 16 -22 11 -44 55 -23 -9 103 -62
6748 -62 49 0 -31 75 23 -19 49 -43 -69 42 -75 5 -1 -36 7 20 -16 86 -70 -20 61 -72 40 -47 -87 23
6774 23 -32 -13 -17 -53 15 -37 -22 78 68 31 27 28 45 0 -65 40 -74 -22 76 -54 4 48 -21 58 18 -57 11 -34 -26 38
6804 38 -34 102 -2 4 70 11 15 53 -60 35 -43 -43 49 -45 -5 5 -36 5 -59 -91 21 -66 18 122 -32 0 -2 20 18 16
6834 16 -90 26 -37 49 7 -64 98 -6 -7 -5 -35 31 8 -30 26 30 4 80 29 -21 10 -54 6 27 -73 39 -73 -38
6862 -38 22 -71 8 -18 -55 53 -55 -10 -42 0 23 -24 -33 54 -30 -18 34 -4 -41 9 -42 42 10 -45 33 60 -11 79 -45
$$ packed form
6659e9Q0m4jQ6j11O1qj4M4k0j0J0Rl7J8l8L2K3k0M7o1MN2o7M1Km5P4p7N2N1j61
6691h7J31m2o0O8Ln8P7j40J44J8q3L9n4J5O1m5m1N4k0M5n1j1J14o9n4J32j38J04
6719E2l0k7km2J8J24j59N6R3q6l8L7K4P3q1n1O5o6R8ll9l8L3n5R9p8J4J12j65
6748f2J11m9l1J06n2m2O8r2k6J11j17Q0ol5M3J3l6J02j56N0Q1j33J12q7m0J10
6774B3n5J9ml6O8n2J5J00j0l7mJJ7m5o5J05j14N2R8j30N8M4o9P9m0p5O8m5QO4
6804C8p2J36j04OO6n9ML8j13R5p8%R2r4M0J0m1M1o4l2J12q7Q4J04j54L2kK2kk
6834A6j06J16o3Q6m2p1J62j04jKl0O6k3l8N6Mk6P6n1n0L1o4O0K1j00J12j12L5
6862c8O0r3P9k6l7J08j08M5l2M2K3m7rQ7q4J2N2l8l7N0n1Q4l2n5P8K7p1R0j24
$$ plain form
6891 -45 47 -35 59 40 -107 -26 -1 7 -7 2 -22 19 -70 32 30 -64 -30 67 -16 65 -64 -19 5 -5 23 -87 -24 -12 -12 -63
6921 -63 -42 -19 -37 23 34 1 -7 0 -29 13 -31 51 -18 -25 72 -42 -2 53 -31 65 -55 64 -13 -1 20 31 14 47 29 -25
6951 -25 31 -50 55 12 -39 -33 -18 -16 9 -23 -20 -15 -72 60 25 -40 26 21 48 9 -40 -21 13 59 -52 2 -8 48 -63 85
6981 85 -9 9 26 -11 41 28 -49 -39 29 -73 -23 66 -47 35 23 -5 76 -36 2 -1 -3 -47 22 -24 -4 -72 55 52 -25 -22
7011 -22 -39 30 61 -18 2 7 5 7 73 -6 41 -40 68 46 35 18 37 -31 49 -63 -49 94 -54 -34 10 -16 45 42 -24 28
7041 28 21 -23 -44 9 -45 -98 -28 63 -30 10 -19 37 29 -42 -36 26 41 -37 -24 -4 17 8 -38 78 31 -12 27 1 -11 6 -10 39
7073 39 21 -45 0 -2 -17 48 -7 11 -8 -11 -6 -16 2 55 -41 34 -37 -42 48 2 4 1 3 56 21 -78 1 60 -6 63 -59 -7 -2 -35
7107 -35 -9 -5 -50 36 -77 22 -35 -139 26 -32 -8 58 -34 -29 26 -44 -3 37 -38 40 2 16 98 -46 32 -33 -44 51 -55
$$ packed form
6891d5R2q2R4j9j47Q1K5Qj4Rk4M1q9J02kr4L4R7q3Q1j29M5K4j0K8j10O3J2%n1
6921f3K1K3j8O0J1l3qPk9M2m4Q2o9pR7j14M0N5q4R6j20J19p7J2K1J1j7L3j8n4
6951b5N6q1J05m3n1OJ5KK5l2LNn7J32l5o5O6nK7l9m9J9L4M6j11N4j0N6j11J48
6981H5r4J8J7l7N2j3p7J0O8j02N0Q9j13Q2j2k8Q1j12L8lkm4O9m6K0o8J27lp7L
7011b2j7O9L1p9K0NkKO6p9M7q1J08k2j1j7J9o8Q0j12J4J43j48K0M4k6O1lo6N2
7041B8pm4k1N3n4n3P0R1r3M0k9N6qp1OO2J5p8J3K0K1rm6J16m7m3L9k6j2J7j6M9
7073C9j8o6M5kj5O5n5J8j9lNj0J8N3r6P5p1nR0m6KlKN3l5r9P9N9o6O9j22N2Nl3
7107c5K6Mm5Q6j13R9n7j04J65n8K4O6r2NN5p0M1M0p5P8l8J4Q2j44P8o5j1R5j06
$$ plain form
7136 -55 27 67 10 37 13 7 -59 -74 -12 23 -42 -10 9 -15 44 7 -46 36 10 -44 -10 -23 25 -2 -53 8 -55 -14 -23 -37 52
7167 52 3 -69 0 36 -44 30 -18 -46 17 -55 27 2 5 88 -8 -88 26 -42 31 57 -32 -6 -27 80 -1 -28 4 35 -48 64
7197 64 6 -14 27 5 0 47 -10 5 -12 10 -16 -1 -41 -30 -12 40 22 -40 4 8 -16 6 28 -21 -38 21 -38 30 3 -27 -33 -12
7229 -12 30 -39 41 16 -8 65 -34 -43 51 9 24 3 28 47 -25 -35 55 -12 50 89 1 71 -14 -57 10 37 -26 13 -79 -7 21
7260 21 35 9 -2 -13 44 -43 40 4 -33 2 -24 -53 19 -44 39 -13 -9 3 -28 71 -66 -74 21 50 -11 30 6 -1 69 -40 19
7291 19 36 -15 -6 76 2 -5 24 -28 39 -39 31 4 47 32 4 -22 55 -80 -10 35 -25 56 -62 -102 -27 -1 25 -11 -17 24 -50
7322 -50 10 9 -22 -4 7 -50 14 49 -10 -31 -40 6 10 8 -57 72 11 -10 -61 -52 53 -38 26 41 -12 6 -4 -49 52 8 -31
7353 -31 56 -4 -54 -37 -71 1 -75 37 -22 19 -6 -7 7 8 -70 -35 38 -49 -11 90 -19 5 -20 59 19 -12 11 34 -62 -11
$$ packed form
7136e5Q2M0n7K7k4oo6j5O2L5o5L2J9k4N9l7n3Q2k6n4L4j3M8k7n1O1o3M1rj4Q9
7167E2m9p2O9L6q0P4m8k8O3p2Q2k5LQ3r6q0J14o8P3K6q9K6k1J07q1k7L2L1q3J12
7197F4n8k0M1k2nM7n7J5j7K2k6J5m0J1J8N2j8o2M4Mk4K2K2m9j7N9n9O8k7l0oK1
7229a2M2o9Q0k5k4P3r9rR4m2J5k1K5J9p2j0R0o7O2L9q8P0q5m3O7K7o3L9r2P2K8
7260B1J4k6j1j1N7q7Q3l6l7L5k6k9P2o3Q3n2MJ2l1R9j37qR5K9o1M1k4pP0j09N9
7291A9J7n1RQ2p4pK9n2O7p8P0k7M3j5k8k6P7j35P0M5o0Q1j18m0P5K6K6l6oM1p4
7322e0O0jl1J8J1n7O4L5n9k1rM6Mko5J29o1k1n1RJ05r1O4J5n3J8j0m5J01m4l9
7353c1Q7o0n0J7l4P2p6J12n9M1k5jJ4Jp8L5P3q7L8J01j09K4k5P9m0l1K3K3r6N1
$$ plain form
7383 -11 51 -73 46 -12 -6 54 -47 4 56 -91 4 13 24 -53 -11 33 -42 -50 48 12 -39 -5 -31 44 49 65 31 2 33 17
7413 17 -68 -23 41 -95 20 15 -73 33 -37 -11 14 -31 -16 22 -26 -8 59 15 2 -18 24 0 -51 -31 26 10 69 -41 -40
7442 -40 17 0 4 0 -64 16 46 6 -69 1 75 68 -22 -14 26 -16 -29 -2 16 44 -18 -32 -8 6 34 13 58 -7 -53 -11 69 -78
7474 -78 -12 0 -2 93 11 -3 26 -5 -23 24 25 37 -65 -32 15 -50 40 6 -41 6 16 -67 20 -15 35 -26 2 -9 -20 25 31
7505 31 -7 24 32 5 1 27 -27 32 -1 35 85 -30 -36 -1 14 44 28 -5 32 -3 59 -8 -41 -1 2 22 -48 -25 -1 46 -46 51
7537 51 40 -20 5 -68 -35 27 -17 -23 26 23 6 -41 36 51 -49 -16 -51 6 61 64 -24 61 -28 -29 -59 -32 -39 -29 -39 31 15 -5
7569 -5 28 -45 59 -98 10 -16 -27 -3 72 -5 26 -15 -24 8 -3 30 -1 -51 1 -25 -15 3 21 -56 57 -33 79 -7 -11
7598 -11 0 -22 -68 50 -26 -43 21 13 -18 7 31 -6 6 73 29 -36 -9 -86 40 -49 -36 -89 36 28 53 35 -83 48 56
$$ packed form
7383a1O2j24J19n8OO0j01N1N2j47R5RJ1p7M2M4p5qR8l6n1L4k6P5NJ6l4k9L1j6
7413A7q5M5O4j36J15nq8J06p0K6K5m5J5L8m8J8O7m4j3k0M2k4n1K0N7j6N9j10J
7442d0N7j7Mmo4Q0L0m0p5P0P4pr0QM0m2j3K7J8K8o2j4K4J4K8k1M5o5m6M2Q0j47
7474g8O6J2kR5q2j4K9l1j8M7JJ2j02L3M7o5R0l4m7M7J0q3Q7l5N0o1K8j1j1M5O
7505C1l8L1Qk7mK6n4N9l3L6N0j15oL5J5L0j6l3L7l5O2o7l3M0LK0p0K3K4M7r2R7
7537E1j1o0K5p3L3O2m4oM9lj7m7P7J5j00L3l5N7N5Lq8Q5q9jl0K7pJ0j0P0j6k0
7569eL3p3J04j57J08k6j1K4P5p7L1m1rL2j1L3l1n0N2k6J0J8J8p7J13r0J12q6m
7598a1J1k2m6J18p6j7O4ql1K5K4l7J2O7m4o5K7p7J26q9J3n3J25qK5j8j18J31Q
$$ plain form
7627 56 8 30 -59 -13 27 7 -6 -2 -50 -4 6 6 -25 -53 -1 6 11 31 -31 -9 2 -25 50 -7 5 -12 -27 -6 -7 -25 -66 14 5
7660 5 27 -26 -4 45 -17 35 20 -58 -48 -60 -53 -30 17 6 -35 3 7 -27 -95 -5 -33 -18 23 -27 29 24 9 36 -1 22 0 -22
7692 -22 33 67 -10 29 -24 4 10 27 -4 16 2 -9 63 -17 -32 -2 -3 -10 -60 32 9 -58 -5 -20 15 26 48 -34 35 -24 -75 47
7724 47 11 67 1 -53 -25 -56 37 -36 -15 -39 9 -26 -10 -20 23 -4 -36 -11 -18 -55 14 16 -2 40 -69 -8 -70 -10 12 39 -11
7755 -11 -8 -19 0 48 1 -19 -35 -52 55 -17 49 5 -72 146 38 -33 -25 45 -5 -24 11 -10 -39 28 63 -39 58 33 -3
7784 -3 60 53 -23 30 -63 52 -1 1 13 7 1 -22 12 -9 -31 16 26 28 -45 -23 32 35 -18 -29 102 18 48 55 7 -21 -18 -49 -31 37
7818 37 48 24 -36 -6 -26 -33 4 66 -39 -7 -14 26 9 -44 -24 -4 -52 -29 36 -44 10 64 -1 -37 -76 43 5 2 -3 -1 -48 -29
7850 -29 34 4 9 -67 2 51 -48 -21 -10 -37 29 27 5 -6 -40 99 -14 91 12 -5 26 27 2 -9 3 -19 11 -41 47 26
$$ packed form
7627E6m8K2q9M6M0k0j3Mm8M6J0%l1k8N2PNK0o2K2J1k7P5n7J2j7j5K1jj8m1Q0r
7660EK2n3K2M9o2N2j5p8J0j2PK3M7j1m1L8Ml4o8R0k8J5M1n0N6nj5K7l7K3k2k2
7692b2N5L4p7L9n3K8OJ7l1K0j4j1P2q0j5L0jpn0R2k3o7N3j5L5J1K2q2O9n9n1J22
7724D7l6N6o6n4K8l1R3p3K1k4M8l5J6j0M3k7l2K5pl7O9Kj8M2j09O1o2O0K2K7n0
7755a1Lj1J9M8m7k0j6j7J07p2O6m4p7K18j08p1QP0n0j9L5k1k9O7L5j02R7k5l6
7784cO3pp6N3r3J15n3KJ2ook3L4k1k2M7J0Kp3K2N5Ln3j1J31q4L0Pm8k8Ll1J8O8
7818C7J1k4o0L0k0pL7O2j05L2pM0j7n3K0K0m8K3O5q0N4N4o5l6l9J19l8lnKm7J9
7850b9O3l0Np6O9M9r9K7J1k7O6kk2j1l4J39j13J05p9j7L1Jk5j1J2k2L0n2Q8k1
$$ plain form
7880 26 -9 -10 19 -65 4 -29 20 5 45 -78 -72 -46 34 -1 -45 -7 9 -13 -68 19 -15 -46 1 -20 35 -14 42 -25 20 52 -26
7911 -26 -25 -13 -12 -37 -42 -22 19 -61 67 69 7 56 -16 33 3 -20 15 3 -12 17 -41 17 58 15 33 -17 34 36 -59 45 -28 -49
7943 -49 -39 -17 6 3 1 -47 -6 -11 41 -50 -65 50 -29 21 21 -75 -13 -18 36 -22 42 1 42 12 -38 64 -27 -4 -27 -52 28 15
7975 15 -42 54 3 -49 22 -24 23 -17 -32 74 8 -31 80 19 -11 35 -56 39 0 29 -19 7 10 13 -35 -15 -30 -2 -67 -7
8005 -7 0 21 -54 7 24 -36 -34 -33 -27 -47 -34 7 22 -26 46 -8 -38 22 50 4 -25 -24 -50 14 -14 -3 -60 32 -20 -62 0 14 -21
8038 -21 2 -90 14 4 34 -23 -61 -9 -2 12 -2 -8 14 21 -11 -67 22 -33 -59 -42 -6 14 4 23 -2 45 -34 -22 -24 -55 -32 19
8070 19 32 -27 44 -82 6 29 43 -26 15 33 25 23 -35 -27 27 62 5 -8 -35 -61 74 13 14 46 47 55 -40 14 -33 20 -3 -8 29
8103 29 15 -6 40 -11 -18 39 -38 -24 -35 -67 -36 12 -54 36 -5 -13 4 6 -2 -1 -21 71 93 45 -4 -28 20 24 -24 -6 36 0 -20
$$ packed form
7880B6l5jK9q4O9l3M9j5M0j23OK6Q0l5m4L8J6k2n5Q7l4l1M7k1N5m9N6o7M5L2p8
7911b6JJ2Jk5nK0M1q0J28Ko2M9p2M9l0k3L5j2j5K9n8N8M1m3J8n0N1Kr5J04p3k1
7943d9J0K2K3lkm8M1nN2r1j5J15p9N0%r6O2nN4n8O4m1M1l0n0J02r1K3k3k5Q0j3
7975A5n7R6n1n2P1m6M7m0j5J06o6l9J11o1l0M6r1R5l9K9m8K6LLm8K0j5K8o5O0
8005gPK1p5O1J7o0KJOk0J3M1J5m8P2n4l0O0K8m6k9Jk6O4k8J1n7R2n2m2O2J4l5
8038b1K3r2J04j0L0n7l8N2PJ4j4oK2Pl2n6Q9n5k6J7L6K0j0J9k5M7p9J2kl1K3N1
8070A9J3n9P1j26Q8K3J4o9M1J8qkn8QN4L5n7j3k7k6J35o1JL2JQr5N4m7N3k3nL7
8103B9j4k1M6n1pN7p7J4j1l2L1M8o6R0m1qJ7KqJk0R2K2m8m9k4M8Mm8J8M2l6k0
$$ plain form
8136 -20 -21 -35 -10 -38 -40 -41 -50 14 39 13 48 -36 -21 -8 32 -44 -5 -20 -5 49 20 50 -45 70 -53 -37 14 23 -14 -14 -3 -3 -25
8169 -25 -63 18 -28 -16 31 -5 18 -19 -93 71 70 -41 102 -10 -27 19 -71 16 -39 11 -33 44
$$ packed form
8136b0jj4K5k8kjrO4K5k6L5q4J5J3M0p6L9j5J5N4k9L0r5J15j23J6N1Rl7%J1%k2
8169b5l8Q1m6J2M7l6K3l7p4J64jj11J43j12j7M6r0Q7n5N0m4P7
8191D4
$$ Imaginary data points
##PAGE= N=2
##DATA TABLE= (X++(I..I)), XYDATA
$$ plain form
0 0 0 0 0 0 0 0 0 8 -8 8 -8 16 -16 24 -24 32 -40 48 -56 64 -72 88 -98 114 -134 152 -170 194 -222 249
30 249 -279 314 -352 394 -437 488 -542 601 -665 737 -817 905 -1001 1108 -1231 1364 -1518
47 -1518 1692 -1895 2132 -2411 2748 -3169 3705 -4413 5400 -6861 9261 -13853 25672 -114329
61 -114329 -189273 199377 70584 -172199 -20899 147001 -13057 -109394 23622 77150 -18445
72 -18445 -26367 -24874 14029 66033 -45614 -87776 79455 71567 -92790 -63401 104418 53301
84 53301 -121259 -15895 133059 -29586 -107484 44224 68978 -31367 -51797 13055 40112
95 40112 -11145 -25666 1323 29553 25072 -54758 -24180 86363 -6019 -83956 32617 51020
107 51020 -40252 -29131 33218 16815 -25231 5939 10610 -16895 26748 1551 -48938 37157
$$ packed form
0@%%%%%%%Qj6J6j6K4l2M0m8N6p2Q8j04J20j36J60j86K12k48K86l22L64m16M71
30B49n28N93o66P46q31R25j030J143j266J402j554J722j906K109k339K595k882
47a518L210l587M027m543N159n917O874q118R813j2261J6122k3114L9525j40001
61a14329p4944L88650j28793k42783J51300J67900j60058r6337J33016N3528r5595
72a8445p922J493L8903N2004j11647m2162J67231p888j64357K9389J67819n1117
84E3301j74560J05364J48954j62645p7898J51708K4754j00345k0430O4852K7057
95D0112n1257j4521K6989K8230m481p9830L0578J10543r2382p7937J16573J8403
107E1020r1272J1121O2349j6403m2046L1170M671k7505M3643k5197n0489Q6095
$$ plain form
119 37157 36046 -64356 -14983 59796 1667 -52262 10081 50527 -30547 -30075 49849 -995
131 -995 -35006 20514 -316 -19230 20211 7251 -32582 -2887 48197 -12471 -57167 49033
143 49033 43790 -72400 -7980 66447 -19690 -50801 23939 36998 -29342 -25256 32169 1485
155 1485 -16064 19462 -10634 -9817 27271 -14179 -22318 25818 11632 -29629 -12791 34241 6349
168 6349 -38451 13473 28288 -23279 -5457 15219 -2592 -1502 -4512 -1675 5783 -869 -3438
181 -3438 -8320 9323 16813 -22734 -5486 28542 -10182 -15099 15407 3308 -12041 -5047 11032
194 11032 2172 -12841 9946 1416 -15353 19238 6342 -23874 9115 15308 -12622 -9961 10429
207 10429 8550 -17344 -2513 19669 -11085 -6333 14437 -9605 1247 13783 -14271 -7016 14789
$$ packed form
119C7157j111j00402M9373P4779n8129n3929O2343M0446q1074M72P9924n0844
131i95l4011N5520k0830j8914L9441j2960l9833K9695N1084o0668m4696J06200
143D9033n243j16190O4420P4427q6137l1111P4740J3059o6340M086N7425l0684
155A485j7549L5526l0096Q17L7088m1450q139M8136j4186m1261J6838M7032k7892
168F349m4800N1924J4815n1567J7822K0676j7811J090l010K837P458o652k569
181c438m882J7643P490l9547J7248L4028l8724m917L0506j2099j5349O994J6079
194A1032q860j5013K2787q530j6769L4591j2896l0216L2989O193k7930K661K0390
207A0429j879k5894J4831K2182l0754M752K0770k4042J0852J2536k8054P255K1805
$$ plain form
220 14789 4003 -16435 -5650 23044 -4843 -25970 20562 15797 -22348 -3219 13194 3766
232 3766 -8194 -7496 10548 1327 -9121 2421 -1737 6033 4733 -17965 6569 19670 -14577
245 -14577 -12426 13304 11825 -13996 -15308 21144 7216 -24750 5843 15197 -7189 -4529 -1949
258 -1949 7311 7373 -12400 -3700 9390 3249 -7044 -9933 14507 8334 -23807 3824 21156 -10476
272 -10476 -10670 6940 9346 -4226 -12824 9682 7430 -12609 2088 3799 -1988 3880 -6623 631
286 631 9774 -5784 -4430 2177 4465 1146 -11735 5367 10564 -14447 140 11329 -5731 -2173
300 -2173 1344 1984 1425 -5611 4036 815 -5878 6922 -3335 -4571 9369 -5161 -3452 7365
314 7365 -2607 -1176 -366 858 3564 -6938 2336 5201 -8923 4247 4371 -7294 3869 1125
$$ packed form
220A4789j0786k0438J0785K8694k7887k1127M6532m765l8145J9129J6413r428
232C766j1960O98J8044r221j0448J1542m158P770j300k2698K4534J3101l4247
245a4577K151K5730j479k5821j312L6452j3928l1966L0593R354k2386K660K580
258a949R260O2j9773Q700J3090o141j0293k889K4440o173l2141K7631J7332l1632
272a0476j94J7610K406j3572q598K2506k252k0039J4697J711n787N868j0503P254
286F31R143j5558J354O607K288l319j2881J7102N197k5011J4587J1189j7060L558
300b173L517O40n59p036R647l221o693J2800j0257j236J3940j4530J709J0817
314G365r972J431Q10J224K706j0502R274K865j4124J3170J24j1665J1163k744
$$ plain form
328 1125 -2435 1959 -1984 3539 -2090 -5076 8746 -3078 -5831 7867 -2751 -2185 3546 -2316
342 -2316 2553 -1588 -1742 4581 -4450 1272 2809 -6607 5821 1309 -7686 6208 911 -4178 2061
357 2061 -131 2564 -3458 -3161 8622 -4471 -4551 7547 -3422 -1160 2769 -2765 3501 -1684 -2661
372 -2661 4681 -3188 647 1376 -4945 5883 -576 -6348 6590 -154 -3573 1979 -538 3078 -3347
387 -3347 -3296 7938 -3871 -3896 5902 -3388 327 2048 -3554 4006 -770 -2748 3371 -1946 1447 -445
403 -445 -4561 6465 -1312 -5800 6216 -763 -2530 2232 -1140 2850 -2184 -2927 5921 -3194 -2277
418 -2277 3962 -3606 1298 1427 -3357 3914 -852 -2018 3191 -2186 1629 -50 -4089 5204 -1496
433 -1496 -4402 5291 -1510 -1884 2503 -1236 2200 -1508 -1875 4674 -3065 -1133 3097 -3837 2013 822
$$ packed form
328A125l560M394l943N523n629k986J3822j1824k753J3698j0618N66N731n862
342b316M869m141j54O323r031N722J537r416J2428m512q995J3894n297n089O239
357B061k192K695o022K97J1783j3093q0J2098j0969K262L929n534O266n185r77
372b661P342p869L835P29o321J0828o459n772J2938o744l419N552k517L616o425
387c347N1J1234j1809k5R798r290L715J721n602P560m776j978O119n317L393j892
403d45m116J1026p777m488J2016o979j767M762l372L990n034p43Q848r115R17
418b277O239p568M904J29m784P271m766j166N209n377L815j679m039R293o700
433a496k906R693o801l74M387l739L436l708l67O549p739J932M230o934N850j191
$$ plain form
449 822 -3716 4221 -661 -2489 3167 -1187 1209 -416 -3197 4680 -1655 -3821 4279 -1641 -922 1464
465 1464 -1988 3395 -904 -2889 4205 -1525 -735 1681 -3623 2792 674 -4539 3314 606 -1736
480 -1736 1184 -1306 3160 -188 -4593 4372 281 -3278 1986 -1979 1056 1378 -4140 3059 1670
495 1670 -3008 1586 -616 1615 1261 -5020 2622 2299 -3801 910 -696 871 1930 -4656 2550 3814
511 3814 -4278 236 1134 924 949 -5420 1893 4353 -5032 -279 2196 106 792 -3424 2368 4047
527 4047 -5095 -15 2261 -1010 1380 -3899 -177 5273 -3774 -1711 3027 669 536 -4141 1653
542 1653 6505 -6214 -3157 5562 -298 -2016 -2411 1958 4573 -5596 -993 5996 -1866 -1181 -789
557 -789 110 4771 -4233 -3772 4891 247 -1270 -1983 105 6004 -3908 -4335 6928 689 -4243 -1634
$$ packed form
449H22m538P937m882j828N656m354K396j625k781P877o335k166Q100n920P19K386
465A464l452N383m299j985P094n730P90K416n304O415k118n213P853k708k342
480a736K920k490M466l348m405Q965m091l559N264l965L035L22n518P199j389
495A670m678M594k202K231l54o281P642l23o100M711j606J567J059o586P206J264
511C814q092M514Q98k10K5o369P313K460r385M753K475k090O86m216N792J679
527D047r142N080K276l271K390n279L722N450r047K063M738k358j33m677N794
542A653M852j2719L057Q719n860j718l95M369K615j0169M603O989p862O85L92
557g89Q99M661r004M61Q663m644j517p13K088N899r912m27J1263o239m932K609
$$ plain form
573 -1634 2217 4960 -6032 -4113 8107 -1016 -4370 2185 1001 1892 -2566 -2330 5568 -1043 -3638
588 -3638 926 -282 3100 -1688 -4683 5169 1468 -3233 233 465 4090 -2539 -6309 7745 2309
603 2309 -8448 770 4202 813 -3399 -2240 6148 -666 -4305 3602 -207 -103 549 -4588 3416
618 3416 3051 -4866 -657 876 3380 724 -7086 3953 6049 -6724 -1659 4850 1474 -4651 -4160
633 -4160 8028 1791 -9359 2842 4575 -2072 354 -2222 1691 3237 -4956 8 3191 -545
647 -545 -1453 -3737 3795 5157 -6772 -1997 5352 1914 -2137 -5431 4627 5820 -9701 -1295 9049
662 9049 -2533 -5228 352 4901 2027 -6618 732 5423 -2426 -1069 -525 547 2894 -4508 -1100
677 -1100 4708 -1117 -1204 -1906 1248 6591 -5248 -5101 7935 877 -6210 -404 5190 1133 -8311 1423
$$ packed form
573a634L851K743j0992J919J2220r123l354O555j184Q91m458K36P898o611k595
588c638M564j208L382m788k995R852l701m701L466K32L625o629l770J4054n436
603B309j0757R218L432l389m212J159Q388o814l639P907l809J04O52n137Q004
618C416l65p917M209J533K504k656p810J1039K096j2773N065O509l376o125M91
633d160J2188o237j1150J2201J733o647K426k576L913J546q193M964L183l736
647e45r08k284P532J362j1929M775P349l438m051l294J0058J193j5521Q406J0344
662I049j1582k695N580M549k874q645P350M691p849J357N44J072K347p402L408
677a100N808n825q7p02L154N343j1839J47J3036p058p087N806N594m057r444R734
$$ plain form
693 1423 9049 -4901 -4230 3781 1007 1139 -2441 -2120 3981 -799 -2132 62 81 3567 -3271 -4390
709 -4390 7451 2042 -6487 -1125 4592 3712 -6415 -3629 8623 -1300 -6984 3943 3028 -1525 -2834
724 -2834 -159 5756 -1220 -4763 2326 1292 366 -1534 -2973 4245 627 -4788 1794 2878 355
739 355 -2718 -2776 6509 1639 -7998 919 5218 -805 -4396 -842 6646 -1209 -7365 5228 4748 -4599
755 -4599 -1989 1276 3202 -397 -4448 1443 1723 -1098 101 -1767 2356 2158 -5185 1353 5092 -2323
771 -2323 -3442 -115 4394 398 -6820 2388 4979 -4627 -1164 3523 782 -1998 -2216 3744 1733
786 1733 -4383 425 814 -156 1959 -3327 -492 4101 -2043 -1249 1910 659 150 -2754 807 3606
802 3606 -3023 -1988 1530 695 786 -2550 310 3566 -2869 -430 2866 -1794 144 -87 -1314 2119
$$ packed form
693A423P626j3950O71Q011k774J32l580L21O101m780j333K194J9L486o838j119
709d390J1841n409q529N362N717q80j0127K786J2252r923n684J0927r15m553j309
724b834K675N915o976l543P089j034r26j900j439P218l618n415O582J084k523
739C55l073n8R285m870r637Q917M299o023l591L554P488p855o156J2593m80r347
755d599K610L265J926l599m051N891K80k821J199j868M123j98p343O538L739p415
771b323j119L327M509l996p218R208K591r606L463M687k741k780k18N960k011
786A733o116M808L89r70K115n286K835M593o144P94L159j251n09k904L561K799
802C606o629J035L518q35R1l336K860L256o435K439L296m660J938k31j227L433
$$ plain form
818 2119 -827 -1313 793 -398 1661 -505 -1605 2739 -609 -1474 1484 -503 629 -1412 -1995 4209
834 4209 -620 -3827 2793 1051 -1010 42 -299 1692 -1135 -1556 2073 -716 -127 -263 -2266 3314
850 3314 865 -3800 1958 1407 -584 66 -1466 1934 278 -3404 2035 1261 -1847 -250 -295 2201
866 2201 157 -2876 2489 472 -1948 1621 -1164 143 974 -2784 1587 1514 -2264 565 154 783
882 783 823 -2305 1525 955 -2302 1278 -249 -363 1041 -2432 1331 2033 -2507 788 652 -476 1403
899 1403 -1722 197 1279 -2094 870 280 -999 1398 -1591 301 2232 -1986 430 699 -1153 1592
915 1592 -1172 -766 1756 -1869 261 1189 -1294 1038 -592 -160 2167 -1900 -4 1261 -1636 981
931 981 -321 -1291 1780 -1354 -238 1755 -1337 786 60 -949 2108 -1335 -794 1693 -1549 440
$$ packed form
818B119k946m86K106j191K059k166j100M344l348q65K958j987J132k041n83O204
834D209m829l207O620j742k061J052l41J991k827m21L629k789N89j36k003N580
850C314k449m665N758n51j991O50j532L400j656l682N439p74l108J597m5K496
866B201k044l033N365k017k420L569k785J307Q31l758M371p3l778K829m11O29
882G83M0l128L830n70l257L580j527j14J404l473L763P02m540L295j36j128J879
899A403l125J919J082l373K964n90j279K397k989J892J931m218K416K69j852K745
915A592k764M06K522l625K130R28k483K332j630M32K327m067J896J265k897K617
931I81j302r70L071l134J116J993l092K123p26j009L057l443N41K487l242J989
$$ plain form
947 440 446 -1381 1720 -781 -794 2066 -1205 179 698 -1322 1499 -625 -1227 1668 -1440 -54 1247
964 1247 -1431 1279 -95 -1189 2106 -1039 -666 1359 -1347 480 120 -1217 1525 -971 -505 1748
980 1748 -1280 504 617 -1243 1656 -524 -1168 1588 -1265 -99 973 -1291 1006 -179 -813 1869
996 1869 -962 -241 1142 -1252 820 -137 -1280 1559 -986 -658 1534 -1157 410 441 -1020 1555
1012 1555 -586 -820 1457 -1134 18 652 -1068 1061 -631 -733 1791 -1096 -137 1121 -1230 922
1028 922 -13 -1072 1369 -919 -530 1234 -1022 512 239 -898 1598 -572 -613 1447 -1175 83
1044 83 586 -1152 1002 -516 -764 1533 -1041 16 963 -1079 834 62 -956 1175 -899 -401 1014
1061 1014 -1146 553 118 -950 1497 -647 -517 1397 -989 151 482 -1025 854 -497 -671 1332
$$ packed form
947D40Oj827L101k501j3K860l271J384N19k020K821k124o02K895l108J386J301
964A247k678K710j374j094L295l145L73K025k706J827l60j337K742k496M66K253
980A748l028J784J13j860K899k180o44K756k853J166J072k264K297j185o34K682
996A869k831P21J383k394K072r57j143K839k545L28K192k691J567L1j461K575
1012A555k141k34K277k591J152O34j720K129j692j02K524k887R59J258k351K152
1028I22r35j059K441k288L89J764k256J534k73j137K496k170m1K060k622J258
1044H3N03j738K154j518k48K297k574J057R47k042J913p72j018K131k074M98J415
1061A014k160J699m35j068K447k144J30J914k386J140L31j507J879j351j74K003
$$ plain form
1077 1332 -892 12 798 -1000 1030 16 -902 1312 -773 -345 837 -1002 616 -15 -1023 1430
1093 1430 -390 -522 1123 -830 393 518 -1138 945 -248 -800 1003 -863 210 580 -1336 1324
1109 1324 266 -1159 1152 -402 -143 598 -1099 791 50 -1252 1192 -415 -286 937 -1118 729
1125 729 746 -1467 797 30 -702 694 -1018 607 630 -1590 1027 465 -881 891 -696 192 884
1142 884 -1453 518 422 -962 763 -618 188 1123 -1568 536 1105 -1193 527 -120 -221 840 -1200
1159 -1200 290 833 -1266 742 -46 -507 1377 -1106 -263 1424 -944 -37 40 -214 938 -1468 19
1176 19 1572 -1561 143 1014 -765 770 -436 -324 1136 -1001 46 437 -915 1104 -578 -802
1192 -802 1833 -720 -513 882 -302 650 -681 -715 1740 -1057 -782 1297 -692 236 12 -614 1520
$$ packed form
1077A332k224R04P86j798K030j014r18K214k085M28J182j839J618o31j008K453
1093A430j820j32J645j953J223J25j656K083j193n52J803j866J073L70j916K660
1109A324j058j425K311j554K59P41j697J890p41j302K444j607J29J223k055J847
1125G29J7k213K264p67p32J396j712J625K3k220K617n62j346J772j587Q88O92
1142H84k337J971r6j384J725j381Q06R35k691K104N69k298J720o47j01J061k040
1159a200J490N43k099K008p88m61J884k483Q43J687k368R07P7k54J152k406J487
1176A9J553l133J704Q71j779J535j206J12J460k137J047L91j352K019j682k24
1192h02K635k553K07J395j184R52j331l4K455k797K75K079j989R28k24o26K134
$$ plain form
1209 1520 -604 -725 1159 -584 278 -61 -1082 1412 -460 -1001 1374 -610 35 500 -1012 1240
1225 1240 161 -1398 791 -15 7 -252 -1023 1583 -245 -1688 1854 155 -999 627 -281 727
1241 727 -167 -1120 1215 -325 -681 981 -933 374 882 -1294 632 671 -299 -36 -892 1270 333 -2427
1259 -2427 1380 1086 -1820 597 567 -106 11 -782 1116 91 -1095 911 -578 -248 1008 -1345 234
1276 234 866 -885 511 -35 -32 792 -1379 357 1344 -1418 -174 392 -103 351 -1036 511 1000 -1381
1294 -1381 527 713 -642 440 -768 147 1075 -1433 84 695 -746 677 -199 -514 959 -326
1310 -326 -171 216 -133 714 -1242 -477 1923 -1254 -955 1421 -276 -325 97 279 628 -1215 233 1204
1328 1204 -1323 24 536 -927 670 55 -480 382 -125 630 -256 -795 1538 -563 -1503 1593 115
$$ packed form
1209A520k124j21J884j743Q62l39j021K494j872n41K375j984O45M65j512K252
1225A240j079j559K189q06K2k59p71K606j828j443L542j699j154J626r08J008
1241G27q94r53K335j540l56J662j914J307N08k176J926L9r70K63q56K162r37k760
1259b427L807k94k906K417l0o73J17p93J898j025j186K006j489L30J256k353J579
1276B34O32j751J396n46LQ24k171J736R87k762J244N66m95M54j387J547M89k381
1294a381J908J86j355J082j208R15R28k508J517O11j441J423q76l15J473j285
1310c26J55L87l49Q47j956P65K400l177K99K376j697m9M22J82L49j843J448R71
1328A204k527J347N12j463J597o15n35Q62n07P55q86n39K333k101r40L096j478
$$ plain form
1345 115 -1102 84 218 781 -589 -449 1210 -649 -302 852 -825 163 272 -882 660 38 -456
1362 -456 308 -436 753 298 -1024 846 118 -688 580 -473 128 296 -988 828 354 -947 437
1379 437 165 120 156 -758 836 58 -1138 846 10 -532 581 -560 271 587 -532 341 -230 -49 897
1398 897 -1132 -95 1095 -1039 -302 630 15 -60 -639 780 566 -1314 703 418 -1229 762 128
1415 128 -759 392 -299 33 201 -147 602 -578 -66 1248 -1005 -313 919 -719 10 14 -200 519 -799
1434 -799 92 1065 -773 115 331 -501 668 -239 -492 489 -378 143 -31 -365 876 -519 -387 1243
1452 1243 -683 -171 590 -790 414 181 -768 415 -219 -25 308 -368 660 -196 -522 1219 -443
1469 -443 -529 739 -607 17 280 -547 583 -361 -278 858 -521 140 474 -803 568 149 -730 246
$$ packed form
1345A15j217J186J34N63j370J40J659j859L47J154j677R88J09j154J542o22m94
1362d56P64p44J189m55j322J870p28q06J268j053O01J68j284J816m74j301J384
1379D37k72m5L6r14J594p78j196J984q36n42J113j141Q31L16j119Q73n71J81R46
1398H97k029J037J190k134P37R32o15p5n79J419k14j880K017k85j647J991o34
1415A28q87J151o91L32J68l48P49j180N12J314k253O92J232j638P29Mk14P19j318
1434g99Q91R73j838Q88K16q32J169r07k53R81q67N21j74l34J241j395J32J630
1452A243j926N12P61j380J204k33r49J183o34J94L33o76J028q56l26J741j662
1469d43q6J268j346O24K63q27J130r44Q3J136j379O61L34j277J371m19q79R76
$$ plain form
1487 246 -318 282 127 -727 883 4 -828 1127 -201 -562 672 -530 -21 283 -475 314 -439 107
1505 107 706 -842 458 567 -903 614 167 -612 397 -361 30 210 -636 639 -6 -530 906 -315
1523 -315 -229 679 -595 123 168 -504 374 -534 -17 643 -804 355 567 -815 604 60 -395 463 -383
1542 -383 45 253 -509 479 -271 -389 907 -492 -172 630 -566 254 178 -381 355 -441 -32 509 -691
1561 -691 379 303 -676 793 50 -468 554 -363 0 173 -497 352 -361 -252 790 -503 -17 673 -569
1580 -569 256 193 -454 357 -308 -42 323 -648 397 105 -622 705 -14 -388 518 -279 87 174 -451 394
1600 394 -376 -313 661 -589 -79 634 -559 267 289 -365 352 -269 -13 205 -613 377 -38 -559 642 -143
1620 -143 -240 557 -363 78 235 -402 312 -260 -320 510 -512 39 382 -529 348 130 -275 390 -201 16
$$ packed form
1487B46n64O00j55q54J610q79q32J955j328l61J234j202N09L04p58P89p53N46
1505A07N99j548J300J09j470J517m47p79J009p58L91J80q46J275o45n24J436j221
1523c15Q6R08j274P18M5o72Q78r08N17O60j447J159K12j382J419n44m55Q58q46
1542c83M28K08p62R88p50j18J296j399L20Q02j196Q20p6n59P36p96M09N41j200
1561f91J070p6r79J469p43n18J022r17L63J73o70Q49p13J09J042j293M86O90j242
1580e69Q25o3o47Q11o65K66L65r71J045k92p27J327p19l74R06p97L66Q7o25Q45
1600C94p70O3R74j250N10P13j193Q26K2o54P17o21K56K18q18R90m15n21J201p85
1620a43r7P97r20M41J57o37P14n72o0Q30j022N51L43r11Q77k18m05O65n91K17
$$ plain form
1640 16 262 -433 313 0 -509 540 -186 -247 501 -316 34 245 -260 239 -264 -185 440 -502 102 335 -545
1661 -545 421 118 -349 456 -150 -20 191 -401 300 -33 -413 468 -172 -248 446 -315 135 231 -247 390 -132
1682 -132 -173 340 -492 56 271 -554 318 96 -354 413 -118 -12 260 -380 296 -67 -417 443 -230 -257 454
1703 454 -322 101 192 -267 350 -110 -84 401 -361 100 214 -560 245 19 -298 425 -150 -68 350 -284 254
1724 254 46 -349 383 -337 -169 319 -450 87 203 -377 327 -38 -71 361 -369 156 189 -490 223 -76 -307
1745 -307 330 -248 56 343 -322 301 40 -229 356 -254 -82 353 -480 135 234 -239 355 -96 -95 401 -254
1766 -254 212 169 -445 268 -109 -327 348 -278 65 331 -284 285 56 -255 447 -196 -129 333 -460 120 52
1787 52 -293 370 -179 -82 406 -329 153 152 -364 293 -108 -216 407 -370 -15 231 -382 251 66 -139 447
$$ packed form
1640A6K46o95P46l13n09J049p26o1P48q17L50K11n05M99n03P9O25r42O04K33q80
1661e45R66l03m67Q05o06J30K11n92P01l33l80Q81o40p6O94p61M50R6m78O37n22
1682a32m1N13q32N48K15q25Q72k22m50P67n31J06K72o40O76l63l50Q60o73k7P11
1703D54p76M23R1m59O17m60K6M85p62M61J14p74Q05k26l17P23n75Q2M18o34N38
1724B54k08l95P32p20J68M88p69N37J16n80P04l65l3M32p30N25L3o79P13k99k31
1745c07O37n78L04K87o65O23k61k69N85o10J72M35q33O15R9m73N94m51JM96o55
1766b54M66m3o14P13l77k18O75o26L43K66o15N69k29l11P02o43O7M62p93N80o8
1787E2l45O63n49R7M88p35M82jn16O57m01j08O23p77L55K46o13O33j85k05N86
$$ plain form
1808 447 -207 -122 241 -398 145 -3 -357 308 -219 -144 368 -218 261 134 -329 336 -99 -201 288 -309 -19
1829 -19 226 -396 352 -19 -168 446 -207 22 248 -412 183 -33 -355 267 -248 -60 313 -301 225 171 -302
1850 -302 354 -86 -205 273 -343 103 136 -528 311 -39 -203 324 -137 88 276 -351 271 -14 -276 322
1870 322 -267 -62 322 -401 127 170 -245 347 -74 -84 301 -368 67 163 -352 180 -59 -140 278 -238 151
1891 151 292 -229 291 -3 -249 303 -258 -112 199 -298 219 109 -186 333 -103 -85 354 -212 104 55 -277
1912 -277 238 -144 -196 344 -246 6 243 -172 203 -14 -141 276 -222 9 215 -346 141 7 -306 310
1932 310 -82 -78 202 -104 154 30 -259 282 -166 -187 310 -136 -34 92 -215 353 -64 -135 393 -231 27
1953 27 181 -290 70 3 -190 149 -204 14 207 -341 208 176 -283 240 -101 -116 185 -255 96 101 -317 295
$$ packed form
1808D47o54Q5L63o39N43j48l54O65n27P5N12n86M79j27m63O65m35j02M89n97K90
1829a9K45o22P48l71j49O14o53K29K26o60N95k16l22O22n15J88L73o14N26n4m73
1850c02O56m40j19M78o16M46L3o64Q39l50j64N27m61K25J88o27O22k85k62N98
1870C22n89K05L84p23N28M3m15N92m21j0L85o69M35R6n15N32k39q1M18n16L89
1891A51J41n21N20k94k46N52n61J46L11m97N17j10k95N19m36J8M39n66L16m9l32
1912b77N15l82n2N40n90K52K37m15L75k17j27M17m98K31K06n61M87j34l13O16
1932C10l92MK80l06K58j24k89N41m48k1M97m46J02J26l07N68m17p1N28o24K58
1953B7J54m71L60o7j93L39l53K18J93n48N49l2m59N23l41j5L01m40L51Nm18O12
$$ plain form
1975 295 29 -155 225 -24 37 87 -218 173 -72 -253 258 -148 -155 283 -151 121 186 -166 121 -71 -28 245
1997 245 -241 19 116 -237 147 -2 -113 246 -206 120 212 -253 215 96 -298 178 -81 -127 108 -104 155
2018 155 -8 -117 293 -143 -38 348 -268 -46 170 -151 115 -50 -136 248 -214 0 182 -117 135 -11
2038 -11 -86 213 -177 -69 171 -260 125 94 -220 242 -27 -146 202 -145 12 67 -209 130 -119 -102 142 -174
2060 -174 131 193 -188 204 -25 -197 219 -164 -136 149 -262 49 -1 -144 223 -88 -11 276 -155 123 52 -290
2082 -290 184 -63 -233 156 -142 63 167 -171 200 53 -158 205 -103 -64 105 -169 87 -4 -178 245 -136
2103 -136 35 262 -184 53 151 -229 193 -22 -129 94 -193 30 109 -210 168 23 -115 319 -49 -41 109
2124 109 -201 76 40 -150 102 -152 36 245 -231 53 173 -143 243 -99 -168 67 -204 -9 64 -172 210
$$ packed form
1975B95k66j84L80k49O1N0l05L91k45j81N11m06pM38m34K72O5l52K87j92M3K73
1997B45m86K60R7l53L84j49j11L59m52L26R2m65M68j19l94M76k59m6K35k12K59
2018A55j63j09M10m36J05L86o16K22K16l21K66j65q6L84m62K14J82k99K52j46
2038a1p5K99l90J08K40m31L85l1l14M62k69j19L48l47J57N5k76L39k49J7K44l16
2060a74L05O2l81L92k29j72M16l83K8K85m11L11n0j43L67l11P7K87m31K78p1l42
2082b90M74k47j70L89k98K05J04l38L71j47k11L63l08L9J69k74K56r1j74M23l81
2103a36J71K27m46K37R8l80M22k15j07K23k87K23P9l19L78j45j38M34l68QJ50
2124A09l10K77l6j90K52k54J88K09m76K84J20l16L86l42o9K35k71J95P3k36L82
$$ plain form
2145 210 -14 -63 239 -95 27 132 -52 156 -85 -159 180 -139 61 159 -270 149 98 -120 260 -42 -100 107
2167 107 -171 68 3 -135 246 -37 -96 267 -149 55 201 -241 144 4 -131 90 -203 -4 66 -230 58
2188 58 16 -163 235 -62 -16 143 -161 80 26 -256 175 -100 -82 309 -95 -11 129 -121 91 30 -83 94
2210 94 -168 30 41 -266 143 39 -156 254 -60 13 226 -58 75 33 -113 5 -169 -90 163 -184 20 69
2232 69 -103 107 -11 -137 157 -154 -18 103 -236 35 81 -84 86 -44 86 77 -36 96 25 -172 120 -122
2254 -122 -4 151 -171 -50 91 -39 67 56 -78 114 -48 32 78 -150 28 -3 -169 130 -71 -41 55 -61
2276 -61 48 73 -32 159 2 -135 86 -118 -76 83 -54 74 62 -13 224 -30 12 105 -147 89 31 -165 51
2299 51 -75 -87 76 -29 119 115 -32 137 -42 -14 78 -71 25 3 -151 114 23 -46 68 -32 53 40 -109 52
$$ packed form
2145B10k24m9L02l34J22J05j84K08k41p4L39l19K00R8m29M19n1k18L80l02n8K07
2167A07k78K39o5j38L81k83n9L63m16K04J46m42L85j40j35K21k93J99P0k96K88
2188E8m2j79L98k97M6J59l04K41n4k82M31k75J8L91m04Q4J40k50K12o1j13J77
2210I4k62J98J1l07M09j04j95M10l14P3K13k84J33m2j46J18j74P9K53l47K04M9
2232F9j72K10j18j26K94l11J36J21l39K71M6j65J70j30J30rj13J32p1j97K92k42
2254a22J18J55l22J21J41j30J06j1j34J92j62Q0M6k28J78l1j66K99k01L0R6j16
2276f1J09K5j05J91j57j37K21k04M2J59j37J28j2p5K37k54M2R3k52K36n8j96K16
2299E1j26j2J63j05J48mj47J69j79K8R2j49R6k2j54K65r1o9J14j00Q5j3j49J61
$$ plain form
2323 52 -24 -144 33 -147 -83 20 -55 77 57 -67 64 -16 -76 90 -140 -21 -24 -164 27 -20 -25 119 -36 109
2347 109 126 -87 60 64 -95 114 -145 -117 91 -114 32 94 -36 146 -29 6 96 -99 7 42 -148 49 -30
2370 -30 -146 62 -101 -22 140 -53 165 56 -127 98 -11 -45 47 -97 76 7 -111 96 -3 4 138 -123 38
2393 38 45 -93 30 -73 -139 38 -114 46 72 -26 88 -15 -48 61 -65 -125 51 -192 -16 -26 -110 42 -15 -12
2417 -12 57 -47 98 55 -104 159 -38 -138 65 -117 14 28 -114 81 -36 -109 188 -27 -78 149 -56 -25
2439 -25 15 -112 77 -10 34 135 -137 64 63 -59 111 10 -100 70 10 25 52 -112 76 6 -66 112 -41 -21
2463 -21 78 -122 -4 79 -60 32 -107 -9 63 -69 -16 64 -21 113 -18 -43 208 -67 -66 16 -82 16 -32 -53 54 -107
2489 -107 9 138 -57 30 69 -139 12 33 -55 63 -114 31 -12 -86 122 0 -100 81 37 47 38 -57 25 -42
$$ packed form
2323E2p6j20J77j80O4J03p5J32k0j24J31q0o0J66k30J19lj40J91m7nJ44j55J45
2347A09J7k13J47Mj59K09k59K8K08k05J46O2j30J82j75L5R0j95J06L5j90J97p9
2370c0j16K08j63P9J62j93K18j09j83K25j09l4R2j44J73o9j18K07r9PJ34k61J61
2393C8Pj38J23j03o6J77j52J60K6r8J14j03l3J09j26o0J76k43J76j0q4J52n7L
2417a2O9j04J45m3j59K63j97j00K03j82J31J4j42J95j17p3K97k15n1K27k05L1
2439b5M0j27J89q7M4J01k72K01jj22J70j01j10J70o0J5K7j64J88p0p2J78j53K0
2463b1R9k00J18Q3j39R2j39R8P2j32N3Q0q5J34j31k5K51k75JQ2r8R8m8k1J07j61
2489a07J16J29j95Q7L9k08J51K1q8J18j77J45m3p4K08j22j00J81m4J0rr5Q2o7
$$ plain form
2513 -42 -23 40 -95 16 87 -23 53 -20 -38 48 -94 -19 -54 -113 -15 52 -78 111 -35 5 97 -7 37 -4 -87 51
2539 51 53 -62 133 -75 -11 24 -40 125 37 -1 93 -8 -39 -2 -109 24 57 -36 61 -63 47 78 -49 28 110 -55
2565 -55 35 32 -81 9 -79 38 -8 -54 95 71 -80 72 -5 0 3 -93 38 -20 -69 38 -37 -36 75 -8 23 107 42 -44
2593 -44 -58 -12 -2 -132 -47 90 -108 0 71 -30 82 42 74 142 -60 20 98 -89 -28 5 -45 16 5 -45 34 -20
2619 -20 130 -7 -129 129 6 -93 127 -47 -24 -16 -54 136 -26 -47 21 -23 20 16 -101 -33 -8 8 61 -89 20
2644 20 41 -128 63 37 -62 6 -2 -21 -13 -77 -39 15 -61 82 -17 -42 87 -32 44 49 -165 20 -69 -145 46 -26 -60 84
2672 84 -40 49 -15 21 89 -93 57 127 -86 -62 100 -127 36 16 -43 17 -109 71 158 -102 52 -5 -131 70
2696 70 -19 -86 -19 -47 129 37 -39 181 -36 -38 199 -120 -113 -27 -45 57 -67 1 71 -91 74 116 -27 61 -30 46
$$ packed form
2513d2J9O3j35J11P1j10P6p3j8Q6j42P5l5n9R8O7j30J89j46M0R2j04M4m1q3J38
2539E1Kj15J95k08O4L5o4J65q8l8R4j01l1L7j07J33L3r3R7j24J10L1j27P7Q2j65
2565e5R0lj13R0q8J17m6m6J49k4j51J52p7NLr6J31n8m9J07p5JJ11q3L1Q4o5q6
2593d4j4M6J0j30Q5J37j98J08P1j01J12m0L2O8k02Q0P8j87O1L3n0O1j1n0P9n4
2619b0J50j37j22K58j23r9K20j74K3Ql8J90j62k1O8m4M3mj17O8K5J6N3j50J09
2644B0K1j69J91k6r9O8qj9Qo4L8N4p6J43r9k5J29j19P6Nk14J85q9p6J91p2l4J44
2672H4j24Q9o4L6O8j82J50P0k13K4J62k27J63k0n9O0j26J80Q7k60J54n7j26K01
2696G0q9o7O7k8J76r2p6K20k17kK37l19PQ6j8J02j24O8P0j62J65M2j43Q8r1P6
$$ plain form
2722 46 47 -30 -26 -35 -41 91 -27 -79 145 -71 22 89 -94 17 5 -136 101 3 -172 -3 -1 17 109 2 120 -47
2748 -47 -81 176 -51 -25 -24 -94 2 -22 -47 52 -74 -56 116 -18 13 23 -118 5 -19 -23 -54 -16 62 -34 -160 135 -20
2775 -20 -92 154 32 -47 26 -17 9 11 -55 48 -85 45 111 -70 25 24 -74 44 -61 -19 57 -65 73 116 -175 6
2801 6 71 -96 25 92 -26 -40 4 -52 -66 13 8 -213 27 138 -76 53 82 -47 70 30 -78 37 -87 -47 -27
2826 -27 13 40 -62 -70 155 -52 -62 51 -42 27 11 -87 -18 -82 9 92 -104 -11 75 -1 25 76 -36 -83 8 26 -45 -47
2854 -47 65 -123 -5 206 -2 -18 27 -20 -48 -26 61 -43 -91 4 8 -114 16 18 6 0 69 68 62 -86 20 10 -66 -13
2882 -13 -20 -71 65 -36 -71 125 -61 -12 12 -66 -20 -114 -17 14 -96 79 -10 -130 123 128 -83 78 -3 35 -27 -42
2908 -42 4 -113 -75 30 -33 -66 102 -100 39 8 -36 2 -78 -10 -44 -125 -31 3 -43 82 41 -99 65 69 5 15 -12
$$ packed form
2722D6Jp7MroJ32j18n2K24k16R3O7j83J11j2j41K37r8j75J69KJ8R2j07J18j67
2748d7l4K57k27K6Jp0R6k4k5R9j26J8J72j34L1J0j41J23k4ml1L8P8r6j26K95j55
2775b0p2K46j22p9P3m3K6Ko6J03j33J30O6j81R5jr8J18j05M2P6j22J38M3k91J81
2801FO5j67J21O7j18j4M4n6j4P9nk21K40J11k14J29K9j29J17m0j08J15j24M0K0
2826b7M0K7j02qK25k07j0J13r3O9j6r8O9o4R1Q3j96R3Q6p6K6N1j12m7R1J8p1k
2854d7J12j88J18K11k08j6M5m7k8K2Q7j04m8R5Mj22J30Kj2oO9joj48J06j0p6N3
2882a3pn1J36j01l5J96j86M9K4p8M6r4R7L1j10J75q9j20K53Nk11J61q1L8o2j5
2908d2M6j17L8J05o3l3J68k02J39l1m4L8q0O8l4q1R4L4m6J25m1j40J64Mo4J0k7
$$ plain form
2935 -12 13 -32 -51 39 -27 -84 65 -45 27 90 -38 78 -16 0 -31 -101 38 97 -99 101 12 -45 79 -44 1 3
2961 3 -10 76 -44 -44 106 -179 -56 83 -115 43 64 -111 -40 -3 -45 29 -33 8 -68 -154 82 -33 -35 65 -4 24
2987 24 73 -30 11 -65 -48 55 -104 -55 103 -86 42 54 -79 61 11 36 50 -48 103 -44 -136 156 -103 -111 85
3012 85 -75 82 59 -21 20 8 23 34 -104 -19 15 -148 91 8 -137 76 -36 -58 74 -105 46 -1 -33 80
3036 80 -93 -30 160 -97 -54 75 -78 61 6 46 104 -166 -32 60 -146 32 -29 -140 125 -89 0 79 -21
3059 -21 21 6 51 148 -44 -60 55 -85 -36 4 -37 68 -17 64 66 -49 -33 88 -112 31 -47 -41 22 -25 6 81 2
3086 2 64 76 -26 121 -73 -20 65 -79 32 6 -109 17 6 -32 30 -15 54 0 -28 126 35 -113 123 -5 -40
3111 -40 17 -97 60 -41 25 125 -59 -35 85 -24 81 44 -73 -11 -14 18 14 -78 92 -23 -45 93 19 -16 58
$$ packed form
2935a2K5m5j9R0o6n7J49j10P2O3j28J16r4J6l1p0J39N9j96K00q9n7J24j23M5K
2961Cj3Q6j20%J50k85J23J39j98J58K1j75P1L7m2P4o2M1p6q6K36j15kJ00o9K8
2987B4M9j03M1p6J7J03j59M9J58j89J28J2j33J40n0K5J4r8J51j47r2K92k59qJ96
3012H5j60J57k3q0M1j2J5J1j38Q5L4j63K39q3j45K13j12k2J32j79J51m7l2J13
3036H0j73O3J90k57M3J29j53J39n5M0N8k70J34R2k06J78o1j11K65k14Q9P9j00
3059b1M2j5M5R7j92j6J15j40M9M0m1J05q5Q1Kj15J6J21k00J43p8OO3m7L1P5p9
3086BO2J2j02J47j94N3Q5j44J11k6j15J26j1l8O2m5O9n4k8J54r1j48K36j28l5
3111d0N7j14J57j01O6J00j84K4J20j09J05l7j17O2lL2mr2J70j15k2J38p4l5P4
$$ plain form
3136 58 -31 -11 12 -134 17 -15 23 164 -30 0 64 -71 23 35 -139 5 -85 -95 50 -48 17 59 -26 15 -53 29
3162 29 104 -115 -36 47 -109 -37 8 -19 40 18 50 67 -128 18 -14 -56 -18 -8 -24 -21 -75 -32 35 -14 71 -53 -11 134
3190 134 -30 -45 114 -113 -30 13 -61 93 -34 38 51 -25 16 79 -3 50 11 -36 156 -77 20 -2 -121 117 5
3215 5 -52 56 -22 41 87 -130 80 0 -103 96 21 -57 55 -80 -3 -18 -109 110 -17 -35 69 -21 2 20 -18 93
3241 93 -5 -49 99 -107 26 82 -97 11 17 -34 37 -57 6 34 -74 45 10 -110 104 -36 -10 -26 -55 44 26 -101
3267 -101 37 -33 -62 171 -33 18 56 -3 29 -23 -22 -19 -99 -23 37 -76 29 71 -78 114 8 5 53 -34 17 -23 -145
3294 -145 49 -68 -13 96 -65 49 111 -12 153 -23 -99 99 -84 -41 45 -126 -32 -21 -148 85 -57 -31 45
3317 45 -12 95 53 17 47 -86 -110 68 -30 26 -2 -59 46 -41 -29 60 -6 -4 23 -66 44 -68 -96 94 1 5 84 -26
$$ packed form
3136E8q9K0K3j46J51l2L8J41j94L0O4j35R4J2j74J44r0j0J45r8O5M2q5M1o8Q2
3162B9P5k19P9Q3j56P2M5k7N9k2L2J7j95J46l2m2L8J0j6Ln4M3O7m9Q5j24M2J45
3190A34j64j5J59k27Q3M3p4J54j27P2J3p6M1O3q2N3l9m7J92k33R7k2j19K38j12
3215En7J08p8O3M6k17K10q0j03J99p5p8J12j35P7j5r1K19j27j8J04r0K3J8l8J11
3241I3r8m4J48k06J33N6j79J08On1P1r4O3K8j08J19l5j20K14j40K6j6k9R9j8j27
3267a01J38p0k9K33k04N1L8n9L2n2JLq0P6O0j13J05M2j49J92j06lM8q7N1m0j22
3294a45J94j17N5J09j61J14O2j23J65j76p6J98j83M3Q6j71R4J1j27K33j42K6P6
3317D5n7J07m2l6L0j33k4J78r8N6k8n7J05q7J2Q9o6KK7q9J10j12k8J90r3MP9j10
$$ plain form
3345 -26 61 12 -44 52 -91 -12 66 -67 45 27 -27 108 -31 -43 99 -112 79 50 -170 83 -41 -80 -26 -32 73
3370 73 0 -92 102 -7 -64 62 -38 -50 71 -91 14 -18 -64 -1 -45 16 97 -61 -15 62 -60 53 -36 -76 47
3395 47 -109 81 84 -183 18 24 -65 79 -43 -76 25 -68 12 -64 -34 61 -2 47 18 -79 43 52 -123 50 -3 -70 94
3422 94 33 -97 54 5 93 64 -12 66 -35 84 20 -27 -28 55 -31 26 -39 -18 19 -70 17 87 -132 3 -27 16 30 -24
3450 -24 44 21 8 98 -26 3 120 -51 -49 52 -56 85 -3 -92 76 9 -23 25 -20 14 22 -37 85 -2 -2 62 -45
3477 -45 -11 23 -111 -14 28 -35 13 -38 -8 103 -23 10 64 -95 60 -35 -49 -38 -75 -16 86 -52 138 34 -62 51
3503 51 2 -23 38 -119 24 2 -80 91 -105 56 83 -99 22 80 -107 67 -112 17 58 -74 32 -7 -60 104
3527 104 -33 -131 129 21 2 -12 -29 35 -55 2 56 -112 22 59 -71 61 -42 -64 79 -43 -7 23 -67 87
$$ packed form
3345b6Q7m9n6R6j43P9P8j33J12j8n4J35j39j2J42k11J91k9k20K53j24l9N4oJ05
3370G3p3r2J94j09n7J26j00j2J21j62J05l2m6O3m4O1Q1j58M6P7j22J13q9m0J23
3395D7j56J90Lk67K01Oq9J44j22l3J01r3Q0p6L0R5o3M9k9r7J22Rj75J73n3o7J64
3422I4o1j30J51m9Q8k9p6P8j01J19o4m7jQ3q6N7o5K1L7q9Q7P0k19J35l0M3J4n4
3450b4O8k3j3R0j24K9J17j71KJ01j08J41q8q9J68o7l2M8m5L4Qn9J22q7%O4j07
3477d5L4L4j34R7M2o3M8n1L0J11j26L3N4j59J55r5j4J1l7N9J02j38J90j04r6J13
3503E1m9k5O1j57J43k2q2J71j96J61K7j82J21N8j87J74j79J29M1j32J06l9n3J64
3527A04j37r8K60j08j9j4j7O4r0N7N4j68J34L7j30J32j03k2J43j22L6L0r0J54
$$ plain form
3551 87 -20 -119 63 -12 -40 119 -72 -14 10 24 72 -53 -31 66 -60 57 43 -91 62 64 -34 42 -3 -43 -11 -53
3577 -53 31 38 -31 82 -28 -31 77 -66 6 66 -18 35 -52 -80 50 -53 -81 87 -80 57 54 2 57 -25 54 39 -80
3604 -80 106 -52 -130 72 -65 -44 68 -83 -17 52 -20 -4 -21 24 32 -57 70 54 -156 121 -55 -99 105 -30 40
3629 40 53 -61 102 7 -86 162 -53 -104 108 -71 59 74 -107 95 -8 -7 -26 -98 66 -3 -109 79 -39 -63
3653 -63 56 -41 -37 1 -17 2 -30 -106 87 -127 -75 43 -62 18 -9 -37 -1 -31 56 12 -85 43 53 -95 36 -32 -29
3680 -29 74 -63 -71 67 -26 -23 -23 6 145 -108 56 31 -122 87 37 -59 110 -24 -27 6 -19 49 -16 -97 74 70 -29
3707 -29 102 -65 -8 13 6 32 -30 -51 75 -93 7 48 -88 57 60 -94 -4 5 -63 77 36 -45 -14 -57 107 37 -46
3734 -46 71 -36 68 35 -2 73 13 -15 105 -55 -8 1 -67 17 59 -91 12 -77 -4 65 -38 112 -11 -53 107
$$ packed form
3551H7j07r9J82p5k8J59j91N8K4J4M8j25K2R7j26J17j4j34J53Kr8P6m5m0L2m2
3577e3Q4Po9J13j10lJ08j43P2O0q4N3q7k8J30j03k8J68j67J37ln2N5q2P9j5j19
3604h0J86j58p8K02j37K1J12j51O6O9p2J6j7M5Qq9J27j6k10K77j76m4K04j35P0
3629D0J3j14J63r5r3K48k15n1K12j79J30J5j81K02j03Jj9p2J64o9j06J88j18k4
3653f3J19r7ML8j8J9l2p6J93k14N2J18j05Q0k7k8L6l0Q7m4r7J28J0j48J31o8L
3680b9J03j37qJ38r3L%K9J39k53J64k5j53K09n0r6J69j34lL3k5O8o5q1J71mr9
3707b9J31j67N7K1pK6o2k1J26j68J00M1j36J45Lj54R0Ro8J40m1q1L1m3J64p0q3
3734d6J17j07J04l3l7P5o0k8J20j60M7Ro8Q4M2j50J03q9P3O9j03J50j23m2J60
$$ plain form
3759 107 -27 -68 83 -87 -26 57 -26 69 10 -9 37 -34 33 30 -63 111 56 -98 39 62 -55 4 -82 -6 -1 -72 112
3786 112 -45 -53 98 -54 -45 9 -105 11 11 -41 61 -118 54 107 -78 109 12 -141 56 -36 16 -67 -77 7 4 -67
3812 -67 28 48 -36 96 -59 -5 44 -75 55 -65 -55 78 -67 10 72 -124 39 -36 -29 59 -25 -7 58 -25 -38 33
3838 33 -58 7 -28 -41 59 -73 -5 79 -99 56 2 -94 30 1 13 116 -118 72 5 -102 119 -83 -43 21 -83
3863 -83 38 -3 -41 60 -115 -1 165 -49 40 28 -60 70 -12 4 64 -123 8 -1 -170 58 37 -62 85 -38
3887 -38 15 118 -90 39 -10 -23 69 -57 -94 74 -89 89 42 -111 60 -37 -150 45 -44 -6 5 -92 8 -67
3911 -67 -41 47 -45 -37 123 -86 41 47 -144 13 -86 5 59 -99 49 64 -25 41 7 -16 75 -16 -25 27 -73 55 -34
3938 -34 -25 103 33 0 84 -39 61 30 -98 104 -56 8 1 -94 21 -50 -93 38 -36 -71 39 -92 25 -18 -53 -76
$$ packed form
3759A07j34m1J51j70O1Q3q3R5n9j9M6p1O7lr3J74n5j54J37K3j17N9q6P6Np1J84
3786A12j57qJ51j52RN4j14J16%n2J02j79J72N3j85J87r7j53J97r2N2q3j0Q4lp1
3812f7R5K0q4J32j55N4M9j19J30j20J0J33j45P7O2j96J63p5PQ8q4J8O5q3j3P1
3838C3r1O5l5j3J00j32O8Q4j78J55n4r6J24k9J2J03k34J90o7j07K21k02M0O4j04
3863h3J21m1l8J01j75J14J66k14Q9j2q8J30q2J6O0j87J31rj69K28k1r9J47j23
3887c8N3J03k08J29m9j3R2j26l7J68j63J78m7j53J71r7j13J95q9L8J1r7J00p5
3911f7K6Q8r2QJ60k09J27Oj91J57r9R1N4j58J48J5q9O6l4k3R1r1rN2j00J28q9
3938c4RJ28p0l3Q4j23J00l1j28K02j60O4pr5J15p1m3J31p4l5J10j31J17m3l5k3
$$ plain form
3964 -76 26 -41 19 -80 -37 25 -56 17 9 -33 47 -41 44 51 -71 50 -4 -86 5 44 24 80 -24 -6 -3 -40 64 16 -53
3993 -53 112 -96 -43 59 -55 59 51 -8 66 -46 10 -21 -124 -3 -6 -52 51 -76 -9 17 19 49 27 -21 53 -15 -48
4020 -48 45 -48 -10 4 6 96 -33 23 45 -2 124 29 -84 -39 2 -95 11 -31 -96 20 -3 88 7 -49 18 -53 17 38
4048 38 -78 49 5 -72 45 -30 -100 37 -18 49 53 -76 -13 53 -9 35 -39 -43 -14 -119 61 62 -17 42 19 -28 106 -39
4076 -39 11 87 -82 -46 12 -31 34 -6 38 91 -108 -16 -23 -63 85 -56 -89 34 -75 40 30 -77 59 -7 5 45
4102 45 -18 68 -62 -74 -14 -12 -43 45 -69 38 116 -101 -53 49 -54 51 -56 -71 44 -88 69 8 -70 42 12
4127 12 -37 84 -96 22 12 -17 114 -75 -66 36 -26 45 54 -63 79 -3 14 68 -74 18 55 -98 -7 60 -116 12
4153 12 -70 -44 45 -68 3 51 -61 50 -107 -70 26 -26 -18 64 -134 19 50 -113 91 4 2 -22 -10 78 53 -27 26
$$ packed form
3964g6J02o7O0r9M3O2q1P3qm2Q0q8Q5Pj22J21n4q2R1L9k0N6j04J8Ll7J04m8o9
3993e3J65k08N3J02j14J14qn9P4j12N6l1j03J21lm6J03j27O7K6KL0k2m8P4o8l3
4020d8R3r3L8J4KR0j29N6K2m7J26r5j13M5M1r7J06m2o5J16k3R1q1n6O7p1P0K1
4048C8j16J27m4p7J17p5p0J37n5O7Mj29O3O6o2M4p4mK9j05J80Jp9N9k3m7J34j45
4076c9N0P6j69L6N8m3O5m0M4N3j99R2pm0J48j41l3J23j09J15j0j07J36o6J2M0
4102D5o3Q6j30j2O0Kl1Q8j14J07P8k17M8J02j03J05j07j5J15j32J57o1p8J12l0
4127A2m9J21j80J18j0k9J31j89RJ02o2P1Rj17J42q2J7N4j42R2L7j53R1O7j76J28
4153A2q2K6Q9j13P1M8j12J11j57L7R6n2QQ2j98J53L1j63K04q7kk4J2Q8k5q0N3
$$ plain form
4180 26 -59 -42 106 -66 -18 20 -19 74 -37 -30 34 -58 45 27 -85 64 4 -32 -4 -5 10 25 -123 95 15 -62 97
4207 97 -106 -45 99 -114 -35 -30 -31 23 -62 -10 0 -37 32 89 -72 38 -33 -43 134 -34 -9 73 -78 131 -3 -82
4233 -82 51 -18 -83 92 -85 11 43 -32 -16 6 36 17 -104 68 -24 -46 50 -5 -19 73 13 -19 18 -23 75 -24 6 19
4261 19 -79 7 42 -80 70 18 -18 87 5 -44 85 -100 79 46 -88 1 -1 -21 3 -23 -5 64 -8 63 -74 -33 61
4288 61 -15 -71 77 -20 -22 -73 52 70 -131 52 31 15 30 14 -15 53 -15 13 48 -24 65 89 -38 60 -4 -95 39 -40
4316 -40 36 95 -37 7 52 -51 13 -13 18 5 -66 36 32 -83 70 -15 -34 24 -21 12 117 -96 20 -20 -34 -5 -47
4343 -47 5 -22 -32 31 82 33 23 -73 68 24 -36 47 60 -98 53 5 -47 78 -31 5 -41 -27 45 -9 -6 27 -40 10
4371 10 65 -45 22 2 -91 38 -30 -39 81 32 74 -17 -38 43 11 -79 -28 -50 -40 -21 -17 50 2 -25 39 -34 -20 25 -93
$$ packed form
4180B6q5J7J48j72M8L8l9R3j11PO4r2J03j8j12J49o0l6K8jJ5J5j48K18q0p7J59
4207I7k03O1J44k13P9NjN4q5N2J0l7O9N7j61J10p1j0J77j68K5Q2j51K09j34p9
4233h2J33o9o5J75j77R6L2p5J6K2L0j9j21J72r2k2R6n5j4R2o0l2L7m1R8r9L0J3
4261A9r8Q6L5j22J50n2l6J05q2m9J29j85J79l3j34Q9kk0K4k6J8O9p2P1j37M1R4
4288F1p6n6J48r7kn1J25J8k01J83k1j6J5j6k9O8o8K8L5p2Q9K4j27R8o4r1J34p9
4316d0P6N9j32M4M5j03O4k6L1j3p1J02mj15J53q5j9N8m5L3J05k13J16m0j4K9m2
4343d7N2k7j0O3N1m9j0r6J41m4o0Q3J3j58J51m8n2J25j09L6m6J4P2n4LL3o7N0
4371A0N5j10O7k0r3J29o8rJ20m9M2r1k1Q1l2r0N1k2J0J9MO7m8k7O4p3J4M5j18
$$ plain form
4400 -93 55 75 -78 66 5 0 63 -58 -9 69 12 74 -5 -47 28 -40 21 75 -55 -11 24 -25 -10 11 0 5 -58 24 6
4429 6 -117 43 -5 -23 54 -43 35 55 -50 68 -46 -19 93 -55 33 156 -13 28 -7 37 116 -53 -21 -3 -23 3
4455 3 6 -59 16 34 7 76 -32 44 58 -22 26 -66 40 80 -80 49 77 -81 4 -50 -20 -17 -15 44 -1 -127 32 26 5
4484 5 51 26 -14 19 -65 -4 68 -38 66 -21 37 130 -10 -1 -3 -43 41 43 -28 39 -26 40 88 -50 98 24 -58 57 -4
4513 -4 38 44 6 -20 -14 -28 48 -70 -41 25 -109 77 -28 -101 8 -22 -95 30 -76 -20 2 -63 82 -17 -91 -29 -16 60
4541 60 115 -76 43 -27 -4 36 -65 13 6 -79 69 32 -58 55 13 -47 11 3 -9 -7 -62 89 -16 -9 74 -63 42 28
$$ packed form
4400i3J48K0j53J44o1nO3j21M9P8n7O2p9m2P5o8O1N4j30M4L5m9J5K1j1No3Q2j8
4429Fj23J60m8j8P7r7P8K0j05J18j14K7J12j48Q8J23j69M1l5M4P9j69L2J8k0K6
4455CLo5P5J8k7O9j08P6J4q0M8r2J06M0j60J29K8j58Q5n4L0LKN9m5j26J59ok1
4484EM6k5m0L3q4O1P2j06J04q7N8R3j40Rkm0Q4Kp1O7o5O6M8j38J48p4q2J15o1
4513dM2Ol8k6Oj4P6j18K9O6j34J86j05p3J09l0p3J25j06N6K2o5J45r9p4O2J3P6
4541F0N5j91J19p0K3M0j01P8pq5J48l7r0J13m2o0N8qj2Kn5J51j05PQ3j37J05j4
$$ [...]
8191e3
##END NTUPLES=NMR FID
##END=
