##TITLE=1H_Pr NCS-old
 CDCl3,8 sc, 
 20.9.2021
##JCAMPDX= 6.0         $$ Bruker NMR JCAMP-DX V2.0
##DATA TYPE= NMR FID
##DATA CLASS= NTUPLES
##ORIGIN= UXNMR, Bruker Analytische Messtechnik GmbH
##OWNER= root
$$ XWIN-NMR		Version 3.5
$$ Mon Sep 20 13:02:07 2021 Russian Standard Time (UT+4h)  she@DPX200
##.OBSERVE FREQUENCY= 200.1314
##.OBSERVE NUCLEUS= ^1H
##.DELAY= (6, 6)
##.ACQUISITION MODE= SIMULTANEOUS
##.ACQUISITION SCHEME= undefined
##.AVERAGES= 8
##.DIGITISER RES= 18
##SPECTROMETER/DATA SYSTEM= spect
##.PULSE SEQUENCE= zg30
##.SOLVENT NAME= CDCl3
##.SHIFT REFERENCE= (INTERNAL, CDCl3, 0, 15.7039)
##AUDIT TRAIL= $$ (NUMBER, WHEN, WHO, WHERE, WHAT)
$$ ##TITLE= Audit trail, XWIN-NMR		Version 3.5
$$ ##JCAMPDX= 5.01
$$ ##ORIGIN= Bruker BioSpin GmbH
$$ ##OWNER= she
$$ F:/spectra/data/she/nmr/H-F/1/audita.txt
$$ ##AUDIT TRAIL=  $$ (NUMBER, WHEN, WHO, WHERE, WHAT)
(   1,<2021-09-20 13:00:42.04 +0400>,<she>,<DPX200>,
      <created by zg, POWCHK disabled, PULCHK disabled
       configuration hash MD5:
       00 E9 B6 7A A2 85 ED C7 34 08 36 98 17 FE 4E 26
       data hash MD5: 16K
       0A D4 5C BB 7B A4 C5 9A 4A 47 E0 23 FC D4 D9 34>)
$$ ##END=
$$ 
$$ hash MD5
$$ 8F 0F EC 6E C7 9C D0 E5 BE 12 89 87 50 D4 B8 94
##$RELAX= 
##$RELAX= 
##$RELAX= 
##$RELAX= 
##$RELAX= 
##$RELAX= 
$$ Bruker specific parameters
$$ --------------------------
##$DU= <F:/spectra>
##$EXPNO= 1
##$NAME= <H-F>
##$PROCNO= 1
##$TYPE= <nmr>
##$USER= <she>
##$AMP= (0..31)
100 100 100 100 100 100 100 100 100 100 100 100 100 100 100 100 100 100 
100 100 100 100 100 100 100 100 100 100 100 100 100 100 
##$AQSEQ= 0
##$AQ_mod= 1
##$AUNM= <au_zg>
##$AUTOPOS= <>
##$BF1= 200.13
##$BF2= 200.13
##$BF3= 200.13
##$BF4= 200.13
##$BF5= 200.13
##$BF6= 200.13
##$BF7= 200.13
##$BF8= 200.13
##$BYTORDA= 1
##$CFDGTYP= 0
##$CFRGTYP= 5
##$CHEMSTR= <none>
##$CNST= (0..31)
1 1 145 1 1 1 1 1 1 1 1 1 1 1 1 1 1 1 1 1 1 1 1 1 1 1 1 1 1 1 1 1 
##$CPDPRG= <>
##$CPDPRG1= <>
##$CPDPRG2= <>
##$CPDPRG3= <>
##$CPDPRG4= <mlev>
##$CPDPRG5= <mlev>
##$CPDPRG6= <mlev>
##$CPDPRG7= <mlev>
##$CPDPRG8= <mlev>
##$CPDPRGB= <>
##$CPDPRGT= <>
##$D= (0..31)
0 1.2 0 0 0 0 0 0 0 0.06 0 0.03 0 0 0 0 0.0002 0 0 0 0 0 0 0 0 0 0 0 0 
0 0 0 
##$DATE= 1632128441
##$DBL= (0..7)
120 120 120 120 120 120 120 120 
##$DBP= (0..7)
150 150 150 150 150 150 150 150 
##$DBP07= 0
##$DBPNAM0= <>
##$DBPNAM1= <>
##$DBPNAM2= <>
##$DBPNAM3= <>
##$DBPNAM4= <>
##$DBPNAM5= <>
##$DBPNAM6= <>
##$DBPNAM7= <>
##$DBPOAL= (0..7)
0.5 0.5 0.5 0.5 0.5 0.5 0.5 0.5 
##$DBPOFFS= (0..7)
0 0 0 0 0 0 0 0 
##$DE= 6
##$DECBNUC= <off>
##$DECIM= 32
##$DECNUC= <off>
##$DECSTAT= 4
##$DIGMOD= 1
##$DIGTYP= 9
##$DL= (0..7)
0 120 120 120 120 120 120 120 
##$DP= (0..7)
150 150 150 150 150 150 150 150 
##$DP07= 0
##$DPNAME0= <>
##$DPNAME1= <>
##$DPNAME2= <>
##$DPNAME3= <>
##$DPNAME4= <>
##$DPNAME5= <>
##$DPNAME6= <>
##$DPNAME7= <>
##$DPOAL= (0..7)
0.5 0.5 0.5 0.5 0.5 0.5 0.5 0.5 
##$DPOFFS= (0..7)
0 0 0 0 0 0 0 0 
##$DQDMODE= 0
##$DR= 18
##$DS= 0
##$DSLIST= <SSSSSSSSSSSSSSS>
$$ [...]
##$SUBNAM2= <"">
##$SUBNAM3= <"">
##$SUBNAM4= <"">
##$SUBNAM5= <"">
##$SUBNAM6= <"">
##$SUBNAM7= <"">
##$SUBNAM8= <"">
##$SUBNAM9= <"">
##$SW= 20.0188988654967
##$SWIBOX= (0..15)
0 0 2 0 0 0 0 0 0 0 0 0 0 0 0 0 
##$SW_h= 4006.41025641026
##$TD= 16384
##$TD0= 1
##$TE= 0
##$TE2= 300
##$TE3= 300
##$TEG= 300
##$TL= (0..7)
0 120 120 120 120 120 120 120 
##$TP= (0..7)
150 150 150 150 150 150 150 150 
##$TP07= 0
##$TPNAME0= <>
##$TPNAME1= <>
##$TPNAME2= <>
##$TPNAME3= <>
##$TPNAME4= <>
##$TPNAME5= <>
##$TPNAME6= <>
##$TPNAME7= <>
##$TPOAL= (0..7)
0.5 0.5 0.5 0.5 0.5 0.5 0.5 0.5 
##$TPOFFS= (0..7)
0 0 0 0 0 0 0 0 
##$TUNHIN= 0
##$TUNHOUT= 0
##$TUNXOUT= 0
##$USERA1= <user>
##$USERA2= <user>
##$USERA3= <user>
##$USERA4= <user>
##$USERA5= <user>
##$V9= 5
##$VALIST= <valist>
##$VCLIST= <CCCCCCCCCCCCCCC>
##$VD= 0
##$VDLIST= <DDDDDDDDDDDDDDD>
##$VPLIST= <PPPPPPPPPPPPPPP>
##$VTLIST= <TTTTTTTTTTTTTTT>
##$WBST= 1024
##$WBSW= 4
##$XGAIN= (0..3)
0 0 0 0 
##$XL= 0
##$YL= 0
##$YMAX_a= 539572
##$YMIN_a= -727054
##$ZGOPTNS= <>
##$ZL1= 120
##$ZL2= 120
##$ZL3= 120
##$ZL4= 120
##$ABSF1= 10
##$ABSF2= 0
##$ABSG= 5
##$ABSL= 3
##$ALPHA= 0
##$AQORDER= 0
##$ASSFAC= 0
##$ASSFACI= 0
##$ASSFACX= 0
##$ASSWID= 0
##$AUNMP= <proc_1d>
##$AZFE= 0.1
##$AZFW= 0.1
##$BCFW= 1
##$BC_mod= 2
##$BYTORDP= 1
##$COROFFS= 0
##$CY= 11.3945322036743
##$DATMOD= 1
##$DC= 2
##$DFILT= <>
##$DTYPP= 0
##$F1P= 2.36226072786647
##$F2P= -0.459571619588291
##$FCOR= 0.5
##$FTSIZE= 0
##$FT_mod= 4
##$GAMMA= 1
##$GB= 0.15
##$INTBC= 1
##$INTSCL= 1
##$ISEN= 128
##$LB= 0.24
##$LEV0= 0
##$LPBIN= 0
##$MAXI= 10000
##$MC2= 0
##$MEAN= 0
##$ME_mod= 0
##$MI= 1.114404
##$NCOEF= 0
##$NC_proc= 0
##$NLEV= 6
##$NOISF1= 3.799351
##$NOISF2= 2.8
##$NSP= 1
##$NTH_PI= 0
##$NZP= 0
##$OFFSET= 15.70392
##$PC= 1
##$PHC0= -13722.37
##$PHC1= 22.8009
##$PH_mod= 1
##$PKNL= yes
##$PPARMOD= 0
##$PSCAL= 0
##$PSIGN= 0
##$REVERSE= no
##$SF= 200.130013532006
##$SI= 16384
##$SIGF1= 3
##$SIGF2= 2
##$SINO= 400
##$SIOLD= 16384
##$SREGLST= <1H.CDCl3>
##$SSB= 0
##$STSI= 0
##$STSR= 0
##$SW_p= 3612.71676300578
##$SYMM= 0
##$S_DEV= 0
##$TDeff= 0
##$TDoff= 0
##$TI= <>
##$TILT= no
##$TM1= 0
##$TM2= 0
##$TOPLEV= 0
##$USERP1= <user>
##$USERP2= <user>
##$USERP3= <user>
##$USERP4= <user>
##$USERP5= <user>
##$WDW= 1
##$XDIM= 8192
##$YMAX_p= 0
##$YMIN_p= 0
$$ End of Bruker specific parameters
$$ ---------------------------------
##NTUPLES= NMR FID
##VAR_NAME=  TIME,          FID/REAL,        FID/IMAG
##SYMBOL=    X,             R,               I
##VAR_TYPE=  INDEPENDENT,   DEPENDENT,       DEPENDENT
##VAR_FORM=  AFFN,          ASDF,            ASDF
##VAR_DIM=   8192,          8192,            8192
##UNITS=     SECONDS,       ARBITRARY UNITS, ARBITRARY UNITS
##FACTOR=    0.0002496,     1,               1
##FIRST=     0,             0,               0
##LAST=      2.0444736,     0,               0
##MIN=       0,             -727054,         0
##MAX=       2.0444736,     539572,          0
$$ Real data points
##PAGE= N=1
##DATA TABLE= (X++(R..R)), XYDATA
$$ [...]
1871d84K42K91j47J65K40o31N16p5o71P41j04j87K73j81L1K78q52Q14L60o35k83
1892b99P16l09m27J60L42P15j033N3P63l25o87N62J87o60L1J23L85L16r79J35
1912b31P92q32J11N31n10K09j52l27P69m78l37N56k1k77L35l27K76l73l35O04
1932a7N03j090O12M05p65N0K85M7K28l24l00O97k30m18P70j33o16K85J7N8M11
1953D75q88Q87L2o68L43L26o14J38R9j77N33l49o39R23m59l30P72k15j24J44l65
1974a56M11j09p09Q19M01j140L69K50J53j71l54J91K73m51M6J66j41j58M11L00
1994D01m30j39l04M68K24q38M51L05k65K46l01k2L57o67M37M23m72r6N43m17K44
2015A48j30l98R24l93l98mO63p15N02J21m26L07J73k00J05m67O43J51q06J84J14
$$ plain form
1871 -484 -242 49 -98 67 307 -324 192 117 -554 187 83 -104 169 -12 19 297 -555 259 619 -16 -299
1892 -299 417 108 -319 -159 183 898 -135 -82 681 356 -331 231 418 -242 -211 -88 297 613 -366 -231
1912 -231 561 -271 -160 371 -139 70 -82 -409 360 -118 -455 101 80 -197 138 -189 87 -286 -621 -17
1932 -17 486 -604 8 413 -352 -302 -17 30 258 -66 -366 331 101 -317 453 320 -296 -11 6 64 475
1953 475 -413 474 506 -162 181 507 -107 31 130 -47 486 137 -502 421 -38 -368 404 189 65 209 -156
1974 -156 255 146 -563 256 657 -483 -114 136 289 118 -236 -45 228 -223 -177 -11 -152 -310 101 401
1994 401 -29 -168 -472 -4 220 -618 -167 138 -127 119 -182 -204 153 -514 -77 346 -126 -222 321 -96 148
2015 148 18 -380 544 151 -247 -251 412 -303 199 320 -106 201 374 174 279 -188 455 606 -200 -16 98
2036I8J56r2q3l62N35m66j07M80P1m99K42L10j23l06l09N11N86j144L3M39j43
2057a73n0J16j86N11l02o48Q29k42j63L32L58n61J92o7P7K17n22J77M35m35j4
2078a19L69k16jj59R8K31n5m05N99r9m92L02K09k2J5k06K24Kl60K98M09r18o2
2101c58O57k66J08l44j87J234q30n08Q25n12J17j9q4K14M7m11L50K98n41J47K37
2122A74l99M37l05j85N37j29o67L29R1J40J64n24M4K84Nj55M41m25L93k35l20
2143c05K45L07n13L96J68j61J94o96J51L90j95k40O68n2l32o4k45L28M60o33L19
2164A90Mm6k4o4j65J96m14NN44l9m71K45j35M88l44k97P12k16l75K1J16q9L74
2187B16k60l28Q11n35j57L03j39q9j19K77J24L53r47J44N83n64q1K28o8M53k74
$$ plain form
2036 98 254 162 79 -283 252 -214 -321 159 230 -269 -27 283 160 -146 -455 56 642 -502 -469 -30 -173
2057 -173 -223 -107 -293 218 -84 -732 97 -145 -308 24 382 -179 13 -54 23 240 -282 -105 330 -105 -119
2078 -119 250 34 33 -126 -28 203 148 -257 342 243 -249 53 262 240 255 49 273 275 -85 213 622 -296 -358
2101 -358 299 33 141 -203 -390 844 14 -494 331 -181 -64 -83 -167 47 94 -317 33 331 -210 -63 174
2122 174 -225 212 -93 -278 259 130 -537 -208 -117 23 187 -337 -293 -9 -4 -159 282 -143 250 15 -305
2143 -305 -60 247 -266 130 298 137 331 -365 -214 176 -19 -259 409 357 25 -39 -284 44 504 -129 190
2164 190 194 148 124 60 -105 91 -323 -318 226 187 -284 -39 -174 314 -30 -327 385 169 -206 -185 -69 -158 216
2187 216 -44 -372 439 -96 -253 50 -89 -178 -297 -20 104 457 -490 -346 237 -327 -408 -180 -248 205 -69
2208f9l51N07J03n16O91m74J58K64k10q7L51n26K79N30p58R7j26Q9N44k42n75
2229c21K74K58n3J9m74j8L35K43j48r1l4Q1J4j88Q3j71m20Q31J17n21j27L50P4
2252A13q8m53M13M85n30n80R62m31j40J94k84K75J56l28L14R9n62j42P74k34J92
2273B05l84p0O30l38l80N09K15n21K24j23n0o3K09K39l20j51K73j0l66L76k07
2294a03k62N96n5o1j43j38K14K47l65pM04m69J95l1k7J72p7l91K35N38m67j4M9
2317D0R5l01k74M26M01n21l75O85n9k76nM30j49l60j18P10j74l56K73J47j80J10
2339A69m22L48K23m06k34L36k95M89r8l05N08k71l03O55o7m74L02R9m12J08J73
2360A23L6j05r9J25N2n23K13L98o6l19L60p1k9l74L19N9n32L48K80p5k23j19J54
$$ plain form
2208 -69 -420 87 190 -326 365 -109 49 313 103 16 367 -159 120 650 -108 -11 -137 -48 496 254 -321
2229 -321 -47 211 158 177 -297 -315 20 263 115 24 -10 71 85 -103 -20 -191 -611 220 337 -184 -311 39 113
2252 113 25 -428 -15 470 -60 -640 322 -109 -249 -55 -339 -64 92 -236 78 177 -385 -527 247 13 205
2273 205 -179 -249 381 43 -337 172 387 -134 90 -33 -83 -146 63 302 -18 -169 104 94 -272 104 -103
2294 -103 -365 231 176 115 -28 -166 48 295 -70 -77 327 -142 53 22 -5 167 90 -301 -66 472 5 -9 40
2317 40 135 -166 -440 -14 387 -134 -509 176 117 -159 -164 266 117 -243 -361 349 175 -181 92 239 59 169
2339 169 -253 95 318 -88 -322 14 -281 208 110 -195 313 42 -261 394 327 -147 155 254 -158 -50 123
2360 123 159 54 -45 80 132 -391 -178 220 154 -165 195 124 95 -279 40 99 -433 -85 195 120 -103 -222 -68
2383f8N9P5m09L85K60p05o2M57j35j97Q8L29L38p56rO33l11l67N34J45O7n91P1
2406a69L02r9k02K75k9j33JJ83o9l6p2P0K76J30l58K52j24j81M9L9j58K18l04
2429a39J79P7m30L87L82m28P2k24L39J58o09O6N25l94r4K80j37k85L39r9J1m1
2451f5n62Q01n1o09L18K82l71J4N1J17K53m75K05K43k07j74M05o5j12j06k80P59
2473C71j51p00N70Q0m19m7J51L10r5m93M92K32k93j45N48m49n5j79L43J73k91
2494d7k48M56Om38L63J54j35j8k25K0K04m18L87K99m83j6P5k12K21L6l76M19K43
2517B67n53M15m1k38K6J59j64J01m56L59J04k77J11M57n38J20L55m29K29n5K2
2538b6J55k43k28M37M4j71JP8K4N4k3O4mn14K67L08k50p7k17K12M5J17P3J08j67
$$ plain form
2383 -68 -9 66 -343 42 302 -403 -465 -8 -143 -340 -252 77 415 -341 -350 283 -28 -395 139 284 351 -240 -169
2406 -169 133 34 -168 107 78 -55 -54 129 60 24 -48 22 298 428 70 322 198 17 66 105 -53 165 -139
2429 -139 40 117 -313 74 456 28 100 -124 215 373 -236 -170 355 -39 -133 147 10 -275 64 -35 -24 -65
2451 -65 -627 174 123 -486 -168 114 -257 -243 -192 -75 178 -297 -92 151 -56 -230 175 110 -2 -108 -388 371
2473 371 220 -480 90 170 -249 -296 -145 165 70 -423 69 301 8 -137 411 -38 -93 -272 71 244 -47
2494 -47 -295 161 167 -271 92 246 111 93 -132 -112 92 -326 61 360 -123 -139 -64 -276 -55 -19 -395 24 267
2517 267 -286 129 88 -150 -124 35 -129 -28 -484 -125 -21 -298 -187 270 -268 -148 207 -222 7 -48 -26
2538 -26 129 -114 -342 95 139 -32 -31 47 71 125 102 166 162 -352 -85 223 -27 -104 -321 -109 -64 53 126 234 67
2563F7l65O59m28j83M81l28K10K07n42K23j35l61K80L71q4J20j07KJ71l92k43
2584c77L92j25k78K34K53k45L2k7J95j36j55K95L20n98L01K9l5p4l29O07j20j79
2606b0j46N88n44K27q9J92R8l16l83N95l17O5k6K92m5k11r3M2J48j23K02J23l93
2629a34q1L24J4m07L60j98l5K60k37K05Qj90J28j81j40N08m1l2j02Q2j55jQ3j81
2653a43P5K31n8k22j35M90k7l86L30o0o7J00o8k66K08j72J44K8k02J22K50l35
2675a63K78rJ20k23R1j76L67m11q6L00k1k16L09j40n6J65j14J4K10l16qM52o08
2698b41M09j04K16k59Q1l57K23k70K36p0L07k48j01O1q1K40q0q9L39k71k75J12
2720b22K96k58Q3K86J30o7q27Q48l8m72M11k09pK70n9j55Rk65L21J90j57Q0J6
$$ plain form
2563 67 -298 361 -67 -250 231 -97 113 320 -222 1 -134 -495 -215 156 72 192 85 87 258 -134 -377
2584 -377 15 -110 -388 -154 99 -146 -114 -141 54 -82 -237 58 378 -220 81 110 75 1 -328 279 159 -20
2606 -20 -166 422 -122 105 16 208 306 -10 -393 202 -115 -50 -76 216 171 -40 -133 -91 57 -66 136 259 -134
2629 -134 -215 109 123 -284 76 -122 -157 103 -134 71 79 -111 17 -164 -304 204 163 131 29 111 -44 -45 38 -143
2653 -143 -68 163 105 -117 -252 238 211 -175 155 95 28 128 60 -206 2 -170 -26 2 -200 -78 172 -163
2675 -163 115 106 226 3 94 -82 285 -126 -212 88 67 -149 160 20 -36 129 15 29 239 -77 -85 367 -241
2698 -241 168 64 280 21 102 -255 -32 -302 -66 -136 171 -77 -178 -117 -198 42 -38 -127 212 -59 -334 -222
2720 -222 74 -184 -101 185 315 248 -579 269 231 -241 170 -39 -46 224 165 10 19 -246 75 265 108 188 204
2743B04k87l1J93l1P4R3J06m88J22p2K46j77J66k04o4K87j19p8kJ90k53J5L9P4
2767CL6n6l46M58m13J29K59m1Q0l78K12J20k48k2K5M10m69K28J3m7K14k85J76
2790E8N0k26J53K22m6k01L6j69K21M9j68Q4j26L96k92J1j74J50m4m1J09J95l07
2813f0L48l00J66p5l35J17K33k56K01l4J46l80L64n27L26o4j18L87j30k82K84
2834A1J06m40L57J32k95J58M5j70J90k28j33J47J63L34l11j85K56j62j90J80k01
2855b36K53L21l94m8J37j52j13N34n21J70L43l52J12k37K88r3k24j1N87k73l12
2876b21L54O2J95l52o8Q2K47o4j83K32o1j45K12l76J73j43J07L0j22J42n7qj74
2899a38N9J39l64M58n41J82L27k82K46J26n72M41l58J16J78k1j74J70J03k19K43
$$ plain form
2743 204 -83 -114 79 48 122 215 321 -167 -45 -117 129 -48 118 -86 -150 137 18 -60 -62 128 -125 -110 -71 3
2767 3 39 -17 -363 95 -318 -189 70 29 109 -269 -57 63 -185 -207 -182 228 -241 -13 0 -47 167 -118 58
2790 58 108 -118 35 257 211 10 46 -123 98 147 -21 63 -63 333 41 52 -122 28 -16 -57 52 247 -60
2813 -60 288 -12 154 79 -256 -139 94 -162 39 5 151 -229 135 -392 -66 -130 -248 139 9 -273 11
2834 11 117 -323 34 166 -129 29 74 -96 94 -134 -267 -120 43 377 66 -119 137 -25 -215 -35 -236
2855 -236 17 338 -56 -104 33 -119 -232 302 -219 -49 294 -58 54 -183 105 12 -212 -223 364 91 -221
2876 -221 133 195 390 38 -30 52 299 235 52 284 223 78 290 -86 87 -56 51 81 -41 101 44 36 -138
2899 -138 -79 60 -304 154 -387 -205 122 -160 86 212 -360 81 -277 -161 17 -4 -178 -8 95 -124 119
2920A19m6J5r7J8Kj04O9K51k32j15J24J95m2j16j73L02l1k15J31n8J3o1L44O7
2944C60j77k49Q0N5k31Q5q8J42P5j4R5k2L0j51N8J9k55J19L78o31N37j25j00Q5
2968G5j27j26K73j83j95L74Pk01p7K90j0j12j80Q7L34l59j10K64J12j90L25n24
2990b53K39O0j65K27o4k42M07J1k48PnJ10Lj70M6J20N4k37j01J85l5N0k0K68l67
3015a20k31N47P4m42P4j15N93k73j49M7K31j54L4j06j67K35J09j08K01n47J81
3036h6m6K71k41K08l70K10n2J76o1P1m55K87J46p3p9J8J1m5J41K5p0j26K08k3
3060D5n4r7j69Q8L22Qr8qJ09j58L2Lq2k46O89k99j01M88n06m0K2j0J36j57J85
3085A02j04L8j73m0LL76j29k58L80J60l96j27J8J41j23J62P4o3p0j61J18o3J50
$$ plain form
2920 119 73 88 -9 9 11 -93 -24 227 -5 -120 4 199 157 41 -132 170 139 -76 55 -3 10 -51 293 360
2944 360 183 -66 14 69 -162 -77 -165 -23 52 38 133 111 141 -10 48 67 -188 -69 309 -322 215 90 -10 75
2968 75 -52 -178 95 -88 -283 91 98 -103 -180 110 100 -12 -192 -105 229 -130 -240 24 136 -54 271 -253
2990 -253 -14 46 -119 108 44 -198 209 220 -28 -21 -26 84 87 -83 -37 83 137 -100 -201 -16 -51 -1 -21 247 -120
3015 -120 -351 196 270 -172 -98 -213 380 107 -42 5 236 82 116 10 -157 78 187 79 280 -267 -86
3036 -86 -132 139 -102 106 -264 -54 -106 70 9 80 -375 -88 58 -15 -94 -76 -65 -110 31 56 -14 -140 68 45
3060 45 -9 -106 -275 -187 135 143 45 37 146 -12 20 23 -59 -305 384 85 -16 472 -34 -74 -52 -62 74 -83 102
3085 102 -2 36 -137 -177 -174 202 73 -185 195 355 -41 -168 -150 -9 -132 30 104 41 -29 -190 -72 -135 15
3108A5j07L35l29J51j03n4K1r7L0J77j9l8K14rl25j01J84L44j81k69J86o3j0J05
3132E7r7J74K8m84J65J03J6J54R1j43O2j58L38j03l14J66J86m47J91L25l38R4
3154F6M3j24J48q4r3l71K56K0J28nj44j63M5J96L94m99j77L22O3J56l73K26J30
3177A60R6l08J80K01k86r1J53l35J07J51k7L63m68J74J0k20r1M50l30L7R4k8O6
3200E8j26l4M80j55j09j34K2J29m7j77L30k80Jr2J01j98K39J25k52L24m46K04
3222c7J6K6j24l0l9J33k04K03k12L59j78j40L79k53n2K75m04P3J48K54J9r0j9
3245A03l8j30J36K44o54N47j61O0m97M69R1k54Q3j70Q2M00m58L63j5j30J36n38
3267c31J76L55O3j18m4l8j14k4k9j5M6m3J3J05R8j76J88k61K42j42k78P78l67
$$ plain form
3108 15 -92 243 -86 65 -38 -92 -71 -168 -138 39 20 -18 196 187 -138 -239 -55 289 108 -161 25 -38 -48 57
3132 57 -40 134 162 -322 -157 -54 -38 116 207 64 126 -32 306 203 -111 55 241 -206 -15 310 -28 66
3154 66 109 -15 133 49 -44 -415 -159 -139 -11 -16 -160 -323 -278 -82 312 -187 -364 -42 21 177 -196 30 160
3177 160 256 -52 128 329 43 -48 105 -230 -123 28 1 364 -104 70 80 -140 -231 219 -111 -74 20 -8 58
3200 58 -68 -102 378 223 114 -20 2 131 84 -93 237 -43 -42 -134 -33 -231 8 133 -119 205 -241 -37
3222 -37 -21 5 -119 -149 -188 -55 -259 -56 -268 91 -87 -227 152 -101 -153 122 -282 -209 -61 193 212 122 103
3245 103 65 -65 71 315 -339 208 47 107 -390 79 170 -84 -1 -171 -89 311 -147 216 201 71 207 -331
3267 -331 -155 200 263 145 101 63 -51 -75 -104 -119 -73 -116 -103 2 100 -76 112 -149 93 -49 -327 451 84
3290H4k60K10Q3j83P5j08K26n2K1l05K50O7k15L37l08Q1O9l18K10Q2r6R9l4j63
3314a48q7K77n3N7j29kj27K13K03j69Pj1l8j43L78l39p8M23j12j54k9J09n4j42
3338a48L83k66K58n36J35L31j68J41M1k11J79j77L8L0oj70J53m4j76K80k30K1
3360a42K00o4K9O9l12J23P9k15M74l40O3k1k4J01j53J64j55K91j92O1ok6OO9k89
3385b10K72o0j66K51J85m95K36K91l85Q8m4L19j99K6p6O9l87J31K60m7j05Q7%
3408D1p5J61k19r5R2J06j21L6N9K91k27K91k45mq5KN8q8K09P2k68j00L6l9K64
3433A52k46P0J38k49RO9r0M30l30J7k6qN1q1N9K57l51QL06j17R7j5K3l82L76k94
3459a27L86j95j01J19o4l8J16j80j1K08k51K71k68K52j07L57m14K16lk05m4N2
$$ plain form
3290 84 -176 34 117 -66 9 -99 127 75 96 -209 41 108 -107 230 -78 3 72 -246 -36 46 -50 49 15 -148
3314 -148 -235 42 -11 46 -83 -85 -212 1 204 35 42 31 -7 -150 228 -111 -189 234 122 -32 -61 48 -6 -148
3338 -148 235 -31 227 -309 -174 157 -11 130 171 -40 139 -38 0 30 24 -146 7 -37 -213 67 -163 -142
3360 -142 58 -6 23 92 -220 -97 -18 -233 241 -99 -36 -57 -81 20 -133 31 -124 167 -25 36 30 4 10 79 -210
3385 -210 62 2 -164 87 272 -223 13 304 -81 7 -37 282 83 109 33 102 -285 -154 106 59 -46 41 41
3408 41 -34 127 -92 -187 -95 11 -110 -74 -15 276 49 340 95 91 6 8 66 -22 187 259 -9 -109 -73 -112 152
3433 152 -94 -24 114 -135 -126 -57 -147 283 -47 -30 -56 -64 -13 -94 -35 222 -129 -121 185 68 165 150 173 -209 167 -127
3459 -127 259 64 -37 82 18 -20 96 -84 -95 113 -138 133 -135 117 10 367 -47 169 166 -39 -83 -31
3481c1K22k32M98m20J62m38K77p7j07N3J19k61m0r3K10L52k9r9j63O3j91O7N8
3504a00J35j33L87q1n2r0j7k35J97K4M2N3k31J44Q4j24J03Q3k67J07J58p8k86
3527a77j5R1k0k0Q1j83J78J42l7j12K05m6k28J72k58M04R0j24k67K24l02J33l1
3550a00J60L3l84L82l76j73L75K91p0k61L91q0j19k71K05J49m3o5k1p6J61L4L2
3573A74k01k66L97q5K25l26J82j4n5j02j7j9J82k14K26j06J87N7j76J92j96j19
3595g4N6l2P0j77MN04j28o3n29N30j82j62j28M96k85p0L92l52p0L64P2k62K14
3618A88k99O6L60n78M11p0j33l58M25o4J56k50k39O45j22m22J38J15j19K34j08
3639b4L2j24J60o8j15j54K72O4j28J12L55n39j67K82J36J92l62n2K24k03m69L22
$$ plain form
3481 -31 191 -41 457 37 199 -239 38 -39 -146 -93 26 -235 -275 -368 -158 194 165 66 -97 -34 -225 -158 -100
3504 -100 35 -98 289 208 156 66 49 -186 11 35 77 130 -101 43 127 3 106 189 -78 29 187 109 -177
3527 -177 -192 -101 -121 -141 -60 -243 -65 77 40 -72 133 87 -141 31 -227 177 267 143 -124 100 -202 -69 -100
3550 -100 60 93 -291 91 -285 -458 -83 208 138 -123 268 188 69 -202 3 152 109 44 23 -53 108 142 174
3573 174 -27 -293 104 19 244 -82 100 86 31 -71 -88 -107 75 -139 87 -19 168 225 49 241 45 -74
3595 -74 -18 -50 20 -157 -153 351 223 160 -369 161 -21 -183 -311 185 -100 -170 222 -130 -200 164 236 -26 188
3618 188 -111 -45 315 -263 148 78 -55 -413 12 -52 104 -146 -385 260 138 -284 -146 -31 -150 84 -24
3639 -24 8 -116 44 -24 -139 -293 -21 43 -85 27 382 -157 -324 -42 94 286 -76 -128 96 -107 -576 -254
3661b54K36l6O4K1J42j53P2Nj47k30K8M26k27K1J80l59K05m0J2l11K5J99M9m0
3685a12K26j73p2J58K38m77M06l25l8J82q0Q9j42P0J1J47m5j70R8P6K43k73J03
3708A40M4q9q7j00J23P5Q7L3k54J19j5j13k46K36K72l61J69k07K90k21L72m00
3730a33L2J01j52j02K47q6m4J64L6j03M29k36k95K84j39j70J06N8J86l11J20j66
3752a74J54j96J59M7j87L77k77J81k15K70k12K99k58M4P1j04l9J3J53j23n4j14
3774a85n5K52M1j93K06j1j06o4J99K26l21O8j35j21K25kj94o4N74l65j05K48j97
3797g9r0L43k4Q8l53L0K47j62j31J28m2Q1l5l03M24J6j29p6M4Q6o7j27j0pK95
3822A47k56J55j27L06k36k0k0M1R0j24J89o5m2K3l18J04K30r4k7M51l75P6N3o06
$$ plain form
3661 -254 -18 -54 10 31 173 20 92 97 -50 -280 -252 174 -53 -32 148 -211 -6 -46 -34 -345 -320 -121 -72 -112
3685 -112 114 -59 -131 27 265 -212 194 -131 -169 13 -67 22 -120 -50 -39 108 63 -107 -9 67 310 37 140
3708 140 184 95 8 -92 31 106 193 226 -28 91 76 -37 -283 -47 225 -136 33 -174 116 -105 267 -133
3730 -133 -101 0 -152 -254 -7 -93 -137 27 63 -40 389 153 -142 142 3 -167 -61 -3 183 -128 -8 -174
3752 -174 -20 -216 -57 -10 -197 180 -97 84 -131 139 -73 226 -32 12 83 -21 -60 -47 106 -17 -71 -185
3774 -185 -240 12 53 -140 66 55 -51 -115 84 310 -11 57 -78 -199 26 24 -170 -234 340 -25 -130 118 -79
3797 -79 -169 174 150 238 -115 -85 162 0 -131 -3 -45 36 1 -302 122 138 9 -67 -23 63 -4 -131 -141 -148 147
3822 147 -109 46 -81 225 -11 -31 -51 -10 80 -44 145 80 38 61 -257 -153 77 -17 -44 407 32 108 161 -445
3846d45N46l09K21J04k79J37prj86O8J21J88k23j22J40K34j87Q5J19l24J02J19
3868I3j41K97j47Qj06n9J3K59l76J14j2p0J08j30kK50l69J81K45m45M33k45K55
3891A54k22L12l83O8L01k89j87K80K07k31J11k11L71l98J96j9K09k25k68L32j97
3912h9Q9K16r6k77L8J86j70J70q5j20J97q5P6Nm0l18M05j75N1k51M12l76K28j92
3936b01K59j59j00L30k41p4K90Q6l41r1J71J30q5J08k62L06n3k80K2M73k12p2
3958DL2k63J41q0K63k04J85k69L72Q2k6o8j76j43n1j5Q8J55J91j61J48k57L14
3981B62k37K84l47j8j5KK51k74J23jJ28j86K7J99K9l17N9J55L6p9n9j1J92m72
4005b69K98L3J1k47M7M77k89k04R8r9K58Q1k86M6J05L7n3k43M56k40K42l05M25
$$ plain form
3846 -445 101 -208 13 117 -162 -25 -32 -41 -227 -159 -38 150 -73 -195 -55 179 -8 77 196 -128 -26 93
3868 93 -48 249 102 110 4 -55 -42 217 -159 -45 -57 -127 -19 -149 -151 99 -270 -89 156 -289 144 -101 154
3891 154 -68 244 -139 -71 230 -59 -246 34 241 10 121 -90 281 -117 79 60 269 44 -224 108 -89
3912 -89 0 216 120 -157 -119 67 -103 67 -18 -138 59 -26 50 55 15 -303 102 -73 -22 -273 139 -237 -9 -201
3936 -201 58 -101 -201 129 -112 -186 104 190 -151 -242 -71 59 -26 82 -180 126 73 -207 -185 288 76 4
3958 4 36 -227 -86 -166 97 -107 78 -191 181 263 237 169 -7 -150 -201 -216 -128 27 218 57 205 -52 262
3981 262 25 309 -38 -56 -71 -69 182 -92 31 30 158 -28 -1 198 227 -90 -31 124 160 81 22 11 203 -269
4005 -269 29 62 73 -174 -127 350 61 -143 -45 -144 114 195 -91 -45 60 97 44 -199 257 17 259 -46 379
4028C79l41l1k27L39P6j98O4J40j9k38J16k30J91K88m05J57k00j9K39j68P5MJ29
4051A21j10J38j71L7P8k13J84j7R3k10n9K04L4j01K7M9l13K64k12J76p8K10m80
4074c49J53K41j97N9K24j28l4r4j71L43r6j26J12P9K99o20M52k94J19j01R3K05
4096A69k55K59l08N6o5L10j86J34q6o3J06K09k14J45j29m03K39J44l32L37o1J22
4118A28p3o4J1k46n6L27j66Q1j28J11J30q4L2lk6O9k9q5R2N4R2j99j90K93j54
4143h3L3nj8KP3k7P2J91k48L2j29j1K82k15J46L2J5n5j1k39Q7L22j06j70L91k89
4169G2j33K46l08K21J45k65j75L56j33j10l6j2J55J62k19P3R2j05J72k99j6J39
4191B2j38j15J41R8n3m4r5K49j38J27j24o1J89j65p4J60lJ54m6j34o8O8J32k54
$$ plain form
4028 379 38 7 -220 119 195 -3 61 201 182 -56 60 -170 21 309 -96 61 -139 -158 81 -87 -12 -8 121
4051 121 11 149 -22 15 93 -120 64 47 140 -70 -129 75 109 8 35 84 -229 35 -177 -1 -79 131 -349
4074 -349 -196 45 -152 -93 131 3 -31 -125 -296 47 -49 -175 -63 16 315 -305 147 -147 -28 -129 -36 169
4096 169 -86 173 -135 -79 -144 166 -20 114 28 -35 71 280 66 211 82 -321 -82 62 -270 67 6 128
4118 128 55 -9 2 -244 -300 27 -139 -58 -186 -75 55 -29 3 0 -26 43 14 -71 21 75 167 -32 -222 71 -83
4143 -83 -50 -55 -73 -71 2 -25 47 238 -10 22 -107 -118 164 -51 95 127 142 87 76 -163 -76 246 140 -30 361 72
4169 72 -61 185 -123 98 243 -22 -197 159 26 -84 -120 -132 23 185 -34 39 131 26 198 -101 -117 22
4191 22 -116 -231 -90 8 -45 -89 -184 65 -73 54 -70 -131 58 -107 -181 -21 -24 130 84 -50 -118 -50 82 -172
4215a72J49K36j99Q1j09N9p9n8N5M4l8p2K60l70J82k51K57r3K9L07k48j00O3R9
4239C2M5l01Q6K57n5K3k60L24k56M80m78j34J14L48k00j09J27k5j5n9p4L37l09
4262a02J59J48j48j72N9J61q0Q9N4k92L24m10L3J26K66q9l51K86p3K10k66j89
4284b57N8K38j46M6m8p0J14J23J36k31J70k74L05k55QJ19o7M3p2k0K68j08j5k33
4308a68J77K78n87K94j1m2k48K68O4j68M25j25n5r2j60J14j37P8j09N0K63j93
4330h4j16J19q0O1J89Lj75j59L2L57N8m83J66%K63j39o9K55k17k82K81K8p5Q1
4354A4jp0J92k9pk23L0L11k78J21N5R4j22j42J73k59J15N9M5o8O9r3J40k45R2
4379b7J70j79p0K31j35o2N4j50K2K37o6R3mr0o3R3j66J65j95J85r5L65k17k04
$$ plain form
4215 -172 -23 213 14 95 -14 45 -34 -92 -37 7 -31 -103 157 -213 -31 -282 -25 -118 -89 218 -30 -130 -67 32
4239 32 77 -224 -138 119 64 87 -173 151 -105 375 -103 -237 -123 225 25 -84 43 18 3 -56 -130 207 -102
4262 -102 57 205 57 -115 -56 105 25 114 168 -124 200 -210 -177 -51 215 126 -225 61 -12 198 -68 -257
4284 -257 -199 39 -107 -61 -109 -179 -65 58 194 -37 133 -141 164 -91 -83 36 -31 12 -60 -80 188 80 65 -168
4308 -168 9 287 -300 -6 -17 -59 -307 -39 25 -143 282 157 102 10 -150 -36 -173 -95 -204 -154 109 -84
4330 -84 -200 -81 -161 -100 89 92 -83 -242 -210 147 205 -278 -112 -112 151 12 -57 198 -19 -301 -20 8 -67 14
4354 14 13 -57 135 106 99 -124 -94 217 -61 60 115 209 87 -55 118 -141 -26 33 78 10 79 -14 126 -119 -27
4379 -27 143 -36 -106 125 -10 -72 -18 -168 -146 91 25 118 114 24 -39 54 -112 53 -142 43 -52 313 96 -108
4403a08J26j04J73m2j21k9j04K98J01j66l6RJ6J0rm7k23K65k31J81O5l63L51q1
4427f9l6k3j41M20j13R8jk49R4j95L59m59L38L54j55l22J10J46j20j27K57l53
4449a87L4J74J80j85k87K36J26j01K32q1j48J09j86L19nm1Rl40Q0J31m3j62P9
4472e7mR0k66N01o1l93K61k8J16J2n9k4J70j83K7k2j35K73k3l03P2j30Q6J93j14
4497ak6m1n4J77q7K16n2j7O3J24k59K70o5j78j27J26K51k39p6J06j3j52j3j21
4521a88M18l15n0m1J91j86M1J29J83q3l75L18P3j69N3J46m4j19m1K5J90j27j04
4544g5K76j8m78R0J42k36Q2M05p8q9k83K17Q2J38n38K22J07O6N0j51m8O2K8J16
4568H9l9j45Q3k03J50J52j60j72K23N7N6O5l35J57Pk5Kq0k67M96k05O2j6P2k24
$$ plain form
4403 -108 18 -86 87 45 -76 -105 -209 89 190 24 -12 -3 13 23 14 -33 -256 9 -222 -41 24 -339 12 -69
4427 -69 -105 -128 -269 151 38 136 135 -114 -20 -215 144 -315 23 377 222 -100 10 156 36 -91 166 -187
4449 -187 -153 21 201 16 -271 -35 91 -10 222 141 -7 102 -84 235 230 189 198 -142 -62 69 26 -136 -57
4472 -57 -61 29 -237 264 203 -190 71 43 159 171 112 88 258 75 102 80 -55 218 195 -108 -36 -166 -80 113 -1
4497 -1 -27 -68 -122 55 -32 184 132 115 178 302 43 313 248 70 -57 69 320 81 5 111 98 -54 -67 -188
4521 -188 230 -85 -135 -176 15 -171 -130 -1 182 99 -276 42 115 -54 -1 145 101 -18 -59 -34 156 29 -75
4544 -75 201 183 -295 -205 -63 -299 -217 188 110 21 -262 -45 37 175 -363 -141 -34 32 82 -69 -117 -55 -27 89
4568 89 50 -95 -12 -215 -65 87 -73 -245 -22 35 91 156 -179 -22 -15 -40 -38 -118 -385 111 -94 -32 -48 24 -200
4593b00N7K78j97N9Mm3P6j87L14k67M7R8J96l35mK38j90o7K3J57K8j74K84k31
4617c6m8n0O5k9J02J46mj53m8KR4K44l21J21j36K90k57j51NJ03K77l55n6K01p9
4642g3j16J17N9O2k22K13o9N0m3J95j39k13L76k56l4j21q4L21o8J89J4J41l34
4665c5k57L36j21R4k36L95qk17L8k1r6N3J79K51k05k40J50K78k86K05j57k07R9
4688hj87q9K99J24j45J22l7j25J36Pm6J20p3j06k19M1J10J96p6j15J4p9O7l8K1
4713h6rJ67j4K6j47j16j4L42j7j05J11j56j42J17K33K9j41l84K96l7Rj23J59j29
4737a31L40l04K75j04k41R4O4k7P1J06m4J22j86N3k2K23l48J74k80L60j77j57
4759a39R5M4j2j01J2L0J19km6J12J12k98M2N3M7k39K37OJ09j80L6J20k15J01Q4
$$ plain form
4593 -200 -143 135 -62 -3 1 -42 34 -153 161 -106 -59 39 235 -100 -104 134 -56 -123 -100 57 85 -89 195 -36
4617 -36 -84 -134 -69 -98 4 150 146 -7 -55 -53 41 285 -36 85 -51 239 -18 -169 -164 -61 216 -139 -195 6 -73
4642 -73 -189 -72 -13 49 -173 40 -29 21 -22 173 34 -179 197 -59 -93 -214 -298 23 -45 144 158 299 -35
4665 -35 -292 44 -77 17 -219 176 168 -49 -11 -32 -128 -75 104 355 150 -90 60 338 52 257 100 -107 -8
4688 -8 -195 -284 15 139 -6 116 79 -46 90 97 51 171 98 -8 -227 -186 -76 120 44 -71 -57 -136 -69 -107 -86
4713 -86 -95 72 58 84 -63 -179 -193 149 132 27 138 -18 -160 -43 190 219 78 -306 -10 -47 -38 -161 -2 -131
4737 -131 209 -95 180 76 -165 -71 -7 -34 37 143 99 221 35 88 66 289 -59 115 -165 195 18 -139
4759 -139 -44 0 -12 -113 -101 -71 48 46 0 112 224 -74 -32 21 68 -171 66 72 181 1 37 157 -58 43 127
4784A27k32L1P0O5R7k77L27l79L17m41L44l37M07j32J86k91Q1r5R7p0j23K05J77
4807A54j73j54m0K95k24J52n4m6K34n45Q1L75Q0j54%Q1o7Q4j75P0o6J13O7j61
4831g3N9K3q1J25j5N1lo0N1J47j64N3j87k27M87j84n2oJ20j51K62l44p2K60l1
4856a2r8J63l38M00ok06l8L82j06k72L72m0Jj44Q8J3k59nK2O4J59j61n0J7J75
4881A21j19L0Rj25J60j84K44R7k36n7J38j48j23M08j34k05L08j35j00K47l29k27
4903c60R5J67J77j97k9J89r1J56R0k84q0J79j10J38L4n2j06k77J94j07L43qp7
4926a6K29k38K7M8r7K08m55K69J2rj19L16J05l46l7K54k74K05k36J77j45r8K54
4949C4m7J90k70r9J43N0p5QQ1L8Oo9q6J06k58Q0J75O0j57L11l10p5J30R6k32K81
$$ plain form
4784 127 -105 -74 -4 61 158 -119 208 -171 146 -295 49 -288 119 -13 173 -118 -37 -132 -35 -105 -228 -23 154
4807 154 -19 -173 -213 82 -142 10 -44 -90 144 -401 -320 55 135 -19 -19 62 -5 79 -96 -26 -92 21 88 -73
4831 -73 -14 9 -72 53 38 89 86 26 77 224 60 113 -74 -301 186 2 -50 -56 64 -87 175 -169 -241 19 -12
4856 -12 -110 53 -285 115 109 -97 -135 247 141 -131 241 201 202 58 146 159 -100 -105 -83 -19 140 -21 -71 -54 121
4881 121 2 32 41 -84 76 -108 136 233 -3 -60 78 -70 -193 215 81 -124 184 49 -51 196 -133 -360
4903 -360 -265 -98 79 -118 -147 42 -49 107 197 -87 -167 12 -98 40 74 22 -84 -361 -167 -274 69 61 -16
4926 -16 213 -25 2 50 -47 161 -294 -25 -13 -22 -141 175 280 -66 -103 151 -123 82 -154 23 -122 -220 34
4949 34 -13 177 -93 -192 -49 1 -74 -66 15 53 59 -10 -96 10 -248 -168 7 67 -90 221 -89 -164 -34 62 -170 111
4975A11n8k5m0R6J76j25J6m06L7O7J21l9Nk15J67K13m8k69K48J1P3k14J80l31
4999b49K99Kj33P2j6q2J37J7O5p3j08j50K48M0k09J22K1J73p7o2j08j27K56j85
5023a27L18j12j45m2o7KK08j60O9K41k20K32O0l16Kk7L66n6j39p6N5m5%J21j12
5048C0k21M24k14o1Q9r3j20K54j02L3k0L2l5J43l85o6J35J23P5j85R6J91k25L1
5072g1J10k47J81L21n11K71J05j36J70l62Q2N2J50j30J96k37J45J1j47J67k33
5093a13J91J73k10M2j74j2j06L13o0j3j03J4L72j80k14J47k8O8QJ17j27rj96K6
5117g4J02j18q1r4J76J55J38j25q5p3Q1r2J71P8l08l8L29k79L67k22j0q8q1M09
5141B38k79p2K03j21nn4K06r5K1J19r2K14k35%p9J2J40j03K18r8j24m0J48L1K5
$$ plain form
4975 111 53 28 -12 84 260 135 151 -255 -218 -151 -30 -69 -64 -279 -112 101 53 -216 32 43 116 -98 82 -249
4999 -249 50 52 -81 -9 -25 -107 30 47 112 39 -69 -219 29 69 -140 -18 3 176 99 37 -71 -198 58 -127
5023 -127 191 79 -66 -108 -175 -173 35 -125 -56 185 -35 197 257 -59 -57 -84 282 226 87 11 66 21 21 142 30
5048 30 -191 233 19 -42 47 -46 -166 88 -14 19 -1 31 -4 139 -246 -312 -177 -54 21 -164 -68 123 -102 -71
5072 -71 39 -208 -27 294 -217 54 159 23 193 -169 -87 -35 115 -15 181 -56 89 100 -47 120 -113
5093 -113 78 251 41 83 -91 -103 -209 104 44 31 -72 -58 314 134 -80 67 39 107 115 232 105 96 -100 -74
5117 -74 28 -90 -171 -265 -89 66 204 79 -6 -79 2 -90 81 159 -149 -187 142 -137 230 8 -2 -90 -171 238
5141 238 -41 -113 90 -31 -36 -90 116 21 42 161 69 283 48 48 -31 -19 121 18 236 138 14 -26 122 153 178
5166A78j36o7K46J9nj12j83K23l3R9j37j19J33O7k40J91J95m82K00r9J49k66J78
5189aM23o40N1J1O38l80j01k20J89P7r7J05L37k55k71M7J68J12l44K55j19J87
5211A72k90J10p0J29j85K4J30l50J46R5J40j9nj29j34K25MK04j7k29K63j60Nj01
5235d2p5R7o8m5L33k57R1j31J0J58jK2M9q8r4J24p4J84k53J24j34JM8J19j83L
5261h2J24n4o9M8m7O9p2K91m74L44j32K34l95K74QO9K6k95J46j27P9J9j71J78
5285ir8L57k57L01m16p2l7O3R6RK42k24J31k33J75j90L20k41N8m7k88N58j85J5
5309B8k96L54m0r6p7L0J81l4K5N9J66m74M01n4k99q8J46M2L89m99J39k66J97k72
5333c38N52j48R2k98J47l6L49l39K83j91J1k16J90J89n3k48R4j06K74l44N8j6
$$ plain form
5166 178 42 -25 221 240 235 123 -60 163 130 229 92 -27 106 173 -67 124 319 -163 37 -62 87 -179 -1
5189 -1 422 -218 -167 -156 482 102 1 -219 -30 47 -50 55 392 137 -134 -87 81 193 -151 104 -15 172
5211 172 -118 -8 -78 51 -134 -110 20 -330 -184 -89 51 32 27 -102 -236 -11 -7 197 180 -49 214 54 59 -42
5235 -42 -117 -20 -88 -133 200 -57 34 -97 -87 71 70 92 141 53 -41 83 9 193 -60 64 -70 -69 -21 98 -85 -82
5261 -82 42 -12 -81 -33 -80 -11 -83 208 -266 78 -54 180 -215 59 67 136 162 -133 13 -114 -35 -16 -187 -9
5285 -9 -107 250 -7 294 -122 -194 -231 -168 -72 -63 179 -45 86 -147 28 -162 158 -83 -25 -72 -360 198 13 28
5309 28 -268 86 46 -50 -127 -97 84 50 75 134 300 -174 227 173 -126 -214 -68 -26 363 -136 3 -263 -66 -338
5333 -338 214 66 158 -140 7 -29 320 -19 264 73 84 -132 58 247 194 -54 40 -66 208 -136 -78 -94
5355i4K5N1O5K4k30K50j75M6J70j48O7J96k22N1m1k6p5J06j40QJ86l8j62j11K25
5380Hl20K55J29j29K51m63J03o1K93q2j26p9L09J7j82L71q8k70K4j8J34l6j19
5403g9L61l94K44m00J37O7K49k57m5o2J66j74O0K84m46J94J21o4P9j5j21J11L8
5426E4k09%j88K07K31J69m27P4J61k4m7J73m1K39j75k15rl37M2M23j09J15j75
5449f8O5k25M39K1k11J0j68L24n0k81K12l16J58J75k60K60j40j87J10o2J01J48
5471E5l6r2L43j52k18K85l05J01k38K36k46J52J48j23M41l48j47K21k26K71r1
5492C1L8o6K1O5k45J80r9J78Ln7Q2k57RK7K87r1l18K42j17kJ00n7k18K31j69J48
5518e4n4N5K18j4o4k2j65K52m81M86m7j64J28j91K7J9K49q2L4J74k49o9J16J74
$$ plain form
5355 -94 -69 -18 47 71 -159 91 -84 -38 132 -16 51 247 25 76 35 9 -66 40 -100 -92 94 56 -106 -217 8
5380 8 -312 -57 72 -57 194 -269 -166 -227 66 -16 -142 -221 88 105 -77 294 206 -64 -40 -58 76 40 -79
5403 -79 282 -112 132 -268 -131 -64 185 -72 -117 -179 -13 -187 -127 157 -289 -95 26 -38 41 26 -95 16 54
5426 54 -155 -155 -343 -136 95 264 -163 -89 72 48 1 174 133 372 197 -18 -27 -364 -322 101 -8 107 -68
5449 -68 -3 -228 211 232 21 31 -137 187 137 -144 68 -248 -90 85 -175 85 -55 -242 -132 -194 -93 55
5471 55 19 -73 270 118 -100 185 -120 -19 -257 -21 -267 -115 33 -90 351 3 -144 77 -149 122 31
5492 31 69 3 24 89 -156 24 -75 103 106 49 131 -126 -117 -90 197 106 -212 30 -87 -89 11 -46 -264 -33 -202 -54
5518 -54 -108 -53 165 151 87 65 -100 152 -329 157 110 -54 74 -117 -90 -71 178 96 130 304 55 -14 102 276
5542B76M9n20o2N08k79j06p7L31j72J86l22L9L9O4N3k5q8J40l3J27R9j55k33k68
5566d29M98J81l54K5M3J13k07M37l75M01k25k46J41n5L22j14O9m27L09j09j13
5587a15N6L7o1L4J27k69N8J05r2M01j14o8m45N14j49j46L98j80j04k06N47m47
5609a19rJ77q1j39K76r3L5m4J4p4k05J54N1K04l16J82J67m89K93LK1K7k11L35
5633A59n8j61j5j17J33J22p9l5J61O2n45K36J71pj40k2K30q9K50n63O4N83j28
5656B12k82O6K72m27K73k23q3M23k4k40L43k63m05K02J8K41k22K00p3K43m36L19
5678A34nk66R5Or7J05j11q6L23L0M0j30p2J09Q8k82P9k32J60J62J65l87N3J45
5702B6O3m0J00k18p6q5J81j5Q1J08j5n2l79K41j31J96M5j51L18k26ML2J18k46
$$ plain form
5542 276 325 -195 -257 251 -28 -134 -211 120 -52 134 -188 -149 -110 -46 7 -18 -106 34 1 128 227 72 -161 -429
5566 -429 69 250 -104 -79 -36 77 -130 307 -68 333 108 -138 3 -52 270 156 225 -202 107 -2 -115
5587 -115 -59 -22 -83 -49 78 -191 -133 -28 -120 281 167 99 -346 168 19 -127 271 91 -13 -219 328 -119
5609 -119 -128 49 -32 -171 105 12 47 3 17 -57 -262 -108 -57 147 -169 13 180 -309 -16 -13 8 35 -176 159
5633 159 101 -60 -75 -192 -59 63 -16 -51 110 172 -373 -137 34 27 -113 -135 95 6 256 -307 -243 340 212
5656 212 -70 -4 268 -159 114 -109 -192 231 207 -33 310 47 -358 -156 -138 103 -119 81 8 251 -185 134
5678 134 129 -137 -42 -36 -133 -28 -139 -225 98 128 168 38 -34 75 163 -119 -40 -272 -112 50 215 -172 -119 26
5702 26 89 49 149 -69 -145 -230 -49 -64 17 125 110 58 -321 -80 -211 -15 30 -121 197 -29 -25 7 125 -121
5726a21K35m28kJ42M22j09j93k2J46j38O9m1L1k1J1L28j94j12J17j09n6J0O3j15
5750h7j08J0M54k63N3k42J34J32k27J61j21P9pn9j96J82l7m9k1M06q27M64K08
5773C9J46m50K18j39K02J20l15jM13j26j32r8J26m93N99l23J84Q3j17m2K97j1
5795A80k60J2k66J05L36j06j23O3p7J62K2n5J9k6L1K97k56O5m9l2k02R1R2K06
5819B29j17k03K1j8J35K9l6j31K25j84N3RJ45r3j31K43k29K72k91J7%L7P5j5L2
5844G4j09R6j08r2K23Q9k37L25j3m34M3K45k38L97m18J42P3K4K12l54O8k0j08
5867a20K32P2k36KJ29L31l28j52M0M8j64K28k44R8j78L29j01R9o6m6J5r9K91j08
5891G2r2j79Q7J65j02M8j2Nj57K14j99jL10k04q0K09j89K70j0j50PJ17o1j53L2
$$ plain form
5726 -121 114 -314 -316 -174 248 139 -54 -76 70 -68 1 -40 -9 -30 -19 309 115 3 120 11 -45 -35 28 -87
5750 -87 -195 -185 269 6 59 -183 -49 83 -144 17 -104 -25 -32 -91 -287 -105 -142 -191 -212 194 -633 -169 39
5773 39 185 -265 -47 -186 16 136 -179 -180 233 107 -25 -123 3 -490 109 -214 -30 53 -64 -106 191 180
5795 180 -80 -68 -334 -229 107 1 -122 -59 -136 26 48 -7 12 -14 17 314 58 123 74 42 -160 -69 23 229
5819 229 112 -91 -70 -88 47 76 40 -91 134 -50 3 12 157 64 -67 176 -53 219 -72 -55 -55 -18 57 42 74
5844 74 -35 61 -47 -139 84 173 -64 261 248 -186 -143 102 -136 261 -157 -15 58 82 294 -60 8 -12 -120
5867 -120 112 184 -52 -50 79 410 82 -70 -30 18 -146 82 -162 -64 -242 87 -14 85 19 -27 -12 -111 180 72
5891 72 -20 -199 -112 53 -49 -1 -13 -8 -165 49 -150 -151 159 -45 -125 84 -105 165 155 5 12 129 68 -85 -53
5916e3l4J74o5k06L03j1K03k87j06l4K27K72l98J90o3j1K1k88N5P7mj04O8J15
5940D1Q1k50J87r1MJ49j35k05L04p3j64J81k4o0p7Q4J77m8j00j59L53k23rJ38
5964H1j14M7r0m1J22j95K80Q0K1l89P2K88n01K65J38NK57Pm02J10N9j29K48k89
5988g0R6P4k61J37K10j94l1LJ17k09K00j90K84k33L02j2k19j2q2J59qJ25k65m7
6012a26L07j92O5j47M26l14k16J87m4o3J72L03m70J64L4j38K86l23nk38N40l34
6034a26J39L2j33k29L03m9j9o5K64m5r6m0o3K82m40L1J55K52L0p8j69L09m62L05
6058H8l25N64l27n6J89l08K85J30j25J25l46K30j31j24l3J45p2J39l9l4j79K95
6080I1j10k57K41j3J67j55k12j91N22j46j08J90L6j74p2J1j6J82L6J25k08J89
$$ plain form
5916 -53 -87 87 22 -184 119 108 311 24 -82 -116 111 383 -15 175 112 101 122 -166 -111 -34 -38 -142 -74 41
5940 41 122 -128 59 -32 -28 121 -14 -219 85 12 -152 29 5 -55 -132 -48 129 81 -19 -178 175 -48 -57 81
5964 81 -33 14 -76 -117 5 -190 90 170 191 -198 -126 162 -339 -74 64 69 326 333 -69 41 100 -29 219 -70
5988 -70 26 100 -161 -24 186 -8 -39 -36 81 -128 72 -118 166 -67 235 223 4 -8 -90 69 61 186 -79 -126
6012 -126 181 -11 54 -93 333 19 -197 -10 -54 -117 55 358 -112 52 86 -52 234 -89 -94 -332 208 -126
6034 -126 13 45 -88 -317 -14 -63 -82 -147 117 72 -24 -64 -127 155 -285 -254 -99 153 183 105 -64 245 -217 88
6058 88 -237 327 0 -56 133 -175 110 240 115 240 -106 124 -7 -131 -164 -19 -91 48 9 -25 -204 91
6080 91 -19 -276 -35 -48 119 -36 -248 -439 83 -63 -171 19 55 -119 -191 -180 -196 -14 22 147 -61 128
6102A28m24K86k40M05Nl08l5J19J12r3L2k14M65j60j46j4J47l27L38O0k38J41
6124C9j38M0O9k10K95j87J63J46k29j86J36K57j67j12K48k40k3K78p4k33K37j47
6146c8N5J79k79j25M53j43o2Q2k80MK17J54m53O5J71K28r4l6l37K14L9j39j66
6169b91K77K56m08J87p6p4K34j09j63J73RJ69j31j98j96K06L98k39o5J45j13p7
6191h6R9k16M4J66J30m19K41q3N4p5p0M11k40R8R6k26J82j4M5Lk46j89M76k17
6215c6O9j54N3L28k82K1P6M7rj51j40M4J04P4j13J41pj61r2M15q5p9k92J38K3
6240f8J32j26R7P3p4J83k56J38j61K28j52r7r0J74k24K41J31l67J19P7r3L28k53
6263d0L9j54K43L46k62l99L46k14j2o3J09J54k38K67j32j40L97L0k18l1j18k1
$$ plain form
6102 128 -296 -10 -250 155 160 -148 -183 -64 48 -45 -13 -227 238 78 -68 -82 65 -262 76 136 -102 39
6124 39 -99 -59 10 -200 95 -92 71 217 -12 -198 -62 195 28 -84 164 -76 -99 179 105 -128 109 -38
6146 -38 17 196 -83 -208 245 102 40 122 -158 -154 63 217 -236 -171 0 228 134 98 -239 -25 14 -125 -291
6169 -291 -14 242 -166 21 -55 -129 105 -4 -167 6 15 184 53 -145 -341 -135 263 24 -41 104 -9 -86
6191 -86 13 -203 -159 7 137 -282 -41 -124 -70 -145 -215 196 -44 54 150 -76 106 92 137 140 -106 -295 181 -36
6215 -36 33 -121 -68 260 -22 -1 75 122 113 -38 -178 -134 -30 44 -69 72 65 -96 -188 227 142 63 -229 -91 -68
6240 -68 64 -62 35 108 34 217 -39 99 -62 166 14 -83 -173 1 -223 18 149 -218 -99 -22 -115 213 -40
6263 -40 -1 -155 88 434 172 -227 119 -95 -107 -170 -61 93 -145 122 -10 -150 247 277 59 28 -90 -111
6285a11J84k28P7L0O8mQ5j56PJ45O7j27j54M19k82J77j37j56K36j12j8p9k8J3
6309h4K87l52Q4J30j3j26K5j58K76J25l41M0j54M64j22mK5k43K17q1M4j10N8L1
6333A8O1n3Q9l04K29L9k15K8o1L60j80J46o1j52JJ65O5m19J71n3J50O7p5k19M97
6358B94j83J29m23J9K39k0j42j99M3K12J62k42J04K5k00J96k77K90k25K40j88
6379a46K37j04l18O20k38J47n11L65k06M4J07L7j51J43m6j6j8j58L29L1j41j49
6401a42J02J22o7Q4j40KO5q0J47o7o4Q7J41J11m80J33L6O3L3q6j29l65M52j02
6425a44K45o9J66k48O9j91M02r5Q9j98j65K4P8J64M4l09q9L99k1J41j30J69n45
6448b14P6j28L79m77M20NQ5J73l12J08p5J15o9p4o5J40j36L7J69J09l94j2K54
$$ plain form
6285 -111 73 -155 -78 -48 20 16 101 -55 -48 97 164 37 -117 302 20 197 60 -96 140 28 10 -69 -97 -84
6309 -84 203 -149 -65 65 52 -74 -49 -207 69 194 -147 -107 -261 203 81 77 102 -141 76 -5 39 -71 -13 18
6333 18 79 26 115 -189 40 79 -136 -108 -169 191 11 157 96 -56 -55 110 175 -244 -73 -126 24 91 16 -203 294
6358 294 111 240 -183 -164 75 55 -87 -286 -243 -31 131 -111 -7 18 -182 14 -263 27 -198 42 -146
6379 -146 91 -13 -331 289 51 198 -313 52 -154 -110 -3 34 -117 26 -20 -36 -54 -212 117 148 7 -142
6401 -142 -40 82 15 99 -41 -39 26 -54 93 26 -38 49 190 301 -179 -46 -10 53 86 0 -129 -494 -42 -144
6425 -144 101 32 198 -50 19 -172 230 135 224 26 -139 -115 -37 127 171 -138 -227 172 151 292 162 331 -214
6448 -214 -138 -266 113 -364 56 61 146 319 7 115 40 155 86 12 -53 87 -49 -12 157 266 -128 -140 114
6471A14n6P1k5J34Q8k22k64M12l90L82l52J89k25J49j5n1K26q4k05N1J79j67J29
6494F8k77K83q9J19j38K4j41O0J85l94J48K58r8O1l21M80k90L8N4j93N5L34l48
6517a22R5L5J04k04J41j3J64k8k23K00j72o8J69k3L0j33J2K13k43K06J04l43K13
6540A14r4l6j08K60k06L5J27m4k24l14K58K37j66L0K76R8l24J66K76k47q6J37
6562A65j65j8m6J07j04n2K31k25M11o5n2o06K39l9J62J38J62l26L41l32R0k3J23
6585A16k83M72k11k62K41j02K27r2o2J11k39m2J60L7Kk99K86n3m1N0p6P4n0j41
6609a77K17K4kj68m0K15j64k3J71J69l53k10N27k17J74o3k84J46J19j17J00j01
6631e7K5j06P5R8P5km89L38p5J61J9j2o7j66K11J62j08k40J30J19j79j32L64m57
$$ plain form
6471 114 58 129 104 238 326 104 -160 252 -138 244 -108 81 -144 5 -10 -61 165 81 -124 -73 106 -61 68
6494 68 -209 74 -15 104 -34 -10 -151 -91 94 -300 -152 106 8 69 -252 228 -62 -24 30 -163 -108 226 -122
6517 -122 -27 8 112 -92 49 36 200 172 -51 149 -23 -91 78 55 85 -48 -36 177 -66 140 244 -99 114
6540 114 20 -16 -124 136 -70 -35 92 48 -176 -490 -232 5 -161 -131 145 243 -81 85 361 114 28 165
6562 165 0 -18 -64 43 -61 -113 118 -107 304 239 187 -419 -180 -219 -57 81 243 -83 258 -74 16 -7 116
6585 116 -167 305 94 -168 73 -29 198 106 44 155 -84 -126 34 71 73 -226 60 7 -34 16 -60 14 -36 -177
6609 -177 40 64 62 -106 -146 69 -95 -118 53 222 -131 -341 186 -31 143 80 -204 -58 61 -56 44 -57
6631 -57 -32 -138 -63 35 110 108 -381 -43 -118 43 62 50 -17 -183 28 190 82 -158 -28 91 -88 -220 144 -313
6655c13N37j82J11j33j12M66j19n20L19j90PR0K72k77P7J8p7o3j00K51K26l58
6677g0K61m20K84n8k01K01J15K7k56j6K5K23p5j07L94j4k76r2o1k93M00j30J6
6700a23J14q3j63M08j80J9K08k51K51m96O91m94l33O80m33L69mp9l9k4J91j01
6722A28o7p0J1J31k13P5j5o7J0J22J65j77k05PL80l79J08O7k71L20R2m51L68J83
6746B52m40R1J6K6j07Q6n4Q1P5J1J89l32K4N8J23j61K32k66J16p3n0k01M00k33
6770a37p9K31j66N7M4J00J06k37L44j52N7l0l68J33R1r1K96J05m73K72l53K85
6792C5m8Q8m22O37n90K83N5O6K4k35J93j9J47k55J76q8j96M7N6J09k7l54K56j21
6816a83K39Pj38J98k17J15K41l10J69j29K3j32J97j00J62m44K44J24r2M7M9j67
$$ plain form
6655 -313 224 42 153 20 -92 374 255 -265 54 -136 -129 -39 233 -44 33 51 -26 -89 -189 62 288 -70
6677 -70 191 -229 55 -3 -204 -3 112 139 -117 -133 -108 115 40 -67 327 313 37 -55 -116 -409 -9 -139 -123
6700 -123 -9 -92 -255 153 -27 -8 200 -51 200 -296 395 -99 -432 248 -185 184 180 101 62 38 229 128
6722 128 61 -9 2 133 -80 -5 -20 -87 -77 45 210 33 -172 -165 215 -164 -56 11 -260 60 152 -299 69 252
6746 252 -188 -97 -81 -55 -162 -76 -130 -49 26 37 226 -106 -82 -24 99 -62 170 -96 20 -53 -103 -304 96 -137
6770 -137 -216 15 -151 -94 -50 50 156 -81 263 111 168 138 -230 -97 -6 -97 199 304 -169 103 -250 35
6792 35 -13 75 -347 290 -300 -17 38 104 128 -107 86 67 214 -41 135 47 -149 -102 -46 63 36 -318 -62 -183
6816 -183 56 63 -75 123 -94 21 262 -48 121 -8 15 -117 80 -20 142 -302 -58 66 -26 21 70 -97
6838i7O8J52k50p4K77J77k59j56%Q4J17L4j14K22l37K96j34j46k55L35J45j21
6860c6J20P6m1j49p7mJ93J4j2P1j41m0q3j9l1J14R6j02k4p9R2K1J68j4p9k41K7
6887a80K85j38m44N32k77jM6M1K40m3J56j61j37k38N24q2j03k28J87Q6rM6P4k32
6911e6r8J71q4J72J6Rj10P5k5K2J01q1O3k53r4K77l8j5o3M8J58k74j18M02l08
6936a03N8J42j0m1j31l33O91l02p8K06M7M1k75K94K1j74j34J04J17o5j95J38J5
6959C3K73k05j57m6K5J13P5k45N2p2K69q2j45J62j99J17Q9L2m25J27K08j06J06
6982am7J80l96J92o7J07K06j80q2J23j11K33K1k80M4R8l80L25J53j21L8ml4P4
7006I1KkK59l01O8j71O8L01j15j28k86K24j76N5K48L0k71K03j57J04K79k43k31
$$ plain form
6838 -97 -29 123 -127 -201 76 253 -6 -162 -162 -78 39 73 -41 181 -156 140 6 -140 -395 -60 85 -36
6860 -36 84 160 119 -30 -107 -111 82 96 84 155 14 -26 -109 -128 -159 -45 51 -51 -75 -154 -62 -41 127 113 34 -207 -180
6887 -180 105 -33 -477 55 -222 -223 -177 -136 104 61 217 56 -81 -319 205 123 20 -208 -21 65 56 102 176 -56
6911 -56 -154 17 -67 105 121 130 20 95 70 92 193 112 175 -78 -172 105 67 52 -11 37 195 -79 -197 205 -103
6936 -103 -45 97 87 46 -85 -418 273 -29 -107 99 146 187 -88 206 227 53 -81 23 140 75 -120 18 33
6959 33 306 101 -56 -102 -77 36 111 -134 -82 -154 115 33 -112 50 -149 -32 57 89 -336 -209 -1 -107 -1
6982 -1 -48 132 -264 -72 -139 -32 174 -6 -88 35 -76 157 178 -102 -58 40 -340 -15 138 17 55 51 17 91
7006 91 93 91 350 49 117 -54 14 315 200 72 -214 10 -166 -111 137 167 -104 99 -58 46 325 82 -149
7029a49J50Q0j08k82K29n2J74l96L21K26j61P3O8k81r0N57n97O0o0l4L33L4q2
7052A3m52N73j69p0J90l73K14o1J06k27L69k7j52L47m13J59j65J11p8m9J95p8
7074c7j48K89K10l27j87J39K73j11k52J94J18J6k05n4K74n6k24kJ69O6l24nK4
7097a60J53J09m46M11j69K82J0j95o0j29M12j84j47J34K05j95J39ok47K3ljK2
7120d2J15k61J8j51K13P8O9p8j02J78k1j10k2l5P8K12J39m21J64J2M4r4J1J37
7144A31k50J74k08J26j90M56l44K10j54K54k24M5N0j96L2OK20j85Q8j58j29K66
7166B0K8j03K29k05k41K72l6o8K34k00j31L98p2l44K64j07l7j57L85j20K72l27
7188d6K92m17R2OO2J86k0l09K50j59R4%m78L13j4K79j68j99K07L51k71N3J79k18
$$ plain form
7029 -149 1 81 -27 -309 -80 -132 42 -354 -33 193 32 105 173 -108 -198 359 -238 -178 -238 -272 61 95 13
7052 13 -439 134 -35 -105 85 -288 -74 -135 -29 -256 113 86 -66 281 -132 27 -138 -27 -105 -154 41 -37
7074 -37 -185 104 314 -13 -200 -61 212 101 -151 43 161 177 -28 -82 192 136 -88 -90 79 145 -179 -184 -160
7097 -160 -7 102 -344 67 -102 180 190 -5 -65 -194 218 34 -113 21 226 31 170 164 -83 -60 -63 -64 -42
7120 -42 73 -188 -170 -321 -108 -30 39 -39 -141 37 16 -94 -116 -151 -73 139 278 -143 21 33 77 -17 -6 131
7144 131 -119 55 -153 -27 -217 239 -105 105 -49 205 -19 26 76 -120 -88 -82 138 -47 41 -117 -246 20
7166 20 48 -55 174 -31 -272 0 -36 -104 130 -70 -201 197 125 -219 45 -62 -99 -256 129 9 281 -46
7188 -46 246 -171 -79 -73 -11 175 155 -154 96 -63 31 31 -447 -134 -148 131 -37 -236 -29 322 51 104 283 65
7212F5l08K73J38r5k0m9p8L57n09o7L02L0p8M2k8O9r0l5J7k24K04P7Q8l6r2K34
7238A87k68L70j49lj48K4Pj89m1O7J30j45J3J94j14J09Q1m0O0k26q2J04j23L9
7262a43K52k2j3j87J43m0j2l4O2r8qJ28k30J46J00J3l34K51k5J1j4J40j20o2j48
7287b44M1M15m18J76j19J46j76K05M8k7m4J3k4q4M3J01k45J14N3k49J50K36J76
7310B87k00j72M13j99l18J81K5J4j35j40R1J74J29j38k6q9R5l44M21K40k7m34
7332a52K95k45j59K06K5J82K47j98r1j08p4M64j79k85J39Q9k33k3K25j10K7q1
7354c9J22J9k47M6J34J94l35J45J00j6j8n8j5k05J62J19j02j12J16n4J51l07J12
7377h8J18N9j41J16j4j92K03j40O7m0L0N4j80L70j24L8j39r0J41J05k21J66j1
$$ plain form
7212 65 -243 30 168 73 53 4 -74 283 -226 -293 9 39 -39 3 -25 44 -46 -81 -64 -288 -84 -7 81 45 -47 187
7238 187 -81 289 140 137 -11 13 20 -169 -210 -143 -13 -158 -145 49 -65 44 125 85 145 -81 -163 -59 -182 -143
7262 -143 109 87 74 -113 30 -10 -22 -56 6 -92 -100 28 -202 -56 44 57 -277 -26 -51 -40 -54 86 -34 -96 -244
7287 -244 -203 212 -206 -30 -149 -3 -179 26 74 47 3 16 -8 -92 -49 52 -193 -79 -26 -275 -125 111 287
7310 287 87 -85 328 129 -189 -8 17 31 -104 -244 -153 21 150 12 -14 -103 -8 -352 69 309 282 -152
7332 -152 143 -102 -261 -55 -30 152 399 201 110 2 -72 392 213 -72 67 156 -77 -100 125 15 42 -39
7354 -39 83 102 -145 -99 35 229 -106 39 139 123 105 47 32 -173 -11 108 6 -106 10 -44 107 -200 -88
7377 -88 30 89 -52 64 50 -142 61 -79 -12 -52 -22 32 -148 222 98 136 -3 -93 48 153 -68 98 87
7400H7j71p5r2k8K92M0j30K33l70J18O5J84l31M05j45O9m6NJ11j93P6kk66J7Q7
7425f0J02J27J95k83k24O5J9k4K58j00l19N42m30K88j81l8J15m5J93k53k3R0j03
7448h9m5kJ54j3k78L14j58J68K17j98m8j34K17k36o3J20N5k9O9J85j68l44K15
7471i1O0K3j93J85L5O4p5j03N5K8K14j78k52J39k7o4L20k16K63k46n8K21K4n1
7495G7k58K22k4Q1j34qj16j35K31K01k67P3j62j87N64q6QL2k06q6J38M4r6J50
7519E6j23j70L31k16o8K50k32J03J63L4J33m08L11k16K25N7l29K08k36J78j57
7540a06m2P7m7K16L0o7j5lP6k14j37J52K18J1j65j2k57OJ69N3j54m1M97j78J17
7565A84k08p6M9r3n6J64n5J71j31J34q7j56K41NQj0k53K87lp4j06j32Q9J45J98
$$ plain form
7400 87 -84 -159 -251 -279 13 53 -77 156 -214 -96 -31 153 -178 227 82 151 105 110 221 28 104 102 -164 -147 -60
7425 -60 42 169 364 81 -143 -78 -59 -83 175 75 -244 298 -132 156 -25 -63 52 7 200 -53 -76 14 -89
7448 -89 -134 -136 18 5 -273 41 -117 51 268 70 22 -112 105 -131 -194 -74 -19 -48 21 206 38 -306 -91
7471 -91 -31 -8 -201 -16 19 83 8 -95 -40 -12 202 24 -228 -89 -116 -180 140 -76 187 -59 -117 104 128 77
7495 77 -181 41 17 98 -36 -44 -160 -295 -64 137 -130 -57 -219 -406 158 72 80 112 -94 -180 -42 2 -94 56
7519 56 -67 -237 94 -122 -190 60 -172 -69 94 128 261 -147 164 -52 173 230 -99 109 -127 51 -106
7540 -106 -148 -71 -118 98 128 61 46 43 119 -95 -232 -80 138 149 -16 -28 -285 -279 -110 -57 -211 -252 245 67 184
7565 184 -24 -100 -51 -144 -200 -36 -91 80 -51 83 -4 -160 81 86 94 84 -169 118 115 41 -65 -197 -108 37 235
7590B35l63J43J50j77KK77m17L3O3J00J48j53J3L2J65j72r4j13j33K37M9L00m00
7613g5m03N65l00K51o7J23J88j47j83KQ8p4J65l03l5K89m09L96j28K53k89r1J53
7636c1J10m20L09M17o81K94j87n6J64L3R9n4J70j43J45K99n41M43o4j67J22k40
7658B1l5J68j27p1N6k6j56M8k24J13K96j85J46k16K32j13m8J68K02k46L3m5K04
7681A95j71j09l0J68k29J97r1k80K94j15K39j34R5O9j78R0Jk11L11j53o1P6J28
7704A01j30R2J92k55j6J18k6j42R6k4J02j47o1K34j62o1l8J46p1J75j83K77q3
7727A34J34m0l63L23k96N9K07mj88R4m1k84K63n0l3J38O2l23M5J94n4j34J32J2
7751a3J0k1J15P8j01j43n8L1n9Q8Q1o8O8j21j31J88R4j88j63L01R3O4k33O0o5
$$ plain form
7590 235 -128 15 165 -12 -10 267 -150 -117 -54 46 194 41 54 86 251 79 -15 -128 -261 -24 25 325 -75
7613 -75 -478 87 -213 38 -29 94 282 135 -48 -46 42 -32 133 -170 -205 84 -325 71 -57 196 -93 -184 -31
7636 -31 79 -341 -32 385 -296 -2 -189 -245 -81 -48 51 -3 167 24 169 468 -73 370 306 139 261 21
7658 21 -14 154 27 -44 12 -14 -170 -122 -346 -233 63 -122 24 -192 40 -73 -121 47 249 3 36 -9 195
7681 195 24 -85 -115 53 -176 21 -70 -350 -56 -171 68 -66 29 98 -80 10 11 -200 111 -42 -103 -27 101
7704 101 -29 63 255 0 -16 102 76 -66 30 6 108 -39 -100 134 -28 -89 -127 19 -52 123 -60 217 134
7727 134 268 228 -135 188 -108 -49 158 154 -34 60 19 -265 -2 -52 -85 53 115 -208 -163 31 -23 -157 -25 -13
7751 -13 -3 -24 91 169 68 -75 -133 -102 -161 -73 8 -60 8 -113 -244 -56 38 -150 -313 -12 81 145 -88 -28 -93
7776i3j26L01k1l14M49l11J74J38k00J59j30j77J90j71J04j97L61j42O3j89o1
7797a93j24N01l77L25l31j16M17j14j82Q5J57r8r9O8O6n0M6J08p4R3m6j33J67
7820I6k0J64q2j76J68l4j2J44m31L34l08K68l83L65r2N2l56K71J85k30Q0J08l37
7843b26L31k17J19L63l66r8j12K14J5k05L03R9l54O1K41m12L14j31K38j38K6n2
7865A3k04M5J28L12m28L61j24M5j21L5k58M34m11P3Q1o3K27n12M05k8KK3k84J42
7889a07O3K36j14kj08K77l29K36j53K08l6j30j12M5J31k01J15j00J45L5Oj8m21
7912c34M04p2k01K73l94R8J56J9K71m85N03k66J09l37J40n5J24j37K46J19j29
7933E2l8pK08m54L71m00J26JK52l59L05K6k3j33K46k06J84l26L23m5j74L6K14
$$ plain form
7776 -93 -219 82 61 -253 196 -115 59 197 -3 156 26 -151 39 -132 -28 -225 136 -6 57 -132 -193
7797 -193 -317 184 -193 132 -199 -315 102 -12 -194 -109 48 -50 -149 -81 -15 -65 -19 89 15 108 62 -71 96
7820 96 76 240 158 -18 150 116 104 248 -183 151 -157 111 -272 93 1 53 -303 -32 153 -77 3 111 -226
7843 -226 105 -112 7 370 4 -94 -206 8 23 -182 121 220 -134 -73 168 -244 70 -61 177 39 65 13
7865 13 -191 -146 -18 294 -134 227 103 148 27 62 -196 238 -173 -100 -19 -82 145 -367 38 10 12 35 -249 -107
7889 -107 -44 192 78 76 -32 245 -84 152 -1 207 171 41 -71 -26 105 -96 19 -81 64 99 105 87 -334
7912 -334 70 -2 -203 70 -324 -226 -70 -51 220 -265 238 -28 81 -256 -116 -171 -47 -184 62 181 52
7933 52 14 7 215 -239 132 -268 -142 -141 111 -248 57 83 60 -73 173 -33 151 -175 148 103 -71 -35 179
7956A79k75J3M83m80J37J90k75p3J41o4N8J25j82J97j08k00M99m96j58K39r0K37
7978I7j05l3K4k8o9k8N6K50l51j48L26J08Lk07K31m7qk3j33J58j74J32p7O7J96
8003B17k21R4m34K36J50l3L65l34p0J32j76N9OL9k01L02k1J41m43J62j45K91j86
8026g0Q8K27k03Q5j20J16j55J80m9k79K17K38m08K46o6o0J96m22J47L54k87l6
8048f1J45j55J53n3rjLk20J78rMK11j11J23j80J10l8J6j07K22j13O7o8j97J82
8073I2j78N1R0J52m13M86j62q5R9n1m9M4q1m4j15L73j59j79K19m3o4Q9J13N9k07
8098C7J68j3p9p3k02J54J76l67L16r8j08O3l6K58l24J47j00K71n3k53k45L91p1
8121d1j04O4o6J79j60j26J59J47j25%J9R9Lr2j43J20J63k34K21p1m0O0J20j08
$$ plain form
7956 179 -96 -83 400 -80 57 247 -28 -101 40 -24 34 159 -23 174 66 -134 365 -131 -289 -50 -140 97
7978 97 -8 -41 -17 -45 -114 -142 -86 164 -187 -335 -9 99 102 -105 126 79 71 48 -85 73 -101 31 -46 21 217
8003 217 -4 90 -344 -108 42 9 374 40 -30 102 -74 -15 -9 30 -171 131 110 251 -192 -30 -175 116 -70
8026 -70 18 245 42 127 7 123 -32 148 99 -180 37 275 -133 113 47 -13 183 -239 -92 262 -25 -61
8048 -61 84 -71 82 29 20 19 22 -198 -20 -29 -25 186 75 198 18 128 90 106 -1 221 108 175 107 -90 92
8073 92 -86 -35 55 207 -206 280 118 33 132 81 32 76 -5 -49 -164 209 50 -129 90 47 -17 72 185 244 37
8098 37 205 192 113 40 -162 -8 168 -199 117 19 -89 -26 -62 196 -128 19 -81 190 137 -116 -361 30 -41
8121 -41 -145 -81 -147 32 -128 -254 -95 52 -73 -73 -54 45 48 -44 -187 -67 96 -138 83 12 -28 32 152 44
8145D4j94Q7Q8O2j04j0J2n2l3R4K23l93L45k57K46m2l02J27jk17K70R1k42K01
8169D3Q4k33J6J67J28j29k79J22j02m1O1K11J27m3K8j83N8lK17r7n6M2
$$ plain form
8145 44 -150 -63 25 87 -17 -27 -15 -67 -100 -6 217 -176 169 -88 158 116 -186 -59 -60 -277 -7 84 -158 43
8169 43 127 -106 -90 77 205 76 -203 -81 -183 -224 -163 48 175 132 160 -23 35 32 249 152 96 138
8191A38
$$ Imaginary data points
##PAGE= N=2
##DATA TABLE= (X++(I..I)), XYDATA
0@%%%%%%%%%%Qj6J6j6J6k4L2m0M8n6P0p8R2j14J33j51J76k06K35k68L08l52M00
33B13m52N09n73O43p20Q03q94R97j108J227j359J501j655J827k017K222k446K694
51A412k968L273l615L997m427M919n485O144o927P872r037J0516j2465J5157j9122
66a0756K5550l7658O8016k78310m93896P58349N08277m72876n33551K67424M34333
77B34902l0648k27786k3308k2842J7514K21232Q6046l52110k56652K97200L96273
88C39821j97832m68598P1855M70286O4030l34788j37891J76493J43260l3108q2150
99A1378p1547o3212J03550J87244j03170k72173P0741K99869N694k50726m0620
110a22972J90362K5200j35681K5125O4066j14426k7565J79067K3684k14904n2771
$$ plain form
0 0 0 0 0 0 0 0 0 0 0 0 8 -8 8 -8 8 -16 16 -24 24 -32 38 -40 52 -62 71 -80 96 -110 125 -143 165 -187 213
33 213 -239 270 -303 340 -380 423 -471 526 -582 645 -714 787 -868 959 -1058 1164 -1282 1412
51 1412 -1556 1717 -1898 2099 -2328 2591 -2894 3250 -3677 4195 -4842 5674 -6791 8366 -10756
66 -10756 14794 -22864 45152 -233158 -727054 31295 539572 66696 -466855 -199431 234902
77 234902 204254 -23532 -46840 -69682 -52168 169064 255110 -97000 -353652 -56452 339821
88 339821 141989 -326609 -254754 215532 279562 -55226 -193117 -16624 126636 93528 11378
99 11378 -60169 -123381 -19831 167413 64243 -207930 -137189 162680 168374 -82352 -122972
110 -122972 67390 92590 -43091 -17966 46100 -68326 -95891 83176 106860 -108044 -160815
121a60815K34765J05927k16812j10662J97240Q4094j76188n9133J41807J8947
131E9170j50716O170J95258j9126k39998K9762K75740j158k65108l4949K39923
142I4968O4054k17074q3254J62910N1669j04321o55N9215l7260k8182Q1409M1933
154H5412j10629o5408J30659P6171j36309q6601R7727P4369n8186o0958L7544
165a6209M8611k6101o738L8940l5073n1180N7502N8490o5298q2759M7584R7583
177F5352m3246j04190M8640R8580l9945o5205L9154M3803m1405m1490M8759L2600
189D1407p3534k5109Q3326Q817p9709L580P7741M839p1744J417Q3244j3914r7953
202e7592K0619R2549k3899r0473O136Q8935J6241q2795j9714P4429K0495m0275
$$ plain form
121 -160815 73950 179877 -36935 -147597 49643 133737 -42451 -101584 40223 59170
131 59170 -91546 -85376 109882 90756 -149242 -119480 156260 155102 -110006 -144955 94968
142 94968 159022 -58052 -141306 21604 73273 -31048 -31703 27512 -9748 -37930 43479 85412
154 85412 -25217 -90625 40034 116205 -20104 -106705 -8978 65391 7205 -53753 -16209
165 -16209 32402 6301 -437 38503 3430 -47750 9752 68242 2944 -79815 -32231 65352
177 65352 22106 -82084 -33444 65136 25191 -40014 -860 42943 1538 -39952 8807 41407
189 41407 -32127 -57236 26090 34907 -44802 -41222 36519 41358 -30386 -28969 54275 40361 -57592
202 -57592 -36973 55576 31677 -58796 -52660 36275 52516 -30279 -49993 24436 44931 4656
214D656r742N514n170Q322J6625j2314m8922J210P9783J2732q8079k0178Q1184
227B5621L8602n4596n1932L1890M6311k2389k8246O416j1559Q63M0985N667m9780
240b2147k1419N6336N2160n3652p1385M4012O7458k8893n8351L3L9442J4750k3933
253e589q381J0671m042J4312K3264k7130l3336K3556L7786j3344n1241k564N6993
266B0955M920n2167J079M1563M187k4177l644K0438J690k5538O716K0694k2405
279e689j4924K4127P860j7785n915J8024J4220j8853j2436K6219L730k8321J076
292h667J7529l434j6232l827K0494N848k4517L636K7012p694j8829P513J2714
305A1546n108j7647R57J9163j0512j9013J9072J2292j7581l754J6127P925j2242
$$ plain form
214 4656 -5086 428 -4742 3580 20205 7891 -41031 -39821 39962 52694 -35385 -55563 25621
227 25621 64223 9627 -42305 -10415 35896 13507 -14739 -8323 -19882 -19019 21966 27633 -22147
240 -22147 -43566 12770 64930 11278 -60107 -16095 51363 22470 -35881 -35848 3594 18344 -5589
253 -5589 -13970 -3299 -7341 6971 30235 3105 -30231 -6675 31111 17767 -33474 -36038 20955
266 20955 25875 -26292 -25213 16350 20537 -3640 -7284 13154 14844 -10694 -3978 16716 -5689
279 -5689 -20613 3514 11374 -6411 -12326 5698 19918 1065 -11371 14848 18578 -9743 -8667
292 -8667 8862 5428 -10804 -14631 5863 11711 -12806 -9170 17842 10148 -8681 -1168 11546
305 11546 6438 -11209 -10252 8911 -1601 -20614 -1542 10750 -6831 -10585 5542 13467 1225
318A225j4088J6483J1583k2831p508J6651j215p574J713M653L181n262K420J4438
332A3869j0285j5445J6204J0458j5663j3320N693J8491k418k3105O840K1895o215
345F999r071N280J434k83j004n44J78j0662M60J7647p195j7470J0432J4270j930
360H541j0219m364J3081N794j6114k657Q691m590j582J780k400J470o99L242P805
375G779r197o211J4472J899j2791l285M626O233m430j1044P195Q813p050J405
389a586M586m857K905M086k483l543n115L651R499r348r602J0038O681j851l254
404a93m134P944O110q223j027J447m922M591L035p356k490J625O692O365j0696
419a232o026J2317M235m929l298o182L350P308m081m647l829K22J3318K474j4137
$$ plain form
318 1225 -12863 3620 15203 -7628 -15136 1515 300 -7274 -5561 -908 2273 -2989 -569 13869
332 13869 3584 -11861 4343 14801 -862 -14182 -8489 10002 7584 -15521 -8681 13214 6999
345 6999 -2072 3208 4642 4359 3355 2811 2989 -7673 -7213 10434 3239 -14231 -3799 10471 8541
360 8541 -1678 -6042 7039 12833 -3281 -5938 2753 -1837 -3419 -1639 -4039 -2569 -3268 -26 7779
375 7779 -1418 -7629 6843 8742 -4049 -7334 -2708 3525 -905 -11949 -4754 4059 -2991 -1586
389 -1586 3000 -1857 1048 5134 2651 -892 -6007 -2356 7143 -2205 -11807 -1769 4912 3061 -193
404 -193 -4327 3617 9727 1504 477 1924 -2998 1593 4628 -2728 -5218 -3593 3099 9464 -1232
419 -1232 -7258 5059 9294 4365 1067 -5115 -1765 5543 1462 -3185 -7014 -6792 6526 9000 -5137
434e137k138P410P409J894j2503q722J0593O973k090q223j0866Q622J8390l945
448G667j3996n456R241J7710n046k1954l70J4387O233l620j4433m772J4557R123
462I271k669q452j0499J0244J9478n767j9527p689J3206K0526p646k6615P34K1085
476E680R196q091j6432p77J8392P594r214j1559p291J1105J5613p322j5407m525
490a3038R372J8990j845k5174m439K0181J4805p805k4296m519K2760Q862j3251
503F03j1505k313J3403J3407q651j3025k229P617J4504J152k0236j0051J2447
516d877J8446k1k7927j1018K9718J8859j8570j9806L119J9836P840j5462r265
529i128L384N379R314l06j6788o483J2205J5466L294k1918j4588K2922K1397j5427
$$ plain form
434 -5137 -7275 135 7544 9438 -3065 -11787 -1194 5779 3689 -4534 -15400 -6778 11612 7667
448 7667 -6329 -11785 -2544 15166 10120 -11834 -12204 2183 8416 4796 -9637 -14409 148 9271
462 9271 6602 -1850 -12349 -2105 17373 11606 -7921 -15610 -2404 18122 10476 -16139 -15405 5680
476 5680 14876 6785 -9647 -10424 7968 15562 6348 -5211 -12502 -1397 14216 6894 -8513 -13038
490 -13038 -3666 15324 13479 -11695 -16134 4047 18852 11047 -13249 -17768 4992 13854 603
503 603 -10902 -13215 188 13595 4944 -8081 -10310 -2693 11811 12963 -7273 -17324 -4877
516 -4877 13569 13548 -14379 -25397 4321 23180 4610 -15196 -12077 7759 15599 137 -9128
529 -9128 -5744 -365 8949 8643 -8145 -14628 -2423 13043 16337 -5581 -20169 2753 24150 8723
543H723k5674l82K7868J2104k4674j5670J2140J2122L309n581j1395N47J1721
556E158N860m755j5216o272J8004J1991r452j5930o105J8342J8660j6362k2900
569a8977Q788K2144M817j8889j5589J1348J4957l386p308o511J60J2743N502q368
583A431q808m144J1806J7430r366k3730o93K2500J3463k0547k4292J7907K7814
596B0771q529k0725k618J0093R860j570o770m368l547Q530J3197j0692j8944L604
610a1708K0658J2144j5867k5879R739K8307K28k3557j2629J5192K0809o864k0825
623a0252k795J0209J0966M903j4334j2328R360J4221J667j3991j4166Q772J9245
636A1477Q38j5199j4701P090K5461P32k6842o973J9671J5078q269k0477j533J5464
$$ plain form
543 8723 -16951 -17333 10535 22639 -2035 -17705 -5565 6557 9866 4285 -7110 -6563 5158
556 5158 11018 6263 -8953 -15225 2779 14770 5318 -10612 -16717 1625 20285 3923 -18977
569 -18977 -10189 11955 16772 -2117 -17706 -6358 8599 5213 -2095 -8606 -8446 4297 9799 1431
583 1431 -7377 -11521 285 17715 8349 -15381 -16074 6426 19889 -658 -24950 -7043 20771
596 20771 12242 -8483 -11101 -1008 8852 7282 512 -3856 -7403 1127 14324 3632 -15312 -11708
610 -11708 8950 21094 5227 -20652 -10913 17394 17622 -5935 -18564 -3372 17437 10573 -10252
623 -10252 -13047 -2838 8128 13031 -1303 -13631 -4271 9950 11617 -2374 -16540 -7768 11477
636 11477 12315 -2884 -17585 -10495 14966 15698 -11144 -18117 1554 16632 8363 -12114 -13647 1817
650A817N719l524o291p391N615J2698k68j1116r078O033K0124R83k3299q752J6176
665e54J5358q135j9259K742K0030m14j1669j967J358K880N239l19m103o562q3
680e458J2142N24j2169k125P399O164R06j0319n003Q903M795l240m854k451M425
695c61M366l676k365j614o48O602L666o157l369O21L026M595m430o768K386O257
711B131L803n457j0043M517J1662k492o489p0J599L090L39l305k731p60N151P499
727H444p262r763N940Q310k65n671n267N443Q338m906p135K90L233M792j862n501
743b842J986J991o21K982k278n293M282M209j894l635k864L914L628m185j403
758b023J950j495L170J835n618q95L499R56k2l502j059L983o70j779J490k254
$$ plain form
650 1817 7536 4012 -2279 -9670 -4055 8643 8375 -2741 -11819 -5786 14338 15321 -7978 -16730 -554
665 -554 14804 6669 -12590 -9848 10182 9768 -1901 -3868 -2510 370 5609 5290 1187 -5375 -5458
680 -5458 6684 7208 -4961 -7086 313 6477 7383 -2936 -7939 964 5759 2519 -2335 -4786 -361
695 -361 4005 329 -2036 -3650 -4298 2304 5970 -187 -3556 -2935 91 4686 256 -6512 -4126 2131
711 2131 5934 477 -9566 -5049 6613 4121 -2368 -2438 -839 2251 2590 -715 -3446 -4206 945 8444
727 8444 1182 -8581 -2641 5669 5404 -267 -5534 -91 8247 3341 -3794 -3504 -271 4521 2659 -2842
743 -2842 -856 1135 514 3496 1218 -4075 207 4416 2522 -1113 -3977 -63 3565 -620 -2023
758 -2023 -73 -1568 1602 3437 -2181 -3076 423 1379 1357 -2145 -3204 779 109 -1670 -180 -2434
774b434R30M254k574j568J407j468J219J625k639j10P86K73K121k736k010M485
790A561L75k069J728j822j191L251k85k077m72k4L252K33n325K095L235j603L18
807A180m83j924K930K49k354M14q19N04K498k691q22J919j189J343P26l367J415
824d71K712k499n22j39k30J737j236j405K161r26q3K354k350j156K989q79m38
841c81j72j362K142N44k916J089J312o27J398j506j395L360n23j955J137n14J18
858b51J977k663l5J896n28R21o91j898K435J353l045M98O70o26J431j575r16J963
876I16n84k17J317k303N53K509k089l20L80j163K027k55k959J922J003j516Q63
893H4p38l25J911j047q79J295j747P13K127k773n26J821k67M33r02j205K687N18
$$ plain form
774 -2434 -1504 2750 176 -1392 15 -1453 -234 1391 -1248 -1358 -572 -299 1822 -914 -2924 1561
790 1561 1936 -133 1595 -227 -1418 1833 1548 -529 -1001 -1025 2227 2460 -2865 -770 2465 862 1180
807 1180 697 -1227 1703 1952 -402 12 -807 -303 2195 -496 -1318 601 -588 755 1481 -1886 -471
824 -471 2241 -258 -780 -919 -1149 588 -648 -2053 108 -818 -901 1453 -897 -2053 936 57 -381
841 -381 -553 -1915 227 771 -2145 -1056 256 -371 1027 -479 -1874 1486 963 -992 145 -369 -251
858 -251 1726 -937 -972 924 396 1317 626 -1272 1163 2516 -529 -31 639 13 1444 -131 -1047 916
876 916 332 115 1432 -871 -318 2191 102 -218 162 -1001 1026 771 -2188 -266 737 -779 84
893 84 -654 -979 932 -115 -994 301 -1446 -733 1394 -1379 -1905 -84 -351 82 -820 -2025 662 1180
911A180k321P91Q8o01J792j133j228J684p35P95J186k605L36K516j127l52q5j078
929h97K356r2k384J391n5r15K296o98k066J145L71J055Q8l029Q48L252k382n58
947b74K55j060J928o4j817R97m85j12K753j539l399K376R22Q7o75k478J758K308
965A481j856p06N77j328K212J413k668n38J23J351K316l441k217L261J442j551
981a29l04j030J206J744j361M33n49k126K846K615m244j660K035L039L31m762
997a916q06N047K05l026M51j85L67J333q48n3j265j219L481J971m923j381K713
1014e4K424M42m511j744M947J168k937j141q84J635K671j688j353n49K55L386
1030B067k89m568R55K333q1Q31j865l127K510K920O73l051m291M137O500m489
$$ plain form
911 1180 -1141 -350 -262 -863 929 -204 -1432 252 -483 312 1498 -1107 -771 1745 618 266 181 -897
929 -897 1459 1367 -1017 374 319 -596 1700 1002 -1064 81 452 1507 1595 -1434 -586 2666 284 -274
947 -274 -19 -1079 849 785 -1032 -35 -520 -632 2121 582 -2817 -441 481 568 -107 -2585 -827 1481
965 1481 -375 -1081 -504 -1832 380 1793 -875 -1413 -1290 61 2377 -1064 -3281 -20 1422 -129
981 -129 -433 -1463 -257 1487 126 559 10 -2116 730 3345 -899 -2559 -524 2515 2846 -1916
997 -1916 -2722 2325 2530 -496 -45 -230 137 1470 622 569 -696 -1915 1566 3537 -1386 -2767 -54
1014 -54 2370 2812 -1699 -3443 1504 2672 -265 -1406 -2290 -655 2016 328 -1025 -1574 -1319 2067
1030 2067 1778 -2790 -1835 498 417 1248 -617 -3744 -1234 1686 2359 -692 -4983 -846 5654 1165
1046A165n790K578M045R38l130k720K719J391j800K126l99l362J030L637J616
1061D044l679n948M020Q426l782q182J991O409J268n511l169M727K060k577Q98
1076I95j57l221J256L091N93k800l633K868N422k850m977qL650M036k402o338
1092d475J460N332k54k280k604Q35L892j90k775k60k05Q95J904p17r35r78j000
1109b355M176K341o968l034O921M626m233o389K296Q057l021o418K468M428k047
1124H48j281Q37J495k748k551M944L749n650l973M822M352k803o465Q05Q637n40
1140D478p391N23L801k83j846j95J769m56k020K595J714m633j302L914J436j189
1156I15k558j364L754J577k915j334j72K606L109m219k949L238K116j599j513
$$ plain form
1046 1165 -4625 -2047 1998 2936 -194 -2914 -195 1196 -604 1522 1123 -2239 -1209 2428 4044
1061 4044 365 -5583 -1563 6863 3081 -5101 -3110 3299 4567 -944 -4113 614 2674 97 995
1076 995 838 -2383 -1127 1964 2557 -243 -3876 -1008 4414 1564 -3413 -3421 229 4265 1863 -4475
1092 -4475 -3015 2317 2063 -217 -2821 -1986 1906 1716 -1059 -1319 -1524 -629 1275 558 -377 -1355 -2355
1109 -2355 1821 4162 -2806 -5840 1081 5707 1474 -4915 -2619 5438 2417 -4001 -1533 2895 848
1124 848 -433 404 1899 -849 -3400 1544 5293 -357 -4330 492 4844 2041 -4424 -3619 5018 4478
1140 4478 -2913 -2390 1411 1128 -718 -913 856 400 -1620 975 2689 -1944 -3246 668 2104 915
1156 915 -1643 -3007 747 2324 -591 -1925 -2097 509 3618 -601 -3550 -312 1804 205 -1308
1171a308l03K268P77k477J132N00k759Q34K975K89k290k898L494M691m632n543
1187e250M816N006k224m547L38L971l19m383K767K952l832p05L532l83l051j500
1203b812M162L526m888l787M401J799k248j417J56K108L60k304P31K74j989J720
1219b08J647j722q16K51J415Q14l365m15L232k29r55J035j255n78J284P42p24
1236A53j834Q2L910m15m187R17K691j218p02L78J164J42k189J298J618l170m99
1253a861L790K11k095j576R16K677j148l148K818J761k545l65J126l7q32n53J947
1270A086J161l835j14L928j250k900N01K115Q35k269q51K654n36k565K146J066
1286A172k187J9J325M16r41j989J648K608k766o90K184m06o39n13J46J263q57
$$ plain form
1171 -1308 -1611 657 1434 -1043 89 589 -2170 -1336 1639 1928 -362 -3260 234 4925 293 -5250
1187 -5250 -434 4572 2348 -2199 -1861 2110 1791 -2592 175 3127 -705 -1410 2122 1739 -1312 -2812
1203 -2812 1350 4876 -12 -3799 602 2401 153 -1264 -1108 1000 1360 -944 -213 61 -1928 -208
1219 -208 1439 -283 -1099 -848 567 1381 -1984 -2399 833 604 -351 684 -571 -1149 135 877 153
1236 153 -1681 -1599 2311 1896 -2291 -1374 1317 99 -603 -225 939 1081 -1108 190 1808 -1362 -1861
1253 -1861 1929 2140 45 -1531 -615 2062 914 -2234 584 2345 -200 -565 561 524 -308 -861 1086
1270 1086 2247 -1588 -1702 2226 976 -1924 -1423 692 1527 -742 -1593 1061 525 -2040 106 1172
1286 1172 -1015 -996 329 745 -196 -2185 -537 2071 -695 -1385 799 393 -246 -759 -613 650 -207
1303b07j154K729o10k618J250J608m86q80l83J979O3k778R69K462k296n55K279
1320A372m46r67n29J038J318k333p89L135l75k461P13J089j22q48o67J629O56
1337A413k698P16K125j430j194R58M67M21j697k06K691j528k279K332Q20j443
1353e32m39M43J250o25k003K011J176k443K2J974r02o86k02J062P54j535l51J854
1371H28m07j821J297N45n76p0l49J455k48j917J363J165j561k98J293j28k89j015
1389g33P03J524j714r47K735o36j659P68N60l8m27j081J660K49j943Q84J113j247
1407b29k94M28K71J79j401P44J751j670j219J872Q9j003J69nP37q74r67J607O37
1426H22k143N58J375n21k05n53O27O34j334k47J898p60j183J279K22k12k63l40
$$ plain form
1303 -207 -1361 1368 758 -1860 -610 998 512 -368 -751 1228 1291 -1487 -518 1944 -352 -907 1372
1320 1372 926 -41 -570 468 1786 -547 -1336 1799 1424 -1037 -324 765 643 -205 -872 757 1413
1337 1413 -1285 -569 1556 126 -1068 -110 357 778 -919 -1125 1566 38 -2241 91 911 -532
1353 -532 -971 -528 722 97 -1906 105 1281 -1162 -1140 834 -68 -754 -956 106 860 -675 -1026 828
1371 828 421 -1400 -103 442 -134 -204 -553 902 654 -1263 100 1265 -296 -594 699 571 282 -733
1389 -733 -30 1494 -220 -1167 1568 932 -727 41 601 563 136 -945 715 964 -979 -95 1018 -229
1407 -229 -523 -95 176 355 -1046 -302 1449 -221 -1440 432 521 -482 -313 -318 419 -455 -1422 185 822
1426 822 -1321 -763 612 91 -114 -667 -40 594 -740 -987 911 151 -1032 247 469 257 -6 -346
1444c46J076k02j677J409Q64j437K12O51n48O67j119O31P36q98o6J329j266o54
1462f38J409n50L74n46r22J468O0j655J465j09p37O30k63K2J06r19N67J133j598
1481g03j21J146k59j90n81K08Q95l75j249J221L36j041O66J99n67L28l86N88O74
1500G89j589L37J007n22m81N52n60P50K74j025N73J47l71O55J43r65J40O02j83
1519B73P5m94L28Q58j189L66L47j042O83K84p19M43j33j07Q96p52j039J161J52
1538C91k33j61n18L19Q59r08k01N00p52O68N9m99O25l25m27J045o28o94P38K24
1558H2p4Q9r50L82J120o50o04O2M10P54m43q96J085K48j049N23J74m49L52J8P4
1579B58L16j165K38J113o37l72L72j40Q73j0j613N44R09k24j32n37J3P73o65k83
$$ plain form
1444 -346 730 528 -1149 260 1124 -313 -101 550 2 669 -450 181 917 19 -47 1282 16 -638
1462 -638 771 221 595 49 -873 595 655 -1000 465 356 -381 249 -14 8 114 -805 -238 895 -703
1481 -703 -824 322 63 -127 -708 -500 395 20 -1229 -8 328 -713 -47 152 -415 -87 -473 115 789
1500 789 -800 -463 544 22 -459 93 -467 283 557 -468 105 252 -119 536 679 -286 -146 456 273
1519 273 348 -146 182 1040 -149 217 564 -478 205 489 -230 213 80 -27 869 117 -922 239 391
1538 391 158 -3 -521 -202 657 -251 -452 48 -704 -36 23 -476 149 -176 -603 442 -186 -880 -142 82
1558 82 8 97 -853 -471 649 -1 -605 -543 -133 621 178 -718 367 615 -434 89 263 -186 166 184 258
1579 258 574 -591 -353 760 123 -249 123 -17 856 846 -767 -223 686 462 330 -207 -194 579 -86 -369
1599c69J157p93m43P84l9n12J92j056J612M99j471j64P95J23j55j371R9K207q13
1618B82j389J160K37o47j41L38K73r4j184J221J025j635p48J449J68K07j170j97
1636h45J702l62j206K35P15K52K9j117R05L72j501O62J251j294j48N81L12L30
1654H73j023m67Q28N67r24J66k33O53O73j569m84J403O2n78p5k64M97n79l34J567
1674G59m69j226P57M66k58n63k82M26J588j406r65R95O16m35o24l61J192L95j564
1693i59R85Q36j459l73J093L90m58r02J048J100j215j177J252J50r8P2p63M55
1711b3O12p72K52P0j03N34n67N9L44p09m62J481l62q49P35R0K16n53l99L64L64
1732C22L4J54n88p75J607o39r73J015P9k03k47J91Q3m32m64R74O94j701M14J327
$$ plain form
1599 -369 788 -5 -448 336 297 -215 -23 -1079 533 1032 -439 -603 192 315 160 -1211 -1112 1095 282
1618 282 -1107 53 290 -357 -498 -160 113 19 -1165 56 1081 -554 -1302 147 315 522 -648 -845
1636 -845 857 495 -711 -476 239 491 520 -597 308 680 -821 -159 1092 -202 -350 231 543 873
1654 873 -150 -617 211 778 -146 20 -213 440 1113 -456 -940 463 525 -53 -128 -392 105 -474 -808 759
1674 759 290 -936 -179 287 29 -534 -816 -390 1198 -208 -1173 -178 438 3 -621 -982 210 605 -959
1693 -959 26 862 -597 -970 123 513 55 -847 201 1301 86 -1091 161 311 213 285 -478 -23
1711 -23 589 -183 69 139 36 570 3 62 406 -303 -765 716 354 -495 240 330 546 -7 -406 -42 322
1732 322 356 510 -78 -853 754 115 -858 157 236 33 -214 -23 60 -372 -836 138 832 -869 -455 872
1752H72r36n60J46J3R90l14q95P32K1l28K03p6q0M13n55K36J010j402k70J177
1772C97K46r15L1N23P32j190n19J279l10q36J056J93r00J00j7K24L51n91K29N75
1792F58q19qK84m72P93j80n85M43J8m81O68l60j4j07K78K23l34q71O88P93j427
1813h12P09P22j039qQ77j97p33k99M58R55r22m31J217l25p77M40L45n6J7l70L30
1834A01K70j084Q18L02p03M73l9J5N32o35j036J637j14p02M22K19k97m05r0P95
1854D79J09j272R44M24j123J37N91j61qk56J71M62q33J95N35p03Q2P09o54k56
1874d28K04j19M00J17n64J86M58o13R6J91K89K6q09M18O97n24o92J020r3q02K73
1895b69L38K50o14l78J238j37j472R64O82n90j21q6L84J05m24j18P19l17l49N81
$$ plain form
1752 872 -64 -624 -478 -465 525 211 -684 48 69 -259 -56 -132 -212 201 -354 -118 892 -510 -780 397
1772 397 643 -272 -241 282 1014 -176 -695 584 274 -562 494 687 -213 -113 -130 94 445 -146 83 658
1792 658 -161 -169 115 -357 436 256 -329 114 132 -349 319 -41 -55 -162 116 339 5 -866 -178 615 -812
1813 -812 -103 619 -420 -428 449 252 -481 -780 -322 633 -289 -720 497 172 -605 -165 180 124 141 -229 101
1834 101 371 -713 105 407 -296 177 138 153 685 50 -986 651 537 -165 257 476 179 -226 -316 479
1854 479 588 -684 260 684 -439 -302 289 128 120 -136 35 497 -336 -141 394 -309 -227 482 -172 -428
1874 -428 -224 -343 57 174 -390 -204 254 -359 -263 -72 217 243 -566 -148 549 25 -667 353 260 -542 -269
1895 -269 69 319 -295 -673 565 428 -1044 -80 602 12 -109 -195 189 294 -130 -248 471 154 -195 386
1915C86k56o0K30k04J42R9p74P40m3m31K84J76m28M8m2L6L25n15jM72l24j25M24
1938A59l45J45k0k96M58k21k38J06L07m25K92J22j52N7l73L14L96o30K86J75k83
1959a66J45J16j82J54j57l21P94j00r03P05M26m91K56k27J05o3n22N51N74j139
1979d45L02N26j43j14j45J00M41p18P8L86o5m60J00L12j53j28k5N74J27q76p1
2000c97O35j58j71K80k89J48j22m09M41Ol71N76K86p69K89k62M03J19l25J23O9
2021A02l67K28K98n33J92M8m4J99j66j82O84n28j48L55j07K79m6m86K01K31l20
2042a10L53J40p86K80N24l27Mj82j78R47m07o02O10k09k44K59o5p8m0l09L40K50
2064A70o07N86J36o11J90o7O2J81j03n00R47m17k28M84m60J15Q8M9J13m45j2O02
$$ plain form
1915 386 130 70 300 96 238 337 -437 303 260 -171 113 289 -139 -91 -133 -97 228 -287 -288 184 -140 -265 159
1938 159 -186 -41 -61 -357 101 -120 -358 -252 55 -370 -78 44 -108 -51 -424 -110 286 -344 -58 117 -166
1959 -166 -21 95 -87 67 -90 -411 383 283 -620 85 511 20 276 49 154 91 -431 120 694 -445
1979 -445 -143 383 240 126 -19 81 522 -196 -118 268 203 -257 -157 155 2 -126 -151 423 550 -326 -397
2000 -397 238 80 -91 189 -100 48 -74 -483 -42 -36 -407 169 455 -314 -25 -287 116 235 -90 33 102
2021 102 -265 -37 261 -272 -80 -32 -76 123 -43 -225 459 -69 -217 138 31 310 264 -222 -21 210 -110
2042 -110 243 383 -403 -123 401 74 78 -104 -282 665 258 -344 266 57 -187 72 7 -71 -111 -420 -80 170
2064 170 -437 149 285 -326 -136 -203 -141 40 -63 -563 384 -33 -261 223 -237 -122 -34 15 128 -317 -329 273
2086B73j91o77N33J65l10K71j41P3K05l89M5P16n30l65O56R2m79O7j63L64K06
2107D21p30M25J69k46R1K38m88K48j54j65N42l16j33N32k37j91Q9l56O02k00j24
2128A7r2j1o1K85k28n9P6Q4j11K41m29K35K08m78L17K20o80J35N64k76k96J47
2150a92pN96m41j63L20K02n50j69L07K42O7l06j57O39p12K99P8j43M91m18j93
2171b10O30k50j44L6K15k79K74m43N93K8m62N6K8n3K73J50n88M69J2m47P6M8l95
2194c83L71m5O3J77o49K45M10l92k57M51K82r5n1o00N09J47q32P60kk94J25J47
2216H7m02L47j30m39R51l04l97K68J36j82L01l88R5L78n15N5L23p1J00n7l34P37
2238E59m46k39J85p6M23k32m49O08K76p57j40Q07l33k66P0o8P85p03o20R01j32
$$ plain form
2086 273 82 -595 -62 103 -207 64 -77 -4 201 -188 -143 573 43 -322 334 426 -53 14 -149 215 421
2107 421 -309 116 285 39 130 368 -120 128 -26 -191 351 35 -98 434 197 6 95 -261 341 141 17
2128 17 -75 -86 -147 138 -90 -149 -73 11 -100 141 -288 -53 155 -323 -6 214 -466 -331 233 -43 -339 -192
2150 -192 -199 397 -44 -207 113 315 -235 -404 -97 145 212 -94 -251 388 -324 -25 53 -90 401 -17 -210
2171 -210 420 170 26 62 277 -2 272 -171 422 450 -12 44 72 19 292 442 -146 323 335 -112 -36 12 -383
2194 -383 -12 -57 6 183 -466 -221 189 -203 -460 -9 273 178 127 -473 36 183 -649 111 109 -185 -60 87
2216 87 -315 32 -98 -537 414 110 -287 -19 117 -65 236 -152 -57 321 -194 -139 184 113 213 156 -178 559
2238 559 113 -126 59 -17 406 174 -275 333 609 -148 -288 519 186 -80 -10 -78 707 4 -616 285 153
2259A53m54M57m3r1p0k42oM07l71J31L37q8l48k98O9N36K6m21M86r2l34J17R9
2282d0j16J41j69K35K2m98L49K62k67p2M92p44M89J99r0j8m85L18K51m11q4M46
2304B10j43j53L14l47J87M23j077O76L62m71j51K41m2K51m29L04K53m99n29O81
2324F1M89p52J65Q2j31j45j99P66j07p50L11M90l38j83MJ38J34L2k79M00P6l04
2346d0J29qk5J23m21L41K13n28o7N42m52J74J67K8j49p5N1J35j85J39M38n13l93
2369c76N02L12m09J50k64M42m21K1L53j47j76j30L45k49L55n32L83J75m92PK20
2390F9j9j56o0J7N12m87n8lN20n43PL46O3j85k12K32J15m06o3P51n00j33M9j8
2414a62k34M52J75j10k08l92N92Q8m39J41J91n5k8J00op4k11J07L99m13L07Q9
$$ plain form
2259 153 -301 156 113 22 -48 -290 -296 111 -260 -129 208 120 -228 -526 -457 79 105 -316 170 78 -256 -139 -40
2282 -40 -156 -15 -184 51 73 -425 -76 186 -81 -153 339 -405 84 283 193 175 -310 8 259 -152 -236 210
2304 210 67 -86 228 -119 68 491 -586 90 452 -19 -170 71 29 280 -149 155 408 -91 -620 61
2324 61 550 -202 -37 45 -86 -231 -430 336 229 -521 -210 280 -58 -241 -237 -99 35 67 -212 188 264 -40
2346 -40 89 81 56 179 -242 99 312 -216 -283 259 -193 -19 148 176 27 -48 3 138 -47 92 530 17 -376
2369 -376 126 438 29 179 -85 357 -64 -43 310 163 -13 -143 202 -47 308 -224 159 334 -158 -151 69
2390 69 50 -106 -166 -149 363 -124 -182 -185 335 -208 -201 145 208 23 -189 43 158 -248 -311 440 -60 -193 -144 -162
2414 -162 -396 56 231 121 -87 -479 113 201 -238 -97 94 39 11 111 105 31 -180 -73 326 -87 220 309
2436C09k88l9m0j57M17J0o35P58j28l45J86L9k14Q8l68M96L59r10M22K87n07L
2458b57R4J27L35k78j04L42r6n35M68J34m50Q3J81j83K26o91M45M74n25M8N6K26
2480A20mq0j93L60m25j22L96R3l98J37K76l3J65m6m1j75j40L03J54k90j38L38
2502B57k49Q1j10j34K43j82J08J90l53q4K66J19J34Q9o13K85K38p14N53J39m84
2523b21O0K85L8L4m30o4M69l01q6M20j4m54K63KPn5j03M1J62n64K40N37k63j0
2547go7K87J70p10K22K40p3j73J09r5J48lk09N13k93k69M10J18l77l0R2L41L8
2570C82n86k8O41n11K5L87m41K66j70j28J48nl26M88K20o24J72l1j5Q3k01J03
2592a51J33k91L33J28l50K9L11k68K32j40j66L61j64m06L29K09m77M01L4j54K9
$$ plain form
2436 309 21 -18 -58 -215 202 212 -423 335 207 -138 48 87 -127 -39 -407 89 448 -462 -40 247 -260 -257
2458 -257 -163 -36 299 21 -83 259 163 -372 96 230 -220 -137 44 -139 87 -604 -159 315 -210 -162 -106 120
2480 120 116 36 -157 203 -222 -344 52 145 -253 -116 160 127 292 246 205 30 -110 193 347 57 -81 257
2502 257 8 89 -21 -155 88 -94 14 204 -149 -233 33 152 286 375 -238 47 285 -429 124 263 -221
2523 -221 -161 124 162 196 -234 -298 171 -130 -216 204 190 -264 -1 1 8 -47 -150 -109 53 -511 -271 266 3 -7
2547 -7 -74 213 383 -327 -105 135 62 -111 -2 -97 51 48 -161 352 59 -210 200 318 -59 -89 3 344 382
2570 382 -204 -232 409 -102 -77 310 -131 135 -35 -163 -15 -20 -346 142 362 -262 -90 -121 -136 -53 -254 -151
2592 -151 -18 -309 24 152 -198 -169 142 -126 106 -34 -200 161 -3 -409 -80 129 -348 53 87 -67 -38
2613c8p5K4K28k96R0L26l61O1N4J24j20J10l96L82O1k72M19j55j80J59J25j76
2635I4j51k77M41J44k38J01k22K23n9j20n1R7r4R4K08k04l68N55j31j62J75j24
2657f9J07P1k35J84Q1l53K0K34j25m2p8K4M71k53m39L34L37n24n6L68n63O85l46
2680a67L47j00j39l9K00q0R2p9j52K87J07m37K88l5q9J86k54p1N90n68J19q1N9
2703a6J62l5q1J4N7k79J70L7j68M9O2J76L8l65O6Q9J03k78n1J59j17M5l32O29
2727A34p0k17j7P7L0R1L8n1J33j68l28M11o6p2M1j69L96k50l70M31J24j74L88
2750C42l27k30K22k14K07J95j65m8N0J4K18l60n1J96L13m66j30L41m5M2q7k63
2772b46K34M1j07K29k33L8J92m55L89P1k66N3R6k98K7J10K9P1j27K0lM0rK08k48
$$ plain form
2613 -38 -113 -89 139 -157 -67 259 -102 -41 13 137 17 127 -269 113 174 -98 321 166 -14 145 270 94
2635 94 -57 -334 107 251 13 114 -108 115 56 -64 -115 -18 -112 -18 190 -14 -382 173 42 -120 55 -69
2657 -69 38 109 -126 58 139 -214 -194 40 -85 -127 -205 -181 290 37 -402 -68 269 -255 -311 57 -506 179 -167
2680 -167 180 80 -59 -98 102 22 114 35 -117 170 277 -160 128 93 4 190 -64 -135 455 -113 6 -75 -16
2703 -16 146 111 30 44 101 -178 -8 29 -139 -90 -28 148 186 -179 -113 -24 79 -199 -250 -91 -208 -163 -495 134
2727 134 64 -153 -170 -93 -63 28 66 15 148 -20 -348 63 -3 -75 -34 -203 193 -57 -427 4 128 -46 342
2750 342 15 -215 7 -207 0 195 30 -18 32 46 264 -96 -147 49 362 -104 -234 107 62 104 17 -246
2772 -246 -12 29 -78 151 -82 -44 148 -307 82 153 -113 -60 36 -262 -235 -125 -96 -25 -152 -132 -135 -95 -104 104 -144
2797a44N6K49j03j72K10k96J54j08P5J77n4o7j72M42m65J38l7k1L32l36P2K39
2819A69k47J20N0J4j75K89m39K42m5j29J81J39k33j30L69k30R9P8K7O0j20r9m8
2842e8r4kK00j29K85j18r4P3J39m36K43j39J90k03N8P4Q6j04k59M2L00k18K77
2865A13o2k67J58j83J34J30k39N09l13j91J51J57j69K39K6P1j81Qj20pK45j7M4
2888B36l12K14j12j25J67J89k03J50R2l80j16K52q5j85J11j07P36m80K9j7m54
2909d00N21J37l04l9J84j42K12m43J55Q8J34j51k2J42j21J31j92O6J62l52J72
2930f2L97k91j5J10l07R8K85R5k07k68r1K22K36k09j73J07J94J04m86J41L56l03
2952f7m4N6j95J98M3J21K01j34m49L11Nj97K27q6J43j93l0J09R8l84J85J47j61
$$ plain form
2797 -144 -88 161 58 -114 96 -200 -46 -154 -79 98 44 -23 -195 247 -218 -80 -117 -138 194 -142 -70 169
2819 169 -78 42 92 106 -69 220 -219 23 -22 -151 30 169 -64 -194 175 -55 44 122 149 209 89 -10 -58
2842 -58 -152 -154 46 -83 202 84 -10 63 202 -234 9 -130 60 -143 -85 -11 75 -29 -288 -246 54 -164 113
2865 113 51 -216 -58 -241 -107 23 -216 293 -20 -211 -60 97 -72 167 193 264 83 91 -29 -36 209 192 236
2888 236 -76 138 26 -99 68 257 54 204 296 -84 -200 52 -33 -218 -107 -214 522 42 71 54 -400
2909 -400 121 258 -46 -85 99 -43 169 -274 -119 -31 103 -48 -70 72 -49 82 -110 -44 118 -234 -62
2930 -62 335 44 29 139 -168 -70 215 310 103 -165 -256 -34 202 -7 -180 -73 121 225 -261 -120 236 -67
2952 -67 -111 -55 -250 -52 -9 112 313 179 -270 41 46 -151 76 -10 133 -60 -90 19 117 -267 -82 65 -96
2975i6J15K25l13N03m25MK51l91R3j42J08L0n3K2J92j28l21M45q8l22L06J98k32
2998a9l0j91J21K88r9j43L90m54J22J21j54q8N7K79j1r4l41K35L37l53j45J51
3020b1M0k5N6j51J56k78L13j86J91oj1j05j37J38k54J90K74j22j65P2j42m2L15
3043A00n58M85j11j64K80l94L98p3K16k89L08j97j94Q0J5K33j26k06K04k01J33
3064f1N2k75K69j30J92r7L46l76l8J89J86K2p5k09R0l53K84L63k77k67kM85j39
3087A79k16J80n7J85n27J95kJ73p5O1k37L4N4J83l47J52j88J10Q5L10l39LJ35
3110E1j62K7o6K38j42K2M7k52J88K6k05L83j47m1J08N1l37L66k64K04j84J80j62
3133g1R1l49J29M58j41qk48q7K43J14j40j4N3k40J52K11j61J16j08K85j81n3K87
$$ plain form
2975 -96 19 244 -69 434 9 13 264 -127 -34 -176 -68 -38 -91 -69 123 -5 -326 119 31 -291 15 213 -19
2998 -19 -49 -240 -119 169 70 -73 317 -137 -15 106 -48 -136 -79 200 189 95 -246 -11 326 -27 -172 -21
3020 -21 19 -6 50 -101 55 -223 90 -96 95 89 78 -27 -164 -26 -280 -90 184 62 -103 -31 -173 -215 100
3043 100 -458 27 -84 -248 32 -362 36 -37 179 -110 198 1 -193 -113 -98 135 9 -197 7 -194 -61
3064 -61 -9 -284 -15 -145 47 -50 296 -80 -118 71 257 279 204 -5 85 -268 16 379 102 -165 -167 318 179
3087 179 -37 143 86 271 -256 -61 -63 110 35 96 -141 -107 -53 130 -217 -65 -253 -143 -58 252 -87 -84 51
3110 51 -111 -84 -150 88 -54 -32 15 -237 -49 -23 -228 155 8 -33 75 126 -211 155 -109 95 -89 91 -71
3133 -71 20 -329 -200 258 117 109 -139 -226 17 131 -9 -23 30 -210 -58 153 -8 108 0 285 104 51 338
3156C38r5k90P2m9j63J47K51j19J24j59K1j36O1L02m13K89j32K2k55N1K76l05
3178a62J37r0L4r8J16K00l99Q6M22j85J78l76K65k80M8J17q9L4Q0m96L80j21K31
3201C2j14k6k35N53P5l35R7j64R9M92l49j50K43l13j09J0r0J38J04k02L87k78
3223a35m5K25m9r6L43k48j77L02j67k7M48o59L74K2j03o0j24J14M1N7l75M47o4
3246D4J73m15N0J2J2j09J69J00o8J37J4k44j3j0K0J65k03n8L28k72j35L10R0j20
3270b3o1K25j27n1l50L72K92l84J89j24J66q8J47k44N63l01n19M35K0l63L46j98
3292g8j58K47j33J84j68Q9L7n3j32nL4J1K60n6p4k6l4q6K44m0j68K21j09j51R9
3317d5J18M2m21L46O8q7n3J22J4n6O1j75j61K25R2M4l2l2j48k72L50k1J93j46
$$ plain form
3156 338 243 -47 25 -24 -187 -40 211 92 216 57 78 -58 3 305 -108 181 49 71 -184 -133 143 -162
3178 -162 -25 -115 -81 -179 -63 137 -262 -176 246 61 239 -137 128 -152 -104 13 -76 -42 38 -458 -78 -199 32
3201 32 -82 -108 -343 210 285 -50 47 -117 -18 474 125 -25 218 -95 -204 -194 -284 -146 -42 -244 143 -135
3223 -135 -180 45 -4 -100 243 -5 -182 120 -47 -74 374 -285 89 111 8 -52 -176 -62 -21 36 -339 108 44
3246 44 217 -198 -148 -136 -124 -233 -64 36 -32 105 119 -125 -138 -148 -128 37 -166 -224 104 -168 -303 7 97 -23
3270 -23 -84 141 14 -37 -387 -15 277 -107 82 -42 124 36 183 -61 502 201 -318 117 137 -226 120 -78
3292 -78 -236 11 -122 62 -106 -17 20 -33 -165 -170 -136 -125 135 79 5 -21 -55 -141 103 63 -105 116 7 -144 -45
3317 -45 73 115 -306 40 108 21 -32 90 104 48 109 -66 -227 -2 90 134 102 70 -78 -350 0 -21 172 26
3341B6J55n7o8J43l99L03k31M64m62J17j28J74L3N9k69L08P9n60L53M6L8k52L56
3364B28l06k6k7M0L36j86J80l09O3J71k94l5L97o4k48J36k6l10M26l1k29K1j6
3387a09J4J94k13L76j26k28k72K23J76j08J09J5PK13k29O0j20j7L31l16k24J30
3409a14J2K00P6k99K87k24J65R7l11p0M35k85Q8k08J44j35P5O1j23K71k61J60
3431D1O2j92L63k66k74K34q1j17K94R9k11K49J0j83l9n3j10L88l73K5R2J43N7
3454A58l47K71J14l71J26O4r0J56l37J27Q1J50m08N30l1r8N7k76K29k14J03K1
3476A5J89j45l0P5N4j80L67l41J8m9J08K6k47K49k04K41k16J86l0j20N6j22R5
3499eR4j63J67J24m0k38JK13q0O7k15L16k98K75j27r9R4k2N3k19K85j83q5L28
$$ plain form
3341 26 181 124 56 199 -200 103 -128 336 -126 -9 -137 37 70 129 -140 168 247 -313 40 86 124 -128 228
3364 228 -78 -104 -131 -91 245 59 239 -70 -7 164 -130 -165 232 168 -80 56 30 -280 146 115 -114 -93 -109
3387 -109 -95 99 -114 262 136 -92 -364 -141 35 -73 36 51 58 271 42 102 -18 -35 296 -20 -244 -114
3409 -114 -102 98 174 -125 162 -62 103 200 -111 -181 254 -31 57 -151 -7 -142 -67 -6 -129 142 -119 41
3431 41 103 -89 274 8 -266 -32 -113 -230 64 163 -48 201 211 28 -11 -64 -174 214 -159 -134 -42 101 158
3454 158 -189 82 196 -175 -49 15 -75 81 -256 -129 -48 102 -306 224 193 95 152 -124 105 -109 -6 15
3476 15 204 59 29 104 158 -22 345 4 22 -27 81 107 -140 109 -95 146 -70 116 86 -34 22 -100 -5
3499 -5 89 -74 93 217 177 -61 -60 153 73 140 -75 241 -57 218 91 -8 86 64 117 -102 183 0 -85 243
3523B43q3k05K5J31j56j0K4j87O4N2L1p9m0K05K25j24J10r7j07J98l85J25j65
3546b05K64k13L5J07j46K89l33L52K44m77m0L04j25k05J52L59l32Jk38L63m1l44
3568b29J08R3R4k76J45J96p4m2l6L29k70J03k88K60J08k70M2J55j00L2q8j30j27
3591b65J76L2p5J01Km9o1j10N26j26l17L22j29k27M01k34j55K35K28k88Rm9K4
3614b9L22m63K70L2J08k9j18r9j13K30k34q5J43r6K07j79M7n0J83j61K36l93J61
3637a10K35k13Q2ok17K21L22n17J22K12m41K58N7O5o4l5o8L7K28r9j28k5K90J2
3661B18l61J72l35N62k15N5j14L1K20l92K78p3nR3k56R1J6K68j59P4p8k43L05
3684A52j71n5Q0o4J78l61j56M13p9q5o5J75J21k3l22J88K14k82r7M65m07J22J23
$$ plain form
3523 243 160 -45 -20 111 -45 -55 -31 -218 -154 -102 -71 -150 -190 15 240 116 226 129 22 220 -165 -40 -205
3546 -205 59 -154 -119 -12 -158 131 -202 150 394 -83 -123 181 56 -149 3 362 30 31 -207 156 115 -229
3568 -229 -121 -28 66 -210 -65 131 57 15 -21 308 38 141 -147 113 221 -49 -7 148 48 80 -8 -138 -265
3591 -265 -89 -57 -132 -31 -29 -78 -139 -249 277 151 -166 156 27 -200 201 -33 -188 47 275 -13 -4 -53 -29
3614 -29 293 -170 100 132 240 211 93 -6 -119 111 -123 -208 -65 -161 46 -133 -86 -136 47 -114 122 -271 -110
3637 -110 125 -88 -6 -12 -229 -8 314 -203 -81 131 -310 -52 5 70 6 -29 -97 -60 168 69 -59 -84 206 218
3661 218 -143 29 -306 256 41 96 -18 13 233 -159 119 46 41 134 -122 -31 -15 253 94 168 90 -153 152
3684 152 -19 -74 6 -58 120 -241 -397 16 -63 -148 -213 -38 83 60 -262 -74 140 -142 -239 226 -181 -59 64
3707F4K8j38j49J35p5K87k96J49J02kj72j38L01J19k28J3j06J45k44J04J65L7
3729A01l74M15o3lj58J11Q1k32J29J63l3K5J24n52L53p0L44k66P9J68m38j40J42
3752i4j6K08k51J27r6j0k32L87J10Q1k35j23J42J06k45r2J22J80j51J66j53JL4
3775c4J38k2j65R9k2j7J00l1l07J20K63ok08q0J41j95N25l71K43k81J31l6Ro3
3799f9K87m03K00l06K11N9j23K11l8Lo3q5n0N94k98j18n0p6J86r4O7J82l15R3
3823Ek2K54k86J75j74j18k8O8O7K9J2j01P1n3K06l8j50N5J20j48l0J77j00J46
3847A37m25K54J81m10K26R3k74O5L14k95K46n2l35P9J53Q7q5L0R5p8m1J11k0l01
3871b45K85k62O2J06J70k43o1K61l94K40K09q9j27j61M07r3K6L7j27J81k74n3
$$ plain form
3707 64 92 -46 -195 -60 -135 152 -144 5 107 105 -67 -205 96 215 -13 0 -106 39 -205 -101 64 101
3729 101 -273 142 79 76 -82 29 110 -122 7 170 137 162 286 -266 87 17 361 95 174 342 -96 -236 -94
3752 -94 -110 98 -153 -26 -122 -132 -364 23 133 214 -21 -144 -2 104 -141 -233 -111 69 -82 84 -69 -68 -34
3775 -34 104 82 -83 16 -6 -23 77 46 -261 -141 122 116 -92 -172 -31 -226 299 -72 171 -110 21 -15 -6 -69
3799 -69 218 -185 15 -291 -80 -21 -144 67 29 32 -31 -116 -166 428 130 12 -38 -114 72 -22 45 227 -88 5
3823 5 -17 237 -49 126 -48 -166 -194 -126 -59 -30 -18 -119 -48 -101 105 67 -83 -28 92 -56 -86 91 -9 137
3847 137 -288 -34 147 -263 -37 56 -218 -153 161 -134 112 60 -275 -196 -43 44 -41 -11 84 6 -35 76 56 -245
3871 -245 40 -222 -160 -54 116 -127 -188 73 -321 -81 128 39 -88 -249 158 65 91 128 1 182 -92 -145
3893a45m8K58K0o2J44j52Q1n6j24J88j41N0m4L1o3K03k10K46r9k04j5K33j82K74
3917A83j58M6P0k25n4K70j17n5m3J19j26K00j88J42l9j47q6K23k41L23M5j16l1
3940ej82J1J62J79l16m4M28k55L0q8kj30K08j5K21k12J25k69rL03k92k5L29j43
3964IJ6J35k80O7j55K71p1K5K32j16njl12L07j26n9r7K90l69K55J15k16K15k6
3988A04pk06J2j5L54j1m68J19K75j53j22N6J95P8m23P0n0J47M2r6j59M69l40J70
4012D1k08K87j7r7j33J79q5j01J82m91L49J86M6q6k01j9K84M9k79L14j15K8K72
4035C85j95m62J62R5j81j2m0M25q8k39K44J8p1k67K33j5J47O0k79J36R7j69rj55
4059a80K76j08Q4j64j3J94j19R7J27l77L24j31j66qJ67q5J76m28L89J8j62Lp9
$$ plain form
3893 -145 -193 65 85 23 167 15 96 40 -84 104 -37 13 -31 0 -63 140 -70 176 77 -127 -142 91 -91 183
3917 183 25 71 141 -84 -138 132 15 -40 -83 36 -90 110 -78 64 25 -122 -208 15 -226 97 142 26 -5
3940 -5 -187 -176 -14 165 -151 -195 233 -22 8 -80 -82 -212 -4 -19 202 -10 115 -154 -163 140 -152 -177 152 9
3964 9 25 160 -120 -53 -208 63 -8 17 249 133 128 127 -185 122 -4 -63 -160 130 -239 16 131 -85 130 104
3988 104 97 -109 -97 -112 242 231 -237 -118 157 4 -118 -62 133 211 -212 -142 -192 -45 -3 -99 -258 211 -129 41
4012 41 -167 120 103 6 -127 52 -33 -134 48 -443 -94 92 138 52 -149 -168 116 165 -114 200 85 113 385
4035 385 190 -272 -110 -15 -196 -208 -248 177 89 -150 94 112 41 -226 7 -8 139 199 -80 56 153 -16 -25 -180
4059 -180 96 -12 72 -92 -105 89 -30 67 194 -183 141 10 -156 -164 3 -82 94 -334 55 73 -89 -86 -165
4082a65R2J7l9L03k86L39j35j75J44j01K86j08o4k65K25R1O3n44K31O9j4L2j75
4105a79L7j30K23k1M9q4J48j60J94jn9J70Qk80n0J66O9l38L16l35J84M15k68P9
4129A53P3k17L6J76n9k06O1R6P7r5l55L73m27R9L16k07n0M7k06L23J50j57pP0
4153F4J58l37L16j52k46K66k36L92k09o7K95k68q0n1O0J12J09j93j37M30k55J01
4175G2k72J43p3K62j97J00J71l39j41K78J27n0p3j10K34j40j10K6J8M7K12k05
4197b0J66l7j62L2K10j35M7l6m3J2M8m20K77j91K16J06Rj56J31J2J96j72k37M96
4221C49m08M1L62l88K01j2j98J09J63l26K90k69J66N0k95L43j4r8J13k87L11k74
4243g1oJ45k33J42K6r2K91j67J03j79K33k72J41m6J9j92K24O5l02J11K2J69k43
$$ plain form
4082 -165 -73 -56 -95 208 -78 261 126 -49 95 -6 280 172 108 -157 68 159 222 -322 -91 -22 -36 -4 -179
4105 -179 -142 -272 -49 -70 -21 -105 43 -117 77 76 17 187 195 -85 -135 31 100 -238 78 -257 -73 342 74 153
4129 153 226 9 45 221 162 -44 17 113 190 95 -260 113 -314 -215 101 -106 -156 -109 -315 8 158 1 -6 64
4153 64 222 -115 201 49 -197 69 -167 225 16 -51 244 -24 -104 -155 -95 17 126 -67 -204 226 -29 72
4175 72 -200 -57 -130 132 -65 35 206 -133 -274 4 131 81 8 -102 132 -8 -118 -92 -74 -27 185 -20
4197 -20 146 109 -53 -21 189 54 101 65 22 34 82 -338 -61 -252 -36 70 79 -77 54 66 262 90 -147 349
4221 349 -59 -18 344 -44 157 145 -53 56 219 -107 183 -86 80 130 -165 178 164 66 179 -108 203 -71
4243 -71 -77 68 -165 -23 3 -89 202 35 138 -41 192 -80 61 15 34 -158 66 131 -171 -60 -38 131 -112
4266a12K90m61K36m3j0K09j99L19n06J98kj86L37j60m0K27k45K1L24n07K13k2
4288a19j17K03P9j89J76k26K10O6p7R6Q7j11J65m12J34K75n13L79r0j74K95N9
4310A96m53J71r8k7M23m51J37J71k75K31k03K8P6J02m8j47K05K32m29J16l21L72
4332Hl01K01J10q5O6j74J80qj13L8k22L67j57J3k02L86j5m2o5l7r3P4r0K63k25
4357a23p3J81j72K5N00l46oj30M16m27L32j58j04M9n1K79l62M09l15j20K53J09
4379A66j82J25J0l17M2K70j0j80J44p9J09r5J91l24M69l49q3rq8K89o9j0R0k03
4403i3J20o5j57rk7K70o6j67Q8L00j34j69k2p3J00L73m81K47K11l05J87m11J96
4426h7o7P4J71k24L96q0j42J14P5j0k06j11K15K33k72J37n31K98J20l21M52j85
$$ plain form
4266 -112 178 -283 -47 -90 -100 109 -90 229 -277 -79 -81 -267 70 -90 -130 97 -148 -127 197 -310 -97 -119
4288 -119 -236 -33 46 -143 33 -193 17 83 6 102 189 78 243 -169 -35 240 -273 106 16 -158 137 196
4310 196 -257 -86 -184 -211 212 -239 -102 69 -206 25 -178 -150 -74 28 -20 -167 38 270 -159 -43 -364 8
4332 8 -293 -92 18 -67 -1 -175 5 -3 -116 -78 -300 67 -90 -77 -279 107 92 50 -15 -52 -145 -71 -161 102 -123
4357 -123 -196 -15 -187 -162 338 -8 -14 -144 272 -155 177 19 -85 -36 -87 192 -170 239 -76 -196 57 166
4379 166 -16 109 119 -198 -156 114 104 -76 68 -11 98 3 194 -130 339 -10 -93 -102 -190 99 30 20 110 -93
4403 -93 27 -38 -195 -204 -231 39 -27 -194 -106 194 60 -109 -131 -204 -104 269 -212 35 246 -59 128 -283 -87
4426 -87 -154 -80 91 -133 263 183 41 155 230 220 14 -97 118 351 79 216 -315 -17 103 -218 234 49
4448D9m4Lq6q6j3K37j17Q9L06k72J0j92L39j69J04l3j71j0j62K28L5l0J0J20j14
4473C1j87J14j7J65j91j66K87k18k50K98K57k39l9O3K42l29K73JJ30k14K74o1
4495B24Kj69Pk18K47Q7n28L53J85l84K96k17j6K14m1pQ9m89M02J51l08J4j4J47
4519B7k52K77j33J2j03L69j29p8J00O2j38J92l23J13K4p6L25j90r8P0K81j97j66
4542c1kK3L8j34R7J50k67m5pL77m33L12m9n0O3j07J08Kj14K68j33k15r5R6K07
4567E9O8J7j59n9P7j89k47N14L0p5k2J7O5l00J20J30p3j18J54Q6j67OPK36j32
4592D5j59K23m4k00L18l46J58j40p2N73n07K19J39m56oo9K72J82j28N1k01M97
4614C49m88j53L7R5L98l59L50l6N4m16L49k2M6m0r5j49J36j53K43j55J18j22J50
$$ plain form
4448 49 5 8 -78 -164 -177 60 -57 32 338 66 76 -116 223 54 158 125 -46 -56 -218 10 45 15 25 145 31
4473 31 -156 -42 -59 106 -85 -251 36 -182 -432 -134 123 -116 -155 -92 150 -179 94 95 225 11 285 224
4495 224 226 57 64 -154 93 180 -348 5 190 -194 102 -115 -131 83 42 35 124 -365 37 188 -120 -106 -120 27
4519 27 -225 52 -81 -69 -172 197 68 -10 90 152 14 206 -117 -4 20 -56 269 79 -19 51 332 135 -31
4542 -31 -33 -10 28 -106 -9 141 -126 -171 -178 199 -234 78 29 -21 42 -65 43 45 -69 199 66 -149 -244 -148 59
4567 59 127 144 -15 -74 3 -186 -433 81 111 36 14 31 96 -204 -84 46 -27 -145 9 95 -72 -66 -59 177 45
4592 45 -114 109 65 -135 183 -163 -5 -145 -217 356 -151 68 207 -249 -255 -324 -52 130 2 53 -148 349
4614 349 -139 -292 -255 -160 238 -121 229 193 247 -169 180 158 204 164 69 -80 56 -97 146 -9 109 -13 137
4637A37L7j88OKJ65m9k58k9J89r7O4n6R2j09K26l76P8J57K5r5J74j02K27k46m1
4662f7O3J47L2j93k65M46r5j28j34j31N5M01P4m89K99J88k36K56j95Q6j53j58
4684a97j67K52L04j03j34L4P3n7n5j37J70K36j02j53PJ4j14K83j74j8K04k05Q1
4707D2L1j74J59k80L98j17j44J74o9j6K44k18q7J16jm22L71Qk5j18J35J7j18K10
4731A16J3k03K38j50J52k15J5j04L51l44P2Q9o5M74o55L8M16o6j65q1m2J82l5
4754C1N7l58K08K9O0j31KN27l01j79j25M93m55J66N7n9L8P1k01j35J13J0m8L58
4778B28j38l89M77j48j47Q6L32l35l10M07j12J85j30J22K6k38O9L6J52k21R6j3
4800C5J48j30O2j59p7j62K34L6K4Oo3J0K08k17P3Q8k80Q8l9J42K04j81rj73j05
$$ plain form
4637 137 174 -14 -8 -6 159 110 -148 -177 12 -85 -21 -77 15 -94 132 -244 -166 -9 16 -79 95 -7 220 -26 -67
4662 -67 -4 143 175 -18 -283 163 68 -60 -194 -325 -270 131 205 -284 15 203 -33 223 28 114 -39 -197
4684 -197 -364 -112 192 89 -45 -11 62 5 -50 -187 -17 219 117 -36 -29 -15 -129 154 -20 -38 166 -39 42
4707 42 73 -101 58 -222 176 59 -85 89 20 4 248 30 -57 59 58 -364 7 15 -10 -128 7 24 -94 116
4731 116 129 -74 164 14 166 -49 -34 -138 213 -131 -59 30 -35 439 -216 -178 238 172 7 -74 -116 66 31
4754 31 88 -270 -62 -33 27 -104 -102 425 124 -55 -180 313 -142 24 81 22 60 131 -70 -205 -92 -82 -130 228
4778 228 90 -299 178 30 -117 -31 301 -34 -344 63 -49 136 6 128 154 -84 -15 21 173 -48 48 35
4800 35 183 53 115 -44 -121 -283 -49 -13 11 17 -46 -36 172 -45 28 116 -164 -76 -115 27 231 50 41 -132 -237
4825b37K23J02j12o6J46J1k9O0R6j48k35K25J08mk50qK32n79M11J13m5j47J89
4848E6p6kJ50M0k65N3r4q4K75L6j31J33l01K84j40j0K20j72Q9r3N2L5k30M1L67
4873B33k01L1J2J35j39M3P2p2j20J65q6j29j84k4j6M56k86mR8J2J79L9n11K77
4897b0j8n8J44kl6k27L52L5q2n2q5n8P2Qn8J14j70k7J29M3j82J38K21L2L3r6k18
4924f8J3R5o2J63j2j96K15j33k0lJ40j34j61K53k8K43k41J1K8j4J22j35k20L01
4948A57m66J69J31R5j54O7J47k81rJ10l2J33o2r9O3Q3j75L22K94o59K27mo7L21
4972C11N8m02j24l2K29O3J3q1j27N12o31O9k1K76Q6j95qp8k28M02j14J7K6m6K61
4997B36k05O4j49K7L9l6l3L5K90k99Q0l05J93J84k37J4K9J78k42K09r1J82k22
$$ plain form
4825 -237 -14 88 -24 -90 56 67 38 98 194 46 -189 36 144 140 -110 -118 114 -465 -54 59 14 -133 56
4848 56 -20 -22 128 168 -97 -44 -138 -222 53 89 -42 91 -210 74 -66 -76 144 -28 61 -32 20 55 -175 -134 233
4873 233 32 63 75 210 71 114 186 114 -6 159 73 -56 -240 -264 -280 176 -110 -114 -16 -4 175 214 -297 -20
4897 -20 -38 -96 48 46 10 -217 135 170 88 36 -49 -107 -35 -27 -85 29 -141 -168 -39 4 -178 -40 181 213 246 150 -68
4924 -68 -55 40 -22 141 129 -67 148 15 -5 -8 132 -2 -163 90 62 305 64 75 103 89 211 76 -144 157
4948 157 -309 -140 -9 86 -68 -1 146 -135 -144 -34 -66 67 5 -94 -31 52 -123 199 493 -166 61 57 -10 311
4972 311 369 -33 -157 -189 40 103 116 35 -92 420 -211 -142 -163 113 199 4 -4 -82 -310 92 -22 -5 21 -25 236
4997 236 31 95 -54 -27 12 -24 -57 -22 268 -31 49 -256 -63 121 -116 -102 -73 105 -137 72 -19 163 -59
5020e9L4nJ61J4j24l21J94K76J1m05J64j20n0K78O4k56J34J2l77N37j57P6K26
5043C07l99j61J21l5M40k28j27j11M81k85j23K51j46J18j22j02Q2k5K2m1J72l4
5065E5L41m81L44n6j39J16m10j07J79L07k62O1N1q1O7o9j05L76k65J40j18J46
5087I0K1J1p2j51K06j73J81j29N0l3K30k36J31j32J71j04j42K80l17j44L9K24
5109Aj71K82j81K17k14J02j45Q5J8j63L33j20k44L14j56j30L41l11J91j43j0J37
5131C3n3n1P7m3q5P1Q7K18j42jj69j14L2M4l2J01L1P0j38K46j23J64k86N2j41
5156a52n5J97p6L94j12m5J38k35J1Q4l23lK33J23k7m53L30K00k60J14k16k60N09
5179A16j29O6k19M62k60J2j03O8k60N06j91k38J69j34M25n93L61q6k43K55Or3
$$ plain form
5020 -59 -25 -30 131 145 21 -300 -106 170 181 -224 -60 -180 -230 48 112 -144 -10 2 -375 162 5 81 307
5043 307 -92 -253 -132 -167 273 45 -82 -193 288 3 -120 131 -15 103 -19 -121 -39 -64 -42 -83 89 55
5065 55 396 -85 259 203 64 180 -230 -337 -158 149 -113 -52 -1 -82 -15 -84 -189 187 -78 62 -56 90
5087 90 111 122 50 -101 105 -68 113 -16 34 1 231 -5 126 -6 165 61 -81 199 -118 -262 -223 1
5109 1 -170 112 -69 148 -66 36 -109 -24 -6 -169 164 44 -200 114 -42 -172 169 -142 49 -94 -104 33
5131 33 -20 -71 6 -37 -122 -51 36 254 112 111 -58 -172 -140 -96 -128 -27 4 74 -64 182 59 223 -63 -11 -152
5156 -152 -207 -10 -86 308 196 151 289 54 65 149 -174 -177 56 179 152 -301 29 229 -31 83 -133 -393 116
5179 116 -13 53 -166 296 36 48 -55 13 -247 259 68 -170 -1 -135 290 -303 58 -28 -271 -16 -10 -103
5201a03K41j50k60M17j26o3l5K06pl1l12K83m7J31k56J65j4l0k10N8J5M30n57
5224b55L45j99r1L60k30J09l48K34K19jj95j96K07J3R3j28l57L49r0K94l27J79
5246a5N5j86K24j64J60j08RJ85l33K47j71J14n4m6L43n98O2J72o5j31L09n9L7
5269a3K2r0j1r9P1M29l06mj13OJ73k51K8J43N0N2j39J22L4j33k64N91p8n2l04
5294a36K60k76jn4R1j0K09R1j68J62K00l18r5j29K47k30r7L05n9J61j83n5J44
5317E9L7j78P6J4j3j19J68M3l2J19j18r2L3J39j77R6R9P8l70J84J9l26K95j32
5341i8j7K46J62n06J80K41j70pm5J39n7K6K2r2j74K93j64q0oJ03j2L3p0O5j4Q0
5367G8k1k38J65J48j87J87l04L03n07K83J10j57NJ90j6J42j13J25l39J7J87l11
$$ plain form
5201 -103 138 -12 -272 145 19 -44 -79 127 120 89 -223 60 13 144 -112 53 39 9 -201 -143 -128 302 -255
5224 -255 90 -109 -200 160 -70 39 -309 -75 144 143 -52 -248 -41 -28 65 -63 -420 -71 -161 133 -194 -15
5246 -15 40 -146 78 -86 74 -34 -25 160 -173 74 -97 17 -37 -83 260 -338 -276 -104 -169 -300 9 -50 -13
5269 -13 9 -81 -92 -191 -120 309 3 -1 -114 -108 65 -186 -158 -15 35 87 -52 70 104 -29 -293 298 220 168 -136
5294 -136 124 -152 -153 -207 -116 -126 83 174 6 168 368 50 -45 -174 73 -157 -254 51 -8 153 -30 -85 59
5317 59 96 -82 -6 8 -5 -124 44 87 55 174 56 -36 -3 136 -41 55 154 232 -138 46 65 -261 34 -98
5341 -98 -115 131 293 -213 -33 208 38 31 -14 125 68 94 116 24 -150 143 -21 -101 -107 -4 -16 17 -53 12 -2 78
5367 78 57 -181 -16 132 -55 132 -172 131 -376 -93 17 -140 -135 55 39 181 68 193 -146 -129 58 -253
5389b53N32k24j12N2j65P5L80l41K36l29P6j27K0J87J48k00N4J54J96l58L9L4
5411G4j73O4O9l6JL69n50K31j54J69m9q1K11j28K6l07L33K22k42O1j68r2j04K76
5435B2q0k0k41L69q6J61p8k20N17k70j18P5lk25P5J7K48k96L6K82j61m9q1k11
5459c37J51K53Ql6j72P3l4kp4J74l2j87K96r7M1j0l22L29j59P6K12k45K13r3j34
5484a08K5oR6J04j15l9J6J80j15j38J90Oo4j37K55j87J00k94L06q5L3J04l87R2
5508a68M56k67j27J81n5N4o9J58j52k8K98j19k41j42R1J87r8k27M00n7j88J44
5530C1Q6j07j4J90k95J16P8j37J17P2k23J67j72L1m1k63M04j17j04N28m72n1J26
5553e0j77R9J61k65m8J54K05q8m3J16k51L52j0j35j58N1J86j87K27k53m7J33k4
$$ plain form
5389 -253 279 55 -57 -5 -170 -95 285 -56 180 -149 -73 -200 -180 7 155 -45 9 163 359 1 40 74
5411 74 -99 -35 34 -2 -1 368 -182 49 -105 64 15 -66 145 17 43 -264 69 291 49 110 -58 -150 -254 22
5435 22 -58 -78 -319 50 -36 125 47 -173 344 74 -44 31 28 -197 -122 -105 143 -153 -117 165 4 -45 -126 -337
5459 -337 -186 67 75 39 -133 -60 -94 -96 -170 4 -28 -215 81 -16 25 15 -307 22 -137 -61 151 -94 119 26 -108
5484 -108 -83 -89 7 111 -4 -43 -27 153 38 -100 90 96 32 -105 150 -37 63 -231 75 -10 23 127 -260 -168
5508 -168 288 21 -106 75 20 74 5 163 11 -17 281 162 -79 -221 -130 57 -41 -268 132 75 -113 31
5530 31 117 10 -4 186 -109 7 85 -52 65 137 -86 81 -91 -60 -101 -364 40 -77 -181 347 -125 -176 -50
5553 -50 -227 -128 33 -232 -280 -126 79 -9 -52 64 -187 165 155 20 -138 -87 99 -88 139 -114 -161 -28 -52
5576e2qp9J31N3r3l8K00P0j09q8J0l8k80N02j48j21J02n0J23M8o7m71L36k11K68
5601a0J11r2k16L0q0J72j1j4j32K41J17j84j24L69j05j15j83J15K76j76j2J05
5623H2M0k99L55q6k02K33k33J29K05j36j06k6J49J4l15J83M3R3r3N2j70j5L2j54
5647b25L66p6j97L24j28j11J31Lj43R3J89k25jJ14N9L45m63L14m31l1r5R5J42
5670D9j30Q8j93J72J58or9K0p9R9p7j91K32%k65L36l73M34j50k87L39k60n8M22
5694A81k28m7J37Rl79N67j94j04K27k85J25J24%m15Q4J51ON2ro3K74j85J13k10
5718f9%J61M4j77J90j70K41k30n6n6m4J31j40J19O7k29M6J02P4K38l80j5J48R9
5742I4k30M1n0K05N0p4n9j98R6K00j77L01j19J18l99J64J63N0q9l39L04j08K31
$$ plain form
5576 -52 -60 -139 -8 45 -48 -86 114 184 75 -13 -3 -41 -321 181 33 -88 14 -36 87 135 68 -403 -67 -278 -10
5601 -10 101 9 -207 -177 -257 -85 -96 -110 -242 -1 116 -68 -192 177 72 -43 -226 -111 165 -11 -23 82
5623 82 122 -177 178 92 -110 123 -110 19 224 88 -18 -44 105 119 -196 -13 30 123 30 82 -88 -103 -71 -225
5647 -225 141 65 -132 192 64 -47 84 87 -56 37 226 1 0 114 173 518 55 369 -62 -93 -188 -93 49
5670 49 -81 7 -186 -14 144 138 39 59 -20 79 2 -189 43 43 -222 114 -259 175 25 -262 77 -183 -241 181
5694 181 -47 -94 43 52 -327 240 46 -58 169 -116 9 133 133 -282 -198 -47 -41 11 2 -61 213 28 141 -69
5718 -69 -69 92 136 -41 149 -21 220 -10 -66 -122 -166 -35 -175 -56 11 -218 -172 -70 4 242 -138 -153 -5 94
5742 94 -136 -95 -145 60 110 36 -23 -221 -125 75 -102 199 80 198 -201 -37 126 176 87 -252 52 -56 175
5765A75k20J12j32L02m29J05j71L92L3k16J94m5j00n9j69M17q6j39pK7K71j61
$$ plain form
5765 175 -45 67 -65 237 -192 -87 -258 134 167 -49 145 100 0 -59 -228 189 103 -36 -43 -16 255 94
$$ [...]
8191b8
##END NTUPLES=NMR FID
##END=
