##TITLE=1H_Pr NCS-new
 CDCl3,8 sc, 
 26.10.2021
##JCAMPDX= 6.0         $$ Bruker NMR JCAMP-DX V2.0
##DATA TYPE= NMR FID
##DATA CLASS= NTUPLES
##ORIGIN= UXNMR, Bruker Analytische Messtechnik GmbH
##OWNER= root
$$ XWIN-NMR		Version 3.5
$$ Tue Oct 26 12:55:13 2021 Russian Standard Time (UT+4h)  she@DPX200
##.OBSERVE FREQUENCY= 200.1313468511
##.OBSERVE NUCLEUS= ^1H
##.DELAY= (6, 6)
##.ACQUISITION MODE= SIMULTANEOUS
##.ACQUISITION SCHEME= undefined
##.AVERAGES= 8
##.DIGITISER RES= 18
##SPECTROMETER/DATA SYSTEM= spect
##.PULSE SEQUENCE= zg30
##.SOLVENT NAME= D2O
##.SHIFT REFERENCE= (INTERNAL, D2O, 0, 15.7039)
##AUDIT TRAIL= $$ (NUMBER, WHEN, WHO, WHERE, WHAT)
$$ ##TITLE= Audit trail, XWIN-NMR		Version 3.5
$$ ##JCAMPDX= 5.01
$$ ##ORIGIN= Bruker BioSpin GmbH
$$ ##OWNER= she
$$ F:/spectra/data/she/nmr/H-F/1/audita.txt
$$ ##AUDIT TRAIL=  $$ (NUMBER, WHEN, WHO, WHERE, WHAT)
(   1,<2021-10-26 12:53:47.87 +0400>,<she>,<DPX200>,
      <created by zg, POWCHK disabled, PULCHK disabled
       configuration hash MD5:
       00 E9 B6 7A A2 85 ED C7 34 08 36 98 17 FE 4E 26
       data hash MD5: 16K
       4F 18 B3 F9 6D 36 7A AB EC E3 FE DE E3 27 A9 92>)
$$ ##END=
$$ 
$$ hash MD5
$$ 2F 99 07 D3 E7 9C 4C F0 7D C3 C4 60 29 BA B0 DC
##$RELAX= 
##$RELAX= 
##$RELAX= 
##$RELAX= 
##$RELAX= 
##$RELAX= 
$$ Bruker specific parameters
$$ --------------------------
##$DU= <F:/spectra>
##$EXPNO= 1
##$NAME= <H-F>
##$PROCNO= 1
##$TYPE= <nmr>
##$USER= <she>
##$AMP= (0..31)
100 100 100 100 100 100 100 100 100 100 100 100 100 100 100 100 100 100 
100 100 100 100 100 100 100 100 100 100 100 100 100 100 
##$AQSEQ= 0
##$AQ_mod= 1
##$AUNM= <au_zg>
##$AUTOPOS= <>
##$BF1= 200.13
##$BF2= 200.13
##$BF3= 200.13
##$BF4= 200.13
##$BF5= 200.13
##$BF6= 200.13
##$BF7= 200.13
##$BF8= 200.13
##$BYTORDA= 1
##$CFDGTYP= 0
##$CFRGTYP= 5
##$CHEMSTR= <none>
##$CNST= (0..31)
1 1 145 1 1 1 1 1 1 1 1 1 1 1 1 1 1 1 1 1 1 1 1 1 1 1 1 1 1 1 1 1 
##$CPDPRG= <>
##$CPDPRG1= <>
##$CPDPRG2= <>
##$CPDPRG3= <>
##$CPDPRG4= <mlev>
##$CPDPRG5= <mlev>
##$CPDPRG6= <mlev>
##$CPDPRG7= <mlev>
##$CPDPRG8= <mlev>
##$CPDPRGB= <>
##$CPDPRGT= <>
##$D= (0..31)
0 1.2 0 0 0 0 0 0 0 0.06 0 0.03 0 0 0 0 0.0002 0 0 0 0 0 0 0 0 0 0 0 0 
0 0 0 
##$DATE= 1635238427
##$DBL= (0..7)
120 120 120 120 120 120 120 120 
##$DBP= (0..7)
150 150 150 150 150 150 150 150 
##$DBP07= 0
##$DBPNAM0= <>
##$DBPNAM1= <>
##$DBPNAM2= <>
##$DBPNAM3= <>
##$DBPNAM4= <>
##$DBPNAM5= <>
##$DBPNAM6= <>
##$DBPNAM7= <>
##$DBPOAL= (0..7)
0.5 0.5 0.5 0.5 0.5 0.5 0.5 0.5 
##$DBPOFFS= (0..7)
0 0 0 0 0 0 0 0 
##$DE= 6
##$DECBNUC= <off>
##$DECIM= 32
##$DECNUC= <off>
##$DECSTAT= 4
##$DIGMOD= 1
##$DIGTYP= 9
##$DL= (0..7)
0 120 120 120 120 120 120 120 
##$DP= (0..7)
150 150 150 150 150 150 150 150 
##$DP07= 0
##$DPNAME0= <>
##$DPNAME1= <>
##$DPNAME2= <>
##$DPNAME3= <>
##$DPNAME4= <>
##$DPNAME5= <>
##$DPNAME6= <>
##$DPNAME7= <>
##$DPOAL= (0..7)
0.5 0.5 0.5 0.5 0.5 0.5 0.5 0.5 
##$DPOFFS= (0..7)
0 0 0 0 0 0 0 0 
##$DQDMODE= 0
##$DR= 18
##$DS= 0
##$DSLIST= <SSSSSSSSSSSSSSS>
$$ [...]
##$SUBNAM2= <"">
##$SUBNAM3= <"">
##$SUBNAM4= <"">
##$SUBNAM5= <"">
##$SUBNAM6= <"">
##$SUBNAM7= <"">
##$SUBNAM8= <"">
##$SUBNAM9= <"">
##$SW= 18.0517286264689
##$SWIBOX= (0..15)
0 0 2 0 0 0 0 0 0 0 0 0 0 0 0 0 
##$SW_h= 3612.71676300578
##$TD= 16384
##$TD0= 1
##$TE= 0
##$TE2= 300
##$TE3= 300
##$TEG= 300
##$TL= (0..7)
0 120 120 120 120 120 120 120 
##$TP= (0..7)
150 150 150 150 150 150 150 150 
##$TP07= 0
##$TPNAME0= <>
##$TPNAME1= <>
##$TPNAME2= <>
##$TPNAME3= <>
##$TPNAME4= <>
##$TPNAME5= <>
##$TPNAME6= <>
##$TPNAME7= <>
##$TPOAL= (0..7)
0.5 0.5 0.5 0.5 0.5 0.5 0.5 0.5 
##$TPOFFS= (0..7)
0 0 0 0 0 0 0 0 
##$TUNHIN= 0
##$TUNHOUT= 0
##$TUNXOUT= 0
##$USERA1= <user>
##$USERA2= <user>
##$USERA3= <user>
##$USERA4= <user>
##$USERA5= <user>
##$V9= 5
##$VALIST= <valist>
##$VCLIST= <CCCCCCCCCCCCCCC>
##$VD= 0
##$VDLIST= <DDDDDDDDDDDDDDD>
##$VPLIST= <PPPPPPPPPPPPPPP>
##$VTLIST= <TTTTTTTTTTTTTTT>
##$WBST= 1024
##$WBSW= 4
##$XGAIN= (0..3)
0 0 0 0 
##$XL= 0
##$YL= 0
##$YMAX_a= 127627
##$YMIN_a= -172365
##$ZGOPTNS= <>
##$ZL1= 120
##$ZL2= 120
##$ZL3= 120
##$ZL4= 120
##$ABSF1= 10
##$ABSF2= 0
##$ABSG= 5
##$ABSL= 3
##$ALPHA= 0
##$AQORDER= 0
##$ASSFAC= 0
##$ASSFACI= 0
##$ASSFACX= 0
##$ASSWID= 0
##$AUNMP= <proc_1d>
##$AZFE= 0.1
##$AZFW= 0.1
##$BCFW= 1
##$BC_mod= 2
##$BYTORDP= 1
##$COROFFS= 0
##$CY= 11.3945322036743
##$DATMOD= 1
##$DC= 2
##$DFILT= <>
##$DTYPP= 0
##$F1P= 2.36226072786647
##$F2P= -0.459571619588291
##$FCOR= 0.5
##$FTSIZE= 0
##$FT_mod= 4
##$GAMMA= 1
##$GB= 0.15
##$INTBC= 1
##$INTSCL= 1
##$ISEN= 128
##$LB= 0.24
##$LEV0= 0
##$LPBIN= 0
##$MAXI= 10000
##$MC2= 0
##$MEAN= 0
##$ME_mod= 0
##$MI= 1.114404
##$NCOEF= 0
##$NC_proc= 0
##$NLEV= 6
##$NOISF1= 3.799351
##$NOISF2= 2.8
##$NSP= 1
##$NTH_PI= 0
##$NZP= 0
##$OFFSET= 15.70392
##$PC= 1
##$PHC0= -15155.25
##$PHC1= 12.20083
##$PH_mod= 1
##$PKNL= yes
##$PPARMOD= 0
##$PSCAL= 0
##$PSIGN= 0
##$REVERSE= no
##$SF= 200.130013532006
##$SI= 16384
##$SIGF1= 3
##$SIGF2= 2
##$SINO= 400
##$SIOLD= 16384
##$SREGLST= <1H.CDCl3>
##$SSB= 0
##$STSI= 0
##$STSR= 0
##$SW_p= 3612.71676300578
##$SYMM= 0
##$S_DEV= 0
##$TDeff= 0
##$TDoff= 0
##$TI= <>
##$TILT= no
##$TM1= 0
##$TM2= 0
##$TOPLEV= 0
##$USERP1= <user>
##$USERP2= <user>
##$USERP3= <user>
##$USERP4= <user>
##$USERP5= <user>
##$WDW= 1
##$XDIM= 8192
##$YMAX_p= 0
##$YMIN_p= 0
$$ End of Bruker specific parameters
$$ ---------------------------------
##NTUPLES= NMR FID
##VAR_NAME=  TIME,          FID/REAL,        FID/IMAG
##SYMBOL=    X,             R,               I
##VAR_TYPE=  INDEPENDENT,   DEPENDENT,       DEPENDENT
##VAR_FORM=  AFFN,          ASDF,            ASDF
##VAR_DIM=   8192,          8192,            8192
##UNITS=     SECONDS,       ARBITRARY UNITS, ARBITRARY UNITS
##FACTOR=    0.0002768,     1,               1
##FIRST=     0,             0,               0
##LAST=      2.2672688,     0,               0
##MIN=       0,             -172365,         0
##MAX=       2.2672688,     127627,          0
$$ Real data points
##PAGE= N=1
##DATA TABLE= (X++(R..R)), XYDATA
0 0 0 0 0 0 0 0 0 0 0 0 0 0 -1 8 -8 8 -8 16 -16 16 -24 24 -32 40 -43 49 -58 71 -80 90 -104 120 -136 153 -173
35 -173 194 -218 245 -274 305 -339 377 -419 464 -514 567 -626 690 -762 837 -923 1018 -1120
53 -1120 1236 -1366 1513 -1678 1868 -2088 2348 -2661 3041 -3520 4141 -4983 6192 -8096 11532
68 11532 -19708 84647 -10209 -147299 42529 111631 33104 -61216 -4348 10087 1182 16993
80 16993 8094 -32184 -55795 3400 40664 -29559 -59370 -25784 18041 -16495 -25337 -8523 -27325
93 -27325 -13481 11913 10071 -29332 -23656 42261 18991 -27060 -4508 47592 17699 -26981 24592
106 24592 41966 -2807 -10528 29998 28615 -15622 3913 21380 2379 -12123 5504 23883
118 23883 -23082 -32968 23042 31578 -35754 -55937 27348 37347 -35871 -42707 13930 22093 -24122
131 -24122 -15021 10335 -782 -12842 -2344 13427 -5724 -6910 7716 -2274 -4149 7765 12187
144 12187 -9474 -12427 13917 14069 -2196 -10770 4173 9439 -611 4742 7607 -2655 -12161 13950
158 13950 27073 -10773 -19090 11307 23440 -261 -11796 1171 2375 7009 6248 -9419 -15724
171 -15724 1409 17551 -5218 -27698 -11839 17312 7718 -28664 -21727 8918 12320 -11149 -20123
184 -20123 -861 5839 1699 81 -1084 -2116 1329 13960 10115 -1401 9 8472 12756 10605
198 10605 5988 -3931 1933 17794 8611 -7324 -7287 6550 7696 -5343 -9259 -5360 1250 -3214
212 -3214 -11354 -7079 -2998 -5634 -8172 -4376 -4360 -4920 -1366 -3339 -2602 598 3054 -290 -1250 7762
228 7762 6169 -1228 2088 9033 7535 -1246 2083 7591 4359 602 69 1527 2373 1698 -3649 -3908
244 -3908 1580 102 -3028 -5841 -3557 1931 207 -5238 -6293 2088 4369 -4314 -3416 2878 1365
259 1365 -1682 2826 3074 -2999 -1612 4222 4264 -2753 -3164 1168 912 695 -1435 -3884 -2284 617 1794
276 1794 -2535 -5786 -1197 4262 1612 -4080 -2226 4980 4145 -2130 1073 6345 1122 431 4834 4527
292 4527 -360 524 4859 1410 -1530 1120 194 -2499 -1586 -916 -3195 -4624 -3325 -1334 -3292 -6604
308 -6604 -3712 -174 -2265 -5358 -2796 2964 -429 -3695 2277 3933 950 1611 5034 3730 1522
323 1522 4918 5937 1083 988 5416 3482 -9 665 833 -21 -1083 -1555 -1140 -3254 -3498 -1953 -1835
340 -1835 -4317 -5823 -1866 687 -3788 -4950 248 1483 -1388 -359 1571 955 1194 3486 2704 -191
356 -191 2890 5045 1512 267 1746 2447 1306 -489 -238 267 -548 -1376 -1753 -1113 -1638 -2871 -1200
373 -1200 -749 -3202 -1573 797 -737 -1534 42 1196 493 648 2728 474 -299 3083 3217 819 -36
390 -36 497 999 1278 265 -1126 -2329 -925 159 -861 -1777 -3546 -3417 477 416 -3139 -3267 -731 641
408 641 990 575 -846 -229 2931 3857 332 473 3283 2855 2040 2082 1960 1596 777 539 494 148 -553 -1875
428 -1875 -2261 -1353 -1729 -2295 -2360 -3397 -2908 -1008 -803 -3035 -2802 795 1300 -1369 -988 1386 2481 2754
446 2754 651 -182 3281 5254 2739 -383 674 2995 3240 2218 -610 -3152 -240 3472 598 -3974
462 -3974 -5788 -1646 2859 -115 -5923 -5501 184 2459 -1753 -3301 -474 -152 -338 1624 2723 365
478 365 -1623 1367 5162 3634 -203 -1203 1586 4586 2240 -1857 -835 433 -149 514 480 -2525
494 -2525 -4639 -939 2627 -628 -5186 -4137 1188 3789 -1327 -5898 -809 5023 2699 -2361 -2152
509 -2152 2251 4904 2950 42 -1714 1398 5292 3318 -1669 -3313 37 4089 2375 -3836 -5027
524 -5027 -447 2640 -14 -4679 -3588 -825 -476 423 -368 -2853 -2005 418 2802 1437 -1043 -267
540 -267 1771 3768 2590 764 1091 1284 676 3430 3795 -1010 -3528 481 4139 972 -4541 -3611 -161
557 -161 1306 -678 -4491 -3897 -496 439 -1015 -2904 -2570 248 2548 1105 -2031 -1284 3390 4373 141
574 141 -1146 1392 3828 3590 339 -1220 1343 2857 1126 -1096 -687 -790 -2136 531 1179 -3568
590 -3568 -4701 -1014 1530 -806 -4419 -2761 685 866 -719 -458 740 117 -823 2109 4345 214
606 214 -2423 1627 5335 3024 -1849 -1915 2138 3076 883 -2403 -2409 959 1238 -1611 -2769 -1758 -653
623 -653 -1018 -1030 -1703 -2293 -889 1164 95 -1259 -731 1224 2753 860 -1385 841 3330 2402 290
640 290 324 1457 1412 1319 959 -932 -952 1352 554 -2010 -2116 -662 -280 -1879 -2198 -975 -914 -1282 -1695 -1250
660 -1250 614 360 -676 -332 987 1851 1544 487 845 1941 2393 1605 464 913 1293 424 724 1178
678 1178 -1433 -1467 25 509 -1498 -2575 -1219 -341 -1213 -1371 -2026 -1283 -309 -117 -432 -745 -144 1165
696 1165 999 619 510 1466 2018 708 1277 2173 892 -126 1279 1672 -233 -1159 439 626 -995 -1579
714 -1579 -831 -1223 -976 -966 -1969 -1314 -689 -368 -994 -1191 -288 827 234 -72 628 1533 1565 472 1376 1851
734 1851 682 922 1904 1137 -32 150 934 296 -1062 -473 -575 -949 -948 -1327 -1641 -1374 -388 -367 -1599 -1540
754 -1540 -73 468 -513 -506 577 1488 1032 257 1137 1675 868 1211 1637 1002 411 764 1237 -19 -677 -185
774 -185 -340 -933 -540 -1097 -1421 -1152 -638 -1062 -1844 -1326 -52 -296 -914 -635 283 1070 189 -19 1091 1499
794 1499 1001 1188 1193 946 743 1289 1172 -447 296 709 -217 -411 -620 -786 -1012 -979 -885 -1156 -1556 -991 -685
815 -685 -967 -989 -751 144 370 -315 171 809 826 723 722 1239 1357 987 1279 964 394 942 663 13 -204 -239
837 -239 -230 -569 -722 -782 -934 -1219 -769 -986 -1009 -957 -1044 -227 -121 -268 5 297 741 834 798 1090 870 942 1585
860 1585 967 968 1213 513 507 593 158 -147 -655 -429 -261 -1050 -1111 -737 -938 -597 -876 -1150 -713 -883 -555 42
882 42 14 205 110 540 1148 698 701 948 907 1245 1423 580 576 686 645 445 -185 -196 -234 -381 -506 -1195 -881 -482
906 -482 -1194 -1340 -1143 -905 -711 -354 -398 -167 -499 676 630 458 626 686 855 1316 922 634 689 751 940 840
928 840 345 -151 46 173 -106 -549 -901 -970 -647 -428 -321 -1226 -1467 -745 -17 -68 -688 -326 300 697 812
949 812 402 308 832 1194 1291 556 400 847 805 992 137 134 44 179 -316 -154 -1005 -964 -351 -628 -1324 -1215 -373
972 -373 -407 -1257 -797 47 -2 -108 119 457 810 119 622 1552 1103 395 487 1308 1256 251 -25 394 -131
993 -131 -59 74 -342 -819 -856 -366 -132 -1175 -1259 -1308 -231 210 -773 -1478 -321 662 544 -242 -223 777 1011
1014 1011 816 794 585 943 661 858 1002 278 -121 702 945 -289 -864 -582 304 -710 -1133 -622 -638 -965
1034 -965 -681 -421 -284 -549 -564 131 60 -75 25 657 837 909 217 845 755 833 1272 562 -5 465 486 268
1056 268 -122 -310 -297 -397 -99 -585 -1169 -1061 -454 -383 -655 -1180 -750 63 -129 24 -448 -208 509 493 606
1077 606 890 890 1097 1269 663 646 409 609 384 182 479 71 -550 -419 -297 -672 -467 -984 -671 -428 -858
1098 -858 -563 -540 -536 -446 -316 90 135 -125 673 725 599 420 665 1113 761 572 597 752 506 404 71 -190
1120 -190 -109 -506 -387 -421 -794 -644 -307 -646 -887 -822 -499 -359 -637 -107 -98 26 307 423 221 368 637 795
1142 795 564 866 1136 502 404 396 348 392 0 -191 -16 -199 -791 -345 -530 -1061 -947 -488 -617 -998 -651 -146
1164 -146 -568 -559 169 77 75 245 582 499 187 296 1011 506 423 777 687 676 156 158 199 -262 -370 -349 -249 -707
1188 -707 -913 -526 -598 -789 -671 -337 -943 -450 -76 -43 -28 -152 310 483 319 490 671 426 342 771 779 449
1210 449 416 630 464 -39 -97 -249 -121 -694 -755 -233 -377 -703 -405 -401 -746 -279 -220 -152 -433 -155 266 234 119
1233 119 473 321 491 469 701 900 423 467 681 733 80 -81 265 -117 -253 -166 -199 -825 -663 -207 -605 -937
1255 -937 -725 -432 -364 -697 -336 21 -349 170 203 318 560 465 797 532 424 696 364 315 479 255 363
1276 363 218 -131 205 44 -916 -506 -320 -438 -458 -532 -402 -643 -714 -113 -160 -490 -3 29 370 220 331 719
1298 719 615 433 490 305 629 523 448 545 171 -31 249 -2 -112 -193 -449 -408 -686 -597 -634 -750 -749 -325 -562
1321 -562 -213 -289 -227 99 1 104 405 212 366 430 423 552 545 594 680 338 499 593 33 -3 90 -216 -279 -388 -260
1346 -260 -504 -815 -558 -278 -470 -440 -368 6 -190 -208 -48 5 300 479 215 575 768 246 762 620 219
1367 219 580 645 153 266 109 -171 35 -308 -91 -336 -572 -278 -645 -578 -302 -682 -383 -427 -331 -368 -192 -80
1389 -80 185 100 423 184 350 537 388 183 347 494 417 458 139 174 8 -159 -146 -424 -222 -354 -631 -377
1411 -377 -372 -611 -523 -261 -368 -545 -319 208 -76 -179 104 114 288 414 218 700 385 430 404 142 396 183
1433 183 185 239 27 -46 14 -578 -429 -106 -472 -614 -449 -739 -520 -493 -457 -298 -5 -119 48 146 86 210 257
1456 257 483 292 573 549 362 498 242 542 277 211 -95 -60 -79 -84 -207 -309 -807 -457 -434 -469 -420 -216 -395
1479 -395 -681 -377 -100 -46 153 119 326 317 205 429 199 561 579 349 449 353 185 295 264 -16 -71 -254 -238
1502 -238 -308 -466 -384 -764 -305 -371 -733 -377 -224 -90 -105 -451 -7 30 79 168 433 233 357 442 521 476 254
1525 254 404 431 231 111 -257 172 -37 -351 -96 -140 -429 -198 -492 -271 -284 -545 -235 -395 -172 65 -263
1546 -263 145 -95 281 230 498 429 295 220 492 416 444 254 395 57 374 -4 -179 184 -301 -281 -177 -382
1568 -382 -326 -322 -606 -258 -479 -384 -237 -330 -54 97 43 376 529 105 382 578 236 626 468 428 189 205 324
1591 324 222 91 -19 -162 -170 -148 -267 -111 -247 -650 -501 -349 -422 -295 -472 -236 -208 -32 101 94 276 331 489
1614 489 516 380 605 355 497 211 644 369 73 129 157 251 -88 -281 21 -274 -335 -456 -402 -686 -516 -233
1636 -233 -162 -454 -503 -127 -187 201 234 131 189 157 501 138 253 523 498 179 650 165 110 90 97 228 -243 -388
1660 -388 -234 -308 -653 -437 -520 -561 -387 -247 -97 -29 -358 62 -70 237 -69 355 183 666 182 120 471 292
1682 292 421 353 267 220 23 251 -34 -200 -315 -376 -317 -422 -105 -151 -730 -503 -174 -79 -294 -253 -262 76 127 138
1706 138 150 162 284 466 188 206 62 476 176 89 273 252 313 -94 -363 -427 -187 -328 -293 -177 -633 -474 -271
1729 -271 -536 -508 -306 117 -112 -364 -71 -48 183 327 279 363 462 436 256 196 312 553 107 176 387 -166 81
1752 81 -83 -251 7 -107 -446 -300 -315 -267 -511 -129 -131 -259 -56 -92 -159 148 71 130 532 55 182 476 361
1775 361 122 372 253 179 53 49 327 65 63 8 -64 -328 -407 -172 -209 -335 -287 -57 -291 -68 -257 57 135 -210
1799 -210 214 231 246 165 166 196 74 145 452 150 181 164 459 242 96 254 -123 -5 -555 -475 -33 -92 -435 -546
1823 -546 -446 -396 -328 -128 -28 -424 -12 -209 14 33 -93 83 443 363 553 331 64 603 221 402 196
1844 196 55 170 -125 -198 -11 -246 -103 -60 -325 -116 -119 -558 -211 -166 -345 -132 -256 52 282 118 229 39
1866 39 175 242 297 98 532 333 94 447 144 119 -68 -148 31 -159 -365 -127 -382 -319 -329 -501 -215 -86
1888 -86 -345 -242 -135 -224 -137 159 -18 205 191 307 451 206 408 338 535 177 426 199 262 295 -40 59 -141
1911 -141 -3 -240 -400 -363 -450 -134 -333 -350 -309 -242 -161 -403 -93 -238 -4 157 100 322 286 436 337 178 12
1934 12 447 282 43 -18 192 -24 -144 7 -111 10 -284 -166 -689 -317 -382 -183 -126 -400 -272 -282 -343 -180
1956 -180 -70 -121 -49 41 262 76 387 -55 343 65 333 372 44 275 6 115 109 179 -254 -32 -24 -7 -215
1979 -215 -80 -383 -138 -104 -200 -196 111 -81 -24 114 -120 274 96 192 381 281 335 313 349 186 298 217 -56
2002 -56 501 129 -214 -92 107 -395 -187 -369 -500 -166 -419 -301 -298 -139 -267 -270 -205 64 122 57 133 219 62
2025 62 436 112 -30 249 259 306 159 75 130 -56 8 262 -122 -328 -421 -352 -337 22 -376 -409 -463 -411 -443 -2
2049 -2 -346 -91 82 66 23 129 294 331 463 336 422 322 152 234 171 44 0 74 -66 -127 -195 -65 -288 -380
2073 -380 -319 -218 -271 -370 -336 -431 -215 -52 -174 102 -241 -30 62 295 373 307 77 109 330 348 273 89 207 -23
2097 -23 -24 -28 120 -213 -310 -40 -154 -138 -347 -205 -398 -337 -223 -224 -28 -199 -40 167 125 -59 410 373 315 346 184
2122 184 333 216 186 267 264 -55 132 82 39 53 -88 -48 -273 -254 -166 -271 -316 -233 -140 -276 -306 -184 114 -20 64
2147 64 56 -55 -26 111 317 114 305 240 405 302 184 31 61 -43 -56 -16 -7 7 67 -45 -349 -99 -244 -100
2171 -100 49 -507 -40 -166 -105 -36 32 58 175 69 26 456 120 393 151 236 140 24 -16 19 -193 46 -132
2194 -132 -189 105 -156 -227 36 -144 -247 -469 -176 -144 -395 -291 -94 -81 25 21 91 261 121 227 344 361 396
2217 396 464 112 449 236 -60 68 108 -50 -178 -200 -108 -197 -300 -136 -222 -292 -80 -303 -250 -228 -174 -117 -66 -197
2241 -197 -153 12 44 172 192 154 285 255 37 148 301 203 150 68 7 184 -90 -101 -14 -51 -320 -72 -6 -261
2265 -261 -140 -157 -152 -51 -317 195 -16 49 18 -32 233 259 173 91 492 256 182 -73 125 -48 160 14 191
2288 191 -208 -201 -25 -147 -11 -222 -259 -325 -56 -152 -42 -105 -233 -63 96 91 246 -59 87 -41 418 134 261
2311 261 346 355 251 312 -28 134 -77 35 60 184 -21 -94 -347 -37 -325 -237 -441 -257 -6 -267 1 -296
2333 -296 -28 -279 -90 155 27 -34 166 132 170 233 424 84 350 111 345 42 175 -132 121 -18 164
2354 164 -187 -325 -355 -111 -350 -164 103 -235 -174 -244 -8 -219 -33 -11 96 -62 -123 13 58 198 554 330
2376 330 269 158 188 -92 135 26 -36 -45 -175 107 -263 15 -34 -55 -236 98 -327 -339 -139 126 -187 -54 245
2399 245 191 159 238 429 137 4 137 114 291 252 -58 488 -14 46 -67 -161 -1 -104 -179 48 -85 -190 -354
2422 -354 -467 -325 -296 -41 -18 -150 -87 43 -78 97 103 266 317 22 150 341 179 253 187 131 122 146 63 222
2446 222 -108 13 24 -55 -16 32 -233 41 -543 25 -183 -75 -128 -1 159 -240 67 200 -237 -56 153 371
2468 371 170 335 89 117 236 21 -27 181 -31 -54 -124 -136 -244 -239 -460 -305 -217 -129 -99 -304 -174 96 44 132
2492 132 -12 218 155 132 217 118 69 283 -59 153 254 48 249 214 86 66 -35 111 117 -145 -20 -201 -251
2515 -251 -98 -36 87 -144 -368 -221 -141 3 -18 -10 168 136 -162 197 218 84 13 178 44 442 -99 446 -236
2538 -236 61 -127 46 -51 181 -105 -227 -90 -140 -145 -260 -302 -265 -328 -293 -121 -230 397 209 69 117 62 -29 106
2562 106 -22 95 168 194 -4 -81 60 33 48 68 -188 -240 80 -254 -236 -3 -102 -149 -121 -191 -29 12 -265 -110
2586 -110 -56 -46 -40 -73 -22 25 86 244 274 117 385 277 332 106 -10 29 -65 -5 -8 -243 -56 -369 -149 -118 -74 -152
2612 -152 -264 -132 -13 -112 -146 226 -232 -48 86 168 108 44 145 436 -65 288 -91 155 93 71 -12 14 -98
2635 -98 166 38 32 -216 39 -105 -143 -123 -32 184 -206 -202 -341 64 -47 -125 154 32 -24 0 436 23 -11 -42
2659 -42 229 35 6 366 58 75 -2 32 -138 -56 137 -29 47 -218 -71 -27 -98 -209 -91 -152 -96 43 -30 79
2683 79 161 -258 356 132 322 388 47 186 168 270 332 26 59 221 90 -13 -77 -91 -324 -76 93 -104 -140
2706 -140 -133 -343 -510 31 -121 -321 3 -231 -16 -4 60 -17 147 146 133 206 89 -101 384 296 33 -50 223 208
2730 208 -60 -188 58 -275 -215 1 -283 -105 -440 -76 -221 -16 4 -3 -119 96 -63 15 124 244 181 294
2752 294 375 193 -208 118 295 89 7 124 142 27 -93 -76 -102 -89 -42 -42 5 80 21 -215 11 -299 -275 -126
2776 -126 -1 -64 -3 -133 67 161 43 203 236 83 67 -6 -21 74 -2 -2 -44 -267 90 -144 -165 31 -73 -227
2800 -227 -174 -247 -255 -2 -113 50 -165 155 283 142 67 19 130 155 170 -11 299 89 218 77 149 199 26
2823 26 210 78 -362 -180 -248 -35 -233 -229 -54 -279 -253 -162 96 -390 148 190 -62 -125 112 -144 189 10 203
2846 203 175 346 70 41 308 1 27 320 108 -152 48 -285 -30 -176 -233 -278 -163 -236 -118 -226 -93 95
2868 95 21 -84 68 -46 192 -45 238 39 109 397 273 417 37 247 216 57 102 -77 107 56 -266 -142
2890 -142 -18 -172 -130 -194 -90 -328 -184 17 -177 -294 -162 -8 73 -143 -22 -226 119 215 138 130 191 199 202 202 61
2915 61 83 -114 32 125 -65 52 23 -45 -192 -44 -97 76 -209 -169 -136 -8 246 -79 -50 232 -160 247 -143
2938 -143 -21 87 71 225 56 81 204 256 158 204 -177 -51 -133 -144 -63 -242 112 -71 7 -71 -181 -161 -221 -122
2962 -122 -194 -47 -75 106 -52 -18 100 -100 45 69 -43 386 74 98 179 152 281 197 -139 21 -199 -34 -109
2985 -109 7 -192 -85 -85 69 211 -274 -147 116 -50 23 74 -89 -8 110 42 138 287 -168 -112 191 61 66
3008 66 145 157 -115 -19 331 127 25 11 53 -31 -304 -25 8 -163 -176 -85 -58 68 20 165 -299 96 5 -203
3032 -203 324 332 -53 57 254 -21 137 11 -19 329 240 245 146 86 -250 118 -64 -202 -130 -49 -350 -72 -264
3055 -264 199 -249 -76 44 88 -221 -129 282 2 130 206 188 -51 14 120 176 206 264 44 184 10 49 18
3078 18 -95 -206 138 90 35 -178 -248 69 31 202 -67 -61 14 -10 106 26 9 151 -3 219 206 167 303 222 379
3103 379 155 -24 -127 135 -135 174 -120 -138 123 -245 -27 78 -207 -212 216 -221 -52 -185 -133 -76 17 -27
3125 -27 -9 340 -63 148 183 165 -193 237 350 -12 -104 114 -7 -76 117 -12 -4 -8 116 16 -246 19 -150
3148 -150 -85 -277 92 -98 -160 68 142 -232 130 155 234 89 32 200 247 -46 287 40 178 244 205 172 -158
3171 -158 300 -47 -78 -64 192 -174 -181 36 207 -189 -223 -103 78 56 18 -234 13 27 38 -53 68 96 -76 274
3195 274 225 183 -17 187 131 194 -20 222 -77 -60 -29 -140 115 -198 36 -384 71 -308 -168 -188 173 -116
3217 -116 -106 161 -336 -93 42 111 139 311 186 -6 178 -60 -239 346 100 57 168 -46 -184 70 -205
3238 -205 241 -76 -55 -94 -87 -2 -225 -126 -17 -38 -76 16 92 7 -88 69 98 -150 59 33 133 313 267 64 102
3263 102 322 -180 -49 -31 -194 -68 -99 -63 -199 -282 -280 -82 41 21 -42 183 -131 18 -237 18 153 -139 -23
3286 -23 78 -206 95 -21 257 -272 -44 113 -52 288 182 38 -346 230 61 15 -85 -145 -74 -70 -203 -224
3308 -224 294 68 -195 40 74 114 80 -139 -77 -32 -47 338 126 63 145 122 8 91 -27 -73 126 4 105 111
3332 111 21 -342 -80 65 -142 -256 -199 -66 37 -243 -58 -90 -29 131 71 59 39 191 47 141 63 45 -64
3355 -64 -6 137 -41 71 23 150 77 10 -174 -139 132 -237 105 -292 152 -107 -289 -142 42 -42 -263 -191 109
3378 109 23 65 71 110 132 100 130 52 58 -196 185 35 -148 14 -78 92 114 -96 -60 -105 4 5 -188 -57 -172 -32
3404 -32 29 -133 36 39 99 -178 34 -331 61 59 -19 188 96 271 27 134 -12 135 109 -45 -79 -92 270 -138
3428 -138 -68 -84 -51 2 -156 -47 12 -182 -160 -15 -66 157 13 313 181 -34 -46 117 102 244 111 11 48
3451 48 86 -2 113 -2 59 -68 -87 -113 31 -65 -200 -103 -12 -25 -478 -114 -39 -257 52 -345 60 -80 -223 -16
3475 -16 -17 57 296 145 266 85 10 38 -85 -82 117 16 -165 154 -82 -210 -135 -103 -1 -373 -223 131 126 -504
3499 -504 -183 73 -70 183 -139 89 81 159 26 -13 18 221 48 -15 60 -89 115 -127 160 -26 -36 -125 -352
3522 -352 -100 -154 -3 -198 9 -198 -151 -174 190 -66 -154 69 -12 91 -21 300 127 10 -17 101 -1 -45
3544 -45 199 276 9 4 199 111 129 -247 11 -175 -221 -198 -93 41 -117 -233 -161 -284 -228 -137 30 -43 170 -121
3568 -121 104 61 267 19 47 -148 156 204 76 -4 -40 50 129 48 -138 -64 -340 103 75 -137 -51 -115 196 -273
3592 -273 -174 10 -43 -66 -117 15 34 -80 -77 227 -30 146 211 -90 294 111 387 155 -55 -107 -286 37 -162
3615 -162 -40 -35 30 -45 1 -66 -203 45 -102 -87 73 91 -38 -74 -98 44 -21 310 104 10 -81 -35 -33 241 -22
3640 -22 10 34 270 26 125 -97 12 -99 -91 98 -74 -106 52 54 -81 100 -56 86 -48 -49 -9 -218 -197 -235 -30
3665 -30 61 53 10 -16 179 122 6 268 -28 -122 59 -158 36 117 143 239 -105 58 -88 3 -9 -112 -364 4
3689 4 76 126 -14 135 185 -166 -19 -160 163 19 70 68 75 -13 237 24 63 -30 124 23 17 -204 193 -124 112
3714 112 127 -166 3 41 -167 105 198 37 -13 -108 -17 -170 300 -4 152 -201 134 -7 -200 254 -27 148
3736 148 -95 -44 37 64 24 -87 -104 -132 80 -18 -351 -130 -88 -240 -198 -39 88 -177 14 180 -24 -6 -10 237
3760 237 76 -15 114 249 -230 -122 -234 -122 144 85 -144 -217 -142 -185 -104 220 191 -99 65 -6 -107 -159 -143
3783 -143 -76 76 -94 -1 -131 117 128 101 -289 121 343 -8 -335 257 -8 -78 -5 120 55 52 -63 -72 -39 23
3807 23 59 -64 -167 115 51 145 -106 18 83 -245 -77 -104 134 -94 211 -93 -105 279 57 70 -18 0 -64 -65
3831 -65 21 -64 -68 39 -122 -270 153 123 -197 -304 102 12 -244 -21 46 15 -265 6 -107 -154 39 224 6
3854 6 12 120 53 29 38 5 -200 42 207 -142 82 77 -100 2 -22 57 268 199 281 69 -197 -45 -16 -7 264 115
3880 115 -205 173 43 -13 35 79 64 72 -26 301 -125 252 277 232 133 -198 16 63 -105 -218 -17 176 -58 151
3904 151 11 -401 -19 28 -284 58 -27 51 -23 -227 -153 226 93 108 177 405 101 181 -91 -119 268 193 331
3927 331 184 11 -6 -118 -273 192 -131 176 -140 -199 7 52 70 -88 -160 -61 -191 38 -8 147 -154 -64 10
3950 10 126 3 107 -7 -77 -160 102 41 170 -204 68 -109 -72 -171 -137 -201 -259 -196 172 -126 -248 -201 -254 21
3974 21 -276 -107 42 -231 -240 362 -115 380 21 54 221 -94 224 288 82 35 -67 392 -103 -143 -225 -124 -109
3997 -109 -115 -188 224 -8 -18 -8 -123 133 212 220 131 -11 100 -110 61 288 109 167 130 -26 162 74 436 24
4021 24 175 -142 -9 66 -207 42 -74 24 24 -60 -19 -15 1 -107 -51 106 -87 -255 10 -102 -2 273 -100 110
4045 110 22 -81 -41 -101 260 -60 126 -19 98 -39 194 -38 282 -203 -113 -190 37 -341 179 -192 103 -157
4067 -157 -71 135 221 -165 -351 -129 28 -47 -82 201 86 46 145 225 112 -120 -17 317 113 -65 -159 -76 11
4090 11 -48 2 81 68 -165 67 -165 17 144 -24 153 -154 -364 -291 17 14 32 40 -26 -105 112 26 -68 -42 87
4115 87 281 251 -94 85 51 -18 -86 -102 -245 5 -103 -56 -59 -262 62 0 -152 -307 142 427 -61 231 223 -99
4139 -99 -165 -125 18 -78 -180 80 -130 168 70 -10 166 246 -120 121 -132 -379 71 129 -104 -283 -208 172 -5
4162 -5 36 142 54 205 -154 -149 264 -154 98 193 65 344 19 71 275 -107 171 103 -140 0 -237 9 -105
4185 -105 -118 -73 31 49 60 -149 72 67 0 60 -139 114 153 132 -300 -75 -16 97 129 148 -140 -68 -7 279 -111
4210 -111 -107 257 230 97 47 -69 92 82 245 -61 -314 24 -36 -33 -63 12 -72 -8 -199 -202 257 396 141 46 130
4235 130 268 4 48 -163 -22 -70 -90 227 -64 41 -176 9 -40 8 -6 -118 97 -34 -270 -11 59 128 48
4258 48 80 11 -266 -120 36 -195 38 105 12 -14 -136 15 8 24 -98 54 15 -85 -94 93 -2 -134 -17 -35 -156
4283 -156 113 19 -164 -103 -162 251 -119 243 -12 -188 133 19 29 -43 15 79 97 80 108 -11 187 286 82 -50
4307 -50 -72 182 -209 101 -107 -176 31 -130 -291 -45 -55 -97 84 -103 272 -170 -35 156 -154 49 -30 -114
4329 -114 -49 120 263 84 175 -28 225 260 74 -92 28 -83 9 53 14 -146 -87 19 94 -171 -31 202 -188
4352 -188 28 -66 138 197 -56 -127 -23 -190 -55 150 30 -165 28 -84 18 -106 85 -187 -118 128 118 44
4374 44 108 -58 -19 -3 48 156 -163 -30 -79 223 -84 55 -152 -25 -57 56 154 35 -109 -129 97 11 -285
4397 -285 43 -51 -14 -79 -24 -47 -45 -1 71 270 -217 23 260 -30 88 -101 38 288 85 -78 -149 83 14 288
4421 288 87 -140 192 84 30 65 391 89 -109 -86 -134 76 -230 7 10 -87 -132 -177 -358 136 -271 -196 78
4444 78 125 -190 -36 -41 143 -103 -267 -76 -32 -232 -117 9 54 36 -73 13 56 -196 -101 -29 87 17 71 142 -74
4469 -74 -99 52 -87 -53 -513 128 -221 22 -73 -160 -243 -33 -17 160 -115 34 292 84 40 52 167 -51 26
4492 26 98 -23 -112 -73 208 27 69 -186 -160 101 -86 -110 -41 -28 -175 -191 58 -316 -158 214 -87 306 30
4515 30 162 174 12 -216 29 41 20 -68 -5 174 122 33 -55 -83 -299 142 -157 -240 0 150 86 82 -134 73 -47
4540 -47 28 -78 -119 156 84 130 152 147 106 -14 14 98 129 120 -2 -176 113 113 -32 -197 -39 -33 67 143 -242 -84
4566 -84 208 -94 -261 20 -147 -44 -21 -20 100 -92 99 -127 59 35 210 27 -71 -10 138 -146 -102 -73 92
4589 92 -143 2 -150 86 -98 7 40 -35 87 -119 23 -140 -7 53 7 -107 -92 -264 88 -44 -54 96
4611 96 -71 361 -30 -110 47 -111 -211 -132 -8 63 135 -22 178 32 125 50 112 -233 -114 -86 -64 -96 -105 123
4635 123 300 97 -50 32 34 45 -62 -111 -142 80 35 153 111 159 109 -123 23 157 241 -155 -83 138 -56 84
4659 84 -36 52 -124 -77 94 -94 -82 -35 228 -94 -83 -5 -8 3 164 30 -130 -37 -85 151 -73 47 -44 -45 -230
4684 -230 66 367 51 -180 167 -62 -101 -13 -46 105 -133 -166 7 -140 66 127 88 -186 84 189 131 -55
4706 -55 -112 -108 167 -139 130 318 83 28 24 -71 -36 -82 -66 23 132 -50 -219 -46 -35 -280 -88 149 10 -50 144
4731 144 -312 163 -113 232 -216 -332 147 -99 -142 140 130 264 19 -158 244 59 -165 8 89 191 285
4752 285 -284 305 3 -35 48 -56 -153 -189 -254 -73 -146 148 -7 170 -277 -62 -41 107 103 34 212 124 -87 158
4776 158 -98 -48 55 40 -29 38 91 187 89 54 243 -107 -65 -218 -62 -274 184 -101 -169 -2 281 137 -238
4799 -238 241 -64 -75 265 136 -171 70 253 117 15 213 -38 -234 -119 -102 -95 7 138 -49 -77 -242 -354
4821 -354 -144 -205 -175 65 -31 139 171 -8 -200 -48 -84 309 58 72 -15 -49 61 92 305 309 -69 160 163 74 214
4846 214 -12 300 -85 60 -18 25 12 -29 -32 45 -20 -63 -76 10 -18 45 -89 -98 176 7 -6 93 -2 45 33 -31 -207
4873 -207 -15 -23 75 11 -94 -212 56 16 -199 -201 301 -120 24 182 11 203 -96 134 -55 -33 185 -38 -170
4896 -170 -154 60 134 -7 1 -116 12 -142 68 -19 276 -9 74 -60 49 -6 4 -40 -85 -21 53 119 145 99 -53
4921 -53 -147 139 -208 -56 -74 35 90 -101 -25 -211 39 -5 43 -132 -85 304 -55 189 -9 -102 -39 206 -3
4944 -3 -46 -71 142 -129 107 -90 -117 103 -172 212 46 41 143 -7 174 -161 44 249 166 85 210 -200 81
4967 81 77 73 199 73 29 -265 -94 -120 -75 -18 -267 91 -48 7 -179 48 -2 20 273 -176 77 -18 -190 -151 9
4992 9 -18 -180 59 -113 -58 196 97 -158 65 120 -192 64 -220 -7 -45 -71 -282 -129 -107 55 -176 -97 -24 -273
5016 -273 -19 -21 -61 -111 -140 20 -109 -41 119 70 39 -61 59 -235 -4 87 -33 9 -25 69 5 -10 -161 -129 -197
5041 -197 85 -37 13 85 129 -45 -16 -75 211 -166 130 117 -255 -28 101 17 -38 -34 -79 157 -242 175 169 192 209
5066 209 56 -98 -243 -160 99 -15 143 -97 -42 60 -270 -214 -164 -65 29 -108 -12 43 85 92 -143 49 163 70
5090 70 -3 -163 46 17 112 34 -9 -27 -88 -166 108 -69 107 -182 -92 -330 -30 -10 79 -8 0 -65 87 20 113 -14
5116 -14 70 -54 -52 165 66 13 22 171 219 251 -59 -6 -89 67 -90 67 87 -37 -143 121 -48 -160 -370 99
5140 99 55 289 81 -126 81 254 33 -190 -71 359 -45 -158 168 -52 -31 6 -22 -47 18 135 -29 -187
5162 -187 117 136 166 -171 -116 53 -156 -224 171 -1 -153 -244 -200 188 233 31 240 -203 -30 -128 -157 -34 119
5185 119 -2 22 48 -77 190 -37 -110 -185 -295 -57 -28 -126 -46 -132 30 -151 -107 -88 38 -74 -94 -90 78 243
5209 243 -22 -35 92 126 55 -8 -45 31 -45 -53 100 137 -145 146 -16 -173 -45 -36 73 -283 -164 2 60 -104
5233 -104 48 -164 141 -36 -170 -86 116 56 -56 0 171 -118 35 -115 -189 138 4 -87 49 -26 -122 -177 -50
5256 -50 -41 11 295 -222 -42 -65 -170 -115 -20 -50 69 -147 134 -52 -355 51 114 -201 -34 216 225 140 -35 252
5280 252 -21 148 68 64 82 -83 21 180 90 23 -116 -123 -85 255 -30 54 42 -95 66 118 -164 -76 45 -31 -191
5305 -191 -66 34 -232 80 -174 -37 118 -44 80 120 -7 -16 56 -73 30 -170 34 -144 -178 107 -56 -195
5327 -195 214 -130 -123 66 13 -49 -13 205 -266 -131 66 -10 -19 6 -52 39 10 -54 205 -6 -189 82 223 -97
5351 -97 20 13 210 79 -75 -278 55 125 -274 -32 -121 -127 -49 -27 -46 -116 138 163 -126 138 273 33 130 256
5375 256 -86 121 -126 98 90 185 -108 60 -245 -44 157 0 47 -202 -14 -110 199 -55 -254 -228 -146 138
5397 138 252 -72 14 180 -55 -129 96 179 150 47 -96 99 159 171 127 -206 -102 148 79 85 -212 -14 249
5420 249 -58 147 194 -29 216 -52 44 -169 142 23 -32 86 160 -44 -22 106 -36 15 -268 31 117 175 70
5443 70 29 22 -86 18 147 -241 40 180 -73 -26 -388 -23 88 3 91 -254 -31 22 -23 -49 -100 157 14 43
5467 43 168 10 -133 36 -55 201 -178 -106 25 -108 49 147 -139 -146 -456 -207 -16 1 149 -214 9 -124
5489 -124 31 -21 170 74 -6 36 113 -17 -16 -121 -143 194 -38 52 131 49 9 -58 -116 -78 26 -10 -262 61 64 -58
5515 -58 -91 -181 -58 282 117 -113 -187 -29 138 53 -39 -140 -159 -168 -102 -64 104 -167 12 -131 -141 200 -173 265
5539 265 148 -35 -256 -26 -116 -97 147 -51 -75 -120 -85 5 84 -98 3 6 93 31 -105 -64 68 -266 -105 -7
5563 -7 -48 24 -100 13 32 -44 113 -59 20 -48 -127 -48 99 39 13 -8 -91 -368 -225 3 -59 285 -49 31 -61 27
5589 27 -1 103 -271 71 266 -67 9 -15 -137 86 20 1 -44 -145 -143 -19 -472 -133 -246 -14 -22 -59 53 18
5613 18 158 160 -26 51 104 -270 10 -80 -41 -6 135 4 215 -12 -79 -52 85 37 113 36 19 202 79 -31 -136
5638 -136 112 -126 -213 -26 -189 -152 39 77 -56 25 140 -129 241 146 75 51 40 195 217 25 97 62 196 -189
5662 -189 -19 318 -226 70 150 130 -241 20 4 -158 16 -195 39 -13 52 -85 96 79 -65 34 38 -102 149
5685 149 170 277 134 -109 107 -61 -17 76 -79 216 15 -125 -160 154 117 -99 229 352 37 131 102 22 71
5708 71 145 -7 -14 -99 49 72 80 13 144 -124 -202 -70 45 269 -50 24 143 -135 40 204 23 -86 139 -8
5732 -8 -65 29 91 -159 -61 48 -82 -218 -236 -78 234 -67 -113 214 32 -128 -77 4 52 186 -229 39 33 -80
5756 -80 275 -113 141 -54 28 50 -61 -31 -16 136 -126 -4 -50 -157 -75 -43 9 57 72 230 205 -11 66 126 110
5781 110 -208 -138 153 64 44 -74 23 316 288 160 90 22 -28 1 -177 52 -27 -337 -180 83 -183 137 -20
5804 -20 -108 -6 50 146 -121 133 72 108 167 -147 -2 -36 156 9 -41 65 -71 24 -211 10 -22 -22 85 27 -64
5829 -64 -159 -67 146 -181 143 29 70 -266 4 161 -155 113 -17 103 -1 108 -131 91 353 -48 102
5850 102 20 -86 78 66 -237 -201 -74 12 0 -88 -95 104 -10 17 -98 -24 -23 16 141 -138 -70 161 23 157 122
5875 122 -42 149 -93 156 -95 -99 91 -243 -198 -35 113 -41 235 98 -141 -61 -172 -180 -81 69 -181 15
5897 15 101 -263 47 251 104 73 25 23 -236 -48 232 82 8 -165 -73 73 10 8 -221 -124 28 -76 -64 79
5921 79 -139 -89 -168 -131 -235 -313 42 -176 16 -96 2 71 -106 112 -47 148 -113 -54 -123 214 -151 -141 -15
5944 -15 405 328 260 214 -66 -95 -170 -3 29 -160 64 -202 -97 91 109 -29 -150 89 66 0 68 28 -11 52 223
5969 223 -113 27 -44 -144 62 -23 -69 160 -183 -157 30 202 24 80 88 96 -114 -35 -9 -32 125 75 -70 -69 13
5994 13 -19 270 34 -22 110 -71 16 113 128 -35 7 64 -196 1 -40 -160 19 21 199 -146 15 72 40 51 259
6019 259 19 -311 137 129 -47 -88 116 292 80 196 282 159 129 -36 -142 3 65 -183 162 320 -102 -38
6041 -38 -216 68 -41 -15 86 122 217 -84 -192 -259 -116 -32 139 48 -79 -86 26 -3 58 -1 -169 198 27 -26
6065 -26 -54 -202 -165 19 -44 -1 142 82 -30 -111 119 259 -66 24 102 15 191 -152 18 -43 -172 -63 -49 1
6089 1 -3 117 72 -62 144 74 157 -2 -217 -86 97 -108 -46 80 70 67 -89 -122 86 33 -97 -8 154 -74 24
6114 24 -31 30 -188 -69 135 234 47 157 -234 -48 189 231 72 202 27 27 111 119 -22 -22 113 -149 -21 -115
6138 -115 -77 -57 -126 -190 -29 -77 -167 -85 129 -172 61 -174 -93 10 166 103 -137 -82 -174 -6 -143 -21 4 39
6162 39 -81 4 -99 135 154 107 259 -105 -118 -86 -117 -11 59 55 45 198 -194 -399 -161 -23 49 184 -109 39
6186 39 -81 87 121 -17 -114 59 -130 -199 10 197 -1 50 -246 178 241 -200 147 320 -158 -162 174 -161 -6
6209 -6 -51 207 28 -207 -134 53 102 23 75 152 -74 168 -52 43 -31 -236 58 67 13 86 139 146 -62 41 -5 -42
6235 -42 163 142 82 29 57 95 -115 -84 31 -90 -194 -228 -41 91 140 67 -129 -167 -26 -66 106 17 48 14 -29
6260 -29 -7 -65 170 5 21 134 -165 240 -3 -15 136 -217 230 26 -228 249 -118 -212 -18 125 129 -139 221
6283 221 -54 7 -14 -195 185 25 -25 -190 130 -128 -281 77 -34 45 -302 -130 -180 152 -45 -12 -7 75 -90
6306 -90 -68 52 -27 77 -71 -104 136 -125 54 52 -73 -40 -101 -114 -56 177 236 196 124 94 -45 141 186 244 -108
6331 -108 33 84 187 -21 57 -75 131 -55 36 -45 -117 43 -133 -57 -71 -99 151 10 155 55 -132 11 -151
6354 -151 -14 22 -69 -129 163 68 -58 -49 175 242 -27 22 -33 -110 -103 23 72 72 -82 32 -27 68 99 25 28 -133 -21
6381 -21 83 54 199 -130 110 301 -26 39 -169 -38 36 -125 73 -5 -158 -5 141 -293 9 198 -258 144
6403 144 -183 18 -135 46 -154 -116 -67 228 101 295 -2 217 -16 69 -25 -230 -133 -60 -100 -42 143 179 -216
6426 -216 -82 -125 8 -75 -151 154 -127 144 130 -144 -156 271 -141 34 77 270 -73 -81 7 98 -221 149 110 55
6450 55 -75 110 28 -7 47 108 -63 142 41 -170 -37 -134 -131 -62 -84 -16 -160 -265 -118 94 19 -59 53 -43 78
6475 78 -177 -16 266 154 113 138 16 -42 -200 25 20 -40 93 -183 -119 -185 12 79 -181 -24 -64 -75 -52 -7 -164
6500 -164 95 -12 26 60 330 -92 35 -232 -32 88 88 353 -70 -52 -52 -202 35 -142 -371 -125 -121 25 -234
6523 -234 66 -85 76 -122 38 44 -119 26 -37 -4 -62 -39 215 -181 -42 304 46 33 -190 -115 211 18 -108
6546 -108 3 0 54 -62 -173 111 109 -128 -100 128 -130 -169 128 -55 83 -38 180 -13 61 88 -82 55 165
6569 165 -128 154 165 -96 -16 30 -232 109 51 83 314 124 -145 -138 -73 -202 4 121 20 -198 42 80 -291
6592 -291 82 23 -44 13 210 87 -64 247 278 15 -239 68 -77 222 50 -223 260 48 -30 -140 -38 -21
6614 -21 -121 -134 163 -101 -250 -32 -112 -152 -225 -29 145 78 15 211 -22 -66 -250 125 87 177 -55 -43 40 79
6638 79 -16 -194 22 -121 156 163 122 -57 47 -27 -85 58 -98 -182 84 -84 189 26 -21 66 63 74 -86 88
6662 88 -37 306 98 -58 155 -23 87 130 -27 -69 -64 -43 -119 8 52 -165 158 -118 -296 156 -125 39 192
6685 192 16 47 37 18 90 98 -98 346 139 -36 150 -11 -126 86 178 206 303 78 247 -21 103 6 53 174
6709 174 20 63 -31 10 148 29 -222 -181 -175 -158 77 306 -88 28 211 -167 -90 -75 101 -112 -75 -206 110
6732 110 -113 -63 151 -68 -57 140 16 23 -115 -52 83 -141 -158 -202 -32 -57 -179 -56 119 -83 -159 -177 30
6755 30 -18 81 -104 -22 -2 12 306 84 -281 -15 50 -30 161 181 -115 6 -59 -170 9 -1 -88 -112 -5 142
6779 142 55 -135 -179 -98 -93 133 110 108 57 133 -43 21 199 -155 18 -86 13 195 -3 194 -99 167 -124 51
6803 51 -77 -255 83 -35 -288 -6 195 72 152 -126 -38 85 -12 104 -9 -76 185 146 -6 -128 -63 -20 113
6826 113 -20 -52 -29 164 159 -255 5 309 -182 -191 -1 -41 -149 -14 31 -173 2 -92 -108 -123 66 -46 -82 13
6850 13 -35 356 -133 122 -212 51 195 -180 29 85 -118 -45 -209 -74 -11 31 111 -148 11 -207 93 159 -45
6873 -45 -220 -15 133 165 -51 -67 -67 -14 -152 -67 65 -106 96 -3 68 -216 64 -87 60 40 -28 -5 -102 -192 24
6898 24 -40 -188 -176 -15 -52 -243 75 -109 -41 138 157 7 44 -134 0 -121 201 44 -54 45 90 130 118 -42
6922 -42 20 68 115 -58 151 -10 -122 81 -106 -150 -181 237 311 -112 -131 -310 44 -63 -19 196 -84 205 174
6945 174 -114 2 40 43 166 -125 -185 -121 -216 -128 14 -238 81 -184 163 11 65 15 -9 -189 205 200 -125 180
6969 180 6 -17 39 -257 -105 -75 136 -298 -35 100 68 19 -147 -56 6 12 24 -72 -199 -184 -31 -97 -253 -143
6993 -143 135 60 151 211 -151 -65 -132 -55 154 17 136 -181 -308 54 54 -7 -44 -63 127 271 245 51 -104 95
7017 95 189 72 -78 103 -234 97 0 -83 99 -101 35 -161 -116 -67 145 32 107 -77 -61 34 58 203 168 -119
7041 -119 15 196 56 -12 -81 -208 -61 -73 168 -75 6 143 -48 -73 74 -31 -142 9 -254 -19 122 38
7063 38 -69 -181 -200 -65 -3 93 -44 136 -241 63 -75 73 -83 100 235 -185 158 67 94 67 -69 129
7085 129 -112 -38 29 -56 -374 -79 -220 68 -99 -96 87 -18 -21 73 -100 6 123 53 70 -57 -28 -52 15 121
7109 121 92 75 -139 96 157 135 -69 -153 80 14 -153 -96 104 171 -18 -346 129 -270 110 -25 -15 120 -170
7132 -170 -54 -59 34 200 -167 178 -51 109 -151 105 51 75 142 -16 76 28 215 97 -11 -35 116 -77 173
7155 173 125 -34 -257 -67 97 -143 -77 -45 35 67 -3 -57 176 -89 61 25 -7 66 -50 123 92 44 238 -88
7179 -88 -278 53 96 59 -206 260 41 217 -51 87 -34 411 -195 3 225 -30 -62 -138 103 10 -96 375
7201 375 131 -86 -15 98 -14 33 -48 23 131 47 -119 122 397 182 -23 -237 347 31 -71 23 -60 -20 324
7224 324 58 152 73 128 44 187 43 153 159 -97 65 -28 45 -45 -68 273 134 -176 -76 -170 254 -189 -44 13
7248 13 -20 -94 -126 176 -4 28 164 126 -7 -73 -38 61 220 -204 -101 18 -34 -5 -63 -83 117 -189 16 300
7272 300 -119 -189 8 81 -73 -187 52 -201 -136 16 -16 214 -12 -197 6 -125 63 120 12 210 -75 168
7294 168 99 142 4 -36 -65 270 -22 7 187 -43 218 5 -148 -90 157 24 103 -116 0 -50 -76 -64 -163 197
7318 197 -247 -121 -276 -208 -208 -48 284 73 42 -22 -319 262 -146 -79 -143 -58 -30 182 90 -103 137 122 4 -32
7342 -32 -176 -43 7 153 -56 -156 -207 -23 -11 -19 -146 78 -42 -53 79 66 119 -74 -55 -26 238 -203 -87 -70
7366 -70 -204 47 33 204 -2 4 -109 -171 175 18 -12 17 42 -204 -142 185 -72 -187 5 172 -130 19 19 92
7390 92 -222 -211 -20 -77 135 42 197 213 118 130 -13 244 16 47 47 -17 142 18 1 -38 44 26 124 44 -154 -117
7416 -117 150 -185 -329 24 16 41 258 63 -135 -207 23 155 93 359 -156 121 -123 -178 -68 10 -186 -45
7438 -45 1 -114 31 168 46 -30 234 -127 177 -30 50 143 55 203 119 175 127 -22 -8 -248 -156 -104 -63 -17 -251
7463 -251 -95 263 40 -199 41 39 101 134 -131 205 -42 75 -243 -132 26 138 -8 -84 -91 -127 202 -224 190
7486 190 -206 91 61 -86 64 -172 70 -173 204 293 -13 133 49 45 -140 -39 -108 -74 70 -59 -4 -53 -156
7509 -156 281 -93 -194 176 -78 -28 -27 -82 34 -21 68 -241 -15 266 -57 -10 5 234 -46 151 235 -58 -101
7532 -101 117 -193 -235 95 270 -53 -266 69 168 -214 112 -354 -134 28 21 154 50 302 -26 -62 -65 117
7554 117 -118 32 3 -185 -369 33 73 -243 -17 -91 257 -205 76 -75 -22 -192 15 -193 -23 38 -46 0
7576 0 350 -181 2 6 -159 152 -30 13 142 -105 -3 -57 -354 53 65 -391 151 132 -231 313 -165 -109 62
7599 62 -186 -40 20 46 -45 204 -125 -249 9 47 -56 150 19 -313 343 117 238 -178 -66 32 -47 -200
7621 -200 38 -111 -1 -86 -116 -70 247 -8 190 -105 -42 -75 34 8 -35 180 -44 -122 -136 160 125 53 -64 -364
7645 -364 176 -71 93 -2 -239 70 -102 -166 -97 -24 -107 -104 -260 234 -184 -216 -18 -8 -166 119 350 102 -140
7668 -140 -236 -142 37 154 168 -79 -24 -197 -296 25 -196 310 77 -241 113 -183 -106 147 9 -104 -121 -97 22
7691 22 181 -35 2 -55 -74 -84 111 -1 -136 214 -223 -32 -299 -23 -101 -117 -190 108 228 -38 160 178 -22
7714 -22 148 137 2 83 -24 150 -86 16 -83 -68 -229 -109 -256 -113 207 -28 -77 -159 158 -44 -19 178 99
7737 99 56 112 -30 76 -269 110 -191 53 106 330 16 -57 -31 29 91 22 72 -71 -204 111 -129 28 -74
7760 -74 -94 60 89 -166 139 -38 -129 -178 -80 229 -96 121 70 -65 115 207 40 -81 -142 -383 -110 17 -128
7783 -128 -144 -319 -180 58 -161 311 -100 32 -142 137 245 -70 -252 60 274 98 -308 275 -36 40 -67
7804 -67 -57 126 127 -266 58 31 73 13 -58 37 99 -95 -3 -60 -28 -14 -83 45 -134 -97 -125 -58 121 -81 -24 -74 94
7831 94 -59 213 5 -45 108 -201 78 62 17 159 -108 25 -130 -8 -46 84 138 83 -133 -67 -98 104 11
7854 11 -140 -60 114 368 31 93 122 15 128 94 -15 -87 -37 -104 162 -145 19 0 -20 16 -12 36 -58 -47 18
7879 18 128 -155 54 -47 -162 -134 109 7 58 -11 -6 24 99 -90 -63 -256 -36 -141 14 74 -47 54 240
7902 240 -101 -112 -112 97 -232 -63 -49 9 -276 -141 201 51 77 7 -376 -98 107 -205 176 -176 36 -28 -20
7925 -20 -108 123 -142 197 -189 -10 62 104 125 -95 168 -9 18 259 119 61 64 162 60 -133 -35 -124 0 96
7949 96 -255 118 -137 -202 -151 -218 75 -34 -45 113 81 67 205 165 137 119 -215 -195 111 -16 223 -190 46 -290
7973 -290 -86 -20 138 147 63 -218 112 105 -50 69 -239 237 44 73 199 299 -10 188 100 -208 -48 -115 56
7996 56 -208 -209 28 159 -126 222 -189 -155 33 -35 200 -140 -263 79 -45 119 -116 -268 -1 77 103 -164
8018 -164 -66 200 202 73 -39 59 200 95 91 150 -54 205 199 57 -119 -77 163 -29 -325 -130 -241 84 -2 -268
8042 -268 -167 -87 58 -188 3 -1 -11 -23 -23 116 33 -66 -54 127 -113 -105 267 208 155 -123 13 -79 136 -161 106
8067 106 -86 4 -65 -143 -116 -19 -191 -82 28 -2 -140 208 -138 45 92 -168 -16 257 -33 -110 29 -50 95
8090 95 3 210 34 185 -53 -32 23 111 -192 69 -91 212 -64 79 -201 -167 126 -18 163 110 -39 17 233
8113 233 138 -58 -134 -69 -253 107 -55 127 173 -55 -198 -216 -90 217 58 186 217 -98 34 -158 -225 27
8135 27 -54 -61 18 -48 -23 104 -72 238 123 195 74 -272 31 -97 -130 19 85 -113 -373 99 -246 -111 55
8158 55 -27 62 -126 -178 -82 -296 -32 110 99 36 -114 -99 47 -200 -65 -55 -119 41 -83 -61 20 201 91 -106
8182 -106 137 18 25 -50 165 -40 -46 81 264
8191B64
$$ Imaginary data points
##PAGE= N=2
##DATA TABLE= (X++(I..I)), XYDATA
0 0 0 0 0 0 0 0 0 0 0 0 0 0 0 0 0 0 8 -8 8 -8 8 -8 16 -16 16 -24 24 -30 32 -39 43 -49 56 -63 71 -80 90 -101
38 -101 112 -126 139 -155 173 -189 210 -232 256 -282 312 -342 377 -415 460 -506 560 -620 690 -770
58 -770 865 -975 1111 -1279 1493 -1780 2180 -2787 3807 -5832 11406 -59148 -172365 17335
72 17335 127627 -13183 -97231 -21099 16846 10754 -9513 4934 -32680 -40208 22887 38941
84 38941 -10069 -58369 -101 43463 -2392 -12871 -4061 4133 -2021 19335 19880 -25548 -7364
97 -7364 35929 27905 -27328 -12111 50981 11820 -25939 9232 40198 -2419 -26213 28669 20792
110 20792 -17738 -7671 15851 4656 -22545 2609 11262 -20729 -31430 10691 28564 -43249
122 -43249 -52953 22667 34406 -37828 -54762 20465 24006 -25115 -19869 10724 10393 -13214 4174
135 4174 18496 2293 291 11884 14965 3057 15863 20617 -1991 437 18291 22979 -2358
148 -2358 -9900 8764 8686 561 -6005 -203 -7216 -18239 3875 9631 -19650 -32690 1871 15406
162 15406 -15896 -22695 -7396 2284 605 -1901 -7155 -13315 8619 19100 -719 -16887 -80
175 -80 29919 14417 -17392 -9242 23200 23707 -7647 -12099 7032 15160 3533 -4368 -847 -3954
189 -3954 689 6796 1147 -9475 -9072 4297 3778 -1224 -4054 -10059 -1641 10147 4150 -12382 -8235
204 -8235 9106 7200 -3956 -8453 472 6457 300 -5691 -3524 3679 -765 -4848 -103 -1475 -1619
219 -1619 -892 -1121 -2079 -500 2439 -1917 -1952 4513 4703 -1953 -405 8843 5331 -1449 1695 7902 5907
236 5907 -368 2328 3811 3374 2814 -2226 -1682 1751 1019 -4117 -6106 -3201 -946 -2300 -8511 -8710
252 -8710 -1085 306 -7238 -8583 752 -265 -4667 537 2097 -1511 -496 6107 6884 58 1189
267 1189 6405 7346 4903 3131 2049 3273 6059 4323 233 -3031 559 4585 -500 -6363 -5009
282 -5009 760 194 -8552 -5667 334 -3836 -6307 -1435 -196 -4929 -3146 2020 662 -2347 874
297 874 3107 374 2141 3671 1692 1303 2403 4511 2111 -1383 1334 3686 864 -2763 -913 2971
313 2971 -839 -5341 -1142 1859 -2846 -3260 501 -795 -2200 47 2234 -1514 -2146 3556 2254 -912
329 -912 656 2416 1913 932 1158 1235 286 -627 1171 527 -1883 -2867 -502 1477 -3072 -5556 -477 322
347 322 -3433 -3141 -997 -904 -1385 577 332 -1645 1145 4552 1695 -257 3048 3928 3112 1677 2007
364 2007 3439 2402 1458 910 1053 657 -1157 -474 -259 -3271 -3015 -751 -2651 -4666 -3045 -1773 -3031
381 -3031 -2789 -1429 -2003 -2983 326 1801 -767 -595 1366 2570 3058 2420 1971 1739 3147 4089 2657
398 2657 1624 221 595 3027 2085 -2172 -2853 -314 63 -916 -2705 -3521 -3010 -595 -157 -3695 -3790 -211
416 -211 145 -1355 -423 513 592 745 1026 1883 1873 1755 1412 901 2269 2168 976 902 151 -41 1039 144
436 144 -2049 -2476 97 314 -3172 -3223 -596 -502 -1094 -2253 -2723 342 2453 -277 -2592 22 3246
453 3246 3011 1142 -23 -680 2589 5619 2224 -2334 -1893 2289 4987 610 -5065 -3476 1900 2693
469 2693 -2921 -5223 -1736 -713 -1883 -1307 -428 -2834 -3467 -504 3042 1136 -2492 -1887 2244 5002
485 5002 2621 -1306 868 3528 2798 2384 2367 122 -1304 2159 4339 101 -4360 -2504 2112 2334
501 2334 -3080 -7224 -2137 3417 -630 -5980 -4679 539 2143 -606 -2870 -2607 670 4752 2524
516 2524 -1987 -1763 2789 6214 3534 -1723 -1822 3271 5758 1958 -2680 -1494 1691 1132 146 -1302
532 -1302 -3159 -2523 -300 939 -1673 -4038 -3015 -332 738 -576 -2231 -1286 349 416 1927 2721
548 2721 -812 -2170 2708 5666 2186 -2613 -522 3697 3824 520 -2394 -1426 1713 1571 -1239 -3099
564 -3099 -2678 -96 897 -1586 -3888 -2930 1383 1479 -3156 -3627 264 2667 1711 -1458 -1395 1908 3641
581 3641 1984 89 690 2013 1011 1929 2879 -1089 -2287 1611 3197 -307 -3960 -2629 1087 232
597 232 -2380 -2467 -1192 -1311 -2350 -280 1252 -1940 -4075 573 4207 1442 -2666 -1363 3576 4298
613 4298 1230 -1023 106 3506 3812 -127 -675 1028 1536 607 -352 -1094 -1359 -958 31 -1351 -3293
630 -3293 -2117 -570 51 -1756 -3256 -1131 1451 184 -1599 -574 1417 1632 997 804 325 1009 2842
647 2842 2473 -37 334 2089 2156 -18 -703 652 571 -856 -1579 -1160 -273 -704 -2151 -2009 -616 -472
665 -472 -1163 -1714 -1161 -47 456 115 -714 502 1399 935 1281 1941 793 329 2295 2531 517 -850
683 -850 834 1838 267 -779 -1109 -707 -225 -614 -1636 -2082 -1529 -656 -1032 -1791 -1230 -441 -84 -371 -612
702 -612 634 522 -162 1381 2006 650 540 1764 2563 655 159 1210 1218 274 325 -752 -890 -132 -363
721 -363 -1239 -1955 -1081 -576 -1217 -2011 -1247 -514 -685 -1209 -716 393 -273 108 1222 955 242 627 1989
740 1989 1381 292 1159 1747 1063 623 961 30 -60 211 -196 -1248 -1439 -358 -539 -1725 -1896 -1025 -540
759 -540 -888 -1775 -352 183 -721 -228 964 539 6 1009 1781 776 352 1460 1236 776 975 511 311
778 311 349 621 130 -1003 -943 318 -554 -1648 -1455 -914 -434 -1278 -1747 -506 -424 -869 -475 -161 -285 229
798 229 642 1253 398 747 1736 1246 354 1399 817 719 908 723 438 -301 51 14 -860 -1167 -953 -701 -659
819 -659 -1613 -1474 -598 -680 -1299 -683 -277 -235 -174 227 726 107 780 1416 730 916 1254 1192 904 1001 805 505
841 505 -174 519 40 -233 -468 -954 -588 -703 -1277 -1345 -951 -1009 -1262 -873 -715 -724 -648 77 -142 -328 563 603
863 603 487 1020 1061 956 804 1063 1140 825 347 600 546 131 -19 -593 -326 -845 -836 -661 -902 -1146 -1415 -950
885 -950 -382 -966 -866 -531 -134 132 374 69 3 811 969 869 936 974 1146 1057 898 575 239 974 274 -437
907 -437 -175 -369 -628 -530 -822 -1075 -1125 -749 -494 -1161 -1039 -590 -581 -65 -222 -613 83 817 715 808 791 791 1135
930 1135 1112 1228 422 335 428 569 814 380 -619 -911 -276 406 -573 -1372 -1162 -733 -565 -733 -1189 -1299 -501
951 -501 -189 -30 -398 -507 375 527 877 586 366 1162 1319 966 1063 669 543 1075 875 -214 -184 312 287
972 287 -949 -1187 -328 -658 -1250 -691 -992 -891 -1306 -698 237 -228 -697 -347 647 772 386 -165 885 1172
992 1172 1053 1078 924 233 655 958 826 13 -498 -71 436 362 -824 -1859 -667 356 -480 -1493 -1324
1011 -1324 -518 -232 -782 -508 -417 -76 33 217 518 220 128 1075 1176 434 353 836 1638 762 -193 589 736
1032 736 -144 -284 -175 -234 -482 -900 -774 -314 -944 -880 -835 -627 -562 -856 -477 -53 -17 454 -45 -21 669 823
1054 823 899 420 168 780 734 748 708 -246 456 915 240 -371 -692 -775 11 -388 -1052 -989 -1061 -448 -459 -916 -694
1077 -694 -554 -307 260 -148 213 293 697 734 579 689 1015 30 570 745 409 506 350 111 283 -388 -412
1098 -412 -159 -485 -683 -240 -556 -607 -1127 -579 -331 -798 -849 -387 144 -132 51 220 413 399 587 761 616
1119 616 751 866 824 749 182 301 403 57 -70 -343 -191 -224 -750 -705 -467 -856 -664 -356 -820 -544 -364
1140 -364 -293 -525 -222 213 105 50 681 771 598 567 617 1013 502 696 1066 679 283 278 200 -120 -344 -542 -201
1163 -201 -800 -1287 -855 -414 -788 -763 -502 -447 -689 -418 143 -85 -241 168 438 533 136 717 720 616 345 745
1185 745 634 556 397 231 528 -334 -382 -288 -544 -678 -388 -567 -824 -704 -547 -293 -804 -559 -12 -236 -300
1206 -300 -164 297 70 337 676 704 416 453 865 813 490 356 789 208 -59 308 28 -390 -188 -133 -142 -826
1228 -826 -899 -320 -827 -984 -341 -364 -181 -290 -228 96 -72 -188 590 596 452 415 764 650 379 526 943 150
1250 150 166 535 298 -154 -144 67 -254 -633 -564 -391 -630 -784 -559 -672 -552 -623 -553 -221 -378 55 34 140
1272 140 385 186 245 568 506 519 938 276 457 593 257 116 45 316 -82 -36 -353 -382 -844 -609 -445 -500
1294 -500 -721 -615 -526 -214 -226 -95 -163 -121 184 161 497 507 504 735 612 492 628 364 588 219 481 296 19
1317 19 33 35 -401 -366 -305 -412 -696 -776 -729 -225 -381 -524 -371 -201 -81 -371 56 332 253 346 611 581 594 584
1341 584 434 436 222 500 615 147 49 355 -279 -136 81 -364 -568 -508 -518 -389 -582 -618 -455 -592 -14 -304
1363 -304 -211 106 40 231 209 410 323 490 255 789 900 412 307 462 515 139 3 98 -274 -534 -353 -271
1385 -271 -409 -648 -362 -303 -746 -555 -372 -639 -171 -108 18 -20 145 80 464 376 422 415 519 482 394 253 401
1408 401 306 -48 305 -144 -54 -132 -200 -474 -518 -172 -540 -511 -551 -568 -463 -552 -331 -191 -29 -240 -12 128 388
1431 388 256 390 487 555 541 315 244 366 576 292 189 -107 250 214 -409 -242 -500 -751 -641 -282 -363 -533
1453 -533 -415 -470 -194 -438 -483 36 -131 41 240 344 342 353 733 546 63 619 489 280 290 245 310 164 21
1476 21 -272 -101 -523 -140 -344 -538 -408 -499 -416 -322 -459 -351 -43 -90 -113 -6 202 364 268 626 529 299 719
1499 719 566 293 667 229 406 364 167 296 -58 -369 -97 -417 -434 -640 -212 -384 -369 -432 -338 -543 -320 -191
1521 -191 -369 141 -155 103 192 558 246 124 439 549 31 335 418 158 202 102 218 117 -242 -406 68
1542 68 -449 -629 -352 -478 -381 -373 -464 -69 -467 -139 -197 -216 209 407 75 205 361 574 134 438 482 367 243
1565 243 523 319 227 125 58 -109 75 -114 -224 -119 -318 -313 -587 -316 -187 -473 -198 -340 -20 -269 -69
1586 -69 208 223 272 377 246 457 650 510 543 612 423 253 365 298 85 15 -6 -173 -433 -156 -553 -173 -430
1609 -430 -241 -667 -239 -510 -306 -164 -52 -87 -103 239 324 27 352 502 140 588 442 473 466 421 176 561
1631 561 2 -161 18 -32 -145 -182 -86 -301 -527 -559 -368 -271 -579 -190 -348 -172 -211 -27 444 277 172 267
1653 267 212 209 328 465 630 93 225 342 -11 -26 80 169 -100 -322 51 -195 -306 -432 -353 -225 -434 -365
1675 -365 -352 -70 -278 19 14 -115 99 287 352 376 203 511 290 538 496 409 422 388 318 -66 158 -245 -126
1698 -126 -413 -165 -249 -208 -344 -368 -474 -254 -323 -341 -124 -237 -123 -121 -37 403 -24 315 573 83 257 436 275
1721 275 555 308 464 322 78 136 333 -107 -170 -396 -220 -276 -741 -134 -340 -360 -441 -266 -187 -229 -189 -57 200
1744 200 -129 17 244 391 72 213 501 411 170 341 347 211 343 106 75 -270 -361 -2 -353 -311 -206 -412
1766 -412 -214 -369 -475 -464 -432 -74 -416 -157 -79 -44 -52 295 141 325 302 451 236 411 206 335 503 370
1788 370 483 -62 -6 -39 -238 -181 143 -530 -361 -379 -218 -398 -368 -33 -343 -102 17 -223 35 229 148 83
1810 83 323 -20 188 156 178 143 544 45 147 194 92 198 -69 142 -262 -255 -63 -299 -337 -391 -539 -187 -189 -153
1834 -153 -212 -277 -30 -15 -64 109 203 186 129 92 398 255 197 307 462 308 334 110 199 -54 -172 -30 -248 -615
1858 -615 -260 -80 -383 -248 -577 -217 -361 -353 -23 89 -136 -59 91 248 168 193 27 370 359 425 353 196 401
1881 401 -42 224 235 199 197 62 -11 -136 -347 -15 -317 -155 -181 -435 -195 -344 -107 -139 -44 -150 210 129 194
1904 194 512 64 102 331 221 362 368 63 365 254 136 168 44 48 -128 -54 -214 -213 -423 -277 -188 -381 -146
1927 -146 -68 90 -281 -201 66 2 345 69 320 49 366 332 150 261 212 313 118 177 65 -75 227 14
1949 14 -66 -271 -325 -185 -256 -518 -375 -430 -455 -316 -24 -262 -180 -220 29 -52 -52 211 270 381 258 202 460 100
1973 100 270 283 280 285 224 -29 -167 -108 40 63 -334 -204 -211 -37 -287 -260 -244 -179 -319 -181 -80 -85 12 188 -196
1998 -196 293 17 442 369 123 256 405 462 230 183 5 58 66 22 5 -85 -123 -176 -246 -250 -481 -183 -169 -183 -296
2023 -296 -206 -171 -230 -132 151 120 225 93 252 205 228 339 234 358 -16 168 246 223 20 -35 168 -62 -309
2046 -309 -152 -176 -458 -313 -283 -303 -259 -307 -27 42 -179 133 -265 -316 177 -19 220 184 154 194 76 238 393
2069 393 351 268 314 11 138 -149 152 -97 -145 -192 -367 -193 -518 -413 -132 -553 -436 -285 -15 -252 -23 -291
2091 -291 -80 212 -72 64 84 297 321 389 129 344 297 204 84 248 208 121 132 -200 -423 -242 -108 -286 -159
2114 -159 -418 -546 -459 -186 -251 -118 29 -57 -50 -52 364 146 183 361 185 244 211 209 256 139 369 108 109 11 -176
2139 -176 -17 -101 -329 -293 -93 -109 -256 -316 -71 -202 -474 -212 -147 -91 -15 75 219 214 53 116 22 244 302 191
2163 191 299 552 555 186 -21 125 -22 -12 -113 72 -122 -36 -256 -315 -152 -116 -260 -129 -149 157 -121 104
2185 104 -33 218 165 172 266 75 145 210 51 443 348 97 74 81 221 -97 76 129 -144 -184 -47 -343 -487 -69
2209 -69 -216 -356 -167 -279 -408 -246 -66 361 -102 134 190 173 152 132 324 90 355 277 47 223 185 147 124
2232 124 85 -36 -182 113 -286 -69 -511 -235 -108 -342 -194 -331 -109 -113 -352 -40 218 184 97 115 9 337
2254 337 -17 76 170 485 244 223 373 193 290 -130 15 -283 -162 -176 -295 74 -271 -365 -263 -314 -244 -338 -91
2277 -91 1 67 -78 -235 -26 262 111 346 198 199 252 237 267 -77 -41 62 67 103 -38 98 -55 -4 -221 -365
2301 -365 -131 -197 -87 127 -138 -179 -348 -64 -8 214 142 101 203 -61 266 254 104 377 329 258 264 490 222
2324 222 154 -77 -64 -9 -11 -122 -291 -90 -59 -352 -16 -252 -83 -338 -136 -88 -115 -243 10 -74 -28 103 3
2347 3 -96 119 632 188 141 114 196 132 147 -53 -58 98 -52 89 -16 -215 -76 62 -131 -259 -240 -220 17 -90
2371 -90 -274 -142 -171 58 95 302 302 10 180 193 185 130 211 3 21 420 271 -95 121 5 -23 181 -121 -356
2395 -356 -272 -92 -61 -326 -395 -252 -274 -193 -61 -247 -154 135 88 123 342 77 -210 478 100 115 257 -133 99
2418 99 120 206 267 -208 -200 -79 -164 -216 64 -400 -52 -276 -187 -12 -195 28 -233 -280 -25 -72 -74 2 52 93 240
2443 240 190 149 232 156 134 129 -43 145 8 228 18 -67 104 -259 -168 -105 4 -199 -398 -200 -20 -111 186 64
2467 64 88 105 -190 19 -134 -85 63 30 344 181 445 191 216 45 33 75 -64 -100 4 -202 -168 22 -275
2490 -275 -52 -251 -199 -321 -284 -202 -244 -235 -239 -89 -58 256 391 -33 294 -36 4 212 277 479 57 113 -63 95
2514 95 -51 51 -234 53 -130 41 -248 -144 -207 -141 -264 -282 -102 -268 6 -52 -298 -119 57 107 -4 43
2536 43 89 266 160 -58 562 437 156 80 39 -84 198 41 -3 -81 -72 -145 -35 -166 -433 -245 66 -132 -427
2559 -427 -119 25 -103 140 45 -106 147 102 190 17 -65 499 323 -20 40 -18 84 146 -25 50 221 -63 20
2582 20 -105 -240 -235 -107 -125 -189 -208 -102 -123 -259 -113 -105 -288 104 99 100 126 244 -14 117 223 239 137 179 137 104
2608 104 10 -72 -81 -125 -198 -130 45 -413 1 -450 -238 -232 162 -126 -58 -171 47 -193 -41 -10 -45 -125 19 -8 85
2633 85 36 282 283 94 166 185 139 -5 -56 7 136 -120 -130 271 -309 10 -281 -211 -225 -315 -251 -308 -164 -197 101
2658 101 -3 -25 96 -58 171 -31 234 150 24 360 225 38 237 195 129 -16 -19 169 -105 -120 -10 -235
2680 -235 -26 -232 -217 -310 105 -49 -27 -260 70 227 24 168 255 343 58 321 87 249 194 346 174 4
2702 4 172 33 -14 -139 -167 -287 -21 -290 -2 -384 -219 -186 -52 -227 -260 -127 -156 -146 100 135 145 -19 1 15
2726 15 130 88 275 214 184 279 148 312 133 36 -23 -121 40 -87 -95 -216 90 -122 31 -79 -173 -159 -229 -33
2750 -33 -107 -172 37 133 43 112 242 246 358 29 195 396 -132 173 1 233 175 22 -56 3 -42 -165 23 -249
2774 -249 -307 -107 -78 -61 -231 -154 -189 21 164 -74 104 91 101 -115 -130 7 60 109 204 -100 270 349 -41 334
2798 334 -28 2 195 -18 -177 39 -179 -103 -340 -214 -266 -163 -336 -108 -265 -171 -41 30 -63 -88 254 -32
2820 -32 8 180 20 -82 53 142 202 -28 247 64 130 9 95 -99 158 45 -249 54 -286 -271 -107 -240
2842 -240 125 -16 -86 -8 -93 250 -108 76 -354 76 -28 62 124 237 255 108 186 156 105 55 142 -7 140 -196
2866 -196 -191 -147 -16 -13 58 -165 74 -295 27 -312 -322 -232 -61 17 6 70 139 76 281 348 -52 280 -34 -6 189
2891 189 68 -29 -57 -37 102 82 -50 -103 -157 -233 -13 -351 -194 -164 -279 -261 -218 -296 86 -28 172 315 127 84
2915 84 39 48 331 175 -111 120 172 162 266 -24 74 -2 81 142 53 -1 -223 -211 -144 -354 -339 -85 -270 -155 -132
2940 -132 -125 -23 -105 -62 407 96 -4 231 145 42 260 72 -73 120 282 160 -260 -73 -63 -300 -527 -180
2962 -180 -63 -86 -109 25 -184 -72 -137 -320 -233 -126 -249 195 116 39 214 177 277 147 311 108 215 5
2984 5 33 41 126 0 120 48 110 186 -39 -220 -52 -53 6 -85 -163 -219 -254 -76 -105 -114 135 -140 -7 -140 124 300
3010 300 3 74 -54 147 39 90 19 59 -141 48 70 302 34 3 -164 -231 -281 -153 -28 -258 -23 -123 -52
3033 -52 -84 -162 -218 -51 72 10 -15 -66 86 346 224 59 172 288 124 110 -142 205 161 111 200 -30 5 -274
3057 -274 7 -7 -123 143 -272 -41 -70 -13 -29 -81 89 76 -15 -29 9 -114 -9 41 246 80 91 -162 110 139
3081 139 242 30 141 225 148 -7 -183 -251 -168 -168 -204 -59 -175 -217 -15 -10 -155 -21 -237 -84 -43 154 -99 42
3105 42 -27 130 157 143 -44 4 242 18 291 144 11 -9 -85 11 -227 -307 -76 -104 -45 152 -123 -24 13 -312
3129 -312 5 -33 40 33 -8 22 6 100 279 -48 161 133 130 58 -119 177 -84 -81 114 -173 39 -347 -46 -92 -104
3154 -104 -13 -73 -84 -164 -213 -96 -192 -62 59 -68 229 -110 105 -27 31 70 22 125 -63 -26 60 -39 357 -22
3178 -22 138 -89 172 -71 -106 -15 -9 -60 -117 -233 -81 44 -370 -15 135 50 -98 0 67 -165 -127 -20 290 213
3202 213 -146 62 114 220 -133 -106 -29 25 -71 -154 -305 82 74 163 -99 -98 -35 -70 -151 -87 -91 58 220 274 120 -13
3228 -13 224 46 181 44 31 71 406 112 38 7 198 -67 124 -37 214 -232 -67 -11 -54 -70 -11 -12 -44 -53 -130
3253 -130 -67 -154 22 -159 -191 -17 11 -28 -47 245 99 -8 162 61 122 7 -7 71 -67 -78 -127 244 -206 -70
3277 -70 -24 -62 -100 -39 -15 -100 -176 -149 -41 5 -74 -7 -11 -41 -34 70 166 194 65 -38 276 143 108 290 67 75 -65
3304 -65 103 -72 275 -281 -171 -22 -93 -115 88 -79 -177 -148 -125 -149 -366 -64 -117 -259 3 142 -69 186 136
3327 136 190 84 137 134 204 198 52 329 165 70 -124 103 -239 -230 119 -403 -156 -130 -68 -151 12 -138 30 32 -40
3352 -40 46 59 96 -224 -69 -11 15 29 24 83 137 -10 254 -34 242 -109 -127 107 -203 186 -85 -35 -56 -94 -217
3377 -217 -71 -134 -254 -150 11 -40 159 -18 -139 49 -25 -95 -127 -69 220 254 3 102 -44 -168 -28 234 -46
3400 -46 -153 -46 -53 -3 -112 24 -224 -134 -253 -189 -43 -111 187 -54 187 128 72 247 -7 78 230 105 149 29
3424 29 -25 114 74 -3 -156 -56 65 -98 13 -248 -104 -21 -215 -45 -171 -46 -91 -161 -231 9 -286 -125 -180
3447 -180 -4 140 -21 -129 -7 -24 -8 17 8 -74 205 22 66 83 55 -115 198 46 -170 66 -205 -341 6
3470 6 -205 -78 99 -137 77 -116 104 47 42 -51 103 157 -63 -131 -113 8 -21 93 176 196 230 139 -28 -151 -140
3495 -140 114 -43 -24 -157 -181 113 -77 -229 -5 72 -29 39 -11 310 -46 -66 115 -90 5 27 46 112 -116
3518 -116 41 -54 196 79 288 336 -57 -247 -65 14 47 -276 -83 195 -102 -29 -8 -51 -74 -191 51 52 -167
3541 -167 139 36 189 109 69 -51 -101 208 -10 120 199 84 229 102 -85 15 71 -66 -236 -276 -48 -84
3563 -84 -38 -122 -123 -216 -93 51 -68 -26 -31 72 71 -352 43 103 7 -71 211 70 25 144 69 86 24 171 80 272
3589 272 -135 23 170 -160 -114 -128 46 -221 -44 -172 -8 -270 -62 -172 -91 158 -52 -92 163 -61 140
3610 140 246 2 37 66 176 87 28 141 -183 -51 13 197 -66 -20 82 113 -8 -39 -237 -109 11 -143 0
3633 0 45 -103 4 -141 5 -23 -65 80 -157 66 39 61 -277 52 -64 65 96 -76 100 178 -69 -84 95
3656 95 364 -141 -80 101 -30 94 -132 88 173 -11 61 -46 31 -31 14 145 123 84 148 93 62 105 210 167 -20
3681 -20 -112 212 217 -38 -267 67 -48 -32 -76 -155 -99 -52 -196 -45 -133 -216 190 116 103 121 72 11 95 163 226 69
3707 69 243 -56 209 -237 52 258 -187 25 -44 40 -152 -108 -25 -49 -276 209 -132 -127 -142 -36 -91 -207 -239 147
3731 147 -23 -320 -151 54 197 194 54 -104 186 -143 263 -14 60 -1 126 -227 74 -59 -113 153 -118 -17
3753 -17 -138 -9 -53 222 70 -21 64 -62 89 -127 -192 98 23 -6 78 -209 -22 222 -48 28 129 73 -365
3776 -365 -50 184 -82 -288 38 170 -181 -334 -112 -181 -37 -11 -160 -53 -6 137 -273 7 -31 -191 46
3797 46 -120 -112 190 173 211 -33 -83 139 -164 -131 290 216 52 132 -64 -28 -101 -119 -17 -1 -95 -137 -5 40 -50 -74
3823 -74 2 -27 61 120 -20 181 3 298 35 115 143 55 93 -39 74 86 -105 220 -64 -258 11 -8 -210 -181
3847 -181 -194 -140 -277 2 -156 61 -63 9 79 -201 12 -136 57 -23 57 125 -17 -59 79 38 -271 219 -76
3870 -76 -82 8 -280 -83 -46 1 70 1 -209 21 -47 -33 -124 -110 46 -205 -49 34 -121 -2 75 146 -390 170 266
3895 266 310 76 0 -8 10 83 -3 66 -108 240 -121 128 61 55 -138 -130 -201 -35 -320 163 -87 -38 -55 -7 16 -3
3921 -3 -85 144 53 -41 206 63 79 250 93 265 78 19 178 -77 112 -29 -64 85 155 63 25 -189 -215 -19
3945 -19 -56 -163 156 -141 -14 109 44 46 -39 121 161 68 -41 148 -31 178 201 117 49 45 6 185 -75 -160 -191
3970 -191 -44 15 -64 -89 138 -165 -83 -211 -304 264 25 39 58 137 31 -124 -223 2 27 109 35 129 133 -104 -181
3995 -181 -58 237 163 -191 26 123 -291 -183 105 42 69 -146 -202 -42 -95 -62 -232 170 -277 165 -126 -31 -107
4018 -107 -22 208 116 80 -145 -250 165 58 1 -87 217 -9 -45 113 -101 -96 -150 -125 -106 154 -21 -206 43 33
4042 33 -178 33 175 242 220 -93 -63 -276 270 242 176 80 178 117 -75 277 232 -176 -117 -57 43 51 -81 105 -70
4067 -70 -89 -138 -152 92 -71 159 36 -110 180 86 -123 -92 -165 126 297 97 67 58 110 162 7 -131 39 -18
4091 -18 167 -65 199 -38 41 -16 -240 -240 116 87 26 -196 -41 245 -22 -106 -5 11 -198 -66 6 143 369
4114 369 192 -23 20 80 318 1 167 179 184 127 143 -111 -23 -50 -110 160 -48 35 39 -70 -8 -399 -277 -1 -533
4139 -533 -271 -109 -106 -15 -70 -31 -23 10 -40 86 -37 11 48 39 234 -133 -30 23 80 146 201 -3 -208 20 33 -35
4165 -35 -143 76 -100 34 -106 -18 -214 -119 44 1 -83 232 -144 113 9 99 -25 -72 63 -195 -35 -149
4187 -149 -55 113 -118 -88 -96 -83 -21 -5 71 77 -128 -10 -98 -116 -165 268 222 -119 -83 -187 124 -254 -29 242 105
4212 105 -121 -35 90 -67 -10 -219 218 -133 -10 -143 -132 -9 64 -4 79 -33 -68 133 -292 -44 -125 53 116
4235 116 -19 -187 -26 -65 142 -13 63 -12 -114 40 42 62 51 45 -88 189 144 181 54 -18 64 65 -151 -101 -116 204
4261 204 -164 49 -98 173 -67 256 52 137 -45 71 -90 67 63 -117 -90 -25 125 200 74 -34 119 69
4283 69 -137 -125 -15 -63 45 -141 -61 10 -81 -160 -44 11 -98 -132 55 122 -1 -112 0 -55 -49 39 74 134 -134
4308 -134 -297 7 94 -145 -48 186 -28 65 -145 31 91 1 -89 116 207 -155 55 43 0 -90 16 76 48 -156
4332 -156 -23 -75 57 -210 129 16 148 50 171 12 -33 119 175 130 -186 76 -108 56 -182 70 -100 124
4354 124 112 33 -118 7 -197 46 30 46 -229 -208 -63 -198 272 -205 59 152 -55 163 85 48 65 -135 166
4377 166 -7 244 -13 -145 -162 -125 -75 -117 -337 -179 3 -218 33 -237 -21 28 129 -45 -77 -73 -53 -28 -8 29
4401 29 -171 73 143 36 186 -234 119 43 -62 -91 -65 172 42 -122 16 84 164 -73 4 68 -77 115 -9
4424 -9 323 87 136 -138 -179 59 73 -15 -25 190 -5 17 33 -192 49 -279 132 96 -96 -88 -99 146 -4 14 -15
4449 -15 217 35 -318 -170 184 -243 62 264 -100 168 108 101 85 -66 -26 -2 23 -126 -138 -110 99 -55 76
4472 76 101 -38 97 -118 -173 -57 -151 -275 -28 -104 -27 -261 9 -104 -182 -9 -11 -86 -74 57 68 -98 -50 -217
4496 -217 -155 156 -3 -80 -63 279 155 132 -127 0 147 -155 -221 16 -105 -119 62 32 -205 -282 164 -23 -118
4519 -118 128 -10 -19 -42 237 79 44 105 -155 18 127 162 107 -5 109 71 -86 -185 -108 -196 -118 49 190 78
4543 78 266 9 -233 85 -100 67 106 86 -269 -47 -169 -5 -50 -258 124 110 264 -97 -34 61 151 -12 -26
4566 -26 -125 -273 -44 -242 55 -298 -46 -81 -140 1 -11 -36 1 -195 32 -15 -126 -88 -32 125 -19 62 314 -9
4590 -9 -23 125 65 -225 260 144 -112 192 193 -108 149 162 41 -33 -20 -8 -82 -308 -69 -45 194 52 7 -176
4614 -176 -117 -132 28 -295 414 239 166 -28 -45 -15 -204 179 -46 224 -150 300 32 -17 -77 -164 -20 -191 80
4637 80 -50 103 -96 84 228 -45 -146 172 -160 -53 76 71 50 152 -7 143 227 67 -106 -20 49 -131
4659 -131 -75 15 72 -61 -17 72 9 -16 -262 -247 30 56 -21 -73 -166 266 349 -114 51 -82 73 286 -113 -168 118
4684 118 335 153 -74 229 358 -133 -95 394 -66 17 0 -120 -112 -233 -115 39 -7 -81 -49 -49 -6 -10 -55 -6 198
4709 198 109 81 -130 -103 117 -4 -217 110 -74 -36 -177 -40 93 149 -16 144 50 247 -126 141 94 6 -334
4732 -334 -171 68 -88 72 -131 33 -60 -10 -46 62 -73 -186 -121 173 -65 121 -31 -116 306 99 -145 -2
4754 -2 -13 -294 0 313 80 -229 -20 -261 -146 -115 -147 58 -28 -107 -251 -159 -14 64 -48 107 -44 -83 -6 62
4778 62 -177 136 277 131 -281 173 111 -140 152 146 145 -113 42 106 32 -198 -232 -131 -125 -31 -200 -240 56 -36 123
4803 123 62 21 94 89 1 136 206 272 224 63 111 47 174 93 110 76 181 78 -43 -37 28 59 101 63 -63 -321 30
4830 30 113 -41 7 235 -119 -17 -16 31 71 71 153 -131 340 13 409 -58 -115 -13 -4 151 -88 -183 7 -120 -34
4855 -34 41 -72 -235 -42 15 -119 -127 55 27 -157 -32 145 2 92 75 -8 -8 189 -196 83 -110 161 12 40
4879 40 131 -160 56 6 78 75 270 -95 -42 -255 -41 -38 221 139 -46 93 71 -186 -140 -25 -61 185 -98 -107 123
4904 123 -185 109 60 149 251 180 -65 91 190 181 -95 49 -10 183 87 43 -161 -125 94 -2 -90 255 50 171
4928 171 57 95 109 204 27 -101 338 195 55 -58 121 26 35 67 -340 -104 -166 28 64 80 -227 -54 -79 -137
4952 -137 -129 -145 120 -162 -19 -361 -64 -155 -165 -242 -31 51 14 18 -29 89 -46 255 -82 41 -41 200 40 37 -33
4977 -33 130 -61 304 1 17 -247 10 -46 243 -16 -110 90 35 55 -23 125 126 -147 -265 -25 116 69 58 -74
5001 -74 -84 286 12 -39 173 -42 -42 84 82 -30 5 16 125 141 -30 78 180 45 3 -115 168 -87 -20 60
5025 60 -282 211 28 1 -63 -31 189 203 93 -17 -103 -25 -7 -166 -106 -7 -132 -232 55 -38 -174 30 234 -97
5049 -97 -358 -22 110 46 -77 -101 -139 160 -119 92 106 55 279 -76 -70 284 150 97 136 28 16 126 229 83
5073 83 75 -19 -140 8 -205 -143 126 -144 -220 -36 -11 -68 245 -141 -150 -59 -149 170 98 -50 82 99 52 -93 117
5098 117 63 -49 76 286 103 -51 -29 -38 182 170 70 -86 139 -11 -256 117 -63 -97 -63 -106 -124 -47 73
5121 73 -147 -33 -14 -32 -145 -72 -9 -5 199 50 76 103 -7 -98 -62 -86 -330 -272 -152 -68 -30 -48 -156 -35 157
5146 157 -319 -187 86 276 206 82 58 23 8 -137 -102 -64 70 190 -166 53 128 108 4 20 -147 6 187
5169 187 -5 -4 118 139 -27 35 88 -6 11 196 -353 41 129 -38 -129 269 91 160 -34 126 226 -18 38 40
5193 40 70 -8 349 96 -61 -190 49 -147 26 21 -15 105 -109 -27 -134 -361 -71 12 60 -147 -69 210 45
5216 45 121 -150 74 -61 -38 82 -99 74 -16 97 -119 -63 -16 9 -140 25 180 -184 -216 291 -50 1 -48
5239 -48 153 6 -136 -104 27 -60 -50 172 183 49 -110 30 202 318 -42 242 2 -5 113 118 86 199 -22
5262 -22 -127 -68 85 244 64 146 -21 -49 110 -84 -352 -353 -68 -106 -66 -256 83 -254 216 170 100 344 42
5285 42 105 -15 129 121 136 -27 146 -57 75 -161 124 -38 10 -120 -47 -92 73 280 -60 -44 94 93 -367 119
5309 119 -44 -10 239 182 242 11 80 223 83 -93 -61 148 -12 -33 162 -214 -94 -11 82 284 184 -7 -104
5332 -104 -94 220 3 55 36 111 -243 -117 -101 -18 -86 -69 -49 224 -145 4 -23 136 -42 162 182 53 79 -109
5356 -109 232 105 44 -162 -24 -10 -45 36 -34 -119 -22 11 151 41 -87 127 -10 51 79 136 -73 29 137 131
5380 131 102 229 -108 150 70 203 190 78 100 -95 -18 -103 -96 -63 -52 -245 37 134 105 -10 78 -57 -106 -217 204
5405 204 4 -16 -16 80 30 -36 130 49 32 119 138 -10 -133 -97 -75 -136 -131 -111 -90 -27 -194 -57 -112 -110 35 -295 211
5432 211 -322 167 -8 -104 -199 10 57 -37 -195 -103 -91 42 3 29 41 241 -124 37 13 32 -78 -138 11 -120
5456 -120 220 160 52 28 -165 -150 76 -137 -47 -192 178 10 124 43 -80 33 -12 -134 -122 -15 196 72
5478 72 114 86 -34 116 -88 -78 -95 -66 -227 105 -105 -67 171 -201 -190 29 -84 128 99 337 121 -146 20
5501 20 -11 60 309 147 41 -134 -143 -181 46 328 65 -105 150 23 -490 154 -191 -190 -21 59 40 -123 -31 -28
5525 -28 -85 152 5 -143 74 75 -198 -63 82 251 -38 69 -24 66 43 -43 -62 135 -87 -177 99 -78 -37 -12
5549 -12 -137 25 -151 23 -179 58 -16 -118 64 -152 -2 28 74 169 146 87 29 -208 -39 288 -3 263 6
5572 6 -38 21 297 -110 91 -150 23 -234 -142 -53 76 -101 159 109 34 9 -36 -138 -122 9 15 295 -262 -129
5596 -129 73 -33 -61 79 97 49 -78 158 -170 -234 138 -21 6 166 -17 81 -9 -227 -38 123 -49 -2 -164
5619 -164 80 -69 88 270 -146 -105 159 -48 -111 -205 -285 -124 75 114 71 133 95 37 176 10 126 -57 158
5642 158 -143 65 77 -65 -66 46 215 -87 183 -128 154 -89 149 249 39 162 2 91 118 -147 82 28
5664 28 -82 -135 199 99 146 6 12 -7 100 122 -103 22 -105 192 -58 -77 63 -86 189 -105 -117 1 20
5687 20 73 -118 8 343 -111 52 283 73 -33 -98 9 -104 -41 158 208 127 -100 -8 -206 -176 234 37 -68
5710 -68 16 -5 -3 -144 -124 -12 -29 145 73 144 77 18 101 72 93 106 2 -147 92 -90 118 -45 297 64 133
5735 133 -139 174 151 -162 -20 -1 -6 122 -20 -78 -129 2 185 106 280 -76 64 16 42 -95 -91 34 -167 403
5759 403 -185 227 -50 -11 100 -85 122 -65 -271 -149 -12 115 19 36 -160 -170 108 36 -1 239 -71 180
5781 180 -135 23 82 257 -25 -34 -100 45 50 124 117 87 12 -40 142 -133 -54 31 -79 -19 27 -170 -47 -81 40 -93
5807 -93 -208 31 -22 120 -174 103 -178 119 139 -196 68 -274 -59 -90 126 68 172 321 -18 149 -29 12
5829 12 -19 -55 235 107 68 -63 91 45 -364 -375 -87 -177 -194 -21 -10 -71 -21 46 -210 259 165 -4 -147 -45
5853 -45 -61 -88 -135 -25 56 -154 -22 301 57 41 98 -104 -67 -22 -44 -98 -118 -87 -85 -72 277 67 46 -108 -1 -164
5879 -164 -172 -124 136 -23 68 -20 -235 213 -57 103 62 51 -108 41 265 76 -115 4 -12 19 -50 -98 17 -101
5903 -101 19 210 42 -25 -17 -144 129 -102 188 5 -28 328 -82 79 56 393 340 -215 -86 31 -131 32
5925 32 35 -93 -92 -8 -139 -105 -48 -336 95 -268 2 255 18 -52 -152 71 60 -93 -49 27 -8 38 196 -62 122
5950 122 -2 52 -177 24 -158 -37 -27 24 10 -91 79 -84 2 69 -80 -116 -238 -248 78 -4 -98 -24 -222 10
5974 10 -26 -83 -50 77 171 42 -39 -71 137 -44 -114 115 261 -4 -105 6 97 -165 74 -178 154 141 -134
5997 -134 79 129 -50 37 -214 43 34 4 7 -96 103 -139 -153 103 130 -252 -57 116 189 -27 -177 -43 -236
6020 -236 68 110 -37 -1 -109 36 -141 -130 -147 174 -159 -102 -56 68 -13 -47 150 -66 192 9 276 21 -39
6043 -39 -280 258 72 220 -163 121 -210 -120 5 -45 318 -84 -8 282 -26 -44 -111 28 -84 -377 31 -161
6065 -161 -261 3 -125 -61 105 -103 -7 128 143 56 75 -4 -50 -45 33 -238 -55 82 -214 -186 21 37 156 -222
6089 -222 -3 -3 23 -234 34 133 -55 -63 84 138 146 -107 -118 20 49 -157 125 186 -5 289 -253 -4 19 -37 179
6114 179 -162 65 58 227 25 -24 -306 -112 247 -184 -338 -37 69 -203 -187 31 127 42 182 -18 161 -33
6136 -33 -146 149 -75 -52 150 467 -96 115 162 53 -112 -101 55 -143 196 -204 35 70 159 61 -114 29
6158 29 -24 11 125 47 121 -77 -160 39 69 -20 203 163 60 -12 89 164 -166 -25 -65 127 191 -31 -151 -302
6182 -302 132 -237 125 -94 103 86 -114 38 -67 114 -25 347 -4 62 197 72 94 33 83 52 -135 -10
6204 -10 51 -261 121 6 194 -134 -129 225 67 125 73 -25 -147 1 -123 60 -64 -51 107 -208 -170 183 228
6227 228 -121 -201 391 -179 -53 186 -118 -109 -300 -124 65 -60 -117 -143 -132 -178 -67 -209 10 -101 -226 -85
6249 -85 -7 64 157 -229 -31 -88 -18 53 105 -210 -74 -55 -110 -98 63 68 250 -112 111 171 -164 -200 -14 -13 54 110
6275 110 66 -129 43 2 91 -100 -175 -41 -12 52 -18 86 76 29 43 -222 161 -90 -120 -5 253 37 42 -113
6299 -113 279 139 202 -131 -87 121 29 259 -138 33 -91 73 -85 138 88 -132 60 -141 -56 114 25 323
6321 323 186 9 -14 -65 87 138 29 11 32 36 162 83 106 14 -32 -235 -265 -30 -127 79 86 -53 -93 99 166 -118
6347 -118 108 -79 -44 -43 121 -47 49 -67 176 172 114 35 -70 -4 -91 240 13 381 50 -40 -140 -198 79 256
6371 256 -25 199 -165 -76 -109 161 -120 27 12 -57 -87 46 -135 -60 144 -148 146 -15 201 25 60 -197
6393 -197 -96 -161 248 -137 202 -39 -208 -51 24 -93 -88 -21 -131 -445 -164 -198 -105 -181 -164 97 35 -22 -230 201
6417 201 116 -214 2 13 -69 22 198 -143 81 121 -30 -12 56 -23 -91 -176 -22 182 -84 45 96 -177 161 55
6441 55 -7 -340 159 131 -68 82 169 82 73 -75 81 68 -105 245 122 217 111 -128 171 148 10 -160 -7
6464 -7 -189 -143 156 73 -122 20 103 62 -82 135 -114 -67 136 69 278 50 -194 -13 212 -126 24 256 -30
6487 -30 103 60 98 106 -20 95 -140 28 31 215 59 -215 120 41 99 154 -213 22 72 -21 -232 -33 -187 -24
6511 -24 -175 217 139 -170 -233 241 133 -37 10 -112 -21 -127 69 -66 -43 155 153 -93 -90 -29 115 133 45 -153
6535 -153 12 -23 97 -142 -108 25 -39 127 43 115 -78 174 7 295 213 16 83 112 118 -130 -78 -27 -81 -68 -308
6560 -308 -89 121 8 -152 57 362 -3 116 114 93 48 -104 -75 289 267 191 299 127 245 -237 0 -99 3
6583 3 -45 -22 87 32 -124 -207 52 -142 -148 146 50 113 -52 -129 228 -4 194 -125 -74 3 80 124 -32 -74 -101 -28
6609 -28 1 -59 189 -19 38 -46 -210 -97 103 -32 -69 74 -89 -132 -187 -40 -101 -29 63 -100 -96 154 62 -21 -59
6634 -59 -105 -64 31 -32 98 -32 137 60 81 -166 -28 242 64 -372 -23 -19 187 -120 -2 -88 -162 355 -37 -254
6658 -254 -58 2 40 1 -114 81 -136 127 -182 185 -20 -349 67 -72 108 110 -119 -83 139 77 -91 126
6680 126 -129 40 -59 96 143 -222 -141 10 189 -50 113 -332 -83 27 103 -249 -125 -95 123 49 113 -54
6702 -54 7 54 42 77 -52 112 -189 135 95 185 180 0 17 75 -53 238 27 89 -73 -142 113 134 -134 -199 -3
6727 -3 -37 -38 -192 -80 -6 -112 61 187 -10 -117 -25 -94 40 134 -13 -127 -145 52 128 86 -14 -491 -155 217
6751 217 219 -300 13 0 -141 15 70 115 -15 -95 35 -156 -4 71 -122 -18 178 84 -171 152 -122 77 15
6774 15 -93 17 -65 275 135 18 -138 -232 126 -29 -27 -206 -66 -48 140 -123 118 232 19 91 43 54 166
6797 166 -35 35 125 -119 136 -287 74 -45 23 -153 -94 -84 -26 -40 -114 -129 122 -58 -78 -84 -18 -81 -22 110 -131
6822 -131 129 55 -163 163 -103 31 -55 -9 88 17 47 43 -9 -143 -48 -103 67 47 -109 -174 55 -138 118 -222
6846 -222 -217 157 -86 -84 -17 -21 -168 -302 -235 70 120 -213 -217 5 230 -77 126 -99 146 220 -206 -35 186 -15
6870 -15 -193 -58 50 -196 -95 -139 -47 -16 120 35 132 17 34 47 128 177 14 113 -68 -373 -87 -113 -170 103
6894 103 11 135 127 173 -4 168 55 79 -26 122 -127 -183 -156 224 -40 -178 35 -29 -26 -132 129 -239 9
6917 9 24 56 -103 -222 -176 -84 38 -9 70 -85 86 92 19 -53 -146 -195 -104 92 -35 -40 125 89 5 -33 90 -54 -77
6944 -77 -84 -184 57 -72 -30 -86 204 -117 -161 -38 133 22 14 -49 -35 46 -87 92 41 -249 -119 -83 -6 63 -35
6969 -35 89 115 -109 72 -28 -119 -244 -195 -213 34 -31 -135 72 -247 -41 -14 262 232 38 83 160 -3 -190
6992 -190 196 18 -14 -13 -29 157 208 -146 -220 163 6 197 -64 45 21 51 54 -37 -288 26 -78 -78 163 -62
7016 -62 -80 -75 23 143 26 345 137 226 -11 114 -263 -7 496 -138 56 -110 206 -3 49 -3 262 -86 110
7039 110 -142 -133 -29 -153 -232 144 -22 -12 -41 -113 74 255 72 134 -175 -15 -97 -147 -51 -111 235 41 244 -72
7063 -72 16 -18 -36 -6 75 -28 -21 87 -61 76 -46 -84 -231 258 27 -85 -59 -68 54 -239 93 49 -155 -171 -13
7088 -13 -107 92 -186 90 2 -70 -58 -7 106 -238 49 290 262 -43 129 88 -124 -2 96 22 -38 146 -45 -80
7112 -80 52 -13 -231 -39 -75 -116 42 -101 2 -191 -82 33 -43 -152 37 58 -157 -47 -54 -3 111 322 -307
7135 -307 -51 129 124 36 -52 -25 25 7 -77 -60 -69 215 -195 -100 94 62 -14 -31 456 -6 66 -30 -7 -39 112 -26
7161 -26 -220 61 65 -185 -29 129 -129 23 -80 40 -75 47 38 -74 -127 -73 -42 84 6 30 -74 54 -159
7184 -159 -125 -88 24 -152 -131 -140 -45 -128 -120 35 5 102 -112 -111 -194 -156 -81 59 103 75 33 -129 -54 22 69 103 66 103
7212 103 35 53 -131 117 76 87 150 -207 -279 121 -31 4 -21 -19 90 -210 97 16 -57 43 -137 -147 -31 93
7236 93 -97 -89 -110 -69 88 118 -62 81 72 7 21 -61 95 101 -8 -220 -33 -112 158 -39 108 41 37 -271 -369 290
7262 290 193 -7 -1 36 85 69 0 -233 -15 104 130 -45 129 -110 103 145 214 -37 -65 36 -85 56 -109 57
7286 57 -10 59 -46 2 -56 60 82 -26 -36 95 85 -100 121 -63 -89 110 105 92 -77 77 -150 232 -109 -118 80
7311 80 46 -39 -241 -87 -79 47 -143 3 80 113 -197 -123 137 64 256 -18 -223 -6 -201 133 226 -14 195
7334 195 -65 -118 -17 9 52 -71 260 218 -65 -24 70 -6 -88 -41 90 -6 88 176 -87 -91 162 25 54 -85 -131
7359 -131 103 -98 200 153 -138 -78 213 13 25 151 110 79 111 111 -53 154 22 175 43 -42 -84 132 -91
7382 -91 -95 -66 -81 -259 -69 107 33 110 -172 26 -16 136 -30 -69 136 107 49 -38 43 -10 46 -132 153 31 -16
7407 -16 165 130 -137 7 22 -88 -243 -213 -32 9 263 29 127 -17 90 174 -115 170 98 199 -49 66 -66
7430 -66 49 76 -86 86 -3 87 30 83 -183 180 -5 -107 56 173 47 8 207 -183 -50 85 -118 -103 100
7453 100 -42 104 42 -161 133 -67 -67 -147 -164 -154 -62 146 -162 147 29 -102 3 -209 -220 63 44 -182 13
7476 13 -90 52 159 13 -9 192 30 76 24 310 299 152 -25 14 -89 178 23 -149 78 -166 84 -175
7498 -175 152 241 86 -121 75 54 137 -27 -119 -138 -192 -22 99 -20 -109 133 -205 90 193 114 42 152 -11
7521 -11 -53 185 -24 52 290 149 316 -91 -179 -26 48 -171 -130 -145 -86 188 88 -21 33 14 213 106 32 -95
7545 -95 106 -95 -293 -193 10 -119 -6 203 226 53 197 35 67 96 -18 226 209 -76 0 208 -142 41
7567 41 99 31 127 81 -155 27 -10 -83 0 -8 15 -61 -115 -325 -41 118 26 112 23 -1 -6 -52 -71 -124 87 -38 -25 266
7595 266 -111 -129 -150 160 -30 -1 -178 132 -170 -69 -52 12 -71 -282 254 2 48 16 -60 6 -32 -103 54 152
7619 152 28 -65 -43 277 -83 2 68 108 179 -53 -51 -113 49 -135 31 -235 156 -159 -212 -4 113 131 -84 6
7643 6 190 59 11 67 -34 -126 -58 284 116 -18 205 -76 75 -13 -4 -128 204 89 -181 86 112 -129 -96 -32
7667 -32 -11 158 20 -29 107 38 75 93 -75 -26 309 -14 41 99 77 -104 94 -252 242 106 156 109 -22 80
7691 80 57 -127 -197 79 9 -12 -151 71 94 48 111 68 -78 197 192 197 -95 -46 238 265 44 123 -206 -107 -128 -17
7717 -17 39 -212 207 -141 -198 -178 294 -233 -37 -6 -79 -71 -200 32 -32 -26 230 58 65 -52 -62 237 -419 52 411
7742 411 -35 12 -107 77 -103 -68 151 -70 -83 -210 -102 -162 14 -3 169 102 104 10 58 -3 -112 104 -163 -23
7766 -23 -71 -17 -141 -30 -3 -109 -218 -86 17 -258 -103 225 54 107 3 -5 131 34 32 -147 212 -17 -26 -139
7790 -139 110 -146 -160 79 -198 -53 2 63 -103 -64 -145 165 -83 -50 85 -144 -9 33 161 -169 -24 104
7812 104 246 -66 163 -151 133 -74 -110 7 -149 28 -5 -74 -151 189 38 -165 33 -182 130 1 -161
7833 -161 -21 90 -167 -3 54 -281 -103 -43 -234 302 -109 -8 -93 104 181 52 235 35 -117 -118 42 197
7855 197 -180 34 23 -22 -86 -186 165 -27 -21 35 -161 156 91 -14 -62 161 58 55 334 -73 -142 197 -6 -131
7879 -131 276 179 27 171 184 26 55 -44 104 -78 286 -197 -151 -21 -126 57 -111 -217 37 229 49 14
7901 14 -12 -218 -30 87 22 -48 -206 150 149 -6 75 16 71 -33 136 -113 22 156 207 -218 -133 93 196 -141
7925 -141 -93 -110 -167 171 87 -10 155 151 -118 3 -303 -54 -71 166 56 -2 60 256 -122 154 -67 -59 -126 -13
7949 -13 -57 -264 -309 -122 170 -115 -289 7 111 106 -123 19 -242 -48 71 -222 19 138 -5 -160 -137 58
7971 58 -93 -42 -129 -43 -233 65 -14 -51 -105 -24 200 -112 -103 108 99 -91 -147 97 -157 229 -295 -85 -57 119 176
7996 176 54 -60 -62 277 40 -98 -40 151 -69 -42 255 -51 -91 110 -123 -44 133 -51 23 125 28 163 236
8019 236 53 21 -75 207 34 -79 153 -124 -224 15 78 125 189 -154 8 -128 -134 81 161 -187 -11 182 -122
8042 -122 157 -23 20 84 -288 174 -70 250 150 107 -67 -18 -180 -225 22 -187 -48 44 -40 47 123 -71 -80 118
8066 118 130 47 -83 38 192 124 -62 -130 -187 59 192 -205 -55 75 -40 -6 74 -59 -100 -78 161 -217 99
8089 99 -124 7 -155 64 13 143 198 -27 191 103 -102 -139 -136 -86 -179 -10 -32 -46 -116 -197 213 -103 39 -223
8113 -223 -1 -46 -127 81 -164 -89 224 -112 160 76 -252 -16 -45 166 -49 7 143 204 165 44 -57 135 214
8136 214 -178 -190 -10 -178 108 279 106 18 -95 46 104 -105 92 139 -9 -48 19 47 64 -165 -112 92 178
8159 178 -3 254 74 65 147 -55 202 -255 -12 -227 88 -81 -12 67 -14 -28 -149 -159 -130 -158 97 -105 -283
8182 -283 43 -64 -83 -72 -39 -32 97 104 -56
8191e6
##END NTUPLES=NMR FID
##END=
