##TITLE=1H_Pr NCS-F6
 200.13MHz,CDCl3,
 8 sc
 
 4.7.2025
##JCAMPDX= 6.0         $$ Bruker NMR JCAMP-DX V2.0
##DATA TYPE= NMR FID
##DATA CLASS= NTUPLES
##ORIGIN= UXNMR, Bruker Analytische Messtechnik GmbH
##OWNER= pz
$$ XWIN-NMR		Version 3.5
$$ Fri Jul  4 17:11:26 2025 Russian Standard Time (UT+4h)  she@DPX200
##.OBSERVE FREQUENCY= 200.1313
##.OBSERVE NUCLEUS= ^1H
##.DELAY= (6, 6)
##.ACQUISITION MODE= SIMULTANEOUS
##.ACQUISITION SCHEME= undefined
##.AVERAGES= 8
##.DIGITISER RES= 18
##SPECTROMETER/DATA SYSTEM= spect
##.PULSE SEQUENCE= zg30
##.SOLVENT NAME= CDCl3
##.SHIFT REFERENCE= (INTERNAL, CDCl3, 0, 14.3821)
##AUDIT TRAIL= $$ (NUMBER, WHEN, WHO, WHERE, WHAT)
$$ ##TITLE= Audit trail, XWIN-NMR		Version 3.5
$$ ##JCAMPDX= 5.01
$$ ##ORIGIN= Bruker BioSpin GmbH
$$ ##OWNER= she
$$ F:/spectra/data/she/nmr/H-C/1/audita.txt
$$ ##AUDIT TRAIL=  $$ (NUMBER, WHEN, WHO, WHERE, WHAT)
(   1,<2025-07-04 17:10:26.18 +0400>,<she>,<DPX200>,
      <created by zg, POWCHK disabled, PULCHK disabled
       configuration hash MD5:
       00 E9 B6 7A A2 85 ED C7 34 08 36 98 17 FE 4E 26
       data hash MD5: 16K
       84 49 BF 7A 18 E1 CA 3D FD C3 2F 48 A3 E5 84 03>)
$$ ##END=
$$ 
$$ hash MD5
$$ 47 37 5B 5D CD E7 14 E6 DB 1B 3E 16 54 CD 82 4A
##$RELAX= 
##$RELAX= 
##$RELAX= 
##$RELAX= 
##$RELAX= 
##$RELAX= 
$$ Bruker specific parameters
$$ --------------------------
##$DU= <F:/spectra>
##$EXPNO= 1
##$NAME= <H-C>
##$PROCNO= 1
##$TYPE= <nmr>
##$USER= <she>
##$AMP= (0..31)
100 100 100 100 100 100 100 100 100 100 100 100 100 100 100 100 100 100 
100 100 100 100 100 100 100 100 100 100 100 100 100 100 
##$AQSEQ= 0
##$AQ_mod= 1
##$AUNM= <au_zg>
##$AUTOPOS= <>
##$BF1= 200.13
##$BF2= 200.13
##$BF3= 200.13
##$BF4= 200.13
##$BF5= 200.13
##$BF6= 200.13
##$BF7= 200.13
##$BF8= 200.13
##$BYTORDA= 1
##$CFDGTYP= 0
##$CFRGTYP= 5
##$CHEMSTR= <none>
##$CNST= (0..31)
1 1 145 1 1 1 1 1 1 1 1 1 1 1 1 1 1 1 1 1 1 1 1 1 1 1 1 1 1 1 1 1 
##$CPDPRG= <>
##$CPDPRG1= <>
##$CPDPRG2= <>
##$CPDPRG3= <>
##$CPDPRG4= <mlev>
##$CPDPRG5= <mlev>
##$CPDPRG6= <mlev>
##$CPDPRG7= <mlev>
##$CPDPRG8= <mlev>
##$CPDPRGB= <>
##$CPDPRGT= <>
##$D= (0..31)
0 0.7 0 0 0 0 0 0 0 0 0 0.03 0 0 0 0 0 0 0 0 0 0 0 0 0 0 0 0 0 0 0 0 
##$DATE= 1751634625
##$DBL= (0..7)
120 120 120 120 120 120 120 120 
##$DBP= (0..7)
150 150 150 150 150 150 150 150 
##$DBP07= 0
##$DBPNAM0= <>
##$DBPNAM1= <>
##$DBPNAM2= <>
##$DBPNAM3= <>
##$DBPNAM4= <>
##$DBPNAM5= <>
##$DBPNAM6= <>
##$DBPNAM7= <>
##$DBPOAL= (0..7)
0.5 0.5 0.5 0.5 0.5 0.5 0.5 0.5 
##$DBPOFFS= (0..7)
0 0 0 0 0 0 0 0 
##$DE= 6
##$DECBNUC= <off>
##$DECIM= 32
##$DECNUC= <off>
##$DECSTAT= 4
##$DIGMOD= 1
##$DIGTYP= 9
##$DL= (0..7)
0 120 120 120 120 120 120 120 
##$DP= (0..7)
150 150 150 150 150 150 150 150 
##$DP07= 0
##$DPNAME0= <>
##$DPNAME1= <>
##$DPNAME2= <>
##$DPNAME3= <>
##$DPNAME4= <>
##$DPNAME5= <>
##$DPNAME6= <>
##$DPNAME7= <>
##$DPOAL= (0..7)
0.5 0.5 0.5 0.5 0.5 0.5 0.5 0.5 
##$DPOFFS= (0..7)
0 0 0 0 0 0 0 0 
##$DQDMODE= 0
##$DR= 18
##$DS= 0
##$DSLIST= <SSSSSSSSSSSSSSS>
$$ [...]
##$SUBNAM0= <"">
##$SUBNAM1= <"">
##$SUBNAM2= <"">
##$SUBNAM3= <"">
##$SUBNAM4= <"">
##$SUBNAM5= <"">
##$SUBNAM6= <"">
##$SUBNAM7= <"">
##$SUBNAM8= <"">
##$SUBNAM9= <"">
##$SW= 18.0517328524113
##$SWIBOX= (0..15)
0 0 2 0 0 0 0 0 0 0 0 0 0 0 0 0 
##$SW_h= 3612.71676300578
##$TD= 16384
##$TD0= 1
##$TE= 0
##$TE2= 300
##$TE3= 300
##$TEG= 300
##$TL= (0..7)
0 120 120 120 120 120 120 120 
##$TP= (0..7)
150 150 150 150 150 150 150 150 
##$TP07= 0
##$TPNAME0= <>
##$TPNAME1= <>
##$TPNAME2= <>
##$TPNAME3= <>
##$TPNAME4= <>
##$TPNAME5= <>
##$TPNAME6= <>
##$TPNAME7= <>
##$TPOAL= (0..7)
0.5 0.5 0.5 0.5 0.5 0.5 0.5 0.5 
##$TPOFFS= (0..7)
0 0 0 0 0 0 0 0 
##$TUNHIN= 0
##$TUNHOUT= 0
##$TUNXOUT= 0
##$USERA1= <user>
##$USERA2= <user>
##$USERA3= <user>
##$USERA4= <user>
##$USERA5= <user>
##$V9= 5
##$VALIST= <valist>
##$VCLIST= <CCCCCCCCCCCCCCC>
##$VD= 0
##$VDLIST= <DDDDDDDDDDDDDDD>
##$VPLIST= <PPPPPPPPPPPPPPP>
##$VTLIST= <TTTTTTTTTTTTTTT>
##$WBST= 1024
##$WBSW= 4
##$XGAIN= (0..3)
0 0 0 0 
##$XL= 0
##$YL= 0
##$YMAX_a= 193718
##$YMIN_a= -224900
##$ZGOPTNS= <>
##$ZL1= 120
##$ZL2= 120
##$ZL3= 120
##$ZL4= 120
##$ABSF1= 10
##$ABSF2= 0
##$ABSG= 5
##$ABSL= 3
##$ALPHA= 0
##$AQORDER= 0
##$ASSFAC= 0
##$ASSFACI= 0
##$ASSFACX= 0
##$ASSWID= 0
##$AUNMP= <proc_1d>
##$AZFE= 0.1
##$AZFW= 0.1
##$BCFW= 1
##$BC_mod= 2
##$BYTORDP= 1
##$COROFFS= 0
##$CY= -3
##$DATMOD= 1
##$DC= 2
##$DFILT= <>
##$DTYPP= 0
##$F1P= 0
##$F2P= 0
##$FCOR= 0.5
##$FTSIZE= 0
##$FT_mod= 4
##$GAMMA= 1
##$GB= 0.15
##$INTBC= 1
##$INTSCL= 1
##$ISEN= 128
##$LB= 0.25
##$LEV0= 0
##$LPBIN= 0
##$MAXI= 10000
##$MC2= 0
##$MEAN= 0
##$ME_mod= 0
##$MI= 1.114404
##$NCOEF= 0
##$NC_proc= 0
##$NLEV= 6
##$NOISF1= 3.799351
##$NOISF2= 2.8
##$NSP= 1
##$NTH_PI= 0
##$NZP= 0
##$OFFSET= 14.38212
##$PC= 1
##$PHC0= -1210.378
##$PHC1= 20.19238
##$PH_mod= 1
##$PKNL= yes
##$PPARMOD= 0
##$PSCAL= 0
##$PSIGN= 0
##$REVERSE= no
##$SF= 200.129724274929
##$SI= 16384
##$SIGF1= 3
##$SIGF2= 2
##$SINO= 400
##$SIOLD= 16384
##$SREGLST= <1H.CDCl3>
##$SSB= 0
##$STSI= 0
##$STSR= 0
##$SW_p= 3205.1282051282
##$SYMM= 0
##$S_DEV= 0
##$TDeff= 0
##$TDoff= 0
##$TI= <>
##$TILT= no
##$TM1= 0
##$TM2= 0
##$TOPLEV= 0
##$USERP1= <user>
##$USERP2= <user>
##$USERP3= <user>
##$USERP4= <user>
##$USERP5= <user>
##$WDW= 1
##$XDIM= 8192
##$YMAX_p= 0
##$YMIN_p= 0
$$ End of Bruker specific parameters
$$ ---------------------------------
##NTUPLES= NMR FID
##VAR_NAME=  TIME,          FID/REAL,        FID/IMAG
##SYMBOL=    X,             R,               I
##VAR_TYPE=  INDEPENDENT,   DEPENDENT,       DEPENDENT
##VAR_FORM=  AFFN,          ASDF,            ASDF
##VAR_DIM=   8192,          8192,            8192
##UNITS=     SECONDS,       ARBITRARY UNITS, ARBITRARY UNITS
##FACTOR=    0.0002768,     1,               1
##FIRST=     0,             0,               0
##LAST=      2.2672688,     0,               0
##MIN=       0,             -224900,         0
##MAX=       2.2672688,     193718,          0
$$ Real data points
##PAGE= N=1
##DATA TABLE= (X++(R..R)), XYDATA
0 0 0 0 0 0 0 0 0 0 0 0 0 0 0 0 0 -8 8 -8 8 -8 8 -16 16 -16 24 -24 32 -32 40 -45 49 -56 64 -72 83 -93 102
37 102 -117 128 -143 159 -178 197 -218 241 -266 292 -323 354 -392 431 -473 525 -575 638 -708 787
57 787 -881 991 -1122 1281 -1479 1735 -2080 2565 -3303 4556 -7062 14012 -76827 -224900
71 -224900 -7071 151338 78216 -61582 -81962 4020 42447 6306 17572 1548 -53908
82 -53908 -39294 22360 38464 2942 -48311 -32146 25353 26778 -7614 -12242 -3850 3196 5482
95 5482 1794 361 -811 -4115 -1800 1487 1858 418 -488 -1818 -1036 1576 1571 -2931 -1316 2049 -2637
112 -2637 -4828 895 3150 777 -4344 -3703 3865 4962 -2430 -2564 1654 1804 -605 -1800 641 1598
128 1598 -1457 -1372 1342 396 -828 -370 1326 100 -1597 -579 1237 -629 -241 627 -641 -930 -227
145 -227 1449 2405 -1556 -3234 727 1779 -629 -1910 -1702 -1 412 -1206 -11 1374 -495 -1178
161 -1178 757 1029 281 -870 -616 532 273 -692 -187 337 -166 -62 -18 52 -111 254 -31 -960 -727 117
181 117 -146 -366 -215 155 267 -811 -499 1389 690 -1329 -1112 550 1506 -79 -2227 -626 906 -331
199 -331 -538 -88 -451 -470 187 820 979 -239 -1086 373 1276 242 -824 -1411 -335 996 275 -735
217 -735 -353 296 -6 843 744 463 -271 -732 356 1593 -394 -1692 -526 612 749 -24 -600 310 937
236 937 -48 543 850 -244 -176 -41 418 436 -210 -794 -266 750 -162 213 -136 184 742 -103 -345 365
256 365 409 -355 -106 418 -78 -124 -553 -274 503 144 -273 302 220 -93 198 218 206 267 112 152 -26 -11 -88
279 -88 266 -30 164 -95 -105 165 -71 179 142 -269 -92 77 309 326 -246 -138 154 -125 -279 -82 -49 -218
301 -218 41 -85 -264 135 74 -19 335 161 160 391 52 194 464 -387 -68 60 -10 -150 421 184 26 272
323 272 -167 263 140 -369 -101 46 -153 113 135 -297 135 -198 -305 157 6 95 89 35 138 279 240 242 -1
346 -1 -63 101 162 -79 141 -113 115 260 -96 42 24 -57 -23 -30 -32 28 17 22 170 4 -169 14 53 255 209 -175
372 -175 -156 -186 -95 -281 218 -425 -61 291 -3 49 111 -111 -7 315 -562 168 9 -392 -172 -357 0 -84
394 -84 153 -135 227 164 325 212 -16 -75 -6 -240 -122 -369 -20 -277 34 3 -49 3 -97 47 -52 -95 81
417 81 -260 -238 -113 140 13 -230 -7 -337 54 -34 56 -174 52 -38 -1 -67 220 -204 -138 61 262 -104 18
440 18 244 -65 57 243 15 6 -241 -46 2 -123 70 170 -39 -163 -375 -41 92 11 152 -83 -21 -286
462 -286 -39 30 -35 232 -127 96 121 227 -41 299 -180 -52 174 -84 -232 -134 -116 218 174 17 -100 -154 202
485 202 0 23 83 52 235 -77 72 330 -20 21 -217 201 -147 -200 90 94 -134 -133 45 -25 -159 -33 347 -75
509 -75 24 235 57 -10 -245 26 127 77 -181 -299 -114 -16 -136 -154 -4 -212 -140 -114 -48 -39 -108 -20 58 68 -135
534 -135 86 -366 5 48 153 239 90 -218 -39 48 43 202 -358 -204 11 13 -113 346 159 -88 -40 -124 25
557 25 341 -118 99 275 25 -227 161 46 122 36 -150 166 -62 -161 -208 -110 226 210 -50 -22 66 -144 -103 109
581 109 -46 -26 144 -9 81 -230 156 -241 284 25 -189 44 140 -62 -175 314 87 94 -176 -167 -2 233 -110
604 -110 -13 -264 117 154 -93 143 -44 41 -211 182 160 118 50 -209 -55 -204 151 50 -33 -98 -173 -9 -360
627 -360 -1 -21 339 -285 -292 -88 -347 26 -532 57 -83 -215 190 61 -82 -99 175 -188 2 -251 36 11
649 11 9 6 -280 -112 8 50 -177 -232 49 382 -8 38 -133 -128 -69 -88 45 -129 35 62 60 -204 51 100 146 290
675 290 -82 -50 145 265 -128 40 6 -139 155 -135 103 -29 -97 77 -73 137 80 165 31 -7 19 110 -37
698 -37 126 105 5 -55 -205 -32 194 -125 126 51 -212 -146 -208 100 117 -16 104 -81 5 7 -142 146 189 2
722 2 42 -19 131 -280 222 65 -113 161 -57 -174 -83 -235 -348 -136 124 -230 18 -59 -298 -50 -33 104 103
745 103 -281 89 225 -39 -159 -120 -156 -38 -229 -92 157 6 -146 -133 178 -165 72 -126 65 -52 122
766 122 -183 67 171 -136 -69 -169 298 131 137 -67 46 -162 -144 83 -1 -64 -12 26 222 -4 -90 138 64 -254
790 -254 -132 -135 -248 42 -43 -81 -162 -249 -344 -178 -77 -10 194 222 36 -154 38 251 161 226 123 123 -52 -180 -188
815 -188 25 108 27 112 82 -169 207 -4 -247 57 12 -20 -215 69 -44 -149 -36 -232 84 95 143 -111 -114 -118
839 -118 -70 -45 -184 -66 106 289 104 -61 -161 -125 255 -103 198 -120 86 235 52 169 -187 300 124
860 124 75 8 -29 -164 319 -16 62 372 38 209 43 -113 130 174 -121 82 -134 -104 203 105 -41 -242 105
883 105 -121 145 222 42 -45 -174 -69 -28 1 -97 -40 -189 -95 -131 -128 106 -14 -85 77 -142 -174 80 -75 51
907 51 -5 -114 91 -468 -35 -147 -166 0 -78 -132 272 42 -50 72 79 -216 -77 -345 -149 258 34 86 -362
930 -362 -41 23 -119 80 113 -198 -177 -1 149 -379 -191 226 -95 -37 -207 44 48 54 231 -76 120 129 264 130
954 130 -26 241 106 -36 12 -220 -301 45 135 -3 11 -48 178 -325 -202 192 63 178 186 24 -123 190 -103
977 -103 -72 110 63 -166 -507 -131 59 215 190 30 -118 113 -124 -104 101 112 80 38 131 12 -99 -176 -88 189
1001 189 11 195 -67 -234 -259 11 167 101 -50 50 136 -68 -233 -97 25 115 -452 -73 364 -256 125
1022 125 -10 39 158 92 -177 77 -69 3 -281 -99 88 169 83 -18 -174 -10 147 31 -151 189 -7 -55
1044 -55 -39 46 -243 23 75 126 -32 -18 -78 -101 178 161 75 85 -7 120 -189 -214 -69 -44 114 127 -216 -139 188
1069 188 41 22 131 418 -42 -222 -116 -45 274 22 -237 3 -61 156 140 192 198 -104 -168 158 79 -85 -66
1092 -66 1 37 101 142 55 25 53 91 207 -14 126 -1 -103 -94 -250 118 39 1 -79 26 23 211 -49 225 140 2
1118 2 -6 -115 -61 -39 187 72 165 75 -117 -22 181 -111 -214 123 26 209 93 2 -48 -161 32 -130 -142 290
1142 290 -30 3 -54 -141 -36 -51 153 5 28 -83 -405 192 -2 -149 -182 -18 -51 -15 47 17 -24 181 108 90
1166 90 -1 -216 -48 -115 -10 348 74 -68 26 57 -83 -224 52 -171 38 -307 143 13 297 134 213 -276
1188 -276 -165 -182 -283 -220 17 -45 -224 21 -189 -76 -127 -148 -157 228 175 -115 -356 -87 130 154 23 35 -8 -90
1212 -90 170 7 173 188 264 314 116 -269 97 -258 -167 -62 -98 -102 9 47 -66 -131 76 166 -193 -3 -27 175
1236 175 -371 -67 -290 -253 133 287 -34 163 -149 -182 13 288 -38 36 -209 -208 -241 -209 113 324 -120 -158 -120
1259 -120 -139 -167 -168 -154 65 -161 -134 -12 124 77 -46 23 -142 15 -72 -65 -81 -24 -30 314 -59 147 -36 -80 11 -96
1285 -96 -161 29 -148 -312 -174 8 46 -246 -14 -9 55 -107 -222 38 7 -90 278 -100 -11 58 54 132 28 -265
1309 -265 -6 -30 -155 110 255 -184 -111 -27 -44 202 174 161 5 130 -105 -60 68 -107 73 67 213 -151 215
1332 215 -165 25 105 -112 -265 65 17 -173 122 -135 -144 -220 58 -49 -110 -273 160 90 114 159 -21 59 -106
1355 -106 30 133 23 180 -366 91 -60 -39 168 -217 116 -189 195 -19 267 -11 -150 54 -149 -112 -3
1376 -3 99 73 66 51 52 -76 44 -156 151 75 -87 -246 -50 118 47 81 -335 207 -29 69 -58 121 -8 -16 -77
1401 -77 51 91 187 -125 156 -144 66 -164 42 122 -88 -71 363 41 71 124 -204 -217 -22 131 -199 -116 -33
1424 -33 119 199 39 -163 -169 -45 -9 -11 -108 105 -5 25 54 24 25 -112 -155 -100 -176 140 -81 160 -20 33 58 64 -109
1451 -109 54 8 63 -534 -3 -255 95 -139 -12 -74 -50 129 -1 94 110 76 60 142 98 51 124 9 -210 -178
1475 -178 -89 -58 -288 -47 -16 -90 83 -164 -30 38 73 305 -156 -113 -42 -290 98 -184 -131 110 213 -53 59
1498 59 17 172 -162 -45 194 -75 248 -93 -105 -38 20 -108 -37 -363 127 -66 4 318 38 -46 -83 -124 -91 -18
1522 -18 18 79 -178 165 274 189 28 -177 60 -162 -65 -43 89 307 19 -281 -167 21 -70 -52 24 -39 299
1545 299 -98 -29 -50 -18 72 -104 22 -137 -139 39 139 18 -231 -164 18 -10 132 -95 -19 -15 -167 -281 -178 -30
1569 -30 283 -156 -179 174 -40 62 -443 -67 240 82 -10 104 -193 -89 -85 149 142 -126 133 -112 -67 -35 -362
1592 -362 -89 -222 174 -96 31 -184 45 104 64 -58 31 52 10 -40 -50 149 -26 314 -198 -169 94 226 105
1615 105 -195 70 33 -165 -189 61 73 -86 223 -12 -152 145 39 62 179 -46 -131 -160 -106 -41 -36 180 233 179
1639 179 -143 -7 -135 -156 18 -164 92 -145 -175 -194 51 -71 -128 -23 319 -61 230 324 105 225 103 -18
1661 -18 409 -90 84 -28 -102 49 -158 -97 -28 21 -116 -44 -5 186 -2 170 77 10 93 187 -1 -100 263 142
1685 142 -241 102 49 251 -250 41 239 110 5 21 -173 -104 -69 219 -153 195 -194 -44 207 -182 67
1706 67 -44 128 -51 217 46 8 -211 -93 -38 127 135 -112 -55 95 9 -290 17 -102 -42 53 -116 24 96
1729 96 -10 145 203 -10 117 216 179 91 39 201 158 -1 -153 18 209 24 -146 -38 229 65 -44 267
1751 267 318 -80 47 -236 196 66 -38 94 200 267 -100 -104 16 -254 -93 8 -196 117 -121 -312 -113
1772 -113 37 18 411 114 128 -15 105 -88 -197 53 -52 155 207 408 18 -43 -112 -56 -216 -5 -136 165
1794 165 -41 -142 55 41 -119 -177 58 -356 -53 30 -200 238 107 -131 247 93 68 -61 232 -107 -8 80
1816 80 -56 116 105 -197 126 72 -50 17 7 11 -226 135 -79 -65 115 132 356 172 196 -90 209 -21 -78 216
1840 216 -333 23 62 110 154 -164 -200 63 120 -47 -51 -212 18 259 259 157 -66 -33 -61 182 -23 186 -32 -18
1864 -18 -62 -138 471 7 -64 18 -220 -112 62 -48 -265 -231 -23 124 88 28 176 -336 -139 235 141 -39 -192
1887 -192 10 -35 -148 -47 -50 191 254 326 80 93 -158 -25 40 57 -40 -8 11 398 -127 122 109 111 79 219 -127
1912 -127 147 -116 -61 -78 -48 165 -228 218 -35 69 32 84 -176 178 -26 330 43 4 -70 -148 -87 168 -90
1935 -90 207 115 -188 174 -138 -19 78 -64 -20 143 -59 -283 94 227 -237 116 -135 83 -38 207 -21
1956 -21 -184 -301 -71 -160 4 75 53 -152 -124 348 -1 103 -30 16 125 -41 209 21 103 29 -19 -147 358
1979 358 -13 150 32 -44 -126 254 106 135 150 68 284 25 -3 -107 -208 -102 87 13 -103 43 19 -68 -21
2002 -21 12 -218 -31 -90 -45 -134 -30 78 -33 71 130 169 142 -35 22 252 -121 303 32 -45 -30 -61 -116 -78 -64
2027 -64 -1 -52 -302 233 94 54 80 309 -310 89 86 -27 156 -3 186 29 -131 91 170 13 233 202 13
2050 13 364 -166 -78 -47 -31 86 -53 54 30 -148 -96 288 -49 -313 -230 -173 26 -164 49 -112 -305 58 40
2073 40 -143 -92 -140 112 -131 -125 -22 -98 -38 -37 -68 -343 -71 221 -171 54 304 111 34 -134 147 1 84 -222
2097 -222 -298 102 189 18 25 -3 -110 179 -148 140 218 7 161 -67 153 45 81 -220 87 -5 -81 69 92
2120 92 -60 -145 -129 -109 58 3 63 16 80 -70 166 214 -64 261 -9 -41 -107 -142 161 65 160 85 -224 -44 -2
2145 -2 8 63 133 -85 71 -6 174 229 -52 -41 -138 -41 66 -79 185 -124 46 -298 -119 -337 213 -282 -181
2168 -181 -399 -7 -68 -86 157 -206 67 -34 -2 208 -62 -74 16 110 391 -158 -11 -139 19 -168 151 94
2190 94 127 -128 31 -206 157 -36 -152 106 143 -502 109 139 142 166 196 190 274 76 22 133 10 169 83 -46
2214 -46 -327 27 241 31 81 -267 -55 -184 -58 -63 -198 -212 -119 23 144 -120 -132 135 32 31 -95 -202 140
2237 140 -65 -78 6 104 -198 -76 95 46 -5 -126 229 140 -72 39 -13 -94 -82 -474 229 -12 -197 -97 145
2260 145 -87 93 -11 136 -57 137 179 131 -108 -61 214 -11 125 28 106 75 25 30 389 -77 29 109 -52
2283 -52 66 138 71 288 85 36 -74 35 178 -381 46 225 -197 -34 187 38 -252 -230 -234 3 14 -80 -21
2306 -21 -270 96 -3 -43 -113 235 -220 -151 -150 -60 -15 53 -216 33 -33 -80 -14 -100 -16 85 20 115 -79 -63 253 -223
2332 -223 -233 235 -46 64 -59 -119 -137 65 115 12 161 134 -121 89 17 213 43 -58 151 116 -231 -25
2354 -25 276 -191 210 -69 124 13 -98 -114 121 266 -245 -164 49 -56 -12 -195 3 64 222 -20 -73 210
2376 210 -115 -95 180 -103 112 175 -30 -248 -92 -24 -155 -124 -252 -282 301 59 133 -255 21 -3 52 -75 -16
2399 -16 -104 -34 -24 125 -256 -31 -3 57 126 7 -112 -5 116 175 -109 217 -212 -312 114 36 190 82 -26
2422 -26 205 228 11 -79 119 99 5 30 135 26 212 -75 -76 81 250 65 -6 76 24 -214 156 -212 -156 469
2446 469 125 -155 -78 -144 2 -152 -15 -253 -55 38 31 -96 -277 -30 133 33 -20 32 114 17 333 -188 129
2469 129 129 -299 105 -82 -3 -99 4 20 12 224 66 60 66 -13 196 66 122 75 83 170 -99 -102 -121 171 111 -94 23
2496 23 5 259 -18 107 210 91 64 13 -117 -61 -134 165 67 -150 18 -164 -89 94 82 -71 53 -137 8
2519 8 84 69 91 148 136 5 -229 -138 -233 -80 -25 -60 -99 88 -63 19 63 12 -168 -140 137 126 -30 -38 104 -196
2545 -196 44 62 83 238 107 320 -63 26 26 104 -149 -158 -76 -148 43 21 -71 279 213 -18 67 41 136 281 -166
2570 -166 201 55 181 220 -44 19 200 -196 211 -131 64 -62 -332 -244 -158 -67 -126 -175 30 -208 88 151 -78
2593 -78 54 140 57 -144 187 24 -19 11 105 181 231 4 24 -15 148 384 148 117 -29 -190 137 -145 -106 230
2617 230 2 -173 -46 -80 -66 213 36 -126 39 -300 -39 -14 109 88 -211 -134 -14 -73 121 23 101 -62 86
2640 86 243 -78 -175 -70 -214 45 232 136 189 137 -137 108 156 -18 121 -220 -52 -279 -81 246 23 -20
2662 -20 -105 11 -39 -57 -270 23 172 49 -76 -26 -45 -228 -23 174 57 235 -199 -7 -229 16 -147 -221
2684 -221 -70 -19 27 78 190 -18 -34 167 213 -212 19 258 -74 -103 -260 -104 -180 -46 15 -8 210 -138 -224
2707 -224 234 -61 -86 -131 47 -244 -10 31 50 215 59 -60 37 -71 174 -33 171 -50 118 -109 38 -87
2729 -87 -93 -49 103 -262 -21 197 -100 -194 82 137 -234 237 163 59 -102 -20 -30 39 -108 -67 -89 -155 309 -70
2753 -70 -115 -69 -84 32 -12 164 -164 -13 -149 39 71 146 -79 -111 -14 0 -133 -122 -376 -169 367 56 -68 263
2777 263 -64 4 -243 -164 34 113 -5 101 -79 71 -285 6 81 -15 -2 -307 -59 16 -12 -123 -108 -42 -242
2800 -242 119 -300 -192 48 251 -214 -152 59 127 -15 75 168 7 119 -137 -145 75 254 -15 33 -142 -105 334
2823 334 306 -41 104 143 21 -46 -101 115 -45 83 -61 12 -221 -17 -4 -327 -158 111 34 180 -2 141
2845 141 13 -111 -99 -280 13 114 -166 59 81 -138 325 -6 -59 177 55 -47 75 -225 10 -255 -182
2866 -182 189 -33 -262 106 37 -73 42 58 -38 110 -198 -238 -371 -281 141 218 76 -63 -67 -207 -32 156 135
2889 135 -189 -75 25 234 142 11 60 122 395 26 285 199 170 301 70 255 -177 -160 173 150 41 108 -34
2912 -34 187 89 -378 27 57 -52 -8 -188 12 -129 -109 7 -202 -74 -32 184 30 -35 91 -191 135 131 -85
2935 -85 -251 -178 -214 92 -230 -26 89 -223 -192 -173 -52 -55 270 -35 -50 235 -232 117 -66 -3 -15 33 -109 25
2959 25 -44 141 53 -188 -137 -39 96 13 -213 117 135 21 -99 -15 -7 9 -233 214 -29 -18 -153 -34 -182 -130
2983 -130 -46 81 5 -216 74 93 -12 316 14 45 202 -25 311 50 238 -169 181 86 150 -59 138 -311
3005 -311 57 -98 -79 -142 66 -156 44 102 -200 6 -197 279 41 176 49 -33 -212 -90 -252 80 -123
3026 -123 -142 -1 -37 177 -38 161 178 110 -237 68 -176 26 -94 -52 -2 -12 146 -9 -96 53 86 -61 7
3049 7 94 86 175 4 -86 68 -165 -178 -8 2 -65 -17 -5 -200 45 -183 -125 -20 75 -106 144 17 -87 37 199
3074 199 62 -167 291 -248 172 127 61 76 -21 -106 -173 49 56 228 104 54 -100 -106 170 44 242 -128 132 63
3098 63 -330 -205 66 165 -32 -180 -212 -30 -101 -119 165 49 164 7 -98 -41 167 30 75 -59 -97 -58 109
3121 109 -105 226 10 -124 174 51 9 90 15 213 -11 12 58 -307 -178 -112 83 -24 -119 76 58 -22 -84
3144 -84 -176 -173 -154 -200 87 -32 47 114 103 85 -191 -14 42 101 -71 -126 -199 119 92 -338 53 -208 -139 -106 -204 -131
3170 -131 107 448 112 -26 216 -288 89 37 -178 -51 -108 113 179 90 52 -3 -5 41 -14 8 79 43 -66 240
3194 240 -16 -10 126 -30 -39 65 149 -69 57 75 -186 -126 -138 30 59 -104 90 121 256 113 -111 119 -116
3217 -116 106 -210 -92 19 111 70 142 -32 -62 -109 64 -67 -31 177 -45 -185 -87 -94 -225 76 45 69 -63 23
3241 23 108 224 -31 -55 -103 -123 34 -229 -332 -4 187 -132 7 -54 -27 -106 121 23 25 -72 60 114 -27 38 -55
3266 -55 -146 -22 214 51 144 -197 -20 23 2 12 -250 270 32 -173 -84 77 112 -76 16 -22 50 -49 -387 -198
3290 -198 0 92 -197 -184 32 -101 -140 -48 28 -81 33 48 132 212 -100 -158 -216 33 109 197 -103 -179 -196 -126 108
3315 108 54 95 67 154 76 -214 251 146 -69 36 -72 -174 -209 -55 -153 10 -141 93 8 -217 -358 -228 331
3338 331 -77 262 293 -163 -109 -335 35 120 28 18 12 -109 -48 157 94 -5 71 61 -7 56 298 108 -54 -48 281
3363 281 -251 -75 -1 -87 3 84 127 -173 125 178 65 -11 277 337 158 16 3 54 -173 -111 -65 -172 83 69
3387 69 -26 -171 16 -58 -21 -71 -313 65 -83 -158 503 -111 -39 47 55 -71 -225 283 67 -67 -33 30 -234 -69
3411 -69 68 -80 4 176 326 -35 -365 -217 -71 33 -29 134 290 -105 -18 5 52 -129 14 -53 102 -166
3433 -166 -152 79 -240 124 35 229 -47 -43 -8 -71 -133 -80 -22 -53 -275 -61 -85 57 48 -62 35 68 -157 -134 261
3458 261 307 82 38 -177 3 65 -388 -381 -83 91 -56 -78 66 -235 -2 109 -45 40 110 -79 -290 -262 10
3481 10 108 24 85 -140 -53 185 197 -122 45 -256 -156 9 246 -104 123 54 -18 35 -112 346 -27 34 -172
3504 -172 -100 -293 -38 136 334 14 188 111 -34 349 107 -15 207 -266 183 16 241 -23 29 178 -87
3525 -87 97 148 16 -194 34 -158 -72 91 -54 -445 -147 11 126 -105 22 -355 48 -359 -165 32 -88
3546 -88 -132 -297 -164 108 -232 75 107 -249 -10 -202 -218 167 71 174 64 -110 27 -20 -52 18 -244 18 -85
3569 -85 -17 74 -59 79 -354 -75 163 -22 42 -118 159 -178 41 144 176 -68 60 136 -305 1 212 134
3591 134 -29 26 -90 133 74 -19 -100 -206 -273 76 -46 295 10 74 77 -15 -203 134 18 -166 28 -17 -109 130
3615 130 -169 137 -30 -338 -80 -15 42 -78 259 -81 -65 5 21 126 128 85 163 91 -149 83 226 167 24 -28
3639 -28 49 255 132 -270 20 39 -276 -95 5 143 -58 -37 -127 296 232 -96 -90 -307 -17 -36 -48 -74 38 110
3663 110 -1 137 -61 99 68 -132 -214 -93 -171 -143 54 184 -126 25 -14 221 36 25 88 -459 65 78 -62
3686 -62 -34 98 -76 -34 -189 -165 -193 59 184 57 172 -223 90 -209 199 -207 0 -127 -72 149 -124 -39
3708 -39 119 154 -113 -53 -147 127 -16 -101 -28 197 39 -92 -71 17 -2 -1 213 134 -11 65 -92 -41 88 -17 -196
3733 -196 -275 -133 144 -33 -41 264 -106 -78 -127 148 -7 -202 98 108 -202 148 -6 -85 151 -93 -76 -193 -14
3756 -14 -67 180 13 -71 -182 160 56 -120 -53 27 -119 231 155 41 -49 -51 185 -4 -10 -171 306 313 -268 -151
3780 -151 38 57 -113 27 92 -53 240 -92 55 -12 -178 104 -99 -12 -219 -115 -194 -50 -111 108 85 18 -70
3803 -70 364 -21 -195 81 -296 -61 5 125 41 48 -59 -156 217 -129 -31 -94 -215 223 114 -60 -73 -92 -113 -149
3827 -149 -108 -94 16 -13 -110 42 -82 101 98 -228 48 -305 -12 86 147 162 123 -34 50 -43 85 28 29 75 -122
3852 -122 264 126 -48 26 -87 104 -58 -130 -112 -214 -67 -196 -87 18 63 -54 47 -204 147 -15 -27 -140
3874 -140 9 -102 31 56 355 19 -150 -135 -58 -156 -133 313 101 89 -77 109 224 -2 74 129 -192 96 -67
3897 -67 -61 104 127 425 119 199 -5 -148 -187 50 -61 40 -274 -82 -151 39 -48 18 -142 -85 -78 -106 363 -35
3921 -35 288 -10 20 21 247 183 86 -158 158 118 4 208 -15 66 -62 -113 -49 -64 197 50 192 6 -58 -2
3945 -2 154 -49 147 -16 57 176 131 38 59 78 67 28 -58 70 320 328 -42 -19 230 206 115 -61 169 138 -238
3970 -238 -96 -10 275 -66 18 185 -115 -126 -200 42 381 66 47 -73 169 -35 -199 -2 136 41 1 48 -46
3993 -46 122 -169 -113 -55 28 97 -87 -6 -168 93 -238 -80 393 -70 -88 -96 17 -67 -63 -196 212 36 -105 -49
4017 -49 -189 297 31 -120 -62 85 -58 33 -118 -134 139 65 -54 -114 -129 56 -49 63 -28 -14 83 113 -328 -6
4041 -6 -4 -205 -212 -156 66 -117 128 -115 -75 105 5 73 212 -194 -16 -23 1 -49 66 -57 -62 -227 -25 -36 -75 121
4067 121 -182 43 -250 143 58 217 -135 114 154 140 129 -86 -12 -101 -102 -126 83 -236 -93 -41 158 -277 -62
4090 -62 41 -245 455 -156 46 -85 -9 150 158 26 23 152 -133 162 44 -76 300 16 67 -319 113 268
4112 268 165 -192 74 100 -195 11 101 -159 -73 120 88 -143 1 -298 23 -85 85 24 326 124 94 -11
4134 -11 288 28 -57 92 -65 -201 -63 -217 12 -54 398 11 -299 248 -29 133 113 -11 15 25 -33 131
4156 131 13 -50 26 -128 128 -117 -20 59 343 -102 -52 55 -52 -22 -26 152 -261 122 -192 -93 197 -115 17
4179 17 -6 117 -40 -87 419 -192 33 304 -91 214 -161 122 99 -193 2 -227 14 86 -64 76 -38 -1
4201 -1 53 -64 195 -25 173 14 -90 -66 98 -109 -219 251 114 36 71 163 216 -290 36 -16 99 -49 108
4224 108 58 163 272 -84 41 57 125 171 28 -199 -252 -71 144 -210 -42 -30 254 -40 -59 -27 148 -84 -66
4247 -66 -114 -161 59 -11 -168 -197 41 -29 -52 -60 -245 -212 -132 7 -152 -244 243 38 78 -68 -14 281 -19 293 46
4272 46 -272 -84 -60 -111 114 109 -34 -86 -212 31 -16 -97 46 94 33 -108 65 52 131 12 61 -81 167 233 -166
4297 -166 389 173 126 76 -404 -445 155 -188 232 -29 255 -52 10 -56 -11 155 38 -102 103 397 78 80 -133
4320 -133 158 -48 -94 270 212 -14 -8 -261 195 -106 105 -2 -48 33 -86 -124 -141 -64 -233 -225 -84 103 -47 104
4344 104 115 77 -192 -7 182 225 86 42 -138 160 -28 128 94 76 107 158 94 165 -252 -49 204 -53 -48 -261
4368 -261 -17 115 51 7 -127 -28 -22 154 116 61 164 -2 4 17 111 -56 7 47 -149 -67 -106 -39 -61 -81 117 35
4394 35 25 27 34 185 70 158 -150 331 126 8 44 -127 -98 -142 13 140 -17 -33 51 -201 -47 7 13 72 11 173
4420 173 -239 95 5 39 -47 -119 -5 -310 26 287 -34 -114 -11 -22 14 -64 40 -76 -34 146 -45 74 -28
4443 -28 99 61 -66 78 -97 -142 -173 -75 203 -99 200 146 -140 -27 298 31 45 84 106 25 -257 172 -85
4466 -85 -15 -153 -217 12 53 92 144 82 -125 -40 -125 -3 136 -151 -28 -67 114 -17 180 35 61 -2 164 105
4490 105 -45 -129 -23 159 44 -223 -36 -118 55 -47 199 -244 -148 -204 -136 -188 85 -57 67 64 7 226 -250
4513 -250 137 82 -156 8 217 91 53 -76 -128 -171 -168 36 12 -36 121 -4 249 -143 -121 108 -119 201 -100
4536 -100 -279 -191 258 -13 -224 -187 60 294 -125 165 -42 -144 -95 47 168 8 43 29 11 92 -249 -184 -45
4559 -45 -292 -203 163 -194 66 310 73 -5 -94 -211 168 118 185 -59 63 269 -20 146 -181 -190 67 -230 -268
4582 -268 66 89 -185 -235 2 -68 -23 -91 50 91 -44 -62 -218 84 196 86 257 -73 186 -202 37 -39 -59
4605 -59 35 -190 83 116 21 -192 -92 -27 250 96 -97 -31 -192 0 113 -69 -169 69 -5 -260 242 -103
4627 -103 -39 31 344 -188 -284 177 -154 250 -256 39 71 -244 63 191 137 -71 -6 57 -156 177 19 283
4649 283 -95 57 -72 55 -44 -112 351 225 -39 20 140 -152 212 -193 23 -16 97 58 102 286 130 33
4671 33 -149 28 78 144 -43 68 -243 20 224 190 77 -77 -49 -41 -56 5 -46 84 -107 84 -62 2 -105 -201
4695 -201 -89 -139 75 -266 -33 19 -238 -42 -63 -185 127 34 -63 220 78 194 5 5 -29 -215 -132 -76 36
4718 36 -3 -7 54 31 -15 58 29 -117 -35 167 164 -138 44 78 -173 -78 -23 44 9 12 -65 111 -45 -68 172 61 82
4745 82 -222 206 132 -73 -383 -257 27 86 84 -32 349 48 -23 37 -150 -106 237 199 -5 1 81 28 -21 -103 -1
4770 -1 -85 37 233 13 -156 234 -151 92 255 52 -211 -1 30 -155 14 -53 126 37 -12 92 -100 -222
4792 -222 24 -165 -28 259 126 -17 97 -23 95 146 -8 97 62 -92 201 13 -97 183 -96 12 63
4813 63 -29 -41 -103 235 -122 -17 1 -13 -181 164 146 206 -11 190 88 16 -322 -281 -112 -234 435 233 -151
4836 -151 113 4 110 125 -135 168 96 46 -8 49 54 87 261 64 -212 -319 25 -51 107 157 -114 195 37
4859 37 -135 -53 19 209 196 -15 79 -78 -207 -70 14 -276 -371 -314 145 -230 181 -166 137 -35 178 145 -28
4882 -28 26 146 -145 -97 61 194 105 17 -220 96 -191 -147 72 -50 -115 44 51 -218 -47 -105 2 244 -59
4905 -59 -234 -8 113 -170 112 -66 -138 185 -112 64 83 65 -34 -41 -251 -85 105 7 167 266 -38 125 73
4928 73 -49 -136 -201 -243 -73 -114 -37 -93 48 148 133 22 -56 93 278 70 -145 296 -23 34 37 428 93 23
4952 23 73 70 -50 142 -96 43 91 -107 -70 -19 149 -8 73 162 -143 -27 -132 141 -22 -118 60 45 117 105
4976 105 -240 92 160 -128 150 137 -352 293 25 171 -261 -90 -127 78 -151 275 -252 -62 -242 43 -173
4997 -173 -148 -45 15 1 -64 129 -124 -35 -58 -68 -258 13 -66 -92 29 248 68 259 -154 -259 -109 -96 -55 390
5021 390 25 106 203 156 34 -46 -52 115 188 227 67 -59 -223 -85 15 -115 72 75 58 -273 -38 143 -108 46
5045 46 19 -238 162 -29 134 123 -37 56 129 -126 143 46 275 123 -206 -79 -173 46 119 50 27 13 75 78 -245
5070 -245 98 71 228 93 5 -103 22 -13 176 373 64 -51 -219 216 -18 -184 22 -69 54 50 102 -88
5092 -88 281 139 -116 21 122 -45 -71 -123 -143 259 -15 -232 63 41 164 61 136 219 182 155 45 44 -3 -59
5116 -59 -197 -9 -5 44 -17 86 128 129 31 -293 -47 -155 18 20 36 -69 -50 10 -56 -69 -15 39 26 73 36 6 -48 175
5144 175 -16 78 112 56 -44 47 -4 -36 -159 50 -22 21 -234 -168 176 298 -53 -174 -54 108 63 109 13 -235
5168 -235 -153 -32 -161 -3 -138 -236 108 28 -293 95 -194 -135 7 -54 90 -124 111 160 21 9 -17 90 53
5191 53 -13 101 -72 -6 10 -22 -176 206 9 -43 -21 5 37 -200 100 -26 87 133 173 211 -225 -94 90 28
5215 28 229 -29 -118 227 -126 77 256 134 -27 14 -13 133 235 80 89 110 -67 -39 -24 -44 -20 -119 -48 141
5239 141 -127 177 263 228 221 -146 -47 -112 121 442 195 86 -15 133 -55 13 -94 -98 -33 91 -205 -198 -24 -93
5263 -93 -94 -225 67 -8 -74 55 184 23 49 -33 -25 81 -195 -172 -78 60 -79 -283 -173 -37 168 87 43 -228
5287 -228 -40 -157 154 89 69 262 -94 -41 -72 -145 297 -34 55 -375 -130 -4 166 -51 47 28 -194 21 144
5310 144 224 -102 -13 129 145 -100 -73 -15 97 -49 -205 -87 -225 87 82 73 86 81 -278 -48 -135 176 197 -117 82
5335 82 -40 -41 -157 -83 -117 19 -62 -73 108 203 -28 -128 -126 238 -128 103 -5 -80 -85 -119 112 -48 183 -129 144
5360 144 328 8 -42 -40 -159 59 109 -82 -377 54 284 141 226 -26 273 144 88 146 -77 91 -1 20 -160
5383 -160 35 -25 -181 110 88 271 -68 198 -236 213 122 130 -214 -3 159 115 -15 -167 251 14 37 142
5405 142 41 28 -30 -89 -97 2 -64 -17 -69 -114 -178 -105 -278 404 -223 -70 -66 28 39 115 -160 130 -20 -85 194 0
5431 0 17 -93 -201 58 -74 101 -364 243 -43 -68 221 -156 112 -126 155 223 176 -189 266 -216 180 -13
5453 -13 142 71 -72 -4 -249 -10 84 194 6 298 182 236 -15 34 -91 -65 22 -60 -19 -148 75 193 -9
5476 -9 215 -138 -73 -83 3 -24 11 94 -33 185 -87 -122 -71 -123 -144 39 -148 38 109 -70 171 -191 89 -341
5500 -341 -222 121 -296 -169 -97 18 75 -23 299 -62 247 -8 -111 -137 17 -31 20 -246 -200 12 -20 35 -7
5523 -7 208 -86 -34 -289 -33 155 -264 120 91 20 214 104 130 -137 303 173 -90 31 -118 62 133 64 -202
5546 -202 140 -15 -13 170 -45 59 -74 -173 -70 76 -102 80 -52 -12 70 295 83 33 -188 3 141 -14
5568 -14 -162 -100 -68 101 -178 60 -152 -240 59 41 19 335 -117 -79 -100 124 3 -203 -6 68 -47 -93 91
5591 91 45 -88 115 72 -104 132 -72 -23 -113 280 166 -95 -50 -60 65 162 95 232 1 63 21 156 -163 159
5615 159 194 194 195 90 164 92 36 41 -147 99 -198 -86 57 -82 95 -258 78 -101 138 196 184 -129 63 25
5639 25 17 12 92 222 -215 -177 -5 -99 -224 24 193 66 133 -176 15 -59 90 302 24 -175 -165 167 -14 142
5663 142 -146 19 182 51 119 -102 17 -37 -226 -52 -148 308 -35 226 -199 -21 84 201 82 -223 76
5684 76 166 -161 -133 202 80 -127 12 215 -203 3 56 18 62 -294 93 125 -127 194 -356 -102 175 -108
5706 -108 60 5 133 -36 146 -260 -103 -109 -254 316 -76 -120 -167 119 -187 -21 -203 -51 -10 -154 61 439
5728 439 211 218 40 33 9 -35 -84 -60 -77 -93 15 -286 64 159 -287 46 21 -39 -216 -87 247 -197 131 -57
5752 -57 228 -9 44 -78 16 220 72 -142 -132 151 116 106 34 -74 59 30 -277 -81 -302 64 48 -12 336
5775 336 -84 -177 17 -74 -79 114 167 67 72 -241 21 -250 199 148 -19 50 59 -145 -174 -91 -90 313 -64 8 -147
5800 -147 4 -47 -143 -20 -242 -10 66 -55 -1 -300 106 -89 -142 -159 164 -158 -39 94 6 101 -191 230 -291
5823 -291 149 -14 164 -134 -27 -402 -141 91 161 66 19 -247 -85 -254 -23 196 -39 122 0 143 43
5844 43 138 -19 -48 -130 204 -162 -57 147 0 185 345 -37 44 -57 266 423 -122 2 -140 184 -147 11
5866 11 -119 -65 144 -7 -4 56 -245 -85 -155 110 229 108 -44 -5 185 -209 7 -144 146 14 -116 219
5888 219 86 -171 -198 -131 -227 -248 -91 80 -81 -188 -167 99 59 51 259 -155 -349 -69 242 -100 -90 286 292 86
5912 86 -12 99 -212 -7 -61 -224 38 73 35 113 -237 142 -131 20 -100 191 2 142 -112 -189 213 -89
5934 -89 -45 -121 395 23 113 -32 -38 -29 207 128 -37 269 -37 105 -91 -29 68 -10 -18 -56 83 -184 -194 52 -87
5959 -87 197 47 21 19 187 210 -48 -113 -137 97 -25 -249 -27 360 225 9 -164 126 -18 145 -134 -157 149
5982 149 -147 -40 189 47 76 -78 -75 155 181 154 -32 -161 86 -9 -15 -41 26 -210 136 96 -159 72 137 -169
6006 -169 -243 -167 81 204 -253 10 24 108 -71 41 -84 -237 -45 -22 36 -167 60 -86 11 88 158 261 -92
6029 -92 -45 35 -115 -95 303 -189 189 -175 22 303 -100 -32 113 -113 -13 147 -192 -12 -28 -158 -43 111
6051 111 213 -75 -88 52 120 -82 183 -158 47 -84 -270 -173 -205 211 321 -73 43 -56 -68 191 29 -81
6073 -81 -199 6 54 -14 -311 27 -14 -11 67 -259 112 77 216 -43 44 51 32 5 -184 85 247 201 -149 -39 89
6098 89 85 234 -41 -173 54 -182 20 66 50 -84 215 34 37 65 218 -53 -216 -60 21 5 13 -37 79 26 129
6123 129 184 -109 58 -57 -410 -11 -135 -182 187 -22 -26 -62 72 -111 -238 10 105 -418 25 -86 -36 -56 -87
6146 -87 25 26 -120 -81 48 -62 71 -277 -220 91 -1 200 -2 -74 20 -107 166 -169 -231 -131 85 3 114
6169 114 192 91 260 63 -270 45 -271 -16 -146 -129 106 -37 -288 -276 202 -92 175 155 -88 -49 121 49
6191 49 -51 -20 226 -10 159 151 -88 -142 50 -155 178 -241 -144 -245 -198 117 274 -12 70 92 -44 -32 -101 -108
6215 -108 -19 -286 -81 24 -37 -228 53 -57 -105 -109 34 -136 -49 -47 80 -19 238 -108 108 -109 314 5 -33
6238 -33 80 203 -63 -140 131 -122 -265 -37 -30 -148 -1 -118 22 -91 89 2 117 -100 -116 -134 40 71 152
6261 152 149 257 202 96 -357 36 -124 39 195 146 -100 -262 -50 47 72 131 158 184 131 -187 -46 -191 37
6284 37 202 254 -98 -88 -76 -79 -212 -97 34 -131 -97 -15 31 230 18 -95 84 165 -126 -110 -204 154 164 73 90
6309 90 -130 -242 67 24 -114 -265 -147 137 -51 27 -97 13 -226 -117 24 -91 225 -108 -3 -31 -221
6330 -221 111 -58 83 -178 -6 95 -118 -293 -172 236 53 41 90 -28 -38 54 174 21 -2 -155 -298 209
6352 209 -373 -20 -81 -34 303 164 23 -104 129 96 224 -18 114 -116 -63 -28 -123 100 -82 19 72 29 8
6375 8 -220 -307 196 29 -112 -12 -135 84 -240 -246 -25 -71 -78 250 -57 134 13 -126 -6 -32 -157 -44 -14
6398 -14 250 -291 31 240 117 -32 -26 19 -74 -59 85 -171 -322 -67 -218 199 -227 -282 152 87 -91 27 74
6421 74 248 29 -157 -166 -20 83 -65 138 -69 14 -213 18 -58 92 58 44 -91 -59 -25 -56 -134 137 -223 -45
6445 -45 147 6 -5 -40 -164 -180 345 -146 -180 146 -53 -67 -121 -55 -136 66 -218 29 -217 19 16 26 50 118 -14
6470 -14 78 148 128 -74 -11 -34 82 -109 -61 -57 39 -128 115 78 204 -17 -106 -36 130 -177 65 91 0 -28 -124 -20
6496 -20 71 31 220 -2 38 -69 -137 -67 -57 141 -43 -261 56 41 -11 -11 58 -139 30 -2 -254 -320 -242 -162 93
6521 93 179 130 1 -289 -145 80 -89 225 133 -24 -21 -136 17 -19 46 6 -86 -64 270 -58 79 133 123 150 -123
6546 -123 -154 -148 -208 -283 -22 -98 -163 -17 183 46 -150 -62 -109 259 -169 58 73 -32 -132 -67 -138 -42 109 153 -90
6571 -90 2 150 260 6 -165 -100 9 277 111 -172 43 -337 4 -178 59 305 -110 125 -62 40 51
6592 51 -250 38 54 -105 25 24 -23 98 36 -87 117 -164 389 37 31 15 17 -74 -120 25 -106 12 33 58 308
6617 308 -140 -200 125 -283 222 -17 116 -206 110 43 -12 -16 -44 283 99 -69 236 -171 -95 242 -45 246
6639 246 -34 157 119 61 76 113 -17 154 278 364 55 167 23 -16 -26 85 272 133 -64 -45 269 24 -250
6662 -250 -36 44 -26 15 205 -107 -30 347 36 147 155 -1 148 -45 117 -208 -251 11 16 28 232 248 82 -91
6686 -91 -126 22 163 80 -128 58 18 233 322 -27 87 53 166 21 -65 100 -410 -110 81 6 -251 107 96
6709 96 -30 73 -23 -8 -78 101 -24 -69 34 -32 1 -201 -195 160 87 61 -69 -204 17 131 -228 87 15 50
6733 50 -161 -207 -269 80 7 37 249 30 349 -85 -87 96 90 -165 -33 53 -14 -138 -91 19 1 -47 -164 363 1
6758 1 53 -7 -297 -224 92 -59 39 -64 -86 -162 304 254 -18 258 187 -42 93 106 -103 -71 -162 -174 -55 -84 -50
6783 -50 -91 -78 66 51 -334 -107 81 -74 214 -62 -2 186 -230 -129 -7 -34 -59 -43 -132 19 -204 -112 134
6806 134 -147 -91 108 49 59 20 143 -76 -163 197 151 -45 160 -102 20 112 -90 148 -93 131 -17 -62 -110
6829 -110 35 116 -159 84 -23 -256 -146 -379 -151 -59 -90 75 211 113 -51 -146 92 346 11 32 308 96
6851 96 -4 12 35 22 -62 155 58 324 202 -247 -240 -229 -30 110 -10 135 182 -84 -183 -79 115 -316 -123 176
6875 176 -71 -186 67 -13 377 -185 115 170 -43 -91 -47 -165 61 -27 -76 110 -66 76 -352 110 80 14 163
6898 163 193 -21 -89 205 247 175 78 217 28 -120 -124 -19 -250 -85 -116 15 -76 17 26 -154 58 -119 -17 -143
6922 -143 -109 -58 157 -217 90 77 -40 16 155 -127 114 -37 0 207 331 -18 -189 -26 -140 117 50 135
6944 135 39 95 320 -48 -26 96 281 -176 -312 -39 -189 154 -149 -205 191 -6 -109 -94 -121 -195 115 49 15
6967 15 129 37 80 -36 -87 74 -18 -58 184 15 -67 210 191 113 373 -171 0 -136 167 1 -228 -152 -139 62
6991 62 -31 -87 80 -68 -134 -97 12 174 41 279 -347 -103 -55 31 -33 -399 32 107 259 -193 -392 -93 41
7014 41 222 325 -435 -124 -148 126 208 -231 74 -176 -21 139 -71 211 -9 -264 64 -117 42 83 -109
7035 -109 62 -6 62 49 -80 73 -201 -282 83 -146 31 -77 -166 -133 129 -11 -103 35 -116 30 39 139 266
7058 266 114 -371 -198 -119 -18 166 175 26 102 -123 92 -136 132 171 -103 -19 -57 -127 -203 133 -52 63 39
7081 39 -192 67 295 30 -32 35 -243 -70 -207 -166 109 -310 65 7 -196 76 30 -54 15 43 -64 -66 95 17
7105 17 -29 77 -291 1 144 -183 93 -91 -117 -104 -195 178 138 147 -65 -232 -256 33 28 13 48 47 68 48 -8 63
7131 63 196 73 -313 133 148 -311 206 90 247 -41 136 124 482 -24 20 -3 -150 140 243 -301 188 152
7153 152 -121 194 188 23 -99 156 -248 -145 -21 57 -25 -266 -116 -183 -54 9 -28 126 6 63 71 -74 -16 -284
7177 -284 82 100 -158 0 -11 -62 -10 347 -171 -126 -141 -119 -270 41 69 50 136 157 139 -89 163 101 -4 -186
7201 -186 -319 196 -265 27 -52 -249 -216 -107 28 -304 -51 100 -70 15 23 -139 115 -206 -94 22 -45 113
7223 113 -8 75 -193 237 294 31 18 12 -108 -101 78 102 -87 91 -160 105 -115 175 -46 -201 352 -83 95
7246 95 -3 -192 131 -98 89 58 48 20 -20 -156 263 81 41 -74 8 332 2 -30 109 158 -38 -248 -138
7269 -138 28 -98 -167 -288 29 -8 -273 77 355 -110 64 -13 -31 -24 1 -18 -95 137 -181 -60 124 -48 -162
7292 -162 26 -163 -94 -257 228 247 -57 -96 -52 155 -202 -45 209 -29 224 92 70 -135 -45 58 -127 82
7314 82 -88 -68 -143 -43 62 35 291 -74 126 -127 -33 -41 75 178 -22 -20 -185 -77 73 239 262 150 103 134
7338 134 -24 205 -184 82 8 -70 -176 -18 -258 84 -17 276 1 -80 121 -16 -144 94 6 78 126 -13
7360 -13 67 -59 21 54 -250 -122 -24 -98 -52 -182 79 93 -18 -127 -13 24 186 -34 7 1 114 5 168 35
7384 35 -17 98 -212 -42 -204 -9 -71 236 173 -12 -53 309 -11 -36 134 -164 72 -83 70 -24 145 -219
7406 -219 -20 235 218 -131 54 -233 -63 -58 145 158 91 -159 -2 -183 116 148 -266 190 -232 119 72 266
7428 266 67 245 -304 -69 -160 -145 10 -307 -115 101 109 -27 -79 80 -33 -65 165 65 -207 -11 100 -201
7450 -201 -116 -14 236 67 -89 271 -100 13 251 113 155 146 -124 -231 315 216 -98 27 79 -167 143 -176
7472 -176 -410 254 -130 -218 5 -50 -47 -3 -14 192 -114 -188 -319 -200 -106 -173 -229 126 163 35 118 73 -55 49
7496 49 189 -120 10 -1 239 -79 -27 -118 -18 -199 -143 -70 13 -91 -42 178 45 54 49 -222 200 75 -103 22
7520 22 -18 -38 -73 -228 -14 115 -149 260 217 169 230 -297 -37 48 188 99 50 203 0 13 -53 27 45 -257 -35
7545 -35 170 -71 -265 -101 -202 -174 35 -38 -15 -60 65 65 57 0 262 -62 100 -86 384 37 -274 -35 42 22
7569 22 -77 -77 -394 20 92 -4 -91 147 -277 30 232 -84 17 -115 -131 -126 117 64 -207 73 -1 -30 427 -163
7593 -163 90 12 215 86 -112 111 85 -38 179 24 -134 -187 309 -39 60 28 76 135 -54 35 62 128 7
7616 7 -88 -113 -84 -193 12 -297 -13 -223 -76 -121 -89 132 202 185 -62 354 -153 -80 11 294 186 137 165 -96
7640 -96 72 270 -7 -224 -67 129 87 -154 19 80 -30 250 -38 -191 184 -119 67 -301 184 -27 26
7661 26 -76 -133 85 -46 -277 -252 33 -37 -21 -156 -143 148 21 -97 -335 75 -33 91 -71 -178 369 -122
7683 -122 -95 -74 -10 -135 164 108 263 199 103 43 -130 -158 -103 -200 -80 -78 -8 9 59 116 -33 -40 -185 -80 66 58 -7
7710 -7 50 36 -285 -343 -172 -180 162 -214 30 -96 -62 212 263 -55 -139 87 -28 -118 80 71 35 94 197 -215 -143
7735 -143 146 -99 -65 -134 -117 -401 -21 115 -177 -31 120 -449 -1 187 -2 -36 75 -293 89 -251 103
7756 103 -189 -23 47 -46 -76 17 53 -181 -309 -200 -150 -88 -256 133 -191 108 -276 -89 -26 108 91 33 96 9
7780 9 33 202 -80 -101 -54 1 -176 -380 125 -96 317 -21 93 -98 108 -27 42 45 -228 -177 68 -104 -231
7803 -231 108 -117 28 -4 140 275 -153 -24 21 -59 338 -54 47 134 4 23 -229 142 45 69 -8 -107 12
7826 12 -101 25 16 -136 -36 -23 128 -115 281 179 110 223 -59 128 -41 -90 -356 60 311 -50 248 78
7848 78 -121 -23 -170 256 -172 -82 56 187 -94 197 36 95 -89 10 53 79 246 19 125 -103 199 -117
7870 -117 64 -99 144 -69 -235 47 -28 145 219 -73 121 90 -11 -97 159 -9 60 -130 -149 38 35 -303 -257
7893 -257 140 87 12 108 59 17 107 116 -194 39 -99 67 -6 55 -99 -23 36 227 108 34 -122 -223 -50 110
7917 110 -50 212 -82 196 166 -208 98 -154 -2 -139 -65 110 -46 84 54 191 -148 52 53 75 49 -2 -120
7940 -120 19 68 -19 122 127 -4 -245 -13 -45 -44 50 164 -292 105 -56 309 -89 124 -97 -41 -71 116 -56
7963 -56 -146 47 -187 -246 60 -6 2 -39 31 126 -86 62 80 -227 114 -37 356 80 18 -194 50 72 56 191
7987 191 -42 296 -286 53 63 -188 78 -35 -25 -86 -41 65 137 -61 -59 -99 -193 104 174 153 216 129 59 19 76
8012 76 7 100 -3 -112 65 102 92 13 141 60 -305 25 -92 36 42 31 -339 70 80 49 64 -333 27 -18 394
8037 394 -112 -25 -127 -36 -80 -78 -122 -189 -143 178 36 119 24 -9 188 -97 107 52 -14 -273 179 115 34 -42 -14 138
8063 138 -23 -96 -263 -120 48 206 145 -57 -105 -65 14 -29 204 188 -135 -92 -17 -72 -36 -80 -281 -169 125 -136
8087 -136 58 -92 36 -241 -125 -9 166 -4 -285 -110 -154 143 42 6 76 -31 224 99 -142 142 106
8108 106 -30 -120 -21 205 270 26 -57 61 -78 28 -174 196 -25 52 120 24 -39 93 89 72 75 235 202 197 327
8133 327 -44 -63 -106 7 -82 9 52 -65 -61 -121 115 -177 22 -79 -35 -109 -138 -98 18 245 -68 4 -18 -9 58 -59
8159 -59 206 -208 -235 76 -48 -207 48 164 47 -105 -26 8 17 -33 -4 -24 163 182 -5 -57 -76 62 -324 330
8183 330 -22 188 -109 -46 156 -104 -27 -41
8191d1
$$ Imaginary data points
##PAGE= N=2
##DATA TABLE= (X++(I..I)), XYDATA
0 0 0 0 0 0 0 0 0 0 0 0 0 0 8 -8 8 -8 12 -16 16 -24 24 -32 40 -44 50 -60 72 -80 96 -107 123 -140 160 -180
34 -180 204 -228 259 -291 323 -363 403 -446 495 -549 607 -672 742 -816 902 -991 1093 -1204
52 -1204 1328 -1465 1618 -1791 1988 -2214 2473 -2781 3150 -3598 4163 -4896 5890 -7324 9575
67 9575 -13670 23506 -102094 -7134 193718 24267 -107040 -100099 30748 65542 14928 -7544
79 -7544 5404 -37641 -13211 44635 44351 -10983 -45729 -24375 36733 27992 -17110 -22184 796
92 796 6701 7924 1284 -363 -399 -1261 -54 3943 1331 -130 -1942 -992 -393 2174 2004 -1266 -946
109 -946 3190 -839 -3388 1941 3564 -977 -4505 -3152 3591 4518 -3503 -3423 2447 2671 -179 -1193
125 -1193 1028 2234 -706 -1669 1466 993 -1099 -395 715 316 -1562 -520 1472 163 -1378 -175
141 -175 -726 -1180 9 1263 1157 -1549 -2488 1504 3267 -47 -1690 -416 695 974 -716 -844 787
158 787 -882 -1638 472 1443 -122 -541 201 854 728 -230 389 527 -169 -400 -7 -7 213 41 30 -546
178 -546 -409 497 414 -166 -406 -194 -7 -636 -680 1142 605 -1480 -450 1100 1542 -205 -1400 207 1684
197 1684 388 -957 -411 -273 -311 50 175 194 -568 -816 704 1835 513 -849 -506 647 1629 430
215 430 -1338 -786 394 107 243 394 -118 -224 -403 779 1701 148 -1377 160 910 150 -540 -1143
233 -1143 -426 316 -455 -262 642 -31 -248 368 210 519 140 -1206 169 658 -360 -707 -391 -407 -50
252 -50 -131 -242 112 330 -349 16 214 35 -266 -257 -13 305 -135 -511 -64 147 -304 276 70 -36 60 -17
274 -17 -63 478 112 -170 243 -21 -59 124 -86 86 -53 -96 249 -385 -174 -15 -35 -244 -211 -42 555 348
296 348 84 201 217 -118 111 -76 -133 -30 -128 -160 -111 -7 38 86 63 516 233 -57 5 219 -5 -525 18
319 18 -372 -226 -192 -270 167 443 -315 -121 425 295 56 167 -418 -167 52 -111 -295 -91 -49 -214 -157 -331
341 -331 222 46 32 216 -122 292 -119 -170 90 -93 40 76 116 169 -8 -3 -139 -139 -274 -83 -159 -242 -65 -105
365 -105 -350 65 -116 -137 -4 -44 -82 385 -177 -406 11 10 -74 54 12 -172 130 -83 126 275 -90 -133 12
388 12 -249 -245 32 -251 -91 -170 -221 229 171 -252 265 -29 -168 108 355 -4 -202 -53 129 360 -96 198
410 198 63 -226 175 -74 193 109 202 131 -108 51 -33 -205 31 -295 -96 -146 -200 16 77 109 -5 257 -46
433 -46 88 -90 127 98 84 50 -19 298 -97 26 167 258 174 115 82 185 246 -104 -381 -108 -232 9 183 -92
457 -92 -387 114 -25 33 -190 13 -94 -6 1 -133 104 -355 -43 -153 1 219 103 227 -138 -123 -107 -276 21
480 21 -155 -145 -47 -287 81 168 78 -34 7 301 142 -151 -94 -112 114 129 31 38 -320 171 -57 -64 49 -75 -117
505 -117 -188 71 -166 304 244 145 -133 97 174 -9 153 -34 -287 127 -101 87 -288 144 -232 -52 -34 200
527 200 161 34 47 39 271 -3 60 42 -160 9 132 -64 -81 185 31 -33 44 -114 95 -59 232 22 36 40
551 40 72 -173 -55 48 -169 113 -281 37 72 144 -216 -61 225 62 12 -85 -87 57 -192 2 -286 -6 -347
574 -347 -102 -32 16 196 -9 293 81 215 -40 136 -107 256 -64 -288 89 -12 -152 156 -314 -136 7
595 7 -66 -81 77 49 116 -46 172 191 -75 126 112 -190 -143 15 88 8 -40 80 259 52 181 25 170 192 46
620 46 134 27 -90 -28 -25 204 112 -45 249 196 52 -171 -156 -18 196 231 -90 44 122 -58 -135 -96 46 41 193
645 193 -21 -277 250 -83 -185 42 1 89 -239 -61 -18 99 73 -133 -112 12 -247 -92 -143 -69 -48 -263 150
668 150 -45 -32 118 11 95 -148 90 -38 -119 -29 90 24 -99 -281 -104 139 2 75 -118 -222 -355 138
690 138 48 145 -107 43 120 -236 47 -170 -102 67 26 -113 4 69 54 58 254 115 88 143 92 -63 192 15
714 15 -23 158 -40 56 -391 -168 101 -200 44 106 -51 -337 -204 207 194 -68 13 233 -55 97 -46 328
736 328 -143 18 45 -117 288 83 -126 24 -98 202 -167 -88 -103 5 -18 -153 -205 81 -9 4 79 -56 19
759 19 -57 -102 212 -9 226 -140 65 55 90 -25 -28 -95 79 94 -112 -39 194 -168 134 218 9 -54 123 121 -128
784 -128 166 -116 -158 58 296 61 128 5 -4 51 122 -71 32 -26 -222 -265 -206 -353 -176 156 -186 218 127 -11
808 -11 203 84 -70 4 264 -262 67 161 195 69 -100 99 75 -11 91 -86 21 -67 29 -339 -45 -250 30
831 30 123 232 -324 20 -52 -23 124 -213 222 147 179 82 228 -179 186 -30 -157 -199 -219 6 83 26 -182 174
855 174 135 61 163 -176 -108 -172 -85 -111 -157 123 -169 -165 49 -4 30 324 0 110 108 -38 30 98 90 171 26 175
881 175 106 -202 -261 -103 293 214 -342 71 127 144 56 9 -252 -65 -14 -29 28 165 -126 -54 -254 -106 -178 25
905 25 -17 -255 241 -213 -93 272 -112 132 -28 240 -20 -342 150 238 -216 199 -218 46 -46 34 8 66 134
928 134 74 0 136 81 -136 -166 -23 227 163 -218 61 416 -30 42 149 -271 175 118 -214 43 45 -10 -359 -14
952 -14 9 -12 -22 -8 18 -192 194 6 -211 -439 -97 59 -113 45 45 -349 -19 -8 -208 -266 156 146 -189 198
976 198 49 -178 -140 -307 -42 4 -9 -87 -62 -324 117 203 62 -140 -151 244 -17 131 201 207 -141 -138 -231 -119 232
1001 232 56 174 30 235 68 -28 -120 49 115 -47 -1 57 49 -68 184 -197 43 29 -29 -167 -62 -186 -148
1024 -148 -119 98 203 -68 194 -42 -261 -97 -35 -116 38 9 -57 -160 6 114 153 202 -19 -176 179 14
1046 14 -118 87 211 240 -60 42 94 -44 106 -17 151 -47 -215 27 -179 6 -59 -10 -30 4 -23 -72 63
1069 63 67 -279 -151 59 -15 -51 -80 38 7 144 -13 94 -85 25 146 -25 58 -105 33 281 236 103 200
1092 200 102 -120 33 -35 145 28 12 71 -307 -39 105 126 -26 -55 -165 -60 -32 6 171 -58 -86 -12 331
1115 331 -98 29 78 73 92 -48 -23 -107 -4 -50 44 293 -20 16 20 -34 -60 -187 -70 -45 63 99 242 107 84
1140 84 -203 -168 149 -228 -207 384 -41 -24 15 -27 -82 127 101 81 -247 62 -48 -52 -371 -40 -359 -214 312 5
1164 5 178 -91 119 -186 141 -238 122 27 134 90 -101 170 276 35 125 -2 -111 -15 133 162 21 -212
1186 -212 -81 -366 260 130 -38 53 264 42 244 -52 58 -109 -1 -119 147 69 -49 -86 89 106 277
1207 277 13 -59 -134 -104 313 74 -191 280 52 -130 -173 156 17 -48 68 112 -31 -21 -153 -88 141 -334 -62
1230 -62 8 79 74 -186 -21 18 112 139 -149 -67 -225 136 -59 28 -177 222 -83 64 117 -9 209 -144 227 97
1254 97 -108 -165 -83 -91 78 -49 263 -106 32 131 -96 -48 137 138 -237 101 48 -88 180 69 -128 -110 -269 -52
1278 -52 -247 -37 115 -81 -22 10 445 -93 -85 -20 -47 204 164 -67 141 166 -54 -41 -260 -5 -257 -300 38 -206
1302 -206 53 1 84 -192 19 1 -175 10 -168 77 53 -115 -76 -104 -219 -61 44 183 196 135 70 101 178 -73
1326 -73 258 224 -105 67 -44 -110 -151 35 158 173 93 184 -147 -68 -120 -13 137 54 -16 -28 142 -48 109 57
1350 57 -126 222 107 4 -16 -275 -220 228 -41 -161 72 295 164 -90 -127 6 37 -60 13 -207 92 -16
1372 -16 -230 -179 -162 105 -7 -48 125 -30 226 -164 16 -128 -110 -258 -38 310 56 -54 -53 167 -32 8 -18
1395 -18 -66 -84 -98 -119 207 0 -187 131 7 -30 400 -147 138 -183 116 -8 13 -169 -95 144 -146 24 -369
1418 -369 -106 -67 244 73 108 98 -97 35 -5 128 112 52 -82 -80 -52 -199 120 -36 -169 219 -109 85 78 -114
1442 -114 -101 133 -202 -327 -18 59 240 -8 221 -2 39 42 -210 -38 10 -8 222 116 131 -140 129 -151 0
1465 0 -57 -98 53 -211 39 56 275 -47 -20 -270 -1 -8 -59 22 210 7 -59 -99 -4 -93 0 -84 258 -46 -142 -167
1491 -167 143 -153 -86 10 -110 305 -100 -166 -194 44 163 323 160 -43 -14 -122 239 -131 38 331 -2 -39
1513 -39 -190 64 -443 91 -34 102 -221 131 -222 -183 207 11 -5 -15 -28 102 -199 28 -21 -12 128 -166 26
1536 26 -89 62 -21 -80 65 152 290 -236 115 -72 162 -140 120 186 315 196 165 -66 -186 137 82 65 -92
1559 -92 155 -87 -3 259 188 231 205 15 -192 -98 -5 -66 129 -51 93 67 33 18 70 37 2 -23 31 33 -183 196
1585 196 501 -258 -166 49 130 236 -197 -95 18 -307 -55 62 71 17 25 -43 72 -2 -50 136 16 1 254 151
1609 151 197 48 -46 43 -173 29 76 -286 17 47 119 190 -234 97 -37 159 161 -130 -286 35 -36 -75 -59 -6
1633 -6 -122 -160 -242 297 236 84 -11 -325 -67 -105 -93 -272 -38 -84 5 -172 -66 -81 -18 -28 -436 177 -103 -16 206
1658 206 290 115 142 12 -40 33 -329 94 -100 104 -120 -82 150 -199 22 -32 -257 131 -218 203 -152 246
1680 246 38 206 -116 -19 -173 -62 -131 76 -29 -82 -44 -76 16 123 156 129 114 148 -9 64 148 -147 142 -189
1704 -189 29 -227 -196 -137 314 -103 0 215 113 128 96 -102 28 91 132 -169 58 81 -31 192 -18 -100 43
1727 43 154 -79 105 -178 32 -186 2 -66 -229 -38 154 137 40 -238 -28 -153 207 -10 173 265 127 133
1749 133 -140 302 -59 -141 1 -244 32 -88 48 -3 -104 46 177 153 -230 174 -228 156 106 85 -110 234
1771 234 -181 -142 -60 -113 7 213 -97 -19 -69 106 -70 106 43 -152 -54 94 156 -118 -81 138 69 142 -73 -92
1795 -92 -51 -15 -91 95 -115 19 -72 -72 -29 84 26 -39 98 230 14 -221 69 9 49 -113 244 109 -204 -31
1819 -31 250 108 -49 -194 -90 243 -151 115 29 185 -52 119 67 -196 292 78 189 32 -76 238 41
1840 41 145 -274 -130 59 -83 -180 -46 -295 -153 209 18 -24 73 -99 -148 -82 -233 -54 -179 -38 142 315
1862 315 -65 71 -151 30 -137 58 286 249 -349 40 6 141 -42 118 -235 48 79 -140 -75 68 -191
1883 -191 194 107 -116 26 29 236 71 343 -145 45 -55 177 1 -61 -81 0 463 -249 -114 362 24 -128
1905 -128 19 48 -205 -38 98 95 -79 -45 -80 97 30 -201 113 -191 -180 -29 104 133 100 51 21 107 -121 171
1929 171 202 -125 -84 69 36 -37 161 43 147 14 68 105 -95 -128 10 60 248 96 -100 -95 139 83 124 137
1953 137 -14 124 114 -147 -155 -136 110 128 189 184 -89 -9 276 -17 9 -160 -79 242 -4 -124 178 -215 268 20
1977 20 -187 37 257 -132 -37 -262 -159 70 -14 131 -149 67 145 78 18 76 -63 207 136 -118 121 210 -181
2000 -181 35 160 -117 111 232 21 132 -163 -32 -4 -56 -220 116 130 45 260 8 -117 -313 -2 -258
2021 -258 42 97 115 -121 -182 -89 -74 34 17 -145 -147 -6 157 86 -158 -3 -128 58 -132 207 16 -110 -72
2044 -72 -22 -178 239 -190 -4 6 260 6 41 -13 22 82 -55 90 -260 223 224 213 121 -265 213 -25 -140 -76
2068 -76 -162 63 143 84 29 -291 233 -77 -330 230 -178 -8 -189 202 -58 -110 -66 -38 -236 13 81 -44 100
2091 100 78 -62 98 185 -75 -215 -122 -279 -230 57 -49 117 286 9 -70 181 -177 -141 -64 -138 34 56 69
2114 69 -61 223 294 28 -44 -189 313 -222 43 -15 -126 -127 244 -67 121 -21 -179 -94 -274 -57 31 -26 -24 76
2138 76 1 69 174 -190 -117 144 192 152 22 -48 92 134 10 64 35 95 -88 -49 -122 -101 -46 92 75 -67 -130 4
2164 4 -86 -172 -19 -198 189 282 139 41 -68 -39 -137 -151 -82 108 81 95 189 38 -96 -30 190 -236 -164 -217 -23
2189 -23 199 -65 132 97 20 -131 -115 52 -136 -170 -10 123 173 306 90 -91 44 -16 49 178 -33 59 105
2212 105 87 -9 21 -192 -141 341 -40 238 177 -28 2 -162 35 -154 -204 83 25 -79 -141 -41 -179 246 -220
2235 -220 -170 -219 -123 26 120 -49 51 -99 -356 -2 -56 -66 -3 54 102 95 50 262 -142 202 -98 -44 -17 25 76
2260 76 4 -71 -106 15 62 239 111 151 -123 -94 -58 135 79 -39 -122 153 -171 123 -365 -101 -92 59 266 56
2284 56 -39 35 -231 142 -58 180 426 -222 164 -288 305 -110 -85 63 -65 -45 -124 153 -299 82 -40 -3
2306 -3 75 21 69 -1 35 174 -90 79 -67 136 263 310 68 -248 -53 8 -255 37 -101 -127 40 60 125 85
2330 85 -147 14 -152 302 -67 -81 48 107 41 6 -63 -280 140 222 67 115 -42 60 213 -36 167 -124 236
2353 236 224 -13 58 106 91 88 92 -152 119 278 -237 -121 66 -2 206 -43 120 54 296 184 323 73 -322
2376 -322 -109 138 80 48 -78 142 246 181 48 0 -120 101 -61 23 -51 -59 -41 19 -155 -141 -127 29 73 -55
2400 -55 -125 -119 152 10 73 -233 53 410 5 34 -111 58 127 115 -76 -99 173 -75 120 -20 67 58 -59 -3
2424 -3 -282 17 -202 199 -124 -127 65 -157 162 -69 140 129 -223 122 75 -319 -134 -8 -78 7 118 56 25
2447 25 260 220 -99 24 -120 79 -86 229 225 -138 92 126 13 32 -159 86 159 -5 -261 -169 -167 -167 -150 -80 90
2472 90 27 180 -52 111 -136 189 92 141 -74 -37 106 92 85 -67 -67 -160 206 106 -38 -1 140 147 -112 -7 202
2497 202 122 -29 169 -41 -71 -66 -49 99 46 -195 -236 -59 33 107 -61 99 174 36 66 -194 -133 -80 180 107 69
2522 69 26 -419 31 88 47 104 -83 -300 4 40 -20 103 -78 -199 -69 232 -81 5 29 -229 232 90 -85
2545 -85 -11 -265 -57 170 -186 -31 221 -79 66 -228 -120 -7 284 100 102 -61 149 -50 -72 56 92 -165
2567 -165 -287 34 49 127 14 0 -299 297 -282 -41 21 -51 93 35 93 16 -17 -65 225 -122 -89 51 -105 -199
2591 -199 96 31 281 50 -36 243 -3 43 14 -30 94 175 179 -73 -98 64 103 -64 60 -178 161 122 -147 78
2615 78 -59 211 -85 -162 -118 -61 -129 -70 223 129 132 32 -77 245 -101 -15 -115 -172 -67 -201 -157 -80 -129 78 137
2640 137 67 131 55 -164 -160 61 -282 96 -127 -64 121 -304 -300 -39 -32 123 -160 10 143 31 116 43 184 -225
2664 -225 26 -210 -14 290 -31 162 -78 27 -3 155 127 -207 -127 -22 -8 -148 -22 27 231 -69 -120 54
2686 54 -34 224 -18 -53 -117 -254 18 -14 -104 -118 130 -53 -257 -194 -105 11 187 170 49 24 -108 62 -104 -23
2710 -23 136 -212 -11 -253 262 8 15 186 13 297 -406 52 -74 407 -200 -16 -89 -74 -9 17 11 -399 144
2733 144 -6 78 344 -35 64 -192 194 41 45 -99 -104 -229 116 -172 -7 -34 -206 1 -264 -58 -39 -136 -14
2756 -14 -233 -197 -120 -139 -102 59 -165 -96 -74 156 -31 99 258 -21 19 261 130 -165 -18 166 -199 -71 9
2779 9 60 112 150 -140 -110 265 -107 -170 -332 37 106 -115 -124 -76 -129 -9 -7 41 42 163 40 95 -90 41 63 43 -122
2806 -122 -126 -258 -132 -92 -181 120 163 -46 -4 163 160 45 -55 -52 -95 151 125 202 -9 30 57 -72 -87 -47 -159 -118
2832 -118 133 -182 -235 -264 -11 -241 -71 -70 142 57 -97 22 -255 -68 -107 72 10 85 86 45 142 -28 24 52 -28
2857 -28 141 -137 224 -12 16 102 199 -135 67 -125 -5 -46 -148 20 -137 228 -64 203 -2 188 207 110
2879 110 -36 -67 -192 71 135 -3 -151 71 -73 255 116 116 44 26 101 -164 118 11 -48 88 147 -127 261
2902 261 117 -73 94 98 23 -232 -270 75 102 -4 47 70 63 -82 42 15 118 -219 179 -54 -194 -188 -142 -65 43
2927 43 162 -50 -43 65 15 -37 303 -271 32 65 39 168 -249 -163 -151 286 112 -193 43 -197 -217 86 -89
2950 -89 -2 -160 171 116 129 -141 -70 164 130 66 209 44 329 204 39 -133 -27 41 25 110 309 -223 185
2973 185 122 195 100 -192 313 232 83 132 -4 -5 227 -62 43 49 22 59 139 -149 -40 10 52 310 -21 120 53
2998 53 295 -10 -129 69 72 -179 95 160 21 106 57 56 -105 7 -42 -73 -2 -26 -136 30 261 -45 57 -39
3022 -39 124 19 135 22 -22 -127 188 6 3 75 227 -111 -16 23 159 218 -90 74 -309 240 92 -111 139
3045 139 7 -140 -153 199 61 -1 52 -120 120 -37 -156 -6 39 -73 147 -77 69 5 35 -134 86 -61
3067 -61 60 -114 -109 -7 90 33 -102 -22 164 50 -23 3 -187 9 -113 85 -143 10 166 32 122 7 96
3090 96 46 24 78 -225 229 131 -107 -303 -99 289 91 -48 -19 -100 66 7 183 -168 84 -85 59 79 -210
3113 -210 114 -57 42 -78 141 237 -109 -47 -172 -80 6 -142 -218 -182 31 128 -8 75 -167 27 50 226 92
3136 92 -112 146 267 -235 -116 1 -91 -198 32 -59 30 155 12 89 -30 -147 -124 20 42 -83 -107 -44 136
3159 136 -224 -71 20 12 -135 299 108 -41 -85 25 135 -31 53 27 -69 -274 129 -111 -47 -29 94 -59 146
3182 146 116 -22 374 109 295 179 -90 -171 147 -6 -50 106 123 26 232 119 -65 78 63 67 -164 58 138
3205 138 423 -242 121 -149 -194 111 89 147 -73 311 48 159 8 -234 1 85 294 -269 117 -187 174
3226 174 -57 -130 -98 151 -47 24 -35 -70 66 -107 -46 157 -191 144 -140 192 -45 87 -17 126 46 93 54
3249 54 -208 491 -29 -73 95 -35 273 -109 85 -45 24 353 150 -17 -137 -17 68 3 164 -152 -3 -104
3271 -104 -255 116 54 278 58 -52 -28 185 107 -67 -205 -79 -201 33 200 100 -320 -23 89 -122 95
3292 95 -126 51 -22 -183 28 347 119 -38 -189 -205 -88 154 -19 27 20 18 74 83 88 -282 -40 24 148 269 5
3317 5 36 -34 -171 296 -99 -94 66 124 35 209 32 216 92 -68 -50 -39 117 42 148 102 60 -96 62 -153
3341 -153 -5 225 -10 90 157 214 -218 74 56 20 -365 109 -96 -35 -89 -187 166 -4 143 74 -117 115 -116
3364 -116 100 288 -51 -43 -158 -154 -193 216 -55 286 -60 -9 -134 -89 51 -246 -127 84 51 -7 -211 65 198
3387 198 7 -215 264 42 45 195 121 -90 211 174 -5 65 24 94 -84 -29 66 -92 98 -117 -236 -255 -233 103
3411 103 -96 210 111 83 11 75 -107 -171 -8 77 -58 -33 66 181 184 52 132 33 92 -368 81 24 -101 149 40
3436 40 -182 -77 196 36 -55 141 96 -95 22 110 -265 -14 125 13 154 -153 -213 -359 18 -48 77 313
3458 313 -33 92 -15 -180 -42 245 -32 -72 70 15 -119 6 3 15 57 213 69 -72 4 -66 -202 276 78
3481 78 278 195 -185 150 -51 10 -59 -154 66 28 -95 -12 -215 98 303 3 -19 23 -169 -148 64 -297 173
3504 173 -31 -50 -176 28 -80 -39 54 -16 -158 9 353 -60 30 -52 -236 182 341 -22 -45 46 81 182 159
3527 159 -165 -80 120 -136 -45 -38 -169 -46 -27 -285 26 -7 155 223 64 -3 -217 -258 -110 122 -61 -151 -95 -61
3551 -61 464 179 172 -21 50 -79 -8 -217 -193 -74 6 -106 -195 158 -79 -1 314 -74 6 152 9 -109 -98 120
3575 120 -166 49 -31 -36 -164 3 142 -171 -27 -1 27 96 16 189 8 -166 91 -251 163 385 49 -52
3597 -52 87 123 216 78 349 176 -7 167 264 93 -111 -7 -51 115 -268 123 -123 -91 208 -232 118 259
3619 259 -23 -87 71 -211 -17 83 92 85 -66 -180 -229 -148 278 178 -48 -118 231 -154 48 -122 100 -155 -19
3642 -19 111 89 -18 177 -242 -113 -28 71 196 -71 -341 -249 17 -120 202 65 -243 200 -66 61 331 131
3664 131 -73 -250 95 -199 -77 -152 -63 -75 312 29 -243 -95 56 52 106 164 -170 182 -23 61 105 59 -180
3687 -180 -130 -53 -84 101 1 45 -23 -16 -54 -38 40 -119 -36 186 -3 -183 37 49 151 187 140 -122 1 122 41
3712 41 218 -245 -50 7 -47 -83 -13 -18 148 -110 -127 204 37 122 -223 140 -123 -50 -27 -47 -77 170 7 -90 217
3737 217 -37 -136 -19 74 -92 51 354 -17 -107 193 -119 -148 -56 146 -138 111 193 -85 -80 -63 62 -225 -31
3760 -31 -75 155 39 -24 227 -177 -70 -37 214 -5 -25 -2 22 -69 -22 -24 -10 -80 -64 -68 36 8 -27 73 216 190
3786 190 -45 13 131 67 -224 -206 -49 -28 -149 82 92 -106 97 -228 166 -22 -72 186 34 34 16 185 -158
3809 -158 -22 -55 144 83 -52 -221 197 -17 31 -236 -123 12 342 82 99 -73 -30 -115 128 -20 216 -336
3831 -336 79 246 165 170 1 187 -21 42 79 64 -2 200 -116 -170 121 -142 -159 -18 349 57 -113 174 -4
3854 -4 -12 44 -383 51 -30 10 -14 55 24 -204 121 -69 -146 62 410 194 -142 282 275 -5 8 -24 49 228 10
3879 10 48 235 -138 21 42 -183 -137 76 -230 0 0 327 246 -13 -49 -362 -52 -89 73 -160 -196 49 -85
3902 -85 199 -66 316 33 -91 226 65 -48 -50 157 -113 -24 29 -40 -35 -166 -202 171 -255 -227 0 -81 265 156
3926 156 124 -22 -61 37 123 -41 255 25 290 46 78 34 14 -25 -236 69 -55 -146 5 130 -101 112 -8
3949 -8 117 175 -79 48 -148 96 118 -63 -39 68 28 8 -88 -120 -59 -38 -160 4 -89 -18 50 34 110 -49 79
3974 79 -264 -282 18 -63 -142 -159 123 -9 172 -1 -136 54 -191 -35 -39 -185 -107 26 -241 -11 -154 173 144
3997 144 -110 9 43 -83 13 221 96 27 -52 -278 46 65 -1 -116 -44 299 104 -361 -162 -169 117 62 -59
4020 -59 172 -31 -25 148 90 -170 -89 -423 21 52 -34 27 -44 -339 54 223 19 -110 120 254 -106 -177 136
4043 136 124 202 56 279 119 -51 72 -88 -77 11 59 -187 79 -62 -27 15 86 204 -79 -61 -32 -29 14 101 -151
4068 -151 -124 325 -285 59 -72 -155 -5 286 -69 -200 183 44 -20 -85 -170 -141 -106 -122 -37 -89 -23 -136 127 -48
4092 -48 75 95 171 115 -189 76 -82 74 28 4 133 -4 17 127 127 -63 -97 172 43 -160 55 -52 41 -34
4116 -34 101 47 157 95 -110 13 -139 -358 80 -80 -14 142 28 288 15 -160 331 -241 -179 219 -311 -278
4138 -278 -71 -66 132 -181 -68 168 147 -76 -237 98 -2 84 153 -272 33 -107 -109 -336 108 -345 -74 13 435
4161 435 -57 -30 178 -33 37 44 104 87 106 -72 -240 25 -30 13 -80 -245 217 -202 -162 196 25 -244 56 132
4185 132 97 -128 42 -138 -168 -106 -23 128 30 100 144 -113 104 115 -132 137 -16 127 48 -71 -49 164 -205
4208 -205 -26 -58 -143 -219 34 -24 -118 109 202 -33 -66 -84 -122 160 87 110 325 240 -185 -84 51 152 66 68 106
4233 106 -219 308 227 65 113 -215 72 67 -170 -120 -68 -35 -87 -143 175 38 -23 -134 113 -52 -75 16 -115 -220
4257 -220 -3 323 -259 -11 133 51 -60 277 3 178 -4 10 48 -65 108 89 119 -278 75 -74 -70 -35 -111
4280 -111 140 114 12 62 -11 -189 -95 61 -169 81 336 160 49 76 -111 -93 -12 29 -143 -26 -68 164 169 -131
4304 -131 -138 -171 -105 109 67 72 -135 -136 49 -89 152 -88 -109 -215 136 219 -181 63 11 -129 -11 -99 -17 149 140
4329 140 -137 -124 -288 -67 66 -95 36 114 -71 -81 -308 44 27 -181 -71 -72 -108 69 83 -207 1 -78 121
4352 121 0 84 87 134 212 -57 -64 -19 -102 -22 17 -28 -23 -107 -155 13 -529 6 208 -82 18 -3 -76 141 -112 -79
4378 -79 -41 92 -14 36 -134 44 90 6 19 138 -28 202 -67 -126 36 95 -44 28 38 53 13 28 43 -177 -46
4403 -46 -85 118 -5 49 -233 29 -37 10 88 31 25 -138 162 -110 81 86 -62 -120 -35 -108 -80 188 -4 132 103
4428 103 177 -107 278 182 -84 -161 16 98 -130 -104 -148 -43 -10 266 92 -1 -85 -171 -87 -156 86 159 -12 -203
4452 -203 37 -74 -164 88 126 147 31 -151 -75 -128 114 38 -68 3 187 34 -169 -23 165 -59 -199 -104 -64
4475 -64 -114 -73 122 38 60 -145 -78 -29 35 -241 226 -33 -102 -210 -356 150 -135 -66 -195 302 50 -12 311 -18
4499 -18 -27 77 -49 -63 -58 -8 -34 -70 -44 14 76 155 33 97 -376 66 5 200 257 -37 -42 -126 -214 89 158 -3 59
4526 59 49 -196 50 236 -2 77 -144 86 -164 -2 193 176 127 13 20 337 92 156 127 -148 -11 64 60 100
4550 100 -206 258 202 -65 -78 -133 32 -119 -214 -30 49 25 -144 176 121 -64 383 -77 -249 270 -98 -16 193
4573 193 303 -174 82 111 -249 112 -20 249 32 -119 163 136 47 -64 -118 64 146 168 -77 -23 62 108 28
4596 28 69 36 -16 -264 -119 172 -109 139 -25 -86 74 -132 152 121 -139 97 -128 -290 10 -98 -65 -211
4618 -211 -70 190 61 -70 185 261 -24 193 39 -78 -77 200 75 103 -17 169 54 1 93 176 336 -240
4640 -240 -85 -87 214 54 -2 -104 65 -181 168 -134 -54 113 -239 -79 -254 137 59 -115 66 -108 -204 -10
4662 -10 -189 181 -88 -3 -95 51 -76 283 71 -35 -45 -116 41 -44 144 74 44 -140 0 339 -36 -9 -27
4685 -27 4 303 196 31 -133 152 -106 135 77 -195 -120 -100 -290 -94 228 -107 -132 -186 51 17 -305 50 121
4708 121 -63 59 -163 110 40 224 -148 -25 301 187 96 83 -108 -31 -228 -116 -38 57 58 141 -263 39 -78
4731 -78 167 5 206 -159 224 -201 -141 -98 97 224 43 151 75 -92 44 29 245 -111 -312 -256 59 140
4753 140 -45 -48 -190 -39 113 177 -30 49 349 -38 22 118 40 -17 121 136 316 -165 -120 -103 37 -37 297 -40
4777 -40 186 69 69 -148 -199 251 -30 -230 42 -381 26 -70 -221 51 25 -22 -121 -22 -218 182 55 -178 -40
4800 -40 -42 67 -22 192 154 -53 -257 31 227 -146 -42 157 117 -56 1 -249 -97 -41 -111 130 122 93 90 -31 86
4825 86 -137 -138 247 -5 -205 -205 301 132 -224 46 180 118 -208 71 -92 -92 49 40 -108 71 396 -54 36 -66
4849 -66 -160 -243 -89 39 30 107 36 183 -18 29 79 59 168 -143 -48 -251 31 134 -199 26 -146 120 50 -2
4873 -2 -4 5 182 -60 245 100 12 -33 138 -61 -90 -9 42 -21 132 1 101 -22 37 -55 -67 101 -5 -173 -3
4898 -3 -41 109 -41 -22 -57 -85 -236 -121 -51 57 -243 -281 133 -20 -336 4 -89 21 50 22 8 134 90 5 84
4923 84 -59 140 -86 22 264 -207 188 -347 189 65 112 -254 -76 -19 -64 70 65 -214 -216 14 99 -102 12
4946 12 21 9 -72 -13 -65 88 26 -3 -14 -57 -84 54 -56 33 -140 55 37 77 166 50 -240 -4 -171 -224 44 -82
4972 -82 65 127 230 100 86 130 18 -119 28 180 -24 200 -72 7 -9 82 -92 185 129 -94 137 -1 78
4995 78 -95 -56 -18 43 -7 -73 247 21 21 -70 -125 -97 1 -51 321 180 142 -174 -193 -99 25 -70 -40 -336 199 31
5021 31 144 351 106 185 -265 202 35 -3 -78 38 -67 -73 -205 58 -70 111 -310 38 -36 -26 -52 71 -19
5044 -19 229 9 -40 241 -52 -135 86 23 -135 76 183 303 -18 180 -21 89 -244 384 37 -129 117
5065 117 -195 -60 -290 -91 57 -7 -109 27 -143 46 44 106 -111 -122 -123 -52 90 -39 32 -35 134 150 19 -21
5089 -21 182 40 14 296 -289 248 105 181 134 -217 4 -111 310 35 123 66 93 -72 -5 46 -177 -441 -1
5112 -1 -225 -179 -214 -84 55 128 -110 89 -19 -97 -144 -111 -171 343 126 -176 178 -216 45 -78 -42 -13 11 -189
5136 -189 -259 -165 -109 -107 167 -91 1 -252 -106 157 160 231 238 131 96 -138 23 -86 29 67 -140 30 -132 -29
5160 -29 -17 -22 91 -1 -10 129 -161 -172 60 160 49 -195 -168 -179 -11 146 -56 -118 -46 13 53 165 6 283 13
5185 13 -232 -257 20 29 -60 -25 -138 -253 37 160 -64 -21 -159 -45 -69 30 -218 37 -79 224 -25 -49 -279
5208 -279 -132 -297 76 -99 -89 -172 53 123 26 -180 95 -51 57 -112 225 151 -162 -27 86 -139 -167 -148
5230 -148 -193 -11 -39 -104 -284 264 38 -40 -176 -66 10 214 -137 84 -57 -310 219 329 189 159 -2 -91
5252 -91 -6 36 -91 -137 -57 -76 -89 -174 -209 -147 -69 305 122 -242 -179 -63 -86 -45 75 203 -111 90 266 -26 -194
5277 -194 57 -297 135 68 38 256 -223 -3 -352 -91 17 190 46 37 195 215 -53 -115 -150 58 -167 -15
5299 -15 -60 -150 -178 34 -189 58 175 -135 169 164 1 58 -48 274 -61 114 -181 -121 -157 -96 -287 172 64
5322 64 -95 -54 -22 198 -140 94 -21 159 31 156 -48 -232 103 -83 147 -55 -96 118 -120 27 -33 167
5344 167 -164 194 107 -172 -163 106 25 -282 46 132 -15 -215 19 -39 248 -229 -352 -34 -79 33 -78 -10 -82
5367 -82 -84 -107 290 -154 -137 -6 -53 -106 -40 116 -198 -117 -321 -143 -59 50 60 142 -186 -274 -69 22 -234 336 151
5392 151 165 128 -95 -304 204 -247 -133 125 0 -136 -182 -194 -161 -191 63 -171 35 42 68 -84 -176 216 -50
5415 -50 208 -97 -76 14 147 -210 -1 -47 -161 39 183 232 -208 -224 -42 -38 -140 -99 -24 -85 -157 6 2 17 224
5440 224 -13 32 371 132 21 162 -42 -97 157 -182 -261 14 -51 -149 -112 271 -24 63 226 39 -259 -114
5462 -114 49 124 -292 4 7 -66 -78 205 63 125 -10 85 -187 -82 261 -191 -50 -15 -169 195 6 -316 52
5485 52 -65 -126 -132 116 130 104 -140 174 24 -20 4 -108 -14 106 -216 -31 -182 386 21 -93 -213 179 -118
5508 -118 -64 -179 33 -113 249 -145 39 -57 203 -11 -107 137 26 -24 -183 -248 123 -302 221 107 84 -57
5530 -57 66 -84 109 -167 -125 175 249 -25 -66 -150 -135 -104 29 -73 -101 152 220 431 158 44 -39 146 143 224
5554 224 -134 151 -312 -35 3 21 306 18 124 -46 -270 -208 38 161 16 -41 59 24 -89 184 -151 86
5576 86 -113 -221 2 59 -106 -9 67 -30 -114 -146 -49 143 113 -89 84 337 134 -103 107 166 -88 86 155 142
5600 142 52 -163 58 -4 -128 -61 63 28 34 -6 -44 -126 245 -32 -72 -33 -61 -88 -44 -82 -116 50 -3 -28 251 -149
5626 -149 9 17 -113 44 -283 136 -37 -144 -241 167 -194 221 4 36 172 28 -253 -92 -55 90 96 -335
5648 -335 242 -233 227 -4 231 94 58 67 -12 90 -4 161 231 -45 -53 -226 -53 -69 -194 60 50 -2 43 20
5672 20 -231 -81 -154 -98 -58 -38 -32 17 -95 -190 -32 -24 -195 -71 99 -125 -275 -175 51 -12 6 47 -217 -45 -82
5697 -82 -206 -101 -147 -18 -100 57 31 -11 201 -127 -18 178 111 -66 -11 20 236 -42 -151 -105 81 -265 -160
5720 -160 56 77 156 27 13 -123 15 87 188 81 -150 165 18 168 31 -66 -72 -134 127 5 55 282 -97
5743 -97 125 -58 104 111 75 199 114 -39 -192 172 -164 -17 194 8 -35 -131 -40 18 155 -61 -59 -99 11 -17
5767 -17 266 284 73 -117 -242 183 -81 -62 -94 -26 4 -65 -111 -132 129 18 -72 -262 -111 79 -91 -19 -69 79
5791 79 30 -243 175 119 -45 78 -128 -98 -46 2 171 137 182 -108 33 -13 -217 112 65 61 -14 49 76 -93 -327
5816 -327 46 -106 -63 369 54 31 -33 -424 -323 68 -30 -54 372 55 -183 -46 22 -19 -145 72 -305 -134
5838 -134 -123 139 133 -9 117 -233 89 107 212 -95 97 124 55 -81 -17 0 -294 121 18 -20 170 9 -205
5861 -205 -11 162 -71 90 -79 -208 -57 -135 -180 -85 -15 206 256 7 289 -205 135 -45 -46 -104 -69 -65 2 -155
5885 -155 8 -29 -83 -46 -2 87 -1 220 275 -184 164 -40 -17 37 32 336 179 69 239 162 -156 308 -109 -417
5909 -417 62 69 151 5 -253 8 -30 -1 46 217 -401 122 45 88 -38 -81 -89 434 174 -186 -77 -114 111 221
5933 221 56 -9 -193 143 132 183 -2 60 -33 138 133 -169 291 7 79 40 -206 148 -78 -202 -2 -189 -58
5956 -58 2 324 145 184 -152 27 -164 18 -13 49 -146 -86 -143 -95 28 128 -151 81 -96 25 -3 -44 95
5979 95 127 -192 -42 -2 -28 -194 132 54 74 -121 -37 -288 -36 12 136 185 -163 198 110 155 -124 30 -26 159
6003 159 -123 -86 70 203 200 94 91 34 12 -92 -196 -56 -38 -162 -107 -269 74 -139 -319 18 -19 34 -26 -57
6027 -57 -22 -85 -312 -91 -143 22 -49 52 -84 -118 39 -121 169 88 -66 209 -125 -7 -11 -287 -8 -149 27
6050 27 -48 -34 -165 18 141 182 -55 44 -218 -161 -9 -240 -248 -64 -7 200 -56 344 172 -80 -48 -52 -97 -117 242
6075 242 -157 -101 93 -103 -76 -35 -15 180 2 -147 -19 105 -53 280 41 -148 -142 116 69 81 150 -168 57
6098 57 -262 142 -42 139 -291 -77 -12 -137 56 220 -139 116 -27 225 171 223 -17 47 -64 -1 -67 -173
6120 -173 345 37 -62 -372 79 -110 -177 88 82 -77 52 -94 95 117 -23 -24 -29 -84 -18 25 161 81 74 199 29
6145 29 52 32 117 27 158 97 -63 -58 365 -46 -8 -299 -34 372 283 -106 -143 17 -114 -192 -82 -52 -37 -56 76
6170 76 -65 61 82 150 10 -48 203 41 -179 -84 -227 -47 -45 151 -105 108 159 -46 314 -190 -124 93 55
6193 55 -36 -142 51 -451 -126 -29 -205 9 -382 284 -46 -7 -63 193 37 30 -169 273 51 72 156 245 173 111
6217 111 -87 226 -72 -114 -10 6 -131 96 -136 38 74 112 70 -99 258 203 -136 -50 83 -195 -14 34 -181
6240 -181 -121 84 66 -105 207 58 -389 -17 73 196 -327 30 132 -68 -177 -52 -265 -171 -156 -193 32 -169
6262 -169 -310 31 -127 -154 -249 -69 -43 170 17 -66 -148 113 86 1 90 59 54 -295 -58 -36 -6 254 -200 89
6286 89 69 -150 -228 -74 -100 210 185 86 -69 -205 53 -54 98 137 308 -231 194 218 -113 -15 -201 -33 -10
6309 -10 -131 52 147 -34 113 -75 -18 62 105 82 36 56 483 -47 -122 244 -19 37 -30 80 -193 204 143 178
6333 178 136 -184 -83 40 -106 77 149 196 61 48 28 142 -42 8 62 -335 -157 124 18 172 -347 90
6355 90 4 88 63 6 -205 52 188 -161 186 -56 173 -21 -30 -539 96 82 60 -204 72 53 -52 60 -82
6378 -82 115 93 -182 256 -274 -37 -102 -197 18 -32 -320 56 -25 275 -224 205 -28 -202 -176 -35 -183 -84 -150
6401 -150 -226 -145 -187 252 -2 134 -86 -361 -22 61 258 187 -14 -167 151 224 44 6 164 -165 43 74 81
6424 81 -122 -26 293 51 229 167 212 -187 255 59 20 3 -122 -44 -148 -260 158 73 -5 -146 -189 -14 87
6447 87 7 -19 -35 -86 -192 92 11 151 169 -16 288 37 18 333 -177 -41 277 84 -289 -128 -12 -12 -92 21
6471 21 -154 110 -157 157 67 138 -316 91 60 134 106 -79 86 -300 110 -2 63 -18 210 -77 85 140 -117
6494 -117 126 -220 -209 -108 125 113 -83 77 115 -179 27 3 -293 -10 -12 -142 162 306 -87 -166 301 -175
6516 -175 -72 25 -18 212 -170 120 -113 138 13 68 -17 204 -312 -123 -37 -109 270 -72 -204 122 259 -159
6538 -159 -63 121 6 -80 207 -275 50 -33 120 231 -165 -225 -138 -99 108 -94 -157 94 108 -207 -24 88 113
6561 113 189 -150 -43 -54 -61 62 -104 183 -85 -166 139 -133 -240 108 154 -136 193 -56 79 -68 -177 98
6583 98 56 120 116 -41 -114 -20 -14 21 -160 439 131 -158 128 60 -92 -113 -214 -104 100 -68 0 40 54 32 -152
6608 -152 128 -40 -145 63 -356 94 155 -210 -70 55 5 3 -141 -168 -116 198 -203 105 -178 -47 106 -54
6630 -54 44 16 48 238 23 -14 20 241 147 70 -157 -124 -165 214 7 -28 57 -53 23 -141 -60 -7 -146 7 -77
6655 -77 -231 245 230 122 109 39 152 -121 -65 17 -91 42 93 30 116 111 -71 233 -192 187 145 21 -155 211
6679 211 -190 -16 -21 239 -84 -130 143 -393 58 -215 -141 -7 -7 -280 -140 11 108 -180 -4 168 -126 115
6701 115 188 95 73 241 -106 96 -7 91 3 104 193 244 -171 24 -3 35 14 -140 -152 -44 197 -167 190 -291
6725 -291 74 -142 -197 -108 43 -193 -257 104 9 -169 -187 87 31 62 -32 -49 -133 -17 68 102 -23 -35 -120 -151 315
6750 315 266 -169 33 -104 -93 13 -143 -122 -116 -185 14 30 -207 -74 -149 -133 146 -47 -96 -130 92 321 158 42
6774 42 119 19 368 48 127 54 -32 -195 -65 154 -222 53 -235 90 50 -13 84 34 -66 -144 -107 278 -40 68
6798 68 -60 81 -109 129 168 -115 171 180 132 -14 248 40 -27 -28 79 182 42 -132 -263 154 -25 -110 -117 -88
6822 -88 137 -87 45 52 -129 -489 112 -230 338 -1 131 -11 -140 111 -108 -127 -43 -93 -324 172 -172 -114
6844 -114 150 186 39 13 0 -76 213 4 16 47 -163 -57 -9 59 -139 109 -30 193 105 -252 -455 154 24
6867 24 -37 139 42 45 42 -295 -61 -99 18 -150 -85 355 106 7 -20 207 -9 18 142 0 -29 94 -19 202
6891 202 -50 241 4 -16 16 114 -69 3 -132 47 158 178 67 -156 92 -33 -319 71 -190 -83 34 -13
6913 -13 218 145 189 -112 316 15 70 -48 -107 185 98 -14 -248 55 -74 104 72 -3 179 158 196 -196 60
6936 60 89 -154 103 -308 18 1 -390 -13 -119 29 9 -91 38 248 -186 -61 -352 -139 71 103 -16 27
6958 27 126 75 -137 -41 3 7 -44 140 -91 -107 51 85 61 125 42 -115 -48 -143 74 7 -10 1 -211 -135 -361 45
6984 45 106 -14 -158 242 22 -111 17 -143 121 53 -100 33 -55 -22 -159 213 44 38 90 82 -236 84 -315
7007 -315 86 157 295 107 -244 -49 41 191 322 -11 -97 -168 143 94 123 159 -7 252 -65 -232 0 130
7029 130 -8 -65 -109 -48 -279 128 132 257 -25 -117 -52 -74 108 -51 325 239 -30 82 -168 -146 -228 -6 139 -198
7053 -198 15 86 -114 -56 -235 -228 -4 -50 -64 -123 13 -130 -96 -91 140 -200 116 260 86 35 -120 -24 1 179
7077 179 8 14 -126 -234 6 -29 -73 48 249 -17 -108 157 -111 168 105 -7 52 -103 -112 266 81 -21 -118
7100 -118 -195 124 244 95 13 36 81 278 17 34 272 -256 62 55 62 226 177 105 6 16 109 -94 31 39 -34 -70
7126 -70 74 151 148 62 -121 -74 -369 29 -56 125 -1 -102 252 201 218 95 -191 -94 -34 188 -22 22 -159 -184
7150 -184 81 49 47 19 -100 7 112 -168 24 66 203 138 -76 86 -135 -13 294 -119 -40 -243 -95 -255
7172 -255 5 -184 -250 81 74 -75 -44 73 5 13 275 -185 -68 61 -25 -32 -183 -123 94 265 -235 -160 -95 28
7196 28 99 -126 101 -23 87 -10 -3 -77 -246 59 83 108 -14 21 -93 337 -83 -27 200 27 -84 374 8
7219 8 98 -17 5 72 -2 23 -51 -82 24 6 -191 -110 -146 -15 -103 265 94 105 27 -45 -194 66 76 258 -79 12
7245 12 -141 32 -128 -177 -10 78 150 -8 208 19 30 -19 -21 -209 86 22 186 -86 -6 133 -86 101 120 35
7269 35 -40 109 -135 6 -37 49 -52 -122 -13 34 205 -314 88 67 -151 63 -332 -246 116 61 334 320 175
7292 175 -40 129 -81 -11 -85 -94 10 -24 61 33 -289 -144 -68 30 -22 102 20 128 -32 53 82 205 -7 -51 165
7317 165 295 60 28 -143 -107 -117 174 166 -3 28 -99 -43 -97 71 130 -86 -83 -23 32 29 25 -221 109 37 224 57
7343 57 -296 234 41 123 -146 293 -108 183 -135 295 189 52 95 199 135 -92 115 -107 -59 -63 -123 -209 -49
7366 -49 -189 166 356 46 97 -50 -111 366 -64 -68 108 29 -69 56 105 201 255 -161 52 62 -106 -52 -57 -64 72
7391 72 16 -2 133 83 205 80 -45 -267 67 65 -32 63 -108 124 77 -71 -129 89 27 -340 -132 139 65 192
7415 192 -67 17 -35 22 -27 -51 -315 201 115 262 163 -5 -153 -2 109 46 69 -64 -44 -52 -93 -143 -30 -185 216
7440 216 173 -118 -153 19 235 78 -230 108 -212 73 90 -168 54 201 -74 -13 -217 -41 88 -181 49
7461 49 38 -109 10 -20 206 168 -189 -28 15 40 49 -181 -44 53 -164 70 -181 -196 214 -228 -207 -83 131 142
7485 142 -97 -60 -71 89 -40 -52 72 -21 204 51 -109 -104 256 241 -46 73 -18 183 158 226 -221 -23 -449
7508 -449 -355 -53 -72 21 -18 -240 -50 -207 103 32 56 6 -94 42 -211 -53 86 301 -219 36 73 115 157
7531 157 -189 -6 179 -123 -64 63 -76 117 74 35 124 -99 -27 -402 30 79 -5 -53 11 -223 169 -10 -102
7554 -102 283 -82 44 -359 225 48 85 95 -161 29 116 52 9 182 -90 165 48 114 187 -163 -109 -26 80
7577 80 -69 317 -66 39 41 -16 324 -63 -277 -65 -66 -35 -72 -154 24 229 75 40 -158 -291 34 187 -53
7600 -53 56 47 -449 -92 -124 -139 -238 98 -201 -278 -61 -61 -321 -144 92 211 -86 32 -10 -14 156 101 -82 137
7624 137 67 -90 -56 -118 -29 138 39 50 -8 -152 -189 20 166 -99 -138 49 19 310 -199 100 60 -16 -67 81
7648 81 -181 5 -62 -84 157 126 -136 342 69 -128 9 181 97 103 -154 111 8 -149 -155 -78 -160 174 -75 99
7672 99 -134 108 245 300 -51 17 4 138 220 -105 249 52 -344 330 -174 -57 33 -25 -42 7 21 -56 68 59
7696 59 48 171 78 -114 108 77 -188 -97 -28 60 -12 64 -112 16 75 40 40 -11 55 25 289 119 -6 49 -112 39
7722 39 -150 -11 -111 123 94 -148 39 20 278 30 -55 144 93 -185 -3 -109 -63 217 68 -56 105 66
7744 66 -163 204 93 160 93 160 -20 -77 88 12 160 161 168 -138 -70 -149 -104 -206 51 -284 -106 11 43 76 -202
7769 -202 4 287 -3 -41 191 -104 -186 -109 -5 129 179 77 36 22 -187 -116 124 197 -67 -84 20 91 -126
7792 -126 -154 84 323 152 -87 58 -299 -108 -78 -66 -162 102 18 -8 -106 -41 -69 -42 172 42 154 20 -141
7815 -141 -66 158 53 -126 -137 -204 201 203 245 -197 -74 -77 26 167 -114 124 -149 112 285 59 102 51 -132
7838 -132 -22 -148 -167 -35 29 200 -62 10 -214 67 -293 -49 -33 -282 237 9 359 81 26 119 -85 96
7860 96 -241 91 -67 -40 -4 -4 72 -289 -65 -246 165 -74 1 -65 14 31 -12 46 -107 -211 165 112 -115 -23 -97
7885 -97 -76 43 65 -107 -102 155 45 -132 51 -26 68 126 167 -63 -37 -308 -80 150 -112 -21 -93 183 79 -237
7909 -237 185 46 -142 -110 104 173 25 -125 -28 43 -27 -15 156 -198 5 76 -80 66 -36 -38 99 -98 -135
7932 -135 -323 268 -77 -366 -46 86 78 18 101 -54 58 127 53 32 72 326 90 14 9 157 -29 146 426 124
7956 124 149 182 158 128 -81 150 106 119 181 244 62 269 -13 34 159 -228 139 -67 73 39 -2 -20 146 167
7980 167 -29 -169 39 132 -240 -137 -21 180 -95 -27 21 -332 22 -22 -227 -199 89 10 93 58 -195 -411 106
8003 106 -92 7 40 49 156 -188 21 43 -34 164 16 130 226 127 -236 -24 -4 125 72 178 -19 89 -15
8026 -15 -140 -97 -253 351 -135 -284 -60 23 -118 151 -133 -9 -144 171 89 181 1 -149 50 96 187 164 -114
8049 -114 -66 161 -175 5 37 83 167 -212 -167 230 99 -104 -134 -91 117 159 137 -49 69 -194 -43 153 107
8072 107 90 -56 371 205 -89 -113 -13 -283 220 -150 86 107 -10 -46 -244 -164 169 189 -250 120 179 106 -16
8095 -16 -30 -54 93 27 129 75 -55 -89 36 -62 46 0 -129 -129 200 -102 -20 -26 -125 -74 -56 -230 78 -36 -28 273
8121 273 -113 105 -23 64 141 -158 -72 117 -90 -13 155 -30 -136 -94 488 132 222 194 161 300 -63 -72 149
8144 149 -17 71 -139 22 -112 -82 -39 253 211 40 105 -27 26 -275 -149 126 70 -53 -55 49 172 -4 127
8167 127 6 62 350 -40 -2 -76 -4 -50 77 18 126 -29 52 164 -142 -29 199 240 27 162 16 74 102
8190 102 9
8191I
##END NTUPLES=NMR FID
##END=
