##TITLE=1H_Pr NCS-F5B
 200.13MHz,CDCl3,
 8 sc
 
 4.7.2025
##JCAMPDX= 6.0         $$ Bruker NMR JCAMP-DX V2.0
##DATA TYPE= NMR FID
##DATA CLASS= NTUPLES
##ORIGIN= UXNMR, Bruker Analytische Messtechnik GmbH
##OWNER= pz
$$ XWIN-NMR		Version 3.5
$$ Fri Jul  4 17:23:03 2025 Russian Standard Time (UT+4h)  she@DPX200
##.OBSERVE FREQUENCY= 200.1313
##.OBSERVE NUCLEUS= ^1H
##.DELAY= (6, 6)
##.ACQUISITION MODE= SIMULTANEOUS
##.ACQUISITION SCHEME= undefined
##.AVERAGES= 8
##.DIGITISER RES= 18
##SPECTROMETER/DATA SYSTEM= spect
##.PULSE SEQUENCE= zg30
##.SOLVENT NAME= CDCl3
##.SHIFT REFERENCE= (INTERNAL, CDCl3, 0, 14.3821)
##AUDIT TRAIL= $$ (NUMBER, WHEN, WHO, WHERE, WHAT)
$$ ##TITLE= Audit trail, XWIN-NMR		Version 3.5
$$ ##JCAMPDX= 5.01
$$ ##ORIGIN= Bruker BioSpin GmbH
$$ ##OWNER= she
$$ F:/spectra/data/she/nmr/H-C/1/audita.txt
$$ ##AUDIT TRAIL=  $$ (NUMBER, WHEN, WHO, WHERE, WHAT)
(   1,<2025-07-04 17:21:29.56 +0400>,<she>,<DPX200>,
      <created by zg, POWCHK disabled, PULCHK disabled
       configuration hash MD5:
       00 E9 B6 7A A2 85 ED C7 34 08 36 98 17 FE 4E 26
       data hash MD5: 16K
       92 8D 6D 57 BD 39 5C 3F 72 C9 BD 8A C1 0F 31 E3>)
$$ ##END=
$$ 
$$ hash MD5
$$ 32 45 90 65 D1 76 05 C8 89 27 0F BC 48 6F 8F 06
##$RELAX= 
##$RELAX= 
##$RELAX= 
##$RELAX= 
##$RELAX= 
##$RELAX= 
$$ Bruker specific parameters
$$ --------------------------
##$DU= <F:/spectra>
##$EXPNO= 1
##$NAME= <H-C>
##$PROCNO= 1
##$TYPE= <nmr>
##$USER= <she>
##$AMP= (0..31)
100 100 100 100 100 100 100 100 100 100 100 100 100 100 100 100 100 100 
100 100 100 100 100 100 100 100 100 100 100 100 100 100 
##$AQSEQ= 0
##$AQ_mod= 1
##$AUNM= <au_zg>
##$AUTOPOS= <>
##$BF1= 200.13
##$BF2= 200.13
##$BF3= 200.13
##$BF4= 200.13
##$BF5= 200.13
##$BF6= 200.13
##$BF7= 200.13
##$BF8= 200.13
##$BYTORDA= 1
##$CFDGTYP= 0
##$CFRGTYP= 5
##$CHEMSTR= <none>
##$CNST= (0..31)
1 1 145 1 1 1 1 1 1 1 1 1 1 1 1 1 1 1 1 1 1 1 1 1 1 1 1 1 1 1 1 1 
##$CPDPRG= <>
##$CPDPRG1= <>
##$CPDPRG2= <>
##$CPDPRG3= <>
##$CPDPRG4= <mlev>
##$CPDPRG5= <mlev>
##$CPDPRG6= <mlev>
##$CPDPRG7= <mlev>
##$CPDPRG8= <mlev>
##$CPDPRGB= <>
##$CPDPRGT= <>
##$D= (0..31)
0 0.7 0 0 0 0 0 0 0 0 0 0.03 0 0 0 0 0 0 0 0 0 0 0 0 0 0 0 0 0 0 0 0 
##$DATE= 1751635288
##$DBL= (0..7)
120 120 120 120 120 120 120 120 
##$DBP= (0..7)
150 150 150 150 150 150 150 150 
##$DBP07= 0
##$DBPNAM0= <>
##$DBPNAM1= <>
##$DBPNAM2= <>
##$DBPNAM3= <>
##$DBPNAM4= <>
##$DBPNAM5= <>
##$DBPNAM6= <>
##$DBPNAM7= <>
##$DBPOAL= (0..7)
0.5 0.5 0.5 0.5 0.5 0.5 0.5 0.5 
##$DBPOFFS= (0..7)
0 0 0 0 0 0 0 0 
##$DE= 6
##$DECBNUC= <off>
##$DECIM= 32
##$DECNUC= <off>
##$DECSTAT= 4
##$DIGMOD= 1
##$DIGTYP= 9
##$DL= (0..7)
0 120 120 120 120 120 120 120 
##$DP= (0..7)
150 150 150 150 150 150 150 150 
##$DP07= 0
##$DPNAME0= <>
##$DPNAME1= <>
##$DPNAME2= <>
##$DPNAME3= <>
##$DPNAME4= <>
##$DPNAME5= <>
##$DPNAME6= <>
##$DPNAME7= <>
##$DPOAL= (0..7)
0.5 0.5 0.5 0.5 0.5 0.5 0.5 0.5 
##$DPOFFS= (0..7)
0 0 0 0 0 0 0 0 
##$DQDMODE= 0
##$DR= 18
##$DS= 0
##$DSLIST= <SSSSSSSSSSSSSSS>
$$ [...]
##$SUBNAM0= <"">
##$SUBNAM1= <"">
##$SUBNAM2= <"">
##$SUBNAM3= <"">
##$SUBNAM4= <"">
##$SUBNAM5= <"">
##$SUBNAM6= <"">
##$SUBNAM7= <"">
##$SUBNAM8= <"">
##$SUBNAM9= <"">
##$SW= 18.0517328524113
##$SWIBOX= (0..15)
0 0 2 0 0 0 0 0 0 0 0 0 0 0 0 0 
##$SW_h= 3612.71676300578
##$TD= 16384
##$TD0= 1
##$TE= 0
##$TE2= 300
##$TE3= 300
##$TEG= 300
##$TL= (0..7)
0 120 120 120 120 120 120 120 
##$TP= (0..7)
150 150 150 150 150 150 150 150 
##$TP07= 0
##$TPNAME0= <>
##$TPNAME1= <>
##$TPNAME2= <>
##$TPNAME3= <>
##$TPNAME4= <>
##$TPNAME5= <>
##$TPNAME6= <>
##$TPNAME7= <>
##$TPOAL= (0..7)
0.5 0.5 0.5 0.5 0.5 0.5 0.5 0.5 
##$TPOFFS= (0..7)
0 0 0 0 0 0 0 0 
##$TUNHIN= 0
##$TUNHOUT= 0
##$TUNXOUT= 0
##$USERA1= <user>
##$USERA2= <user>
##$USERA3= <user>
##$USERA4= <user>
##$USERA5= <user>
##$V9= 5
##$VALIST= <valist>
##$VCLIST= <CCCCCCCCCCCCCCC>
##$VD= 0
##$VDLIST= <DDDDDDDDDDDDDDD>
##$VPLIST= <PPPPPPPPPPPPPPP>
##$VTLIST= <TTTTTTTTTTTTTTT>
##$WBST= 1024
##$WBSW= 4
##$XGAIN= (0..3)
0 0 0 0 
##$XL= 0
##$YL= 0
##$YMAX_a= 919945
##$YMIN_a= -1109437
##$ZGOPTNS= <>
##$ZL1= 120
##$ZL2= 120
##$ZL3= 120
##$ZL4= 120
##$ABSF1= 10
##$ABSF2= 0
##$ABSG= 5
##$ABSL= 3
##$ALPHA= 0
##$AQORDER= 0
##$ASSFAC= 0
##$ASSFACI= 0
##$ASSFACX= 0
##$ASSWID= 0
##$AUNMP= <proc_1d>
##$AZFE= 0.1
##$AZFW= 0.1
##$BCFW= 1
##$BC_mod= 2
##$BYTORDP= 1
##$COROFFS= 0
##$CY= -3
##$DATMOD= 1
##$DC= 2
##$DFILT= <>
##$DTYPP= 0
##$F1P= 0
##$F2P= 0
##$FCOR= 0.5
##$FTSIZE= 0
##$FT_mod= 4
##$GAMMA= 1
##$GB= 0.15
##$INTBC= 1
##$INTSCL= 1
##$ISEN= 128
##$LB= 0.25
##$LEV0= 0
##$LPBIN= 0
##$MAXI= 10000
##$MC2= 0
##$MEAN= 0
##$ME_mod= 0
##$MI= 1.114404
##$NCOEF= 0
##$NC_proc= 0
##$NLEV= 6
##$NOISF1= 3.799351
##$NOISF2= 2.8
##$NSP= 1
##$NTH_PI= 0
##$NZP= 0
##$OFFSET= 14.38212
##$PC= 1
##$PHC0= -1200.738
##$PHC1= 10.39238
##$PH_mod= 1
##$PKNL= yes
##$PPARMOD= 0
##$PSCAL= 0
##$PSIGN= 0
##$REVERSE= no
##$SF= 200.129724274929
##$SI= 16384
##$SIGF1= 3
##$SIGF2= 2
##$SINO= 400
##$SIOLD= 16384
##$SREGLST= <1H.CDCl3>
##$SSB= 0
##$STSI= 0
##$STSR= 0
##$SW_p= 3205.1282051282
##$SYMM= 0
##$S_DEV= 0
##$TDeff= 0
##$TDoff= 0
##$TI= <>
##$TILT= no
##$TM1= 0
##$TM2= 0
##$TOPLEV= 0
##$USERP1= <user>
##$USERP2= <user>
##$USERP3= <user>
##$USERP4= <user>
##$USERP5= <user>
##$WDW= 1
##$XDIM= 8192
##$YMAX_p= 0
##$YMIN_p= 0
$$ End of Bruker specific parameters
$$ ---------------------------------
##NTUPLES= NMR FID
##VAR_NAME=  TIME,          FID/REAL,        FID/IMAG
##SYMBOL=    X,             R,               I
##VAR_TYPE=  INDEPENDENT,   DEPENDENT,       DEPENDENT
##VAR_FORM=  AFFN,          ASDF,            ASDF
##VAR_DIM=   8192,          8192,            8192
##UNITS=     SECONDS,       ARBITRARY UNITS, ARBITRARY UNITS
##FACTOR=    0.0002768,     1,               1
##FIRST=     0,             0,               0
##LAST=      2.2672688,     0,               0
##MIN=       0,             -1109437,        0
##MAX=       2.2672688,     919945,          0
$$ Real data points
##PAGE= N=1
##DATA TABLE= (X++(R..R)), XYDATA
0@%%%%%%Qq%qJ6j6J6k4L2l4M2n6O5p6R6j14J33j59J88k16K49k90L34l82M37m96
32b63N60o33P14q03R03j012J128j256J398j553J721j905K105k325K566k827L114
49A632l432L782m166M592n069N606o213O904p701Q634r738J1070j2720J4821j7592
64i590K1429k7108L6356n3900R8420m19422p55622J045455R20981m44309q50356
75d37666Q1859O06114J92279l17697k54732J0251K70356J53736k86425l84186
85c66111J47399M88273L9456n90197k80286M76688M30496k02260l71343k3896
95b51781K60594J70555k5123j02869q6198N9382J53344n8953j69908N5449J48485
106A52977q9177k20967Q726J88625j1033j40740N447K5907m2302N2677J16643
$$ plain form
0 0 0 0 0 0 0 0 8 0 0 -8 8 -8 8 -16 16 -18 24 -32 33 -43 53 -61 72 -87 101 -115 134 -156 178 -204 233 -263
32 -263 297 -336 378 -425 478 -534 594 -662 736 -817 904 -1001 1104 -1221 1345 -1482 1632
49 1632 -1800 1982 -2184 2408 -2661 2945 -3268 3636 -4065 4569 -5169 5901 -6819 8002 -9590
64 -9590 11839 -15269 21087 -32813 65607 -353815 -1109437 -63982 856999 412690 -437666
75 -437666 -355807 250307 442586 124889 -129843 -119592 150764 304500 18075 -366111
85 -366111 -218712 269561 309017 -281180 -561466 -84778 345718 143458 -227885 -251781
95 -251781 8813 179368 154245 51376 -34822 24560 177904 118951 -50957 4492 152977
106 152977 63800 -157167 -148441 40184 29151 -111589 -106142 -80235 -122537 -69860 46783
117D6783O958q9952n584R6216J1299j9264J04149K1198j92425r1211K00075J49237
129B37479k17731k40854J46397J97136j44161j90061Q6212J66325k7729j32282
139a19269j0841R0985R5455P8945n5963j71278J2145K42467J11135k02357k00769
150a29345J07663J91907o7308j98175k7247J28007M5494j27409j14733O8245J54284
161C1383M0066j32400j30255R7628K39314N3608j88811j24174J27397J70472k9033
172A55195j40627m5714O6420M8920o1207j11200m819J12208L1060j49653j20586
183b20003J17731J98059j7896j91902n4335J69652J50507m3919j20137r214R6880
194G5423N0743n6629o6726Q660N5528m004j08266p8497P5950J07947n1822j59301
$$ plain form
117 46783 53741 -36211 -41795 54421 65720 46456 150605 171803 -20622 -111833 88242 237479
129 237479 19748 -221106 -74709 122427 -21734 -211795 -125583 40742 13013 -119269
139 -119269 -130110 -39125 56330 135275 79312 -91966 -79821 162646 273781 71424 -129345
150 -129345 -21682 170225 102917 -95258 -122505 5502 50996 -76413 -191146 -122901 31383
161 31383 71449 -60951 -191206 -93578 145736 199344 10533 -113641 13756 184228 155195
172 155195 14568 -31146 35274 84194 22987 -88213 -93032 19176 50236 -99417 -220003
183 -220003 -102272 95787 77891 -114011 -168346 1306 151813 107894 -12243 -21457 75423
194 75423 126166 69537 2811 11471 66999 62995 -45271 -123768 -47818 60129 8307 -150994
206a50994k7452J52771J00225p3922r5352K6662J11692N5686n5357m6341M9046
217D6664O4092k0619q8135k5875Q0559L9699q7126j06777K598R7591K8848r9899
229f8380o4261N9405P8606l254o0869N548R1912M1924n2025n2898L9339J10610
241A25657J2167j25543o7864P1372Q0655l9421j19513k8831P6624K5252o3651
252e3096n9776L5377R7208k496r8179j5689J06883J06557k9289j29469j5277J34336
264G7090Q2852p2283j24726j220J05734R461j02970n4384M3294O3222l6192j10585
276a20707l034J18544P0208p2058j16708L6383J66406N3617j01455q4992M6198
287g598J17943R556j06061m0786N7899L9797n5921r4679J3625R3646J896r9627
$$ plain form
206 -150994 -178446 -25675 74550 628 -94724 -68062 43630 99316 43959 -2382 46664
217 46664 110756 90137 2002 -23873 56686 96385 9259 -97518 -94920 2671 31519 -68380
229 -68380 -132641 -73236 5370 2116 -58753 -53205 38707 80631 28606 -24292 15047 125657
241 125657 137824 12281 -55583 15789 96444 57023 -62490 -91321 -14697 10555 -53096
252 -53096 -112872 -77495 19713 17217 -80962 -96651 10232 116789 87500 -41969 -57246 77090
264 77090 159942 87659 -37067 -38287 67447 76908 -26062 -80446 -37152 26070 -10122 -120707
276 -120707 -123741 -5197 65011 -7047 -123755 -87372 79034 132651 31196 -53796 -7598
287 -7598 110345 119901 13840 -26946 30953 70750 14829 -79850 -66225 27421 29317 -70310
299g0310p1265O0607J29465j95j17666l0882R7938R5188k2210q7200P839Q3723
311G5032K0784n9084n8468L1322P6203l4265j12789l0497P3693O5391n4487j08263
323a15428Q345R9858M2346n3741n9369M7739R6374m866o9831p025P1471N9400
335A15273n2189r7117Q368Q7768K6734q6150r5978L0170Q8180j0934q2108l0915
347i8898N9291O4065l3265o6538K8943R4519L6206o8811o6551N8738J04051l758
359A07992r6175n9528N1771P5915l2932r4735k0228N6751K6824n8259n4892M4440
371e3056P4591p437p3275k5864Q5833R4141k9259r3610j0065Q8759O2748m9333
383F4173q0845K035N4929P154o0515m3669L5478M0978m0697p0556P483Q1573M2072
$$ plain form
299 -70310 -141575 -80968 48497 48302 -69364 -100246 -2308 92880 70670 -16530 -8691 75032
311 75032 95816 36732 -21736 9586 85789 51524 -61265 -91762 -18069 47322 -7165 -115428
323 -115428 -107083 -7225 35121 -18620 -77989 -30250 66124 61258 -8573 -15598 55873 115273
335 115273 63084 -34033 -25665 62103 88837 2687 -93291 -63121 25059 14125 -67983 -98898
347 -98898 -39607 24458 -8807 -75345 -46402 48117 84323 15512 -51039 7699 111750 107992
359 107992 11817 -47711 4060 79975 47043 -47692 -67920 -11169 15655 -42604 -97496 -53056
371 -53056 21535 14098 -59177 -85041 792 94933 65674 -27936 -38001 50758 113506 64173
383 64173 -16672 -14637 40292 47446 -13069 -56738 -21260 19718 -20979 -91535 -84052 -2479 39593
396C9593n8123o5675L5724R8298L2963o3709m9499M5888O6944j3455o3238j2532
408f821M6090J4460n9053n7573K4498O4126p668q3985m0648O1781P6298j4293
420A7212p1926j0188P3814N7966k8448n6584J8379P3466Q935p0946m0028M7561
432A9213N6933l6490r2049k1508O5104M4121m7189p5477Q698P4504K4692m4986
444b4434l2158L9996O7566j757n8471r268O3735N0540m0666p9910J944O9258J8493
457F4868o1446o3856J2506N6180n640n7192j3352M5529L4032l2344m1488L8608
469b3595P0734P566n0141l3500M3339O9403p891o6774l3001L3877M4819k8213
481B6623o7013l214M4913O466n4528m0806N3374P0457l0961p4648K629Q5755O2027
$$ plain form
396 39593 -18530 -84205 -48481 49817 82780 19071 -30428 15460 82404 68949 5711 -6821
408 -6821 39269 53729 -5324 -62897 -38399 25727 18059 -65926 -106574 -44793 31505 17212
420 17212 -54714 -64902 8912 66878 38430 -18154 225 73691 82626 11680 -28348 19213
432 19213 76146 39656 -52393 -73901 -8797 35324 -11865 -87342 -78644 -4140 20552 -24434
444 -24434 -56592 -16596 50970 49213 -9258 -18526 45209 95749 55083 -24827 -22883 46375 64868
457 64868 3422 -60434 -47928 8252 2612 -54580 -67932 -22403 11629 -20715 -62203 -23595
469 -23595 47139 54705 4564 -28936 14403 83806 75915 9141 -23860 10017 54836 26623
481 26623 -40390 -43604 1309 7775 -46753 -87559 -34185 36272 5311 -69337 -66708 19047 81074
494H1074m3644o8402J4368O7506L5664m2067o4716J2473N4802n976o1951l7636
506e8505L9821N1277m0954p7949N429P9556M6968n4738p0507L6542Q9230K2441
518F8611n0984m3768L5374O2026j1593n4685j5711L3905K4907m2129n5329J2619
530c6757M1644M592m2491m2266K5456N8817M981m1178j7057M3846M9696k2161
542B7122l8768K5121M5180k646m8176k4064M1081K8978m0423m9823l460L3654
554f224J4846l4672l0469J4752L2683J1420k9850j7142M9800M7364k5453n0691
566b3636R576P2137K9740o3661n6784K5792N7729O38o7771m1119L7295L7266k5059
579g857m9534k485N4444K7317m3555l9163L3654P2507J8371o2335m1365M8209
$$ plain form
494 81074 37430 -30972 -16604 50902 86566 44499 -20217 -7744 47058 41082 -20869 -58505
506 -58505 -18684 32593 -8361 -86310 -80881 -1325 45643 -9095 -79602 -43060 46170 68611
518 68611 17627 -26141 9233 71259 59666 4981 -10730 23175 48082 5953 -49376 -36757
530 -36757 4887 9479 -33012 -75278 -49822 8995 13976 -27202 -44259 -413 49283 27122
542 27122 -11646 13475 58655 56009 7833 -16231 24850 53828 13405 -36418 -39878 -6224
554 -6224 8622 -26050 -56519 -41767 -9084 2336 -27514 -44656 5144 52508 27055 -23636
566 -23636 -14060 58077 87817 24156 -32628 -6836 50893 51531 -16240 -57359 -20064 17202 -7857
579 -7857 -57391 -59876 -5432 21885 -21670 -60833 -27179 45328 63699 1364 -40001 8208
591H208O7765m116o7351l7287M1850M4313k9673o1410o675M7797J1817n5474l1839
604g2075M3466N0202j3261n2810q054N9396M8995j8926m8103l779M9313L1185
616F5549l1150m2540N173L4816k298m9206k3422L5649K6379l6060m8420J3363
628e2167N5703J6148l9191k7312K9463M9284O583l4009j2242L3583K9159k2460
640C2542l9169N382L6929K613m7824l7453K2658M1782j0206n1587j8540M0300
652b2573L8359j8116l6101J1359M7097J9333l2023k5767L4013M6184j3134n2581
664c950j7194M1055L2038l3806n3289n756L6727J9583l3791l6938J9328M0150
676D157n16l4646p921M7273L8406k6644m1844J0873N5236K5189m5504m7948J7635
$$ plain form
591 8208 75973 71857 4506 -32781 9069 53382 23709 -37701 -44376 3421 15238 -40236 -72075
604 -72075 -28609 21593 8332 -44478 -52532 6864 55859 36933 -11170 -14949 34364 65549
616 65549 34399 -8141 -2968 31848 29550 -19656 -43078 -7429 18950 -17110 -65530 -52167
628 -52167 3536 19684 -19507 -46819 -17356 31928 38511 4502 -7740 25843 55002 32542
640 32542 -6627 -1245 35684 38297 -9527 -46980 -24322 17460 7254 -44333 -62873 -22573
652 -22573 15786 -2330 -38431 -27072 20025 39358 7335 -18432 15581 61765 48631 -3950
664 -3950 -21144 19911 51949 18143 -35146 -40902 -4175 15408 -18383 -55321 -35993 4157
676 4157 3641 -31005 -38926 8347 46753 20109 -21735 -10862 44374 69563 24059 -23889 -6254
689f254M2874J015m5264l2437K2206K7850j8842l5501J78M0127J9641l7174k8429
702e0010L4007N2321P521m5042k6719M0766M6963j1497m6546j8726L2571K3487
714C9096l2483l6091P520K6922Q7m0091k0766L6359L5766j3620l9630m999N0612
727H682L6471k4628l2516P949L7937J6454l3103k6053K0036K1523j5669l8149
739b1066j0779L2649J4704l3314l2363Q794M0742J6139l4577k0606L0198L5378
751B5899N3k8344m240L6370J7374k6658k8127P493L4594K073m7125k7802K1957
764a6483K9870p679m2211j3435L4920K3258j6834k3250J1151M1217R226l3075
776c325j1384L1675L4505r926m6062j3120L7019K3910k5420m4992o925L5228J0345
$$ plain form
689 -6254 36620 37635 -7629 -40066 -17860 9990 -8852 -44353 -44175 -4048 15593 -21581 -50010
702 -50010 -16003 36318 43839 -1203 -27922 12844 59807 48310 1764 -16962 15609 39096
714 39096 6613 -29478 -21958 4964 5051 -35040 -55806 -19447 16319 2699 -36931 -41930 8682
727 8682 45153 20525 -11991 -4042 33895 50349 17246 -8807 11229 32752 17083 -21066
739 -21066 -31845 804 15508 -17806 -50169 -41375 -633 15506 -19071 -39677 -9479 25899
751 25899 25952 -2392 -6632 29738 47112 20454 -7673 -180 34414 36487 -10638 -38440 -16483
764 -16483 13387 5708 -36503 -49938 -15018 8240 -8594 -31844 -20693 20524 29750 -3325
776 -3325 -14709 16966 51471 41545 -4517 -17637 19382 43292 17872 -27120 -34045 1183 11528
789A1528l2208k2031J5658K9692k578l2074L27M1509K5316k0151l4320J0153M8722
802C9543J5467l5560l3420R647L5575O62m0191k0845J8994J7808j6726l1613N381
815c5278L5697P257k8694j9289K5535M4615K865l7104j3560L1983L3188j0316
827C6899l6860o247K6291R418k6314k7461Q735K5627q631l6107j0239K9727K7380
840A2218j4899l2073M562L9505K2388j9472k4241J4787L3791J012l0157j3117
852e696K1625J8934k1332l6902k310K9657J1074l1025l1069J3522L5247N369k7560
865b0466j2414K7262K9741p447k4474M010L4329J3923k8746k6967J4306L1528
877C4585k230m0051k5483J9744K6416j0495l4344r144K8176J7904j7663j7307
$$ plain form
789 11528 -20680 -42711 -27053 2639 61 -32013 -31686 9823 35139 14988 -19332 -9179 39543
802 39543 55010 19450 -13970 -4323 31252 31914 -8277 -29122 -10128 7680 -9046 -40659 -35278
815 -35278 419 7676 -21018 -40307 -14772 29843 32708 -4396 -17956 14027 47215 36899
827 36899 39 -6208 20083 29501 3187 -24274 -15539 10088 1457 -34650 -44889 -15162 12218
840 12218 -2681 -34754 -30192 9313 31701 12229 -12012 2775 36566 37578 7421 -5696
852 -5696 15929 34863 13531 -23371 -25681 3976 15050 -15975 -47044 -33522 1725 7094 -20466
865 -20466 -32880 -5618 24123 16676 -7798 -3788 30541 44464 15718 -11249 3057 34585
877 34585 32355 -7696 -33179 -13435 12981 2486 -31858 -41002 -12826 5078 -12585 -29892
889b9892J5715L1891M978k6968r569L0389K9449j1324l7296r730L1124J8371k4317
902A2821l3517k631K3710N467k7040j5210J8251J9612q317k3956N776L6426J6292
915B7684k0611k2269J2192L8227R847l2135k2292J4276K3878o070l3609j0877
927b1759K0511P769k0942k3198Q935L1948J917l0113j0561K7171L4071k032l1537
940g820m327L1627K0919j3630k8581K69K6936R89k9645j9092J1925K2133r663
953B040l5886p043K8716K1835j2789k9563O253L8177J3145j9461j4421J5476K8439
966C4918m012k8508m961K0378J2872j8571l3273j80K5996N054k3353k4158Q082
979b9716K9818K531k3026m563K2800K1644r187k0979J2394L0075L540k4518k0094
$$ plain form
889 -29892 -14177 17714 22692 -4276 -13845 16544 45993 34669 -2627 -12357 18767 37138 12821
902 12821 -20696 -23327 383 5850 -21190 -36400 -18149 1463 -6854 -30810 -25034 11392 27684
915 27684 7073 -15196 -3004 35223 45070 12935 -9357 4919 28797 22727 -10882 -21759
927 -21759 -1248 6521 -14421 -37619 -28684 3264 5181 -24932 -35493 -8322 25749 23717 -7820
940 -7820 -12147 19480 40399 26769 -1812 -1543 25393 26382 -3263 -22355 -10430 11703 2040
953 2040 -33846 -40889 -12173 9662 -3127 -32690 -26437 11740 24885 5424 -8997 6479 34918
966 34918 30906 2398 -2563 17815 30687 12116 -21157 -21337 4659 9713 -13640 -37798 -29716
979 -29716 102 2633 -20393 -24956 -2156 19488 10301 -10678 1716 31791 35331 10813 -9281
992i281J5077K7597r157l3757j4649J5170J8755j2259k7559P29K0752Q026j3805
1005a4361j3331J8799K9280m734k4068k842K8967K6165j7423l3718R21K6937J1434
1018C2026k4010k9708O294K1737n392k3483q850J8455J7317j3490k0581R022L0082
1031I419J5734j8974k2405J5853L2316M618k5462j9190J4820K1642j2023k8098
1043a1750n112J7876O807k3150k0109J4458K3733j241k2367q982K3877K6392n007
1056A5425k0952r07K3748J6167j5473k0143O611J9027k307k6511j5621J6633J7084
1069A2781j4720k8286k898K5301J5118j6315j8021J0728K6284O821j7047p132
1081g386J9893J8942j0082k2721m82K2817Q334k3133k6468L553K3836L476k6222
$$ plain form
992 -9281 5796 33393 24236 -9521 -24170 -9000 9755 -2504 -30063 -29334 -8582 -556 -14361
1005 -14361 -27692 -8893 20387 15653 -8415 -11257 17710 43875 26452 -7266 -6345 20592 32026
1018 32026 8016 -21692 -15398 6339 947 -22536 -31386 -12931 4386 -9104 -29685 -20663 9419
1031 9419 25153 6179 -16226 -373 31943 36561 11099 -8091 6729 28371 16348 -11750
1043 -11750 -16862 1014 7821 -15329 -35438 -20980 2753 1512 -20855 -29837 -5960 20432 15425
1056 15425 -5527 -6434 17314 33481 18008 -2135 4476 23503 21196 -5315 -20936 -4303 12781
1069 12781 -1939 -30225 -33123 -7822 7296 -9019 -27040 -16312 9972 16793 -254 -7386
1081 -7386 12507 31449 21367 -1354 -1836 20981 29315 6182 -20286 -16733 7103 10579 -15643
1094a5643j8475J3546K1973k612j9811J18K3848J3497j2773j4630J3498K7440
1106B9976J160k5838j4050J6667K1506q364l0074j1299J5583J3312j1945k2761
1118b6127J344K0622L953j6728p402J9022K2946o083k2235J465K6809J8120j5400
1131B0306k6347L184K3203M390k0544j9431N528J6161o717k1219m509J7260J3004
1144D269j3701j9063J1411K7930P584j7350j4535J6088K6168k091k1600q479J4335
1157A0966J4148j4610k3138K260J5586J424k0542j7517J4056K2206m824k0257
1169b0242n515K1121K1716q203j7044N860J9815R242j4702j5961J2046J7136q149
1182A7120k3846j0411J6627J4763j7090k4190Q48J9840J1281j4762j5178J3333
$$ plain form
1094 -15643 -34118 -20572 1401 -1211 -21022 -20904 2944 16441 3668 -10962 2536 29976
1106 29976 31136 5298 -8752 7915 29421 21057 -9017 -20316 -4733 8579 -3366 -26127
1118 -26127 -24783 -4161 -208 -16936 -24338 -5316 17630 11547 -10688 -9223 17586 35706 20306
1131 20306 -6041 -2857 20346 24736 4192 -15239 -9711 6450 -267 -21486 -25995 -8735 4269
1144 4269 -9432 -28495 -17084 10846 18430 1080 -13455 2633 28801 26710 5110 -3369 10966
1157 10966 25114 10504 -12634 -10374 5212 6636 -13906 -31423 -17367 4839 15 -20242
1169 -20242 -25757 -4636 17080 8877 -8167 -2307 17508 26750 12048 -3913 8133 25269 17120
1182 17120 -6726 -17137 -510 14253 -2837 -27027 -26179 -6339 4942 -9820 -24998 -11665
1194a1665K0342J237j3018l938J9907J6067j3803j8619L474K0604P850k4468k2888
1207a8918R143J8372j268k1465j4074J3806J5503o924j3379K206J9855J0624j5227
1220a746j0250J6689K1604k84k2685j1941J9114J7318j1215k3881q224J5340R465
1233I304j6463j5602N520J4153J664j6587n590K0970J6997p860j7186K128K5608
1246A7056J3303j6845j7210N202J7808K779k0953j3657R894J0249r087j9177k398
1259b3036J8805P936j5751j3369J0210K3681O477j8067q293J6885J8282l081j7804
1272B875l480J6139O578j5581j6858K896J6179j589k2746j1784J3785J6916m204
1285h74j9507k152K0512J3974p572j2363O996J9896L233j6525p795J3184J4111
$$ plain form
1194 -11665 8677 9914 -3104 -7042 12865 28932 15129 -3490 -16 20588 28438 3970 -18918
1207 -18918 -9775 8597 7329 -14136 -28210 -14404 1099 -5825 -19204 -16998 2857 13481 -1746
1220 -1746 -11996 4693 26297 26013 3328 -8613 10501 27819 16604 -7277 -15501 -161 9304
1233 9304 -7159 -22761 -17241 -3088 -1424 -18011 -23601 -2631 14366 6506 -10680 -8552 17056
1246 17056 30359 13514 -3696 1506 19314 22093 1140 -12517 -2623 7626 -1461 -20638 -23036
1259 -23036 -4231 3705 -12046 -25415 -15205 8476 14953 -3114 -11407 5478 23760 20679 2875
1272 2875 -605 15534 22112 6531 -10327 -7431 8748 7159 -15587 -27371 -13586 3330 -874
1285 -874 -20381 -22533 -2021 11953 4381 -7982 -986 18910 22143 5618 -2177 11007 25118
1298B5118r836k3535n591J6919R660j5348k1543J290J8896N903j3775r647J1736
1311i753J7174j223j3097J812J9339J1009j3375j6586O937J9854J938k1020j7880
1324a4871P713J6337l553k0160q920J2039J1656q188j2499O978J7792M858j3064
1337c882p350J6628J9376l847j9221o424J6320J3665j1995k0227k876J2271M672
1350G110j5414j3315Q293J3000m231j4764j489J9614J3687r670j3471N607K1021
1363A5978R644j4904j3816Q275J4605k293j8249r297J1359P479j2794j6294R39
1376a9368J6645N961j6331j1055J2214J9071L229j4172n404J6560J4130o112j3515
1389A853k08J5144M147j8236j3263P129J3145l389k1613r807J4503J3333n436
$$ plain form
1298 25118 15282 -8253 -13844 3075 12735 -2613 -24156 -22866 -3970 1933 -11842 -21489 -9753
1311 -9753 7421 6198 -6899 -5087 14252 25261 11886 -4700 2237 22091 24029 3009 -14871
1324 -14871 -7158 9179 5626 -14534 -23454 -11415 241 -7947 -20446 -13468 4324 9182 -3882
1337 -3882 -11232 5396 24772 20925 1704 -4720 11600 25265 13270 -6957 -9833 2438 7110
1350 7110 -8304 -21619 -13326 -326 -4557 -19321 -20810 -1196 12491 2821 -10650 -5043 15978
1363 15978 25622 10718 -3098 5177 19782 17489 -760 -10057 1302 8781 -4013 -20307 -19368
1376 -19368 -2723 3238 -13093 -24148 -11934 7137 10366 -3806 -9210 7350 21480 15368 1853
1389 1853 1645 16789 20936 2700 -10563 -3434 9711 6322 -15291 -25098 -10595 2738 -2698
1402b698j5800j283J8988J0480r474p233R060J5548J123j6143m318J5027R838
1415B3115j0802k0377l657J6798N871j5457j6344J740J5668M287j4106n409J2663
1428f010J2352k681j1524M043J9837N813j3394j2203O754J8466m31k0814j1947
1441a1739P966J1780m689j8252m602J2718N597q179r282P065J7938J476j4113
1454f316k982J5414J6483m390j8832k088J5720Q318j1340j7199k36J3146q85j5350
1468a0537q236Q171J1595n373j5017J708J7456J0813q089j2786O553J9489M670
1481B0417j2462r321P448J2860n282j7062l726J0430N312j2929j6373M523J5989
1494a76J789j3716q979J0818J7348K12j1989j165J3514J0803o871j2126M642J3193
$$ plain form
1402 -2698 -18498 -19781 -793 9687 213 -7020 2040 17588 18711 2568 -1750 13277 23115
1415 23115 12313 -8064 -11721 5077 10948 -4509 -20853 -19113 -3445 842 -13264 -18673 -6010
1428 -6010 6342 3661 -7863 -3820 16017 21830 8436 -3767 2987 21453 21022 208 -11739
1441 -11739 -3773 8007 3318 -14934 -19536 -6818 -1221 -9400 -18682 -11617 6321 7797 -6316
1454 -6316 -9298 6116 22599 18209 -623 -2711 13009 21327 9987 -7212 -7448 5698 4813 -10537
1468 -10537 -18773 -10602 993 -4380 -19397 -17689 -233 10580 2491 -10295 -3742 15747 20417
1481 20417 7955 -1366 6082 18942 13660 -3402 -7128 3302 8614 -4315 -20688 -16165 -176
1494 -176 1613 -12103 -21082 -10264 7084 7296 -4693 -5858 7656 18459 11588 -538 4104 17297
1508A7297k47j5690j1697Q413J3034o901j8872o570J2499J1953p428j3358K743
1521a4824J5110O588p882n972J1222J3430l692j3472j754J4359Q787j2666j7639
1534h405l49J3987M582j4874j4418N192J2652K25j1563l429J2816J0173n977r159
1548h547O136J6934M873j3684j0067R019J4512k019j7601r265Q836R003p319j4565
1562a3754k419J1944M199j0648p361R363J4746rj2807k316J5264J3163n416j4485
1576e36p27J4283N368j2132j2213K416R912k205j5336n888J0070Q963o410j3679
1590a8114K051J6755P818q511q777O510J6162K664j2018n086R008Q655o548j5278
1604d709o70J1853J675j3046j3229M508J4691N31j3977o046J0045J3844q52j0778
$$ plain form
1508 17297 17050 1360 -10337 -1924 11110 4209 -14663 -21233 -8734 3219 -4209 -17567 -14824
1521 -14824 286 6874 -1008 -6980 4242 17672 13980 508 -1246 13113 21900 9234 -8405
1534 -8405 -8754 5233 9815 -5059 -19477 -14285 -1633 -1408 -12971 -16400 -3584 6589 612 -8547
1548 -8547 -2411 14523 19396 5712 -4355 4664 19176 17157 -444 -9709 -873 8130 811 -13754
1562 -13754 -16173 -4229 -30 -10678 -18039 -8676 6070 6061 -6746 -9062 6202 19365 13949 -536
1576 -536 -1263 13020 18388 6256 -5957 -3541 6371 4166 -11170 -17058 -6988 1975 -4435 -18114
1590 -18114 -16063 692 8510 -1 -8778 -2268 13894 16558 4540 -546 8462 17117 10569 -4709
1604 -4709 -5379 6474 8149 -4897 -18126 -13618 1073 1604 -12373 -18419 -8374 5470 4618 -6160
1618f160J696J3042O456p330r061O353J3077l179j5633p645Q877J0887p780j7646
1632a4046l339J1150Q143o836j1658M184J3727K572p757k462J0445J2287n339
1645A1071j2766J680J3153O787j2036j5965K733J2526P05j3165j1036N241J1030
1658d2l128j0815K12J1184Q152o839r002Q800J5349K125j1555q404R553J3193
1672A8783m767j4635o012P938P293r412j3095K065R765J319j0344o854J0600J3120
1686E764k560j0490p68J3776J1566p054j1062K643J1051L135j1181j0374N912
1699C58Q059n771j3544m404J0615P625q975j1765L635J4048P089q851p300Q881
1713c00J2417L34r159l021J0140O468r343j1822J390J0457J370j4642j1325O380
$$ plain form
1618 -6160 -4464 8578 15034 7704 -1357 4996 18073 14894 -739 -8384 493 11380 3600 -14046
1632 -14046 -17385 -6235 1908 -4928 -16586 -12402 1325 3897 -3860 -6322 4123 16410 11071
1645 11071 -1695 -15 13138 19925 7889 -8076 -5343 7183 7888 -5277 -16313 -11072 -42
1658 -42 -3170 -13985 -13773 -2589 5563 -1276 -10278 -1478 13871 15996 4441 -3963 5590 18783
1672 18783 14016 -619 -6631 1307 8600 -812 -13907 -11842 -2077 -758 -11102 -17956 -7356 5764
1686 5764 3204 -7286 -8054 5722 17288 10234 -828 1815 12866 16001 4820 -5554 358
1699 358 8417 2646 -10898 -15302 -4687 2938 -6037 -17802 -14167 -119 6970 -1881 -9181 -300
1713 -300 12117 12451 3292 271 10411 16879 7536 -4286 -2896 7561 8931 -5711 -17036 -10656
1727a0656J1564o94j2302n464J1017J0643k916p487K549J2493M769r062n753Q135
1741F836J0476l385j4849o260R947Q027q240j5129k748J0883N620q400q015M973
1755a0264J1047J546q069p00J1873R026n281j0685K081J3437M280j2019j1950
1768e678K718J0574q47j3448p490O347P407m142j0082J901J1691N134p368o323
1782i606Q252J4199J188j1036n096R179J0087m990j3321k806Q227K914r740j0412
1796a2961L048R683j371j0860m328J0339J1535l109j0012J430J2689Q521o015
1809H589r243M323J0105j60j0692o839O106O863p442j3015j941R543O342q954
1823f415j1005M644J2947M258p176n034Q722J0924k226p592j18R433M664j0029
$$ plain form
1727 -10656 908 214 -12088 -17552 -6535 4108 1192 -6295 -3746 8747 13516 4454 -1299 6836
1741 6836 17312 13927 -922 -7182 2765 10792 2552 -12577 -15325 -4442 1178 -7222 -15237 -10264
1755 -10264 783 2329 -5740 -6440 5433 14459 9178 -1507 574 14011 18291 6272 -5678
1768 -5678 -2960 7614 6767 -6681 -14171 -7824 -417 -4559 -14641 -12740 -1049 4085 -3283 -9606
1782 -9606 -1354 12845 14033 2997 -2099 7080 17167 12177 -1144 -3950 4277 7191 -2549 -12961
1796 -12961 -9913 -230 -1601 -12461 -16789 -6450 5085 1976 -8036 -6606 6083 14604 8589
1809 8589 -654 3669 13774 13614 2922 -3917 2189 9052 1610 -11405 -13346 -3803 2539 -6415
1823 -6415 -17420 -12776 171 4429 -2747 -7781 941 11865 9639 2047 1929 11362 16026 5997
1837E997j0594L472R461p18j3365j0376P069J0258k665j0563l256R853R020m522
1851i29n808N085J0314L242q681m457R252Q886n140j2719m825R375O476r611j2355
1866a1895n13Q605M049q586o520P270Q848m89o872k31J2556P622o846q098K914
1881A814J1323L568j2077r587M466P613k421j2023n738P768N375o299p867K194
1895a1891J1810M217q617m210Q657J1635Q34j0160l549R671O707n798j0255j713
1909b662Q237J191j1356p433M155Q364j622j1556k886J0875Q785k868q090J149
1923e717J2430N676o356n649M393Q513j295j1641l721P401M205p361j2481o12
1937a2215J0550L439q832p943L792J1922K714p578j948Q329Q344k549p534J870
$$ plain form
1837 5997 -4597 -1125 8336 7618 -5747 -16123 -9054 1204 -1461 -12024 -15280 -5427 3593 -929
1851 -929 -6737 -1652 8662 11904 3223 -1234 8018 16904 11764 -955 -5780 3595 10071 460 -11895
1866 -11895 -12408 -3803 246 -8340 -14860 -7590 1258 769 -6103 -6334 6222 13844 6998 -1100 1814
1881 1814 13137 16705 4628 -4959 -493 7120 4699 -7324 -13062 -5294 81 -6218 -14085 -11891
1895 -11891 -81 4136 -4481 -8691 -34 11601 12435 2275 -1274 8397 15104 9306 -949 -2662
1909 -2662 5575 6766 -4590 -12023 -7868 496 -1126 -12682 -15568 -4693 4092 1224 -6866 -5717
1923 -5717 6713 12389 6033 384 4777 13290 11995 354 -3367 4034 8239 878 -11603 -12215
1937 -12215 -1665 1774 -7058 -15001 -11209 713 3427 -4151 -6099 2230 10574 8025 491 2361
1951B361R716K073r745q774L623R390k338j3011o752O164Q187l061j0101n56R191
1966c633N879l955m872N265J0640O54q203k371Q211Q088n498j1974k096Q205M029
1981H369q523j0781Q39Q513O20q244m097O878Q729k371p120K215J0956O273o489
1996E767p521M237J0175P20r791p394M397O665m416j0430k976P006M265p232p465
2011a3993M147J0558K568p603m265Q691J0550j046p820j965Q486N300o813q302
2025a507R57O588m36j0392o700N473P328l118j0168k450J0472P827m228o508K542
2040d320J0195M514o137m304N811O656k720r553k850P847L121q499j0115j14R424
2055a044K801r115o532N141R053J699o634j120Q639O198l233n702K258R276J278
$$ plain form
1951 2361 12077 14150 4405 -4369 -746 8644 6306 -6705 -13457 -7293 894 -2167 -12268 -12824 -3633
1966 -3633 2246 -1709 -6581 -1316 9324 9978 1775 -596 7615 15703 10205 -1769 -3865 4340 8369
1981 8369 -154 -10935 -10096 -1583 -963 -9207 -13304 -6426 2303 -68 -7188 -4973 5983 12256 5767
1996 5767 -1754 2483 12658 13378 3587 -3807 590 7255 2839 -7591 -10567 -3561 704 -6528 -13993
2011 -13993 -9846 712 3280 -4323 -8588 103 10653 9607 1787 -178 8308 13608 6795 -1507
2025 -1507 -550 6038 5602 -4790 -11490 -6017 1311 -1807 -11975 -14425 -3953 3874 -354 -6862 -4320
2040 -4320 5875 10389 4252 -52 5759 12415 9695 142 -2708 5139 8260 -239 -10354 -10468 -1044
2055 -1044 1757 -7358 -13890 -8749 304 2003 -4631 -5751 2888 9086 5853 151 2409 11685 12963
2070A2963j0051o369M119P660k393j2329n255O619N636l576q336q1R337L551n069
2085c574k980N995R124J40q191j260Q757N948m885j0857r67Q270J791q411q120
2100i220J408P205o97q628j955P135O619k252p343K737J1220L977n408n859L624
2115B563R581n07r148m509M304M805m726j0165q04P227J609o827o719M076J0262
2130A022J149p321k059P150R394j326p369P26P233L275n938p451K451O704l078
2145D562r592n094N334O864m434r450m82Q470O324l379o396L821R394K089m979
2160C052k655N733O333m538q457o70O640K842q527r754K042P589O02p485n834
2175a3087N318Q441q60n233N08P756N718m198n193M546P702K62q417o448N265
$$ plain form
2070 12963 2912 -3457 662 8322 5929 -6400 -11655 -5036 600 -2976 -11312 -11393 -2056 1495 -3574
2085 -3574 -6554 -559 8565 8705 514 -746 8011 13959 9074 -1783 -2750 5520 7311 -1100 -9220
2100 -9220 -7812 -607 -1304 -9932 -11887 -4752 1867 -385 -7728 -4991 6229 10206 4798 -1061 2563
2115 2563 12144 11637 2489 -2020 2284 7089 2363 -7802 -8606 -1379 230 -6597 -13316 -9240 1022
2130 1022 2171 -5150 -7209 -59 9335 8009 640 1366 8599 11874 5936 -1515 936 7640 4562
2145 4562 -5030 -10124 -4790 2074 -2360 -11810 -12292 -3822 2502 -877 -7273 -3452 5942 8031 3052
2160 3052 397 6130 12463 7925 -532 -1202 5438 8280 -247 -10001 -7959 -370 232 -7253 -13087
2175 -13087 -7769 672 -188 -5421 -4913 2843 8561 4363 -830 3716 11418 11680 3263 -3185 2080
2190B080O162m051j0030l738N661M856n496o908K000P513K870n249k796P430Q031
2205H335j437o411p07Q047N421n866q322K25O334J049q659o661L250N298k275
2220b379p642j624P865N550l726n542L121R571M204n904m230M498P197p46q064
2235B149l177N009K897n965q110j22O756J060q095n301M885Q668N82o931j198
2250f893P963O952j791n436J155P243J685o653m860K781N348l248r696l507N561
2265c396M700m092q706J85Q608M214l663m210M028Q360J033n298r45O138M744
2280A1700m415q127M05O606Q92p671q197J799O994k94p666l455M937P082j520
2295i30n097K023P813L582l836m414M619P569j009p859m160M028N255m680q855
$$ plain form
2190 2080 8242 4191 -5839 -9577 -3916 940 -4556 -11464 -9464 -1951 919 -4330 -7126 304 8335
2205 8335 6898 487 -220 7827 13248 7382 -940 -715 5619 6668 -1991 -8652 -5402 -104 -2379
2220 -2379 -10021 -11645 -3780 1770 -1956 -7498 -4377 5194 9398 3494 -736 3762 10959 10213 2149
2235 2149 -1028 3981 6878 913 -7197 -7319 -563 497 -7598 -12899 -8014 654 1236 -5695 -6893
2250 -6893 1070 8022 6231 795 1950 9193 10878 4225 -635 2146 7494 4246 -5450 -8957 -3396
2265 -3396 1304 -2788 -11494 -11309 -2701 1513 -2150 -6360 -2332 6028 7061 1763 818 6956 11700
2280 11700 7285 -842 -437 6169 7061 -610 -8807 -7008 -14 -308 -7974 -11429 -6492 590 -930
2295 -930 -6027 -4004 3809 7391 3555 -859 3760 11329 10320 2461 -1699 2329 7584 2904 -5951
2310e951j782M883K746m928o276L465P238P03m951j672O966P788k357n789N28
2325F11O743M477n326p475J554N086r92p111n381L537M903l952o742j79O857N348
2341A958m257n236M239Q313L096m692m108N156O067k450o191k161M619K166p112
2356e93o789J653N255M93p323m929N755P203m95n306j007P354O305k983l784K206
2372C015N315J306o562m174M220L738l706q231l401N983L892n206o273N76P011
2387b497L930m522k898N101O276M18m446j018O838L545m899o139O5N819J081q242
2403a588o141K476N112m75p128k528N966M782k179l876J679Q123K886m748k982
2418f21M376O168o64p518l188M376L286m200p275j453N430R85n548l950L206O597
$$ plain form
2310 -5951 -7733 -2850 -104 -5032 -11308 -7843 -605 98 -4853 -6525 441 8229 5872 83 611
2325 611 7354 11831 6505 -970 584 5670 4678 -2433 -7814 -4277 626 -3326 -10068 -10247 -3390 1958
2341 1958 -2299 -7535 -3296 5017 8113 3421 -687 4469 10536 8086 1895 -266 4353 6519 -593
2356 -593 -7382 -5729 -474 19 -7304 -12233 -6478 725 230 -5076 -6083 1271 7576 4593 809 3015
2372 3015 8330 9636 3074 -1100 3120 6858 3152 -5079 -8480 -2497 1395 -3811 -10084 -9508 -2497
2387 -2497 1433 -3089 -5987 -886 5390 5808 1362 344 7182 10727 5828 -311 -246 5573 6654 -1588
2403 -1588 -7729 -5253 -141 -616 -7744 -10272 -4306 476 -1703 -5579 -3900 4223 7109 2361 -621
2418 -621 3755 9923 9259 1741 -1447 2929 6215 2015 -5260 -6713 -1283 -298 -5846 -9796 -6590 7
2434GK84n601n68O745N886j374n505P90O646K648m924n403J256M761j804p277
2450c433l104L557L628l616o784N11P166L571l966m174L620Q113J570m507k004
2465A48M350M777k507n922k95M054P33n898o194J907N502q87o744l327M609O533
2481H39r39n080M78O304M722k597l861L054N335k35n592l391L906L946m358p463
2497d932j799M778L074m726o038J765O278J968l519k338N116N625q91l771P7N871
2513F538L319n053n686J554M706K8o855n300K993M094k142n384j635N471M093
2528G41l335l222L086O519K485m668k664M970N041j249n911k877M556K495n044
2543I23n626k58M015P18n736l391M308N131l65m695p39O975M877k113l999P28
$$ plain form
2434 7 291 -5310 -5878 867 6753 5379 -126 664 7310 9958 5034 -369 887 5648 3844 -3433
2450 -3433 -6537 -2980 648 -2968 -9752 -9241 -2075 1496 -2470 -6644 -3024 5089 6659 2152 148
2465 148 4498 9275 6768 846 551 4605 5338 -560 -6754 -4847 655 -232 -6976 -10303 -5694 839
2481 839 -100 -5180 -4702 1602 6324 3727 -134 2920 8255 8020 2428 -963 2943 6889 2531 -4932
2497 -4932 -6731 -1953 1121 -3605 -9643 -7878 -1600 368 -3151 -5489 -373 5252 4361 590 667 6538
2513 6538 9857 4804 -882 672 5378 5406 -1449 -6749 -3756 338 -1804 -7188 -8823 -3352 741
2528 741 -2594 -5816 -2730 3789 6274 1606 -1058 3912 8953 7704 1793 -1084 3472 5967 923
2543 923 -4703 -4961 -946 -228 -5964 -9355 -5047 84 -281 -4976 -5715 1260 6137 4024 25 753
2559G53N873K338n043l903K084L126j891o536k507M373K242m406n330M46O789
2574a592L080m631k833L659O058K023m449j106M667L226k492m781m3M470j58o256
2590a158m496J793M614j096o688k161M729M734j063m257P96O320K955k646k095
2605B81K393N325o41n758j810L621K784l658p197j124M878J273m401m551J664
2620f921N969O85l890n62M509N036j048m190J371N712J921l967m927J244M386
2635E328p93o229l560K169L196k230n388K0M929K532k656l226L363O465J062l622
2651A360k041M314M572j725n166r28L230J461m316n415R13L725r34n011k494L910
2667d545M833j293m237L44N802M717k285l625J998M799R82l964l180K309K591
$$ plain form
2559 753 6626 8964 3921 18 2102 5228 3337 -3199 -5706 -1333 909 -3497 -8827 -8381 -1592
2574 -1592 1488 -3143 -5976 -2317 3741 5764 1315 209 4876 8102 5610 829 786 5256 5098 -1158
2590 -1158 -5654 -3861 753 -343 -7031 -9192 -4463 271 -792 -5049 -4253 2067 5022 2376 281
2605 281 2674 7999 7358 1600 -210 3411 6195 2537 -4660 -5784 -906 367 -4034 -8585 -6921
2620 -6921 -952 -267 -4157 -4719 -210 4826 3778 -412 959 6671 8592 4625 -302 942 5328
2635 5328 4535 -1694 -5254 -3085 111 -2119 -7507 -7487 -2558 -26 -2682 -5908 -2545 3920 4982 1360
2651 1360 -681 3633 8205 6480 1314 386 3616 5077 761 -4654 -3741 -16 -950 -5961 -8455 -4545
2667 -4545 288 -1005 -5242 -4898 904 5621 3336 -289 1709 6508 7490 3526 346 2655 5246
2682E246k938n549j423L618J876m611m731J638N429K043l726k476L930N417N93
2697D336l256m65M361K780l126l826O74L491k87o004l993K472L278j463n288k037
2713h353M612L728j754k895J373N480K354k845j826L393M321r90n214j543L664
2728C505J963l633n604q56L832Q04m657k899K064M414K53l393m34N226L949j556
2744B978l195J160N351J602m083l660J193L411r51n622k642K415J885k316m388
2759f862J29M998J713l244j887K919N958Q93l861j097L918L816j641m604n09L163
2775C802K00l976l938Q17L345j340n125j241L612M048j186m171R37N819K756j625
2791B734k771J783M599J45l976j938J954K258k878n423k14L203P87l827m166J821
$$ plain form
2682 5246 2308 -3241 -4664 -1046 830 -3781 -8512 -6874 -1445 598 -3128 -5604 -1674 3743 4336
2697 4336 1080 615 4976 7756 4630 804 1478 4969 4682 -1322 -5315 -2843 435 -1028 -6316 -8353
2713 -8353 -3741 -13 -1767 -4662 -3289 2191 4545 1700 -126 3267 7588 6598 1384 -159 3505
2728 3505 5468 1835 -3769 -4625 -793 11 -4646 -7545 -5481 -1067 -814 -4207 -4641 585 4534 2978
2744 2978 -217 943 6294 7896 3813 153 1346 4757 3806 -1816 -4458 -2043 -158 -2474 -6862
2759 -6862 -6733 -1735 -22 -3266 -5153 -2234 3724 4617 756 -341 3577 7393 5752 1148 639 3802
2775 3802 4002 26 -3912 -3095 250 -1090 -6215 -7456 -3844 204 -982 -5153 -4216 1603 4359 2734
2791 2734 -37 1746 6345 6490 2514 576 2530 4788 1910 -3513 -3727 -524 263 -3564 -7730 -5909
2807e909N280N49l122j238L394M945n61k938P70L617K118k797l950J242L390j319
2823C471m694l441K152L325k292m749n02L619L025j741k913K525M617J453k683
2838A172j435L514L843j841m093p77K708J940l912m972M90K889J45l828k696K739
2854d114L639p93k884M00M625L290j920k790J809M258J194l550l116J738K614
2869D400j724m426k044K421J668l349l432J158L930J427l244j844L634M781M02
2884C758l158p93L909K838k107l344r5K564N6m073l043J458K314j347m587j117
2900f767M092K908j914k788J066M618K774k268j775K072L424l1l622j349K504
2915B944J231k902m236l91L403N36m111l056J826L837M61l160l64L518L369m31
$$ plain form
2807 -5909 -629 -80 -3202 -4440 -1046 3899 3338 400 1170 4787 6905 4108 158 1400 4790 3471
2823 3471 -1223 -4664 -2512 813 -1479 -6228 -6730 -3111 -86 -1827 -4740 -2215 2402 3855 1172
2838 1172 -263 3251 7094 5253 1160 383 3091 5031 1119 -3853 -3363 -474 -329 -4157 -6853 -4114
2854 -4114 -475 -1268 -4152 -3752 873 4163 2243 -547 1262 5520 6714 3164 48 1786 4400
2869 4400 2676 -1750 -3794 -1373 295 -3054 -6486 -5328 -1398 29 -3215 -5059 -1425 3356 3758
2884 3758 600 -193 3716 6554 4447 1103 1008 3572 3628 -445 -3488 -2030 284 -1063 -5650 -6767
2900 -6767 -2675 233 -1681 -4469 -3403 1215 3989 1721 -54 2018 5442 5411 1789 440 2944
2915 2944 4175 1273 -2963 -3354 49 585 -3526 -6582 -4756 -919 -458 -3618 -3982 -464 2905 2474
2931B474k455R07L996R66k882k728J362K799j048m654k377K203K059j956m288
2946e622P3L494J525j796k261K688M188N11k658l35L355K926j169m153q9K795
2962C472P70l347l826M66K742j049l464j335K203L057j280k976J408L890K772
2977C503j768k735K239M031K92l088k046J532K341k137l940p66J890Q43l090l143
2993f042J853L235L82k724j411L463M236o24k307L7L163K568k220k965J010K051
3009C705n59l498k600J781K188k285l746l21L023K539k245k562J897L821J880
3024C018k029j506K936K746p66k647j030K548J044l353l438M55K128K16l669k556
3040e903K143L001l57k445l10L730K721j376j599J548L106J013k906j944J748
$$ plain form
2931 2474 19 926 4922 5888 3006 278 1640 4439 3391 -1263 -3640 -1437 622 -1334 -5622
2946 -5622 -5549 -2055 -530 -2326 -4587 -1899 2289 2800 142 -193 3162 6088 4919 766 677 3472
2962 3472 4242 895 -2931 -2465 277 -772 -4236 -5571 -3368 -311 -1591 -4567 -3159 731 3503
2977 3503 1735 -1000 1239 5270 5562 2474 428 1960 4301 2164 -1776 -2542 -652 191 -2899 -6042
2993 -6042 -4189 -954 -572 -3296 -4707 -1244 2992 2368 61 98 3261 5829 3609 644 1654 3705
3009 3705 3146 -352 -2952 -1171 1017 -1268 -5014 -5335 -2312 227 -2018 -4580 -2683 1138 3018
3024 3018 989 -517 2419 5165 4399 1752 722 3270 4314 961 -2477 -2022 106 322 -3347 -5903
3040 -5903 -3760 -759 -1116 -3561 -3871 -141 2580 1204 -395 1153 4259 5272 2366 422 2170
3055B170J977j170m105j819K451J143k524k924J21L045R55k642q63K707L300L52
3071B174k564k9L704K135j782k642j95K601O56l538k544O39J631q66l526q36K661
3088b321J593j504k009J028M286J675k230j076J858L239M22l075j103J802J160
3103C745j819l482m37K399m55k861k256J414L082j51k965l02L216L225m40k355
3119d42O43L325J231j795j974P89K140j010l655j269J428J483k161l687J60L075
3135a719J233j738j896J603L878O29j810j70K312K372r80k646L81J924N01l084
3151G90k980O60K192p03l130j820J791K457j027k023P51K955K044r99j726K252
3167A484K837K46k476j605J805J940j986l244r14J559P97k345k672Q18K338L54
$$ plain form
3055 2170 4147 2977 -1128 -2947 -496 647 -1877 -4801 -4680 -1635 -680 -3322 -4185 -1478 1822 2174
3071 2174 -390 -419 3285 5420 3638 996 801 3402 4058 520 -2024 -1385 246 -620 -4146 -4982 -2321
3088 -2321 -728 -2232 -4241 -3213 1073 2748 518 -558 1300 4539 4961 1886 783 2585 3745
3103 3745 1926 -1556 -1993 406 -49 -2910 -5166 -3752 -670 -821 -3786 -4088 -872 2353 1913 -442
3119 -442 201 3526 4757 2962 988 1777 3917 2907 -748 -2017 -589 894 -1267 -4954 -4794 -1719
3135 -1719 -486 -2224 -4120 -2517 1361 1990 180 10 2322 4694 3714 1068 1449 3373 3874 790
3151 790 -2190 -1530 662 -41 -3171 -4991 -3200 -743 -1770 -3793 -3042 -87 1957 958 -768 1484
3167 1484 4321 4567 2091 486 2291 4231 2245 -999 -1913 -354 443 -1902 -4574 -3756 -1418 -1064
3183a064k138o50K841K933m62k035M53L126K011k014k022N04J864p4k770k342
3199a839J116J111j520k699m22K278J392k088j539J696L356J446k215q47K438
3214A664K632j57k375r37K006P55k174k663M2J626l17l311j607J958K003m31k320
3231c606j25L395K215q76j355Q38K858Q55j966j385J519J198q60l557q13J709
3247D4O03k242k600Q9K662P46k085o60J662K842M18j867K62K631J622r83k226
3264I18M07K311j80k943k161O40J761j026l211m61J482J623q56k090J095L115
3280D24J146j371r64J961L057l51k499n28J543J274j558l257k59J765j71k119
3296a907k016Q47K412o56k173K34K407K610q59j862J180K747J037j355k219J120
$$ plain form
3183 -1064 -3202 -3852 -1011 1922 1460 -575 -122 3004 5015 3001 979 1483 3347 3273 503 -1839
3199 -1839 -723 388 -1132 -3831 -4253 -1975 -583 -2671 -4210 -2514 842 2288 73 -774 1664
3214 1664 4296 4139 1764 827 2833 3588 1414 -1249 -1207 419 102 -3209 -4816 -2858 -855 -1286 -3606
3231 -3606 -3731 -336 1879 1003 -352 486 3344 4199 2233 848 2367 3565 2705 -852 -1665 44
3247 44 647 -1595 -4195 -4106 -1444 -698 -2783 -3443 -1781 1061 1479 -388 -126 2505 4127 3144 918
3264 918 1325 3636 3456 513 -1648 -1008 753 -273 -3484 -3945 -2463 -840 -1696 -3786 -2691 424
3280 424 1570 199 -765 1196 4253 3902 1403 875 2418 3692 2134 -1123 -1382 383 212 -1907
3296 -1907 -3923 -3076 -664 -1320 -3493 -3259 -852 1758 899 -963 217 2964 4001 2646 427 1547
3312A547J903q17k586j305J018R84k045k257J17J998O01k027j106K025K874L87
3328A311j525l61K071K617j058j659k32J567O94k446k092O25J502j092k716j186
3344c980J755J811j245j894N79K656J909j495r42J551K546J85j780j050J919J084
3360C609j619k523n84J498O67k451k492R15J837J94j894p30K328K299l79j384
3376g09M77K772J164j565j447P25J939n6k976j481R19J216j463k435o45J820P96
3393i49j283j150J159K712O13j562l02K060K276m22k179k01J805Q48j625k384
3409e84l0J323n64k331j178J085J417n25k000J48K808J277p36j316J177L020O20
3426C611j873r77R60J586p94k621n59Q97L73j582k478N59K229l31j702p92J544
$$ plain form
3312 1547 3450 2633 47 -1258 -240 744 -1301 -3558 -3441 -1443 -842 -2869 -3975 -1950 924 1311
3328 1311 -214 -575 1496 4113 3055 1396 1164 2731 3425 979 -1113 -488 1014 -78 -2794 -3980
3344 -3980 -2225 -414 -1659 -3553 -2974 -318 1591 96 -846 705 3251 3436 1656 606 2525 3609
3360 3609 1990 -533 -1117 381 1048 -1403 -3895 -2980 -1143 -949 -2843 -3573 -1245 1054 675 -709
3376 -709 -232 2540 3704 2139 692 1417 3356 3300 324 -1157 -238 978 -485 -2920 -3565 -1745 -949
3393 -949 -2232 -3382 -2223 489 1102 -460 -762 1298 3574 3152 973 772 2577 3425 1800 -584
3409 -584 -614 709 145 -2186 -3364 -2279 -862 -1387 -3387 -3239 -431 846 110 -1206 -29 2991 3611
3426 3611 1738 761 1721 3307 2513 -108 -667 230 603 -979 -3457 -2898 -669 -1000 -2702 -3494 -1950
3443a950K693J39j871M32K122J939p35j927M95J786k93j983j621O22J330j363
3459a85k494o97J599J226j143j813R79K310J053q15q09J343K386p7j711k43J366
3476B275J191j603k329j05J309j00j915k204J169J493l63j571l58K037J824q12
3492f2r80R79K232J096j537j442J400J672n54k030j597J213P44j652k001k11J357
3509a373N81j513j037J439J885N04j282l15K455J878o37j590LJ594R17k078j832
3526d01K13R53l40k374j297J557J020j251j345K53K435J411j164r18J524K106
3542B382P67j776o10J595Q38j215j748p97J343Mk061j663P01J402J89k204m63
3559c316J943J766o8j325M20K336J185j073p94M26J655k44k185j148Q32R06j184
$$ plain form
3443 -1950 743 882 -989 -557 1565 3504 2769 842 1337 3123 2830 847 -774 -152 1178 -185
3459 -185 -2679 -3376 -1777 -551 -1694 -3507 -2528 -218 835 20 -789 554 2940 2863 1152 909 2275
3476 2275 3466 1863 -466 -571 738 638 -1277 -3481 -2312 -819 -1182 -2753 -3111 -1074 750 -62
3492 -62 -1042 -63 2169 3265 1728 286 1686 3358 2804 774 -823 390 1134 -518 -2519 -2730 -1373
3509 -1373 -792 -2305 -3342 -1903 -18 486 -796 -1111 1344 3222 2585 995 998 2592 3509 1431 -401
3526 -401 -188 765 425 -1949 -3246 -1689 -669 -1920 -3265 -3012 -577 834 -330 -1248 276 2382
3542 2382 3149 1373 763 2358 3196 1981 233 -564 779 783 -1278 -2941 -2240 -838 -649 -2853 -3316
3559 -3316 -1373 393 325 -1000 -580 1756 2941 1868 1074 1500 3155 2911 726 -422 410 1316 132
3576A32k797k88J668O15j382j066O22K496M96j179k26J646J952j80j646K89J449
3593B601N98j552j910j34J484k56k431j140P13J343o67j590J83J903J295o44j117
3610a321J442K258N57j464q89J127J612q70k086p30Q62N09j752j958M50J459k51
3627a045j363p61J543J916k00j118L52J941J682n47j601M55J542K1j503j586M30
3644A58R09j117j920o61J138Q46j167j281O68J944J043r87q60J706K185l11r40
3661A353m41J129R80j300j614K2P16O4k109j607P78J198k16j366n89J804J640
3678D42p26p08O60J943J097j223p25R63J080l83j686j401J397O05j713j926l67
3695b671J612M04j442r50J242J437O43r30k38J968J311m28j289J91J733M83j888
$$ plain form
3576 132 -2665 -2953 -1285 -670 -2052 -3118 -2496 0 496 -683 -909 737 2689 2509 863 1152 2601
3593 2601 3199 1647 -263 -397 1087 831 -1600 -2740 -2027 -684 -1351 -2941 -2758 -855 440 -204 -1321
3610 -1321 121 2379 2936 1472 583 1710 3322 2452 366 -364 498 1007 -745 -2703 -2253 -794 -1045
3627 -1045 -2408 -3169 -1626 290 90 -1028 -676 1265 2947 2400 799 1254 2796 2817 1314 -272 158
3644 158 1067 -50 -1970 -2631 -1493 -647 -1814 -3095 -2427 -483 560 -427 -1287 419 2604 2293 1353
3661 1353 912 2041 3021 1721 107 129 845 909 -1200 -2807 -2029 -831 -1047 -2413 -3002 -1198 442
3678 442 -284 -992 -332 1611 2708 1485 760 1723 2803 2420 734 -667 730 1335 -378 -2304 -2671
3695 -2671 -1059 -655 -2097 -3047 -1805 -368 275 -655 -893 1075 2386 1958 669 860 2593 3076 1188
3712A188j428K70Q20k68j984j222J004R86q35j111j2J963R74j045m03R87K428
3729B312J08j399m44J105J277n15k213m32Q99J67j693j375J56J308j05j883m5
3746b772J449J634k02j519P20K074J075p46r74K72J801l05j746q51N28N55r21
3763G2j949k80J033M73j167j000O99J969L09q90n9J241J677r5j094P7J156N73
3781B745j223j562J66J036p52j614j223P89J114p18j333J43J281J221k90j076
3797a296J259J745K77p78n96J173J030o74j724o88R90L51j426j584k1J180r9r93
3815a874q99J247J360M1r10K87J607J300o49j047O03J224L80j576j302O19O73
3832A084p63j600p76O76P46r57j138N55J506Q04r71m51J350J867K62j339l10J332
$$ plain form
3712 1188 -240 30 850 582 -1402 -2624 -1620 -634 -1469 -2580 -2592 -629 345 -700 -1103 -116 2312
3729 2312 2420 1021 577 1682 2959 2444 231 -201 698 865 -828 -2203 -2047 -739 -844 -2727 -2772
3746 -2772 -1323 311 109 -1410 -690 1384 2459 1713 739 1011 2812 2507 761 -90 438 993 72
3763 72 -1877 -2157 -1124 -651 -1818 -2818 -2119 -150 159 -731 -790 451 2128 2033 939 1016 2172 2745
3781 2745 1522 -40 126 1162 410 -1204 -2427 -1638 -524 -1242 -2575 -2432 -1151 70 -220 -1296
3797 -1296 -37 1708 1985 1207 611 1784 2814 2140 416 -272 718 1069 -357 -1941 -1962 -782 -881 -1874
3815 -1874 -2773 -1526 -166 -125 -1035 -748 859 2159 1510 463 1066 2290 2670 1094 -208 411 1084
3832 1084 321 -1279 -2055 -1379 -633 -1590 -2728 -2173 -667 137 -834 -1285 65 1932 2194 855 545 1877
3850A877P54q39j465l05P61J58j686j244N21Q06l97j304n03J784J222n10q49N20
3868f99J934J041j129n70P36J235k14j554r55R69L47j254j448l82J126L75j221
3885a663r42P70J547L11j047P0J519J215o7j110K05J324L48j381r05J48Q39l72
3903H09j818q07N91R06q52j324l7J536P69m38m52Q86J933K30j200K9R39R68o38
3922B030j769l69J086M5j296j454l4J197k60j331k71R79J221q4r66O77J494Q59
3940A754m52j110R54J316qj214j220L49Q95r69j555m41N37N27r27j003O73J530
3958c64J58o73l97J426J732k85r27R4R74R39j058j425K38N65j99j423j146N79
3976a192P18n95j240p6J271J361r26n58R21J382Q63q37o66R72J106o25j281m23
$$ plain form
3850 1877 2631 1792 327 22 783 941 -745 -1989 -1468 -662 -1059 -2363 -2866 -1082 140 -370 -1219 -699
3868 -699 1235 2276 1147 577 1313 2548 2334 780 -175 794 1141 -113 -1561 -1943 -817 -442 -1663
3885 -1663 -2605 -1835 -288 23 -1024 -954 565 1780 1713 603 808 2132 2480 1099 194 342 1181 809
3903 809 -1009 -1816 -1225 -319 -1171 -2495 -2532 -996 -227 -665 -1117 -231 1702 1932 732 761 1700 2668 2030
3922 2030 261 -108 978 1023 -273 -1727 -1761 -564 -824 -2155 -2426 -1447 -226 -310 -1276 -599 895 1754
3940 1754 1302 192 1146 2462 2454 1240 20 369 1264 295 -1260 -1701 -1164 -637 -1564 -2567 -1894 -364
3958 -364 -206 -879 -1276 150 1882 1597 670 764 1738 2677 1619 194 432 997 798 -625 -1771 -1192
3976 -1192 -474 -1069 -2309 -2385 -1114 247 -679 -1237 -316 1066 1929 1092 426 1398 2504 1879 598 175
3994A75P26J20j052j569J03Q12L4j046j090J365J068q4n79J31J481J092n32o53
4012E02M08J224N68j563j214N73O06n99j551q64R51M99q91r12J78J209O71q27
4030a032p3R10J546J01p36k02J359O71q06j117n14Q92J15j602j015J23P96l65
4048i49j383N4J195P67l77o71O36J717P42q15m00N91J310k9j546o71N03M94j064
4067A04j280m32Q69J27j108o84P58J212K67j209L25J330J136L3r52K21J168N02
4085B387j115r24K67N34l48j528p68M07N85m96j335J42J282P10l34o39Q45J651
4103A323J30o15l00R37Q03o06j212J14K24K43j277j218J42Q84k95r25q28Q58J194
4122d24j33m15K32J223J002o16o20P67J121k5r93r91N29P20j002j321n98O21N56
$$ plain form
3994 175 901 1021 -31 -1600 -1497 -685 -651 -1697 -2787 -1422 -354 -438 -1017 -886 595 1687 1155 502
4012 502 910 2134 2702 1139 -75 498 1104 505 -1046 -1910 -959 -460 -1351 -2263 -2085 -876 -205 -1032
4030 -1032 -1105 -195 1351 1452 716 514 1873 2544 1738 621 107 999 1114 -488 -1503 -1380 -584 -949
4048 -949 -2332 -2278 -1083 -316 -693 -1364 -728 989 1731 916 516 1107 2417 2388 842 171 674 1168 104
4067 104 -1176 -1608 -739 -612 -1720 -2404 -1646 -434 -167 -1376 -1051 279 1415 1448 496 717 1885 2387
4085 2387 1272 348 615 1149 801 -727 -1495 -1088 -503 -999 -2334 -2192 -910 -200 -534 -1173 -328 1323
4103 1323 1453 838 538 1475 2278 1672 460 574 798 1041 -236 -1454 -1312 -428 -723 -1648 -2476 -1618 -424
4122 -424 -557 -972 -740 483 1485 869 249 1016 2137 2112 1119 128 657 1377 375 -946 -1544 -923 -367
4141c67r60o60J91J119L20m91m01J404J353l27m24j80J157O14q98j205K13L74
4159H32R1j145j193M84L20l81p98l93J243O72m08n33O38J291P97o61n96R53R55
4178B168k33j171m96M13M58j187p27j39K37J69j190n36R02Q70P6o92J47J251J059
4197A379k9q30K08J097L09j085o16J36M66m27j420o13O63M02p25r33J66J096M43
4216c13o80j59Q54J238L60q75J24R64N68n63j040r8N62Lj282p31qP31k20j255
4236a820k15Q88M93O8o18M74J518M71n77k58N68J164l02j207l02L49M95n86j476
4255h73r7J95K02o45q28M53J022N2o85K24J226P64j29m64K76R66K43o77p42l0
4275D53Q01l58j169p07J28M68n07j017K79Q76M02l58m36P13J176M78m51m52R75
$$ plain form
4141 -367 -1327 -1987 -1796 -677 -357 -848 -1249 155 1508 1181 757 577 1734 2348 1450 245 458 832
4159 832 923 -222 -1415 -931 -611 -992 -1790 -2183 -940 -268 -676 -1209 -571 720 1517 856 260 1213 2168
4178 2168 1935 764 268 681 1139 -48 -775 -914 -677 -508 -1698 -2234 -1332 -462 -386 -1078 -931 320 1379
4197 1379 1350 520 728 1825 2134 1049 433 569 1035 608 -812 -1425 -762 -360 -1085 -2018 -1852 -756 -313
4216 -313 -993 -1152 -298 940 1300 425 549 1513 2081 1518 478 380 942 945 -337 -1068 -1076 -345 -565 -1820
4236 -1820 -2035 -1147 -654 -586 -1204 -730 788 1259 682 424 992 2156 1854 647 345 694 1189 603 -873
4255 -873 -970 -775 -573 -1218 -2046 -1593 -571 -519 -1204 -980 246 1010 881 417 693 1659 1902 1225 483 453
4275 453 1254 896 -273 -980 -852 -384 -891 -1908 -1629 -753 -351 -709 -1145 -432 744 1222 771 319 1294
4294A294P15n08q42q7M31Kr63j088K37M58k56j050l44Q15Q30k50n00J67J227P79
4314A067j93o54P55Q06O5r00n88M47L94n68j277k98L88M26j052o78J62Q31M72
4333c95m41j77Q32J056Jm32r1J229M19o82p56j31N86p4j097r20L75M39l88q66
4353a513k14O98P20n09k52N28J180M01q80P0P34P94lj123k25N28J57q23r80l16
4373a028P30j20q56l93K62P96J35q03K80J344N80m02l40L33R87L70p65o19K55
4392G46M82l75j124n98M72l2j85j200K41J057J03m61m29O97J313J80n86J9P96
4411A116O71k84q57j65P70m62q10o04q8M87k97j012j88N33O76j53m63L41J149
4430C60L19l4l12M61R85k43o43m50N82K34o72j192l28N85j0p56o07L84P87m8m70
$$ plain form
4294 1294 2009 1501 659 572 1003 1005 42 -1046 -809 -351 -607 -1657 -2001 -1186 -356 -606 -1106 -939 288 1067
4314 1067 874 220 975 1781 1846 946 358 805 1199 631 -646 -944 -556 -130 -1182 -1860 -1698 -867 -395
4333 -395 -836 -1013 -181 875 876 444 353 1582 2001 1319 563 432 1018 944 -153 -1073 -698 -259 -647 -1513
4353 -1513 -1727 -1029 -309 -818 -1070 -542 638 1039 159 229 963 1757 1754 631 406 934 1091 268 -712 -1028
4373 -1028 -298 -418 -1274 -1667 -1405 -609 -474 -1277 -997 347 927 525 185 518 1505 1875 1110 491 746
4392 746 1228 853 -271 -869 -397 -429 -614 -1814 -1573 -516 -413 -874 -1303 -606 707 887 301 320 1116
4411 1116 1787 1503 646 481 1251 789 -21 -625 -713 -226 -523 -1535 -1723 -1190 -514 -667 -1130 -789 360
4430 360 679 645 333 794 1779 1536 893 443 1025 1259 587 -605 -933 -348 -358 -1114 -1721 -1337 -550 -598 -1068
4451a068mQ74R95j17n30L30Q21M50n15r25K18N85j72j214o54M51J60m19q76J25
4471a485O65K92l39k95O39J042J24m36P0P83P76n17o38k71M84K48q21r99R4K06
4491c78o8p85n97Q64L16pm72K09J086O04k90l52M95Q36J48q04l29L64L56o17j033
4512d54l53L41K99p71o40L37O54J41o84J5P76Q71J15l55N1O43N60m97m77N5M59
4533A086j99j032m25J48J73k90q03l02P54L62k61l04K59J160M27l58P4L83O62
4552A514qr07j63N77Qn17j123n3N92k36o99n48L22O49K5m32K59O32P56o9m55M01
4574E25Q27lm97l84J00N13l21j069l85K52L90o29o97J29O35q1j80q9O32O57j8
4595C07k17K05R38J73k7q75k2M41n6o60o51L2K33l51n99k34L68O94l72l11L12
$$ plain form
4451 -1068 -1072 -198 797 680 150 480 1301 1751 1236 311 529 1114 942 -272 -926 -475 -315 -734 -1610 -1485
4471 -1485 -820 -528 -867 -1162 -523 519 643 207 277 1060 1836 1319 681 410 894 1142 321 -678 -584 -378
4491 -378 -446 -1231 -1828 -964 -648 -655 -1127 -918 168 772 482 130 625 1461 1609 805 476 840 1196 579 -454
4512 -454 -807 -466 -167 -938 -1578 -1241 -587 -446 -1130 -1115 -339 532 647 292 343 986 1546 1049 572 627 1086
4533 1086 887 -145 -570 -422 -249 -539 -1342 -1644 -890 -528 -789 -1093 -834 326 753 395 469 852 1514
4552 1514 1506 599 436 1013 1021 504 -619 -672 -80 -316 -1015 -1563 -1241 -592 -567 -999 -740 -108 648 579 124 525
4574 525 1352 1349 852 468 568 1081 760 -309 -694 -442 -52 -681 -1378 -1249 -614 -695 -875 -964 -332 325 307
4595 307 90 295 1233 1406 1379 504 482 923 867 207 -444 -412 -179 -530 -1129 -1363 -995 -301 -673 -984 -672
4616f72Q08L37k15k17N91O08J69o12k01L23L58q23q03J3J93J2p33o46K98O90j1
4637e33k29j48M96P92k9lJ97N30M07l88n84J64K66k31o92o25L64K8k48p44k17
4658a427O62K33k03l59N46O26M21k60O6O65M21j59o55l5L30J24o66o01l46M56
4678a61k8o57n12L41L51K14n35L7R72M02k09j77L43Q35Q6p67q0K59K10k92p62
4699a30n53N72J08p41m52M4O01O0m21j32N00Q59P5j47r9Q55L12j13p30r2O67j75
4721H68q24n22L04N2j77q47N8N01J42l38k22L39Q14L22m05P2M71N37J06o69j00
4742D82M46Ro33o06o3L70k46n77m86L98L75M0n28j2R39L40J56l95M35N01K80m14
4764H11l00J89L06k26o94n30J76K79n97n63q9Q37p6m62j23N21P11J17j10J1N29
$$ plain form
4616 -672 136 473 258 41 632 1240 1409 797 596 919 1277 454 -349 -336 -143 -131 -864 -1510 -1212 -522 -533
4637 -533 -762 -910 -414 378 349 346 543 1073 1480 1092 508 672 938 707 15 -610 -246 -218 -466 -1210 -1427
4658 -1427 -765 -532 -735 -1094 -548 78 499 239 305 970 1391 1232 577 542 872 996 330 -271 -617 -161
4678 -161 -189 -846 -1358 -1017 -666 -452 -987 -950 22 424 215 38 381 1216 1302 535 455 714 924 632 -130
4699 -130 -683 -111 -3 -744 -1196 -1152 -551 -491 -912 -1044 -544 315 390 243 144 999 1311 1198 468 376 1043 868
4721 868 44 -478 -174 -122 -299 -1146 -1088 -587 -445 -783 -1005 -666 148 470 65 137 608 1145 1251 582 482
4742 482 928 937 304 -302 -365 5 -241 -818 -1304 -906 -531 -491 -1019 -1031 -92 248 404 9 444 945 1225 811
4764 811 511 700 1006 780 86 -444 -268 11 -586 -1149 -1238 -401 -477 -939 -1062 -541 170 287 177 188 717
4785G17M56j41o20P0M39P2p11p45M0L91k98m43k11L13L35m39j56M00M09M38k45
4806G1j22M96M76J09l90o6K35L59n78o06k42L22k13o06l47K16L90r3k58j14O14
4827c47N48Q2k80K92N56J74k40m05M09J86j22p50m09K89N6m41m64m27O96K22l48
4848g23j30J60P10K69l29L4O14L57K6m43r3M38R5o40n00n5K38k8o75k98K45K22
4870e06Q9m13R5N55L88Lk70M41N49L6k50m35N37N2j22p93k17K50N0n62l40n0L62
4893e51o6j28Q9N7O98J24k56K82N37K72k12l38J03O22m57n82l66q3M10l99m12
4914f56j78K36J84j73k96K78M99J74j66K38M07N84j59m68m1M34q2l05p11kJ57
4935d6j86l06o19L18M88l42j63O5M42O28j87k83M82N12K28l93j78N9M42m06n89
$$ plain form
4785 717 1173 1032 412 482 921 993 282 -463 -423 -32 -330 -773 -984 -671 -336 -775 -931 -531 -122 316 71
4806 71 -51 445 921 1030 640 574 809 1168 590 -16 -258 64 -149 -755 -1102 -886 -496 -589 -847 -961 -347
4827 -347 201 283 3 295 851 1025 785 380 789 975 853 103 -306 -17 39 -402 -866 -1293 -597 -375 -723
4848 -723 -853 -693 17 286 -43 -9 605 962 988 545 452 890 985 345 -155 -210 28 0 -675 -973 -728 -506
4870 -506 -417 -830 -735 -180 208 211 -59 382 931 967 717 282 819 871 749 -44 -261 -11 39 -523 -863 -913 -551
4893 -551 -617 -745 -656 -599 99 223 -33 249 786 1058 846 508 611 1233 776 194 -172 -255 155 -244 -656
4914 -656 -834 -598 -414 -587 -883 -605 -106 68 -98 140 547 1131 972 504 463 897 815 510 -201 -203 -46
4935 -46 -232 -538 -1157 -839 -351 -693 -856 -791 -349 279 92 -191 291 803 1031 638 460 519 961 555 -34
4956c4j54M1L10p33k64m6K45Q3q0k37L23P80j03k10J92M47L06Kk03p6J27J36n02
4979C50l57j60J61l76m71j60K51M75m03j1K01L16M72j09j34M37K36K23m58J04
4999E87R3K77l90n18k96J16K3l48m18Q5K22N0k92k7N63L45Q1j61J78N18K22k85
5021F25l08K34M52k36n93m78K45J71l60m72k47M46J37l82q7K68N63K44l15K09
5041A16J77N24J4k73j66M94q2m40l12l34L04p0l73n91L35K34j31j53mN03L46J51
5063B69k85L09M02Mj42o4k0K63j51n59p2J28m7l66l80k0J97K08l99k0K82L40L78
5086B55m67M80K88J40J4l00J07K00N7n11k55p6R1k78m22j85J61L96k93k18J28
5107f88O03J30j3r7L00N94j21j63N7L4J91l38n82K6LJ1m31l02N5J58J90j93O2
$$ plain form
4956 -34 -188 -147 163 -570 -834 -880 -635 -552 -632 -869 -546 234 131 -79 113 560 866 868 665 589 716 852 350
4979 350 -7 -167 -6 -382 -853 -1013 -762 -287 -690 -701 -500 -184 288 179 45 482 718 941 483 587
4999 587 680 957 567 49 -247 -131 -108 -456 -874 -789 -567 -517 -809 -836 -273 72 153 -8 170 688 910 625
5021 625 317 551 1003 767 174 -304 -59 112 -248 -720 -967 -521 -384 -766 -853 -585 -22 222 -93 116
5041 116 293 817 831 558 392 886 804 364 52 -282 22 -48 -421 -1012 -677 -443 -574 -727 -731 -228 118 269
5063 269 -16 293 695 699 557 493 473 736 585 26 -46 82 35 -331 -711 -731 -534 -326 -725 -745 -463 -123 255
5086 255 -212 268 556 696 710 410 517 717 774 263 8 -68 23 -255 -677 -862 -701 -305 -598 -816 -688
5107 -688 -85 45 32 -65 235 829 708 545 602 636 827 489 -93 -67 -64 -53 -484 -786 -731 -573 -383 -576 -514
5130e14K02M07n6k9N4M09K20lk98L24J3r1o00k06K44O3m60m14K0J58K02k03j08
5153f66K31L38J79p2J01K07M86r6l45K41q2J29m84k34R4M8r4m74j32O2J15j67
5175f15j56K75L80J37Lq3K28L41Q4j76j20L58K6l58k45k09J92o2j83l26j83L66
5197c26j91j9j25J87M00J17N4J8L68M09m09m7mJ72p4l38j83j04K38l74n49J06
5219f74M25j12j67j13J07M13J04j44J65K58M17j65k34P7J94K51m68j91k56K98
5239A85l12l10j44O3J23r3k13K72KL44k0n6K71M00l3j93J08K33J21l39j68l63
5261a22J87j15j04k98M6J20j82k79J99K36K29r4j4K37M31M6l3j88P7L40R0n89
5283B20k21Q7J27n74M4j98O5J35j87p6K23Q7J22J05n3J72N03j47m5j88L01K86
$$ plain form
5130 -514 -312 95 39 10 64 473 693 690 392 716 729 638 38 -168 76 139 -321 -735 -715 -557 -355 -558 -666
5153 -666 -435 -97 82 10 111 318 804 708 363 604 522 651 167 -67 27 75 -19 -493 -625 -563 -448 -615
5175 -615 -771 -496 -116 21 24 -59 169 510 594 418 298 656 682 324 79 -130 62 0 -183 -509 -692 -326
5197 -326 -517 -536 -661 -474 -74 43 97 115 483 892 483 436 432 604 530 192 9 -95 143 -231 -780 -674
5219 -674 -249 -361 -528 -641 -534 -121 -17 -161 4 262 679 514 280 357 551 802 334 143 -113 185
5239 185 -127 -437 -581 -518 -395 -488 -701 -429 -427 -83 -103 -159 112 512 479 286 394 627 748 409 241 -122
5261 -122 65 -50 -154 -452 -406 -286 -468 -747 -548 -312 -83 -177 -191 46 477 523 490 302 379 719 809 220
5283 220 -1 86 213 -361 -317 -515 -450 -315 -502 -578 -355 -268 -146 -41 -94 78 581 434 389 201 502 788
5305G88n71j80L7%J7m01l10K94l1l0k03O0L01Q9M1J45K5L90J11k49j58L96J15
5328F76l28n6j96J15O4l49l57q7J92n7l04J74NM04M0j27J60K69M35j10k13J29
5350D79J76j58j83j34j42L2N2m12l52K61J31q7j46k20M98P8j59J65K29M56j02
5371D62j12j07K38J67k86l62O3J89j97l41k24J67j8Q6k31M1J58K20p4p6L36M5
5393A44J94M0O9m0K06j30l06nn6M3k44j57k56J6K70k18j08k4M02lKJ50J59K29
5417C77k2j12K16P4J66k94k43o8J29j20m46j09l6K05q1j37J33J11K55p3j47M54
5439B32%J60p0j6K55k1k17j68M4J13j52k86k54J65n6q6j74JL28p6J30m9L84j64
5463B3M09j03pP8J55m3j25k12j98J51n5l32q1J0m5k04K29j62J45L00q7J72R5J97
$$ plain form
5305 788 217 37 74 74 91 -310 -620 -326 -357 -387 -590 -530 -229 -140 -99 46 71 461 572 323 165 561 676
5328 676 348 292 96 211 275 -74 -431 -518 -326 -383 -687 -513 -508 -104 -64 -191 -31 238 673 563 350 479
5350 479 655 497 314 180 38 70 122 -290 -642 -381 -250 -337 -483 -703 -205 -127 -286 -121 108 564 462
5371 462 350 243 481 648 362 0 63 252 55 -286 -510 -343 -361 -275 -506 -465 -307 -87 -161 -237 99 144
5393 144 338 378 447 407 613 483 177 172 116 159 -85 -242 -498 -482 -212 -430 -538 -562 -160 -163 -161 -11 148 377
5417 377 355 243 459 533 699 405 162 94 223 103 -343 -452 -488 -283 -364 -501 -368 -257 -2 -75 -222 232
5439 232 232 392 322 306 561 540 323 155 199 312 160 -126 -380 -215 -271 -357 -531 -530 -202 -278 -148 -197 187 23
5463 23 432 329 322 400 555 512 387 175 -23 128 73 -259 -340 -330 -375 -579 -350 -512 -367 -67 -154 18 113 310
5487C10Rn3l4L28j7j36l33p0L36k32l24k01J84p9K1j61j6K47p0Q9J19M1P0K60
5511B88m0O3j3J30Lk37j40L7j17L1k96r2J21R5j71j48N5L04P3j30J18K16J28n4
5535B24J4K63J04k03j52l7j09J23l7l03q5q8L2o7j62J46M2J53M8K3oL65m2j70
5559G6K32j30K94k38r6nm3J57l64k92J08J36j49j45oJ32J93k1m4J58K15J94j24
5582B38q4J67K48j34j8k57k6K6q6k23J31l3k20j35p2K72pJ52j03J23J67J61j99
5605H8K64q7J02L1j86k85J23J50p4j47n9r6l2K7q2j59K92j55PJ6K60J58PJ89j03
5630B49L9K04p1j33j03P3J23n44L3j61MJ7r8j06J50NK73j60M2K57l3J11L3P0J86
5655D60j39K8k94K65j05l85J8k34K65l10O8r1O3L24k28o9K08R7J35M1m4K22K56
$$ plain form
5487 310 319 266 232 560 543 407 74 4 340 108 -216 -417 -233 -312 -291 -452 -468 -221 -291 -202 -83 -42 28 288
5511 288 248 311 298 428 431 194 54 91 -26 5 -291 -383 -262 -167 -338 -486 -431 -127 -54 -184 -66 150 278 224
5535 224 238 501 605 402 250 213 104 227 190 -113 -198 -286 -254 -321 -483 -337 -295 -142 -94 -71 -77 288 246 76
5559 76 308 178 472 234 138 133 90 247 -117 -409 -301 -165 -314 -459 -465 -333 -140 -161 -205 -47 168 362 238
5582 238 154 321 569 435 417 160 134 160 74 -149 -18 -51 -271 -406 -478 -206 -213 -61 -164 -41 126 287 88
5605 88 352 265 367 398 212 -73 50 200 126 -21 -80 -176 -208 -181 -263 -422 -130 -285 -278 -262 -2 156 163 352 249
5630 249 288 492 421 288 185 258 381 -163 -130 -291 -287 -270 -368 -474 -324 -319 -46 -206 -164 93 60 171 204 274 460
5655 460 321 349 55 320 215 -170 -152 -386 -121 -431 -363 -454 -391 -67 -295 -364 -156 -59 76 117 73 295 551
5678E51p5k38N5p8J51k18l63%J28R9k15k26Q4K11k18J65OK03J10J57j81R1J29
5701C28P0p1k02J07p2k2j72j41j16K35j38m0l60K65K46j76j08J39J87J85K72m80
5723f4K93J16J47l40p3J97r3q8j38r5q2M1l6l76J85K49J2k00J68K03K3M5oj6K32
5748C04J59k55m6N3o4M2j53l3j73J03j89j33Q4P3k75K67o9J26K62J0J40K7P9Q0
5772D19p0k59r2L30j40j76o0l0k1j06r2j51J56M6J18q6R3J31J53j58L7J09K36
5795C87L3M4k86M8m0r9k76q7L05j75r1j33Q7R6l3j7k03K29K57Q0n7K5J86mk6P8
5821C28j49J03lm00o2Q8n3m8q2r8m5K35Jj42LM36j09NM8J91J82j67j24L1O0j54
5847G5N0j37q3j1j11Q1K2k5j5j17R5J26j74L56j09J6Q4K95q9m8k41K78m4l09j64
$$ plain form
5678 551 476 238 293 215 366 148 -215 -215 -87 12 -203 -429 -345 -134 -352 -187 -181 22 132 289 108 199 328
5701 328 398 327 125 232 160 138 -34 -175 -291 -56 -194 -234 -594 -329 -83 -259 -367 -228 -41 144 416 -64
5723 -64 229 345 492 152 79 276 183 95 -43 -138 -220 -179 -215 -591 -406 -157 -145 -345 -177 26 49 94 88 72 304
5748 304 463 208 162 215 151 193 40 7 -166 -63 -252 -385 -301 -228 -503 -236 -305 -179 83 93 233 260 339 419
5772 419 349 90 -2 328 188 12 -48 -78 -99 -205 -297 -448 -292 -246 -128 -214 -121 10 163 5 42 151 387
5795 387 420 464 178 226 186 87 -189 -276 29 -146 -237 -370 -283 -187 -220 -237 -440 -211 46 126 69 94 280 276 250 328
5821 328 179 282 279 -121 -183 -95 -148 -196 -278 -376 -421 -186 -185 -327 -324 112 3 8 56 247 429 262 138 169 229 75
5847 75 125 -12 -95 -106 -217 -136 -114 -139 -154 -271 -176 -50 -224 132 23 39 123 418 329 281 40 318 274 -35 -199
5872a99K32j90J25j01j27M0n6R2O2m6N0K01p7J81J7P7L1p2j15J54L3j66o4k66
5896a84J29J02k32l5j95L79k18K07k88M04q6R9j00J31J17%J02K4m5l8l5k15k45
5919b22K05k20N5j00j09k6J09Q9L6J72q6R7J07N9j57K05K72j73p4k5o1M0k33j61
5943b01J93j73Q0k8j77L80j78j96M0r2K50K62k30K36j19K10N1n4r1mJ28k59Q5
5966A13j91J20k04p6P2J5j13J51Qj54K73J29o9J04j99K65R0j67O9r1M4j71L3j8
5990C3p4j53n4j58R2k2J84k5P4j7J70oJ1j82L59J10j44Q0l70M73k35P8l21M9M7
6015ak40mj6M7j1J28j02J57m7K06j05j88M73O7l1j61R7N2j1j80k64J53RJ8l44
6040b98p8m5J01K50k25O8J36J54j7k8J75O8K5L3k01k7J08j39J01l9j02L2l70J42
$$ plain form
5872 -199 33 -157 -32 -133 -260 -220 -276 -184 -122 -168 -118 83 6 187 204 281 312 240 125 279 312 146 82 -184
5896 -184 -55 47 -185 -220 -415 -36 -254 -47 -335 69 -17 82 -18 113 230 230 332 356 311 273 238 23 -222
5919 -222 -17 -237 -182 -282 -391 -417 -308 -219 -183 -11 -97 0 107 166 9 214 486 313 239 214 153 193 -40 -201
5943 -201 -8 -181 -101 -129 -306 74 -104 -300 -260 -352 -102 160 -70 166 47 257 308 254 163 159 287 28 113
5966 113 -78 42 -162 -238 -166 -151 -264 -113 -105 -259 14 143 74 178 -21 244 334 167 236 145 189 18 51 33
5990 33 -41 -194 -248 -406 -314 -336 -152 -177 -103 -120 50 44 55 -127 232 342 198 278 -92 381 146 224 -97 -48 -1
6015 -1 -241 -245 -261 -214 -225 -97 -199 -42 -89 117 12 -176 297 364 333 172 269 321 310 130 -134 19 28 46 -298
6040 -298 -376 -421 -320 -70 -295 -227 -91 63 46 18 193 261 286 319 118 91 199 60 161 122 20 52 -318 -176
6064a76J07j30r6M1J24L0R4J21l1J5P1N8o5m6J30j5J53k34j07K5j46j45J12j76
6088b86J38J6j90J95l3j53L25k1r0L42O2j05K38k24p0O8j00qm7j53M3lj45p7M4
6113b34Rk8j00J66K9L9K41j1R7n1N4No7J03P0k17k08K09k73N3j62k9J84j91J64
6138a48J39q6k6K99j96K24k3k3K28k81J90J06k24ml42J53pq3j13l0n3l5J25n6
6162b66K20j83J45L1j28K26J15o3O7K4L0O2j38k20N5m4J13%j12j87J30J0j05o9
6186b87J31J18Q7K9jkK20j09j22J04Jk9j4r1j85K03J0j88k48K09J6j52N7K04M7
6211Hk01J35KO8Q2J61L7J1n4r8j9m9o5M0k46q7p7J39M2n3n0J07P0NM3mj00K98
6239A45Q1q4KK13n9j82Q7k43L6p4j50J1p6P7J16j04r6J06P9%O8J77K8J74q4j87
$$ plain form
6064 -176 -69 -199 -295 -254 -130 -100 -6 115 84 99 170 228 163 117 247 232 385 151 44 69 -77 -222 -110 -286
6088 -286 -148 -132 -322 -127 -160 -313 12 -9 -99 243 305 200 438 214 144 212 112 104 57 -96 -53 -56 -201 -278 -234
6113 -234 -225 -253 -353 -187 -158 -119 122 111 208 157 211 216 149 252 322 105 -103 106 -167 -114 -276 -305 -121 -312 -148
6138 -148 -9 -95 -121 178 -18 206 183 160 388 107 297 403 179 175 -167 -14 -21 -104 -217 -247 -300 -335 -210 -266
6162 -266 -46 -229 -84 -53 -181 45 160 97 164 188 218 280 142 -78 -23 -67 46 46 -66 -253 -123 -113 -218 -287
6186 -287 -156 -38 49 78 77 75 295 186 64 168 169 140 126 35 -150 53 63 -125 -373 -164 -148 -300 -243 -39 8
6211 8 -193 -58 -56 12 94 255 292 303 249 151 132 83 18 58 -188 -275 -352 -213 -171 -224 -274 -167 -97 -92 -49 -53 -153 145
6239 145 226 142 144 357 298 116 203 -40 -4 -78 -228 -217 -293 -216 -100 -204 -300 -194 -115 -115 -47 130 158 332 248 61
6265F1K72j73j59J1Km4p1J61p4k14%J43OK6l7Q5j2n3L3M6K57n5k40K26J02J5j69
6292A45j71R8N4k45j23M5JJ75j41j17j07J79J43n4PJ59J38p7O3J29j56J51k46
6315E0KL8j52P2j16j6M6l3m7N5j01Mm1N5Q2L4J15P0K08j98J5O4K32l49j0j1j60
6342i2m0kJ15n7j93P5K7k4M5R1m6J25J57r5m4O5J23Ljo9j2j81K86k35Ok02K64
6369H9n7k73J42q9M6LM3l4N8J98J24j50R9J97l5k69m8J77j35q8j20L9n2N0L0j15
6395a70k60L08N6l0J40o0P8K05k13K1n2K87k44L1k5Q6m7l6j48k42J72R8o2n0k0
6420a77O2j0j9P1J5L4J78L8k43K46J23Pl34N5Q1r7j39N4o7K1m1j14R7l3J17N7
6446a8l6o9K90p4o5P6N8J3Q6j17R1m3j31L3j97m3K6n6m4Q6k54J07K4J24Q1P1J4
$$ plain form
6265 61 333 160 1 12 14 -30 -101 60 -14 -228 -228 -85 -79 -53 -90 -5 -17 -70 -37 9 266 211 -29 197 299 314 145
6292 145 -26 72 126 -119 -242 -197 -196 -21 -162 -279 -386 -207 -64 -118 -111 48 186 109 172 301 145 296 50
6315 50 52 90 -62 10 -106 -122 -76 -109 -156 -101 -202 -198 -239 -184 -102 -68 47 117 325 127 142 206 438 89 79 68 -92
6342 -92 -132 -134 -19 -76 -269 -194 -167 -191 -146 -55 -101 24 181 86 42 107 230 233 232 163 151 -30 256 21 27 -175 89
6369 89 32 -241 -99 -188 -142 -139 -96 -130 -72 126 250 100 199 396 361 92 44 221 86 -2 -122 -83 -135 -85 -55 -170
6395 -170 -430 -122 -66 -96 44 -16 62 267 54 75 23 310 66 97 72 158 111 75 -73 -315 -143 -45 -107 -157 -177
6420 -177 -115 -125 -144 -73 -58 -24 154 192 -51 195 318 325 -9 46 127 30 -109 -55 -122 -101 -142 -256 -159 -192 -75 -18
6446 -18 -54 -123 167 93 28 104 162 175 261 144 235 192 61 94 -103 -146 -120 -176 -220 -134 -388 -281 -257 -133 -52 19 33
6473C3J24M3p5J02J56j78k31L14k1j68k11pk3J49j87l2J6l4K14j44N3R9P1Q9j01
6498E1R9J1q8J0J07J37l89L93m46j03J65n3j42K10k50K47r0j25J06J63R7K6L5
6521A71k18L06q3J26j64p4l3N4j45J0q9R5j05m1K4L5J36j00j09m1J65J22J07j15
6545C4N5J3K04j98J31j03O3o7k0j65K18l65N3Q6Nk00J13M5J0J52k0k8L2Q3N1j23
6571E9K6Q8K0k11J38k3j67J25p0o2j52n7L5R0M1o7K79k20J91o5L2n1J71K1j7l31
6597a77K86L4j86K1NNq5j24j54J12n0K57k45J82K01O5j98J21Q9M7J33k93jK2l0
6622C7m9N2Jj18j00J34j11ok2L07j08j65M4M0J17P6j48P0K27j55J22k1j24J08
6646B08k20j78J5J27p3j31J05M5o3J5m3L39j97N3QK66j18k6N9k1j8r5J41j55j36
$$ plain form
6473 33 157 200 125 227 383 205 -26 288 267 99 -112 -119 -142 7 -180 -212 -196 -230 -16 -160 -107 -8 63 152 51
6498 51 150 161 73 83 190 327 -62 331 -115 -218 -53 -106 -248 -38 -288 -41 -131 -256 -150 13 110 136 171
6521 171 -47 259 176 302 138 64 31 85 -60 -50 -139 -44 -149 -190 -166 -131 5 -95 -204 -245 -80 42 149 34
6545 34 89 102 306 108 239 136 199 132 112 -53 165 -200 -147 -61 -56 -256 -143 -98 -88 64 44 16 48 131 182 59
6571 59 85 173 193 -18 120 97 -70 55 -15 -77 -229 -286 -251 -161 -120 -187 92 -128 63 -2 30 -21 150 171 154 -177
6597 -177 109 143 -43 -22 -17 -12 -97 -221 -375 -263 -313 -56 -301 -119 82 147 -51 70 159 206 339 46 45 67 37
6622 37 -12 40 41 -77 -177 -43 -154 -160 -182 125 17 -148 -104 -64 53 129 -19 51 278 123 245 224 100 208
6646 208 -12 -190 -175 -48 -121 -252 -147 -102 -165 -150 -193 146 -51 2 10 276 158 132 191 170 152 57 198 43 -93
6671i3o4J39L4k28K02k61N9J87j36N5J13r1P8M6L0J03L9j95K24j57m4k2Q5j81
6695g8j03K56k45p7J60J07r6J3n7N6m3J78M1j63J99j50K00k30J72J47j95m1j65
6718a14P0j04J12j43l5K8rK11l34K37j60J52K05p0r3K03k8P5p1o5J16j63k51J22
6742a09Q5J26k40J8k06J53J5M7p7K0J14N9j42K37Q1j36K5K5m4J62n3k08K9n7J61
6767H5r1j69q3K28P1l60J72j05J74J50j71N8J80K5J03k49j1P2J33j49k03K35n3
6790D2j19k49J05J44RL3L3L8L2n9l4M2Q5K56k03qL8r5M3k30o6J92N6o2j63K5n0
6817a65K0l0J36o9J34l9M8j72J34o1O7N4J99k27J64k37J88j22J58q6l18M0M6J22
6841a6r8J1m2k8P7J38k17L87n6q5J38j85J63j2j08k6j8P7j67J70k76p8L81k13
$$ plain form
6671 -93 -157 -18 16 -212 -10 -271 -212 -25 -161 -106 7 -84 -6 40 70 173 212 17 241 84 40 18 103 -78
6695 -78 -181 75 -170 -247 -87 20 -76 -63 -120 -64 -107 71 112 -51 148 -2 198 -32 140 287 92 51 -114
6718 -114 -44 -148 -36 -179 -214 -186 -195 16 -318 -81 -241 -89 116 46 -47 156 128 203 132 67 183 20 -231 -109
6742 -109 -24 102 -138 -120 -326 -173 -158 -111 -188 -168 -54 5 -137 100 181 45 70 95 51 213 160 -48 -19 -76 85
6767 85 -6 -175 -258 -30 41 -319 -147 -252 -78 72 -99 -41 139 164 267 18 7 79 212 63 -140 95 42
6790 42 -77 -326 -221 -77 -68 -35 -2 36 68 9 -25 17 102 358 155 147 185 90 133 -97 -163 29 85 23 -140 -115 -165
6817 -165 -145 -175 -39 -108 26 -13 35 -137 -3 -64 3 57 256 29 193 -44 144 22 180 94 -224 -184 -138 -16
6841 -16 -114 -103 -145 -173 -96 42 -175 212 156 71 209 24 187 175 67 41 23 100 -67 103 -173 -251 130 -83
6865h3n3n6o8n4L63K7j63J44l7Q8o3O3J40n6k30J78j03Rp0k3O3j09J3J4j08j07
6891b81L90j45j93J74L6M0QJ21R5m6K3j90J9l0j39J13Q1Rk60Q6P4j98K8P4J69
6916E8M1p6J01j22J11K6k34J79O3R4j27j40m8oJ86j23j96J06J6r5N9r9K08J05
6940H7q6q1J16m9Q9q8R4R7L6q6j46J25q7l7L8j49o4L0R8N9j93K7K06P2j26rJ30
6967A03pl6K1P8p6p1J9O6n9N3m9j79R4O7M4k87k3R8J9J25j41L4P8L19r1j98K99
6994C00k40K30o9k70P4J11j31m6n1n9J43k51J09l3O0R8o5L5m0M26k97OJ79K9j43
7019A05j62Q4m4N4rJ06l83L05j27%k05J86n2j02K02r1p3J61j6J60m6mK03j67j68
7044h3J08m4K2P4j05p1O5j21o3N0J42j51P9l1J62K7J4n9J86r4N6N9r1j14mJ50
$$ plain form
6865 -83 -136 -192 -260 -314 49 76 -87 57 20 108 45 108 248 192 -38 140 37 46 -24 -47 16 -93 -80 -66 -174 -281
6891 -281 109 -36 -229 -55 -19 21 29 150 245 199 222 32 51 21 -118 -5 76 85 -175 -89 -15 -213 -185 -111 58
6916 58 99 23 124 2 113 139 -95 84 147 241 114 -26 -74 -80 106 -17 -213 -107 -91 -186 -127 -226 -18 87
6940 87 1 -80 36 -13 76 -12 82 179 215 129 -17 108 21 -16 22 -127 -191 -161 -63 -4 -197 -170 36 108 -18 -27 103
6967 103 96 60 81 159 83 12 31 97 38 91 42 -137 -43 24 68 -219 -242 -144 -125 0 -141 -107 -29 290 199 1 300
6994 300 60 290 221 -49 25 136 5 -41 -92 -151 -8 -259 -150 -183 -123 -25 -90 -55 -95 331 34 40 219 248 105
7019 105 -57 27 -17 37 28 134 -249 56 -71 -71 -276 -90 -142 -244 -42 -133 -206 -45 -61 99 53 49 252 85 -83
7044 -83 25 -19 3 77 -28 -99 -34 -155 -218 -168 -26 -177 -98 -129 33 60 74 15 201 107 163 222 131 17 13 163
7070A63j04q7m0K9m4j12J32q3j28J97L4j2j14M6K04l0J20r8R2L3o9k5n2k9m5n3
7096g5K7K2L5k61rJ03J19j76kK23L9K6j00Q1J59r5Q9k6j76N3J81j46j38j31J29
7121d9Lj0j89O9N4L5j50K01j37O3J32P7J7lk9j1j10J38j85K18n0k62K1J08J5L3
7147ak16Q8R9J3k81J29K72j11N6k6MJ89m3r6n2M0J05k00M9K2r9QM7j51J52k1m3
7174f7o2KJ44oJ16r2J69q9J79q2m6p8J17j54j16p2K35j87k2kj03j00L33j31j04
7199b18K9J9K73j2m9o3K48k15J28p5J15j73q2n8O4J01N8n7l25L63j94k3J20Q7
7223F1k29K42j1q8J28Q4P8q3q4RM5p3ok09q7K19j14j70J67N9O9j58k7L15k79J17
7249b5P3k5J26J02j37Jm6K25k36J13l02R0j5J15k68P8o8J26j31Q4J90m7p3l4J78
$$ plain form
7070 163 59 -28 -68 -39 -83 -195 -63 -146 -274 -77 -43 -55 -169 -123 81 51 171 73 165 198 129 104 52 23 -22 -75
7096 -75 -48 -26 9 -252 -261 -158 -39 -215 -217 6 45 71 -29 52 211 116 205 179 3 56 237 91 -47 -178 -49
7121 -49 -46 -56 -245 -176 -122 -87 -237 -36 -173 -110 22 99 116 113 84 73 -37 101 -84 134 84 -178 -157 -49 -34 -1
7147 -1 -217 -129 -30 -17 -298 -169 103 -8 48 22 26 215 172 76 24 64 169 -31 18 40 -59 -51 -4 -155 -3 -24 -67
7174 -67 -129 -127 17 11 127 35 204 115 294 212 166 88 205 51 -65 -137 98 -89 -111 -113 -216 -316 17 -114 -218
7199 -218 -189 -170 103 91 42 -21 227 12 140 65 180 7 -75 -133 -69 32 90 33 -292 71 -123 -146 -26 61
7223 61 -168 74 63 -25 103 187 265 182 98 107 152 79 73 -136 -223 -4 -118 -288 -121 -62 7 -151 -178 137 -142 -25
7249 -25 48 23 149 251 114 115 69 294 58 171 -131 -41 -56 59 -209 -131 -199 -73 -204 -120 70 23 -50 -84 94
7274I4NJ38o1k4j78O3Q2L3j71j29K1RM6pK4j04J20n6k43L20Q5K3k51K35J01K0
7300A95p3n3J49k69RO9q3N5N3j56p5J37j12J57j31k04M27k8K01l53J08J27K7L1
7324B08k7n8R4j71J31j82m7O0j01j43R0k6K9OQ9m8m8K25j4j79M4K80o8n9M9M6
7350A80n9M7k39m9P0J8l70K14K0J71q9p1j02J28K04J55k71J77rM5j13L0J82q0
7374A89k0p6oO0k11R0j91K3P2p9O1j95J24J8L28k68P2K09j20J01o3J23j48N2Q
7399A53j83%K26j01k39q4J55j97R9r8J61K07k11O9j66K99k5J01o8J55n5J08p7
7422B29j58n9J26j05j93J63q9m6N5j24kJ14k8J69k20M4J93K0Q7r4L4j7L6N5j56
7447C4rJj63j00P6k8J45q2qn1K00n6r1K84k58K10l4j49K03l5l9oo2m5J78Q5k57
$$ plain form
7274 94 99 237 176 152 -26 37 119 152 -19 -148 -127 -118 -72 -79 -55 -159 -39 -95 -338 -18 67 90 -161 74 175 195
7300 195 122 69 218 -51 -42 27 -56 -1 52 -104 -179 -42 -154 3 -128 -332 95 67 268 -85 23 150 177 208
7324 208 181 123 217 46 177 -5 -52 8 -93 -236 -146 -172 -143 -137 -48 -96 -144 81 67 -112 -68 212 144 85 134 180
7350 180 121 168 -71 -120 -50 -32 -402 -188 -168 3 -86 -157 -259 -131 73 228 -43 134 125 170 57 87 269 189
7374 189 169 93 87 147 -64 26 -165 -142 -70 -149 -88 -283 -159 -141 187 -81 -9 200 80 181 118 241 93 145 153
7399 153 -30 -30 196 95 -144 -228 -73 -270 -171 -269 -108 99 -112 -43 -209 90 65 166 98 253 198 306 229
7422 229 71 12 138 33 -160 3 -86 -132 -77 -201 -203 -89 -117 52 -168 -124 69 89 176 82 116 99 135 190 34
7447 34 25 26 -137 -237 -161 -189 -44 -126 -134 -185 15 -41 -132 152 -106 104 70 -79 124 89 50 44 -18 -63 115 200 -57
7474e7j45oM2K6ro1J28r2Q5r6J56J57m1R5p8o0J76q9l8j55J64j21q5q4J4j7J13
7501g8k61K8J75P7P1r2j60L70J86m9j41m4P3l5j2k9n2P9K0j95j37P1j8j07m4J05
7527a99K51k34K33rQ0L0Q8J24k43J77j12o0Q9r6l03J50o6j89L1J35J3j52P5Q6
7551a01N5j16J04J86O6L2p3m5j02K56o5k42j55J22J21K4k38j00R2O3r8O0J6J62
7575B4m1k2J3N0J61R3p2p1J91q0k19j15q4K22O5l87J45M0K04k37l13J53K71P0
7599F1j29j13J54P8Q0j3q3o4K40r7l5o4J8l3j44Kn2J48j29o1J45J6k0R3k11J41
7625g2K01J69j50OQ0N0k1r1j66L7r5q1P2j65rJJ2N7M2N0J7k4K0J36P6q2J80j38
7653A12R5K7k03p9mP4J13j28k51M7J20j97j9n3J02J17N8j89L42l8K64j64oL5O9
$$ plain form
7474 -57 -202 -208 -166 -140 -149 -210 -82 -174 -89 -185 -29 128 87 182 104 44 220 131 93 -62 102 -19 -104 -188 -174 -191 -78
7501 -78 -339 -311 -136 -59 12 -80 -240 130 316 267 126 82 155 120 108 79 27 106 126 -69 -206 -135 -153 -260 -304 -199
7527 -199 52 -182 51 42 122 152 240 364 121 298 186 126 215 119 -184 -34 -100 -289 -258 -123 -110 -262 -187 -101
7551 -101 -46 -162 -58 128 194 226 153 108 6 262 197 -45 -200 -78 43 67 -171 -271 -179 -116 -214 -154 -138 24
7575 24 -17 -39 -26 24 185 278 206 135 326 246 27 -88 -172 50 115 -272 -127 -87 117 -120 -433 -280 -9 61
7599 61 -68 -181 -27 51 131 118 35 -29 211 114 79 15 33 0 -144 -142 -194 -46 -175 -236 -91 -75 -95 -2 -213 -72
7625 -72 129 298 148 154 234 284 263 172 6 43 -52 -133 -61 -226 -235 -234 -222 -165 -123 -73 -56 -80 -60 76 152 70 250 112
7653 112 207 234 31 -48 -52 22 135 7 -244 -197 -77 -274 -293 -346 -244 -127 -69 -258 84 46 310 146 140 175 244
7678B44j21J35k93n1oJ12j22P9m8k03J15j25KJ76M7q8qK81j36K30k09P4J25Q9
7702B99L8k53j89J05J25l47J64K8q4k5j67M9J27Q7M3j56J16O7J86k6k7n4K5J21
7726B52n9n1J09k63N7k79P9J38j15j20q8P5K12l0j85J33J99J77m6l9K1J52k21
7749A08l9nJ21l1j11k62J21j32J49k89N2J17R4K8K1o3J65J78R4j08k45K13J00
7772B76j79k0j29K14j02j01j25O8J15k15p5m7J24R6O8j83P5R9L37o0p4j6O4p8
7796A32L0k6j24O4j37J1k12K47k35R2l2k7J30j4jJ2J81R8n6q3l7J89P2j17j04
7821E3l7J45j10o6k40m0K26j30j20k9J24N4J68k32N4J66K37N6q4l4K43j93m2k15
7845d6K61p4j81j60M9K27m68J77j20P9N7J27j03K16J60j5P1j20N8Q8Oj04j35J03
$$ plain form
7678 244 123 258 -35 -86 -92 20 -102 -23 -71 -274 -159 -284 -282 -106 -59 -147 -155 126 -10 220 11 85 210 299
7702 299 337 84 -105 0 125 -222 -58 -30 -114 -139 -306 -257 -130 -43 0 -156 -40 27 213 187 160 106 131 252
7726 252 193 142 251 -12 45 -234 -155 -17 -132 -252 -340 -265 -53 -83 -268 -135 64 241 195 156 177 329 108
7749 108 69 64 185 154 43 -219 -98 -230 -81 -370 -318 -201 -107 -79 -58 -121 44 222 316 208 -37 176 276
7772 276 97 77 -52 162 60 -41 -166 -98 17 -198 -273 -320 -196 -100 -32 -215 -140 -41 296 236 162 146 210 132
7796 132 162 136 12 76 -61 -50 -262 -15 -250 -158 -190 -217 -87 -101 -102 -90 91 189 133 50 13 202 274 157 53
7821 53 16 161 51 -15 -255 -295 -69 -199 -319 -348 -224 -170 -2 -234 -180 -14 223 279 195 161 404 211 169 -46
7845 -46 215 141 -40 -200 -151 76 -392 -215 -335 -256 -199 -72 -175 41 201 186 257 137 195 283 289 185 50 153
7869A53J14j86j32qk6j45J3rj35K06o9J80k53K46J52N8j75j08L05O5r3j72J35
7892A16l3K0j66Rj89J2J41k07P6Q8o8K93j81K3J31J86j43J16J0rk8mJ3n9k2k49
7918a24l6r4J36l3k05J63p0J61K50k83J39J20l5N9K2o1L05k11M8j53L9n5q2k24
7942b24mJ07k15K44j82j91L87j43m6J43L9K65o0j9O2oR6J09k23M7j05j00l0j30
7966a79M3J17j31n9n0J46N8R0k12J20J36qJ17k03K45J46j84j37K31k58J97l06
7988h1j62N8R6n0j04p8K1R0Q7j00N5K99P1J9k2q0l2K25j45J05j77J01K9l67o4
8013b06J31j38J8j97J42J78j34J28J0j04K48Q1k60Q3K21J40n2n6j15O1q7j54j50
8036b12l6R7J8L9r5J05j86m5K65kJ59O6Q7j79J23L1q1o2K8n7P5j19j70J10j93
$$ plain form
7869 153 267 81 -51 -59 -85 -230 -217 -226 -361 -155 -224 -44 -297 -51 101 159 -16 -124 181 246 153 -19 116
7892 116 83 103 -63 -54 -243 -231 -90 -297 -221 -133 -201 92 -89 -66 65 251 108 224 234 225 197 193 206 147 125 -124
7918 -124 -160 -254 -118 -151 -356 -193 -263 -102 148 -135 4 124 89 148 170 109 414 203 251 98 137 82 0 -224
7942 -224 -228 -121 -336 -92 -274 -465 -78 -221 -267 -124 -85 180 120 101 163 157 253 362 139 186 81 -19 -49 -179
7966 -179 -136 -19 -150 -209 -259 -113 -55 35 -177 -57 79 71 188 -15 230 376 192 55 286 28 225 -81
7988 -81 -243 -185 -89 -139 -243 -321 -300 -210 -123 -223 -168 131 202 221 199 119 87 312 167 272 95 196 225 -142 -206
8013 -206 -75 -213 -195 -392 -250 -72 -206 -78 -68 -172 76 157 -103 -20 201 341 289 233 118 179 92 -62 -212
8036 -212 -248 -151 -133 -94 -189 -84 -270 -315 -50 -52 107 173 260 81 204 235 154 92 120 63 138 19 -151 -41 -234
8061b34Q2j22J65j03J71q5K7k0K06L0n8J51p5l7J99j58K6j17j11K05l47j27K02
8084a30k7N2j95M2J62J15r6j74L25O9P8o5j44M5L89Ll54K2J56j32j88p7j10L5
8108a99q1p9L7J4J52L7k10K37j9J54K67k90J91K9m8J30j68k64J88Pj78k5K7n1
8132a42r7j1J6N5p9P3O0K06J40k2j34m1J70J79j08j27m2J4L3p2k20j14K05j00
8156a58p5J2p2N8J87k78K66J57J55j18p5J11J80j76n3Q1j35M7n0k93n1J49n3j08
8180b92p9J46J53j4L5j25J62J03N9j8J08
$$ plain form
8061 -234 -152 -274 -109 -212 -41 -126 -99 -119 87 117 59 210 135 98 297 139 165 48 -63 142 -205 -332 -130
8084 -130 -157 -105 -300 -258 -96 19 -77 -251 74 143 221 156 12 57 446 449 95 117 273 141 -47 -124 -234 -199
8108 -199 -280 -359 -322 -308 -156 -119 -329 -92 -111 43 310 20 211 240 192 322 154 -110 78 85 -93 -118 -91 -142
8132 -142 -239 -250 -234 -179 -258 -185 -125 81 221 199 65 24 194 373 265 138 96 110 143 71 -149 -263 -58 -158
8156 -158 -233 -221 -293 -235 -48 -326 -60 97 252 134 59 170 350 174 121 202 67 114 64 -229 -280 -131 -184 -292
8180 -292 -371 -225 -72 -86 -51 -176 -14 89 148 130 238
8191B38
$$ Imaginary data points
##PAGE= N=2
##DATA TABLE= (X++(I..I)), XYDATA
0@%%%%%%Oj4J6j6K4l2M0n5O9q5J03j28J53j84K24k66L16l74M44n21O03o99Q11
29D35r32J068j222J390j575J780k008K258k532K834l165L529l926M357m829N344
45B806n908O525p197P934q742R631j0611J1693j2894J4238j5749J7457j9407K1659
59A1435k4297K7429l1226L5949m1999N0069o1446P8814j08887J75302n76803L32152
71a33508J053453q55677q06341K13795Q32062P9223l87889k31080K12935K63377
81B40350J13939l01175k58756K02379M33891j04029n76610k08853N34042L34239
91D09417l69337m47450P2055L18677J31316j32269j22175j7371J10783J58405
101A12051j8147j38883Q3131J70038o7094j84454M4602J96283k6716k01873k6252
$$ plain form
0 0 0 0 0 0 0 0 6 -8 8 -8 16 -16 24 -31 38 -47 56 -72 81 -103 121 -145 171 -203 241 -280 323 -376 435
29 435 -497 571 -651 739 -836 944 -1064 1194 -1338 1496 -1669 1860 -2066 2291 -2538 2806
45 2806 -3102 3423 -3774 4160 -4582 5049 -5562 6131 -6763 7475 -8274 9183 -10224 11435
59 11435 -12862 14567 -16659 19290 -22709 27360 -34086 44728 -64159 111143 -465660 -133508
71 -133508 919945 64268 -742073 -528278 303784 383007 -4882 -235962 -23027 240350
81 240350 354289 53114 -205642 -3263 430628 326599 -250011 -458864 75178 409417
91 409417 40080 -407370 -335315 -16638 114678 -17591 -139766 -157137 -46354 112051
101 112051 93904 -44979 38152 208190 141096 -43358 1244 197527 170811 -31062 -57314
112e7314N1849n0145j930O1658m5589j15627r707J07313L5563l4126O8164M0717
124E0826j25355k2064K27283J38455k01113j98270J79164K14590j62269k14974
134a13727R0835J49140q5136j77205j1926J05149M8012j3020p9536j19359N9251
145a47522K41058P3780k05293j37866J79228K23093p2190j90927J8605J55119
155A37085K3490j46371j02472P8272J12161m3464j71498j02810J12380J90127
165H6900k2497k16803q0776J82050J79479n1956j37288Q845J21195O3553n3292
176G9410p7023K5066J01612r15j54098r5692J18395J41250r3464k20381l1701
187b07541J82753J09467j02815j31086K8120J29810N6312n3083l8578N0236P4135
$$ plain form
112 -57314 -5465 -55610 -57540 4118 -41471 -157098 -166805 -59492 -23929 -58055 10109 50826
124 50826 -74529 -96593 130690 269145 68032 -130238 48926 263516 101247 -113727
134 -113727 -22892 126248 41112 -136093 -148019 -42870 5142 -7878 -87414 -206773 -147522
145 -147522 93536 167316 -37977 -175843 3385 226478 154288 -36639 -18034 137085
155 137085 160575 14204 -88268 -9996 102165 58701 -112797 -215607 -103227 86900
165 86900 64403 -152400 -233176 -51126 128353 76397 -60891 -52046 69149 132702 79410
176 79410 2387 27453 129065 128150 -25948 -121640 -3245 138005 44541 -175840 -207541
187 -207541 -24788 84679 -18136 -149222 -121102 8708 65020 11937 -26641 23595 97730
198I7730K060p7849l6627R0058Q1450q5707j57681p811J41955M7981j35306j16135
210a55882M1515J03726K2734p5392m1281O8698P3306j4944n4729J6873J02598
221H7222M3359q2936p3419M2567R6022J931j19900o9135O2148N3621m6800q3068
233h8388p097P2749J7673o8453l4523O2169J00311M269j05475k2952J19315Q8532
245A38130m7087j00236o04R4035J7048q5239n8115K9881O0094l6267j15641j3683
257a17684J01730N7953o7394j15349J9224J55344O8085q8975r0774M7904J32751
268A02815J8039j02339l1187O7515M8235n1856j03455K286J02408J7050j14293
279d4782j06679M8743J46357J0189j35330o2592Q7135J21413K475r9420j2274
$$ plain form
198 97730 99790 21941 -14686 75372 156822 71115 -86566 -94377 47578 95559 -39747 -155882
210 -155882 -114367 -10641 12093 -63299 -104580 -35882 37424 22480 -32249 -15376 87222
221 87222 130581 47645 -25774 16793 112815 114746 -5154 -74289 -12141 41480 -5320 -88388
233 -88388 -95485 -22736 -5063 -73516 -108039 -45870 54441 58710 -46765 -69717 49598 138130
245 138130 91043 -9193 -9797 84238 101286 16047 -42068 -12187 47907 11640 -104001 -117684
257 -117684 -15954 41999 -25395 -140744 -121520 33824 101909 12934 -77840 -29936 102815
268 102815 120854 18515 -12672 54843 103078 51222 -52233 -49947 52461 69511 -44782
279 -44782 -151461 -102718 43639 53828 -81502 -144094 -56959 64454 66929 -32491 -44765
290d4765R5849M8916m8972o4311L2664R0148j9756j14185n0023O6842Q8461m5647
302C5221j43065k4470J06947O4611n5028q7648K3516J01534K1441n5276k2797
313c5014N7850P9338k7440r4489M415R2377L9817p7228j05415J6768R3686K763
325D7428q9919o2690M3049P8337k4800p9065J0316Q2512M6265m8131o6377M6854
337a6221J07907J6728q4531o3310N6148R0405l0238r9683k4191N5230L4388n8464
349a5832p7277K5997P8013J120p9685m5168P7175J02242j9896r0206j5293Q7306
361B8496Q1950l6196q6234M482P0861J6299o6951n4008L8843N1113m2027q6298
373g9670j5860P7642O0744n8971r2915J9188J06259N2508n6878o2899L6541P9903
$$ plain form
290 -44765 51084 100000 51028 -13283 19381 109529 89773 -24412 -74435 -7593 80868 35221
302 35221 -107844 -132314 -25367 39244 -15784 -103432 -79916 21618 43059 -12217 -35014
313 -35014 22836 102174 74734 -19755 -15340 77037 116854 39626 -65789 -49021 44665 47428
325 47428 -42491 -105181 -62132 16205 -8595 -87660 -77344 5168 51433 3302 -63075 -16221
337 -16221 91686 108414 23883 -39427 16721 107126 76888 -22795 -46986 8244 42632 -15832
349 -15832 -93109 -67112 10901 12021 -67664 -112832 -35657 66585 46689 -43517 -58810 28496
361 28496 110446 74250 -11984 -7502 63359 79658 12707 -41301 -2458 48655 6628 -79670
373 -79670 -95530 -17888 42856 -16115 -109030 -89842 16417 68925 12047 -50852 -14311 65592
385F5592J1906n3111k5533M4008L5393m9085o7250J4106O4634L857q4845o5216
397a05544M3286Q2820j94p9903l7054O5478P2569j5876n2602J1541O4713K1203
409G0437m7883l3068M2240N6690k6068q7445k8176O3465M8387n0983q7399n841
421h5644P1057L5186m9022n2975L1089P6716O998o0844j1202P1464N7860l7717
433E2966p4202Q282P8594K7334o6537p3817J5175O6041k548p1065l6984L7109
445c9652M8228j9598o0214M677P2503M0559m1975n5457L3237Q7760J5503o3676
457B1895m2038L4427N7465j5567o7904j5043L8547J1561m8514m6626L1437N4423
469A4063j8258n9444j4427N7089O4756j5151o0379k034O0954M8948k5073n6134
$$ plain form
385 65592 77498 24387 -1146 42862 78255 29170 -38080 -23974 40660 44517 -40328 -105544
397 -105544 -62258 20562 20368 -59535 -96589 -31111 41458 25582 -27020 -15479 49234 70437
409 70437 22554 -10514 31726 88416 62348 -25097 -53273 10192 58579 7596 -79803 -85644
421 -85644 -14587 20599 -28423 -81398 -50309 26407 33405 -27439 -38641 32823 90683 52966
433 52966 -21236 -12954 65640 92974 26437 -47380 -32205 33836 31288 -39777 -76761 -39652
445 -39652 8576 -11022 -71236 -66559 5944 46503 4528 -50929 -17692 70068 85571 21895
457 21895 -20143 14284 71749 56182 -11722 -26765 11782 23343 -25171 -71797 -40360 14063
469 14063 -4195 -63639 -78066 -20977 43779 28628 -31751 -33785 27169 76117 51044 -5090
481e090J1363N2393l280n7360l3081M3315M5386n5917q3907J2791P8669K9877
493C5159o5258o5028L7691Q0424K2414m4322m2470L6595P0698l927n5461j4835
505h320M7882L9530m9917p5747J5524P0124R884p8656o9633M2643Q1768o645o8218
518d9781k9433N1005O5870j2836m8874Q102N2185K7190l3904m0225K7744M5788
530F2831j2315n1547l4589K4524M3537k0635n9804j6848L8771L4966l0218m0697
542f2024L1669N0638n029l5844j443N4732L5227l8492l8386J8671L9570N545m3039
555A1795l3311J5537K1433j0988l8721k0763L6722L0483l8800m5108K5436P0983
567B4698J9482o1371l5591N6351O6489o590o1075k2652N1659L6313l8143n1597
$$ plain form
481 -5090 6273 58666 55386 -1974 -35055 8260 53646 -2271 -86178 -73387 5282 35159
493 35159 -30099 -95127 -57436 22988 45402 1080 -41390 -4795 65903 61976 6515 -8320
505 -8320 39562 79092 29175 -46572 -31048 39076 48960 -29696 -99329 -56686 25082 18437 -49781
518 -49781 -79214 -28209 37661 24825 -24049 -15947 36238 63428 29524 -10701 17043 62831
530 62831 50516 -1031 -35620 -11096 32441 11806 -47998 -64846 -26075 8891 -21327 -62024
542 -62024 -30355 20283 15254 -20590 -22033 32699 67926 29434 -8952 9719 49289 54834 11795
555 11795 -21516 -5979 15454 4466 -34255 -55018 -18296 12187 -26613 -71721 -46285 24698
567 24698 44180 -17191 -52782 3569 70058 63468 2393 -20259 31400 67713 29570 -22027
579b2027J909M2672N770n9386l9791L6584N4236q418o7791k5904O5655O5442j8274
592C0677o0511r734O3745M9443l2075n2005R753N0956M449n9534l0044M1928L1890
605C8938l8129o0238k886N6071K9186l9274m7105J3231N8208K7805l1959k9627
617b5779K5785M5494J247l9584j0179M0603J9819m3505m5674J7525M4934p035
629B3651n6954k8452L1240L8454j0501l9749n107M0570K9365j9910k5797K2416
641g74M5295K888m0113j9043L5101L7442k3074n5269j2247L8637K1782l7103m4762
654e1240J0255L9693L616l7909j8773L9936M3721j7107m2479O592N5411L1394
666F3110l4841m3056J3901M3854R125m1609l6804J8531L1301j7814m3862q228
$$ plain form
579 -22027 -20118 22554 28324 -31062 -70853 -34269 19967 11549 -56242 -82146 -16491 48951 30677
592 30677 -29834 -39568 24177 73620 41545 -10460 -707 50249 54698 -4836 -34880 7048 38938
605 38938 809 -59429 -62315 -6244 22942 -16332 -63437 -50206 8002 35807 3848 -25779
617 -25779 6 45500 46747 7163 -3016 37587 57406 13901 -31773 -14248 30686 23651
629 23651 -33303 -61755 -30515 7939 -2562 -42311 -47418 -6848 22517 2607 -23190 -774
641 -774 44521 47409 7296 -11747 23354 60796 37722 -17547 -29794 8843 30625 -6478 -51240
654 -51240 -40985 -1292 2324 -35585 -54358 -14422 29299 12192 -30287 -23695 31716 63110
666 63110 28269 -14787 -886 42968 52093 10484 -26320 -7789 23512 5698 -38164 -46392
678d6392L8419K2037l7937l7904K5307N6203J5064m4572l1059M0044N3555l330
690D9435m2208j7994L2138K8184k5966l7850K532K9526K295m6599l0024L4057
702b2474L9084j4530m8338j4368N0375M5712j9731m0625K714M6137K8030k9410
714B2576k8765J9548K8462p889l9229j7381L2618K1498l4244m4467Q1M3859K1469
727A8136l8527l3123K1334M1681J2425k8296j5622L3854K9209j4423k6798K419
739B269L5087R716m0323k9703J5412L0197k604m5420k4973L0274K6618j4726k9786
752c7962M63L8563J7087k6027j5090K4630L7550J893l9816j3767L5718K6898j9172
765C0968m2527j0489L3147J1934l2748k8604R236L0112j479l7381o865L8525K8209
$$ plain form
678 -46392 -7973 14064 -23873 -61777 -36470 19733 34797 -9775 -40834 -790 52765 49435
690 49435 7227 -10767 21371 49555 23589 -14261 -11729 17797 20092 -26507 -56531 -22474
702 -22474 16610 2080 -46258 -60626 -10251 35461 15730 -24895 -22181 23956 51986 22576
714 22576 -6189 13359 41821 33932 -5297 -22678 9940 31438 -2806 -47273 -47192 -3333 18136
727 18136 -20391 -53514 -32180 9501 21926 -6370 -21992 11862 41071 26648 -150 2269
739 2269 37356 47072 6749 -22954 -7542 22655 20051 -25369 -50342 -20068 6550 -8176 -37962
752 -37962 -37499 1064 18151 -7876 -22966 1664 39214 41107 1291 -12476 23242 50140 30968
765 30968 -11559 -22048 11099 23033 -9715 -38319 -29083 1029 -450 -37831 -44696 -6171 22038
778B2038j5059l4708N135M9983K4135k8563l3622Q520M0120O784l9625k2419J7405
791A24J8539j4969l7200k851L4850J0318l1958k8222J9581M8647Q683l7445j8652
804c0555K9181M1446Q64l6532j0723K9318J6842k1578k9803M852K7521o473l9255
817b4895j8012K4734L0581j2526m1764n357M0230K9986j4795k9898P738L8074
829B4096J3114k3040j6517J7137K5279j2466l6331n817K7693J2400k9370l6589
841d0411N806L4224Q026k9595k2278K0732L5145r07k5943q13L2272K1153j8340
854A9071k5748J0881L3228M318l5362k7354J6932K8095j0339l7902j4406K4216
866a4370J9577j7669k5955Q808L4123J0153k5947j4656K8894L5543m375l4167
$$ plain form
778 22038 6979 -27729 -22594 27389 51524 22961 -10661 -2141 37979 44763 5138 -17281 124
791 124 18663 3694 -33506 -36357 -1507 8811 -23147 -51369 -31788 16859 25542 -11903 -30555
804 -30555 -1374 40072 40936 4404 -6319 22999 39841 18263 -11540 -6688 20833 14360 -24895
817 -24895 -42907 -18173 12408 -118 -41882 -47239 -7009 22977 8182 -21716 -13978 24096
829 24096 37210 14170 -2347 14790 40069 27603 -8728 -14545 13148 25548 -3822 -40411
841 -40411 -34605 -381 7645 -21950 -44228 -23496 11649 10742 -15201 -16014 16258 37411 19071
854 19071 -6677 4204 37432 41750 6388 -20966 -4034 24061 13722 -24180 -38586 -14370
866 -14370 5207 -12462 -38417 -29609 4514 14667 -11280 -25936 2958 38501 34126 -41
878d1j0540L0605K5718j8796l5919n703K5582P962k9247k2767J2931K1827o747
891e135k9387m550L3861K4253j6053k8375O921M1603K0079k5560k4449J0991K8126
904C2325K371k9848j5743J6840J0591j9374k6739K763K8140L033l0213j7684K0082
917b3456L5701M750l0979j0600K9553K8945n457k6589k103K7366P095k4560j9350
930i684R415K1937r878l8178j0487K6284K0370j5389l3679R41L7066J7659j7095
943g18j9281J2248L3879N016k5795p571K1053J9183j3338l4623l484K8133Q534
956B3236k6905l1817N198L2505K348k9289j2105K0511K5743l693k3720N857L0413
969A8282J3287j6039k1676J0604L0449j9k9290j9256J0162K2241p841l2850p520
$$ plain form
878 -41 -10581 20024 45742 26946 -8973 -14676 10906 18868 -10379 -33146 -20215 1612 -5135
891 -5135 -34522 -39072 -5211 19042 2989 -25386 -18465 23138 43217 17657 -6792 4199 32325
904 32325 34696 4848 -10895 5945 16536 -2838 -29577 -26814 1326 4359 -25854 -43538 -23456
917 -23456 12245 16995 -13984 -24584 4969 33914 28457 1868 -235 27131 34226 9666 -9684
930 -9684 -269 21668 11790 -26388 -36875 -10591 9779 -5610 -39289 -38348 -1282 16377 -718
943 -718 -19999 -7751 26128 31144 5349 -2222 18831 38014 24676 -9947 -13431 14702 23236
956 23236 -3669 -35486 -30288 2217 4565 -24724 -36829 -16318 9425 5732 -17988 -12131 18282
969 18282 31569 15530 -6146 4458 34907 34888 5598 -13658 -3496 18745 10904 -21946 -29466
982b9466J9522J0939j5802k0623J3678L0062o68k2337n984K5759L0106q712k9375
995b901r65K4687J5846j6320k8309J330J9350k401k2185j5313J2779J9392j3942
1008h952k6754L973L0661J8701j8807k6117J5204L6983R725k2516j9783J5511
1020G829K6093q173k6506n855J5403P830k1606k4478Q699K3135Q47k5435j8616
1033d0833K1221L2589j455k4689p126K5446K5967r758k2845M810K2527M302k3575
1046F581j7760J4844J6920j3481k8659q294K0703J6623j6002k3690L883K5861
1058b471J3617j5262j3324J6368K4308p25k0125m856K2204J5845j8657k6872J768
1071h182K2917M649k7020k1498J0292K0049k911k1933o041K1556J6640j1004j6043
$$ plain form
982 -29466 -9944 995 -14807 -35430 -21752 8310 7642 -14695 -20679 5080 35186 26474 -2901
995 -2901 -3866 20821 36667 20347 -7962 -6632 12718 10317 -11868 -27181 -14402 4990 -8952
1008 -8952 -35706 -31733 -1072 17629 -1178 -27295 -12091 24892 34617 12101 -7682 7829
1020 7829 33922 25749 -757 -6612 8791 16621 -4985 -29463 -20764 2371 3218 -22217 -40833
1033 -40833 -19612 12977 11522 -13167 -20293 5153 31120 21362 -1483 3327 25854 30156 6581
1046 6581 -11179 3665 20585 7104 -21555 -29849 -9146 7477 -8525 -32215 -28332 -2471
1058 -2471 11146 -4116 -17440 -1072 23236 22511 2386 -2470 19734 35579 16922 -9950 -8182
1071 -8182 14735 19384 -7636 -29134 -18842 1207 -1704 -23637 -29678 -8122 8518 -2486 -18529
1084a8529J0233K8147Q575k0786j5648J4808K5743j518k8946j5593J5723J6031
1096A8240j2627k5850k767J9252M743j9305j3324J5901K4863k714k3385k776K7070
1109G321K3010r373k4623m29K3871J2033j6079k2290K437J7321l457k3168r289
1122b2715J4823J2775j4002k3359N733K8203J2028j7714j8675J3980L0447M827
1134B6351j9465j0446J3271J8142p599k1986k190J5083L935k0204k1052J0056
1146a6104K1436l789k3867j0672J9113K4498n589k0381J135K2478J5470j0630
1158A3098j6771J0200J9603k090k0324j2981J4013J6386j4314k6519l931J8055
1170e575J2165j6051j9819Q302K1209M860j3031q599J7920K1321p477j7839J052
$$ plain form
1084 -18529 -8296 19851 28426 7640 -8008 6800 32543 31025 2079 -13514 2209 18240
1096 18240 5613 -20237 -23004 -3752 991 -18314 -31638 -15737 9126 6412 -16973 -19749 7321
1109 7321 30331 20958 -3665 -4094 19777 31810 15731 -6559 -4122 13199 9742 -13426 -22715
1122 -22715 -7892 4883 -9119 -32478 -26745 1458 13486 -4228 -22903 -8923 21524 26351
1134 26351 6886 -3560 9711 27853 20254 -1732 -3922 11161 15096 -5108 -26160 -16104
1146 -16104 5332 1543 -22324 -32996 -13883 10615 5026 -15355 -14220 8258 23728 13098
1158 13098 -3673 6527 26130 24040 3716 -9265 4748 21134 6820 -19699 -23630 -5575
1170 -5575 6590 -9461 -29280 -20978 231 5091 -7940 -16539 1381 22702 15225 -2614 -1562
1183a562K1410J2767j9655k2800O195J8300J323k1643j8367J0911J5783p696j6774
1196b1808k094J8311J2891j3642j3417J3758K4159N925k0160j3981J8840K1566
1208C0348o507k2330j0300J4103J1570j5017j8375J211J3244K313j8723j0483
1220b8946J8391J8366n863j8725k123K6123J9537j2569j8613K860K0685R175j7882
1233A0416j5616P683J0891n845j9560p420J6401Q594j6724j7506O155K3977Q908
1246A0354j9126j1745J5573K2123K809j6764o753J6896J2038j0562j6779K17J5756
1259A4037J214k2349j4231R926J6248l791k2643p200J9401J5910o723j4752L312
1272a1641K1440R261j2805r381J0835J7571l080k1935p466J5694J0684j3166k2863
$$ plain form
1183 -1562 19848 32615 12960 -9840 -3645 14655 15978 -5665 -24032 -13121 2662 -5034 -21808
1196 -21808 -23902 -5591 7300 -6342 -19759 -6001 18158 24083 3923 -10058 8782 30348
1208 30348 23841 1511 -8789 5314 16884 1867 -16508 -15297 -2053 260 -18463 -28946
1220 -28946 -10555 7811 1948 -16777 -18900 7223 26760 14191 -4422 -1562 19123 28298 10416
1233 10416 -5200 2483 13374 7529 -12031 -19451 -3050 5544 -11180 -28686 -22531 1446 10354
1246 10354 -8772 -20517 -4944 17179 19988 3224 -3529 13367 25405 14843 -1936 -1719 14037
1259 14037 15251 -7098 -21329 -11403 4845 1054 -21589 -28789 -9388 6522 -201 -14953 -11641
1272 -11641 9799 19060 6255 -3126 7709 25280 22200 265 -7201 8493 19177 6011 -16852
1285a6852k793J7287O325j5362j3735P896J8458R23j5348j318J9233J4867q186
1298A1395j6838M360K2403P426j7808j8377N340J7657j391k0789j1950R401J0912
1311A741p901j6156K187J8002O589j3650j0457J4918K2861P40j7849q188J6205
1324I042J8289o190k0353n831J2670P024j3672j6264M274J2100l483j6619o092
1337b5105J6448J5741q156j6553K513K2269J4776j1413j5027O256J7536L796j5363
1350G718j1274R136R508j0325j7707k222J4356N621j6990j4645Q763J9158M814
1363E911j5349q928J6024J8274j734j3434j893J6111R163j3626j3616M549J3431
1376A4883j068k1026j2661J1800J2723o528j7947m738J7206J2089q796j0562O630
$$ plain form
1285 -16852 -19645 -2358 3967 -11395 -25130 -17234 1224 2147 -13201 -14519 4714 19581 11395
1298 11395 -5443 -1083 21320 28746 10938 -7439 -2099 15558 14167 -6622 -18572 -9171 1741
1311 1741 -6160 -22316 -20129 -2127 4462 -9188 -19645 -4727 18134 18874 1025 -7163 9042
1324 9042 27331 21141 788 -5043 7627 14651 979 -15285 -11011 1089 -2394 -19013 -25105
1337 -25105 -8657 7084 -1072 -17625 -15112 7157 21933 10520 -4507 1749 19285 23081 7718
1350 7718 -3556 5580 15088 4763 -12944 -15166 -810 4811 -12179 -26824 -18061 1097 5911
1363 5911 -9438 -18366 -2342 15932 14198 764 -1129 14982 24145 10519 -3097 1452 14883
1376 14883 13815 -7211 -19872 -8072 4651 -1877 -19824 -24562 -7356 4733 -4063 -14625 -7995
$$ [...]
8191c8
##END NTUPLES=NMR FID
##END=
