##TITLE=1H_Pr NCS-F5
 200.13MHz,CDCl3,
 8 sc
 
 4.7.2025
##JCAMPDX= 6.0         $$ Bruker NMR JCAMP-DX V2.0
##DATA TYPE= NMR FID
##DATA CLASS= NTUPLES
##ORIGIN= UXNMR, Bruker Analytische Messtechnik GmbH
##OWNER= pz
$$ XWIN-NMR		Version 3.5
$$ Fri Jul  4 17:05:49 2025 Russian Standard Time (UT+4h)  she@DPX200
##.OBSERVE FREQUENCY= 200.1313
##.OBSERVE NUCLEUS= ^1H
##.DELAY= (6, 6)
##.ACQUISITION MODE= SIMULTANEOUS
##.ACQUISITION SCHEME= undefined
##.AVERAGES= 8
##.DIGITISER RES= 18
##SPECTROMETER/DATA SYSTEM= spect
##.PULSE SEQUENCE= zg30
##.SOLVENT NAME= CDCl3
##.SHIFT REFERENCE= (INTERNAL, CDCl3, 0, 14.3821)
##AUDIT TRAIL= $$ (NUMBER, WHEN, WHO, WHERE, WHAT)
$$ ##TITLE= Audit trail, XWIN-NMR		Version 3.5
$$ ##JCAMPDX= 5.01
$$ ##ORIGIN= Bruker BioSpin GmbH
$$ ##OWNER= she
$$ F:/spectra/data/she/nmr/H-C/1/audita.txt
$$ ##AUDIT TRAIL=  $$ (NUMBER, WHEN, WHO, WHERE, WHAT)
(   1,<2025-07-04 17:04:12.85 +0400>,<she>,<DPX200>,
      <created by zg, POWCHK disabled, PULCHK disabled
       configuration hash MD5:
       00 E9 B6 7A A2 85 ED C7 34 08 36 98 17 FE 4E 26
       data hash MD5: 16K
       05 90 BD BB 62 CE 60 91 A7 7A 8D A5 4D 56 26 A2>)
$$ ##END=
$$ 
$$ hash MD5
$$ DC 2F 1D A8 5A 91 F9 21 04 88 F1 7C 90 1D 8C 80
##$RELAX= 
##$RELAX= 
##$RELAX= 
##$RELAX= 
##$RELAX= 
##$RELAX= 
$$ Bruker specific parameters
$$ --------------------------
##$DU= <F:/spectra>
##$EXPNO= 1
##$NAME= <H-C>
##$PROCNO= 1
##$TYPE= <nmr>
##$USER= <she>
##$AMP= (0..31)
100 100 100 100 100 100 100 100 100 100 100 100 100 100 100 100 100 100 
100 100 100 100 100 100 100 100 100 100 100 100 100 100 
##$AQSEQ= 0
##$AQ_mod= 1
##$AUNM= <au_zg>
##$AUTOPOS= <>
##$BF1= 200.13
##$BF2= 200.13
##$BF3= 200.13
##$BF4= 200.13
##$BF5= 200.13
##$BF6= 200.13
##$BF7= 200.13
##$BF8= 200.13
##$BYTORDA= 1
##$CFDGTYP= 0
##$CFRGTYP= 5
##$CHEMSTR= <none>
##$CNST= (0..31)
1 1 145 1 1 1 1 1 1 1 1 1 1 1 1 1 1 1 1 1 1 1 1 1 1 1 1 1 1 1 1 1 
##$CPDPRG= <>
##$CPDPRG1= <>
##$CPDPRG2= <>
##$CPDPRG3= <>
##$CPDPRG4= <mlev>
##$CPDPRG5= <mlev>
##$CPDPRG6= <mlev>
##$CPDPRG7= <mlev>
##$CPDPRG8= <mlev>
##$CPDPRGB= <>
##$CPDPRGT= <>
##$D= (0..31)
0 0.7 0 0 0 0 0 0 0 0 0 0.03 0 0 0 0 0 0 0 0 0 0 0 0 0 0 0 0 0 0 0 0 
##$DATE= 1751634252
##$DBL= (0..7)
120 120 120 120 120 120 120 120 
##$DBP= (0..7)
150 150 150 150 150 150 150 150 
##$DBP07= 0
##$DBPNAM0= <>
##$DBPNAM1= <>
##$DBPNAM2= <>
##$DBPNAM3= <>
##$DBPNAM4= <>
##$DBPNAM5= <>
##$DBPNAM6= <>
##$DBPNAM7= <>
##$DBPOAL= (0..7)
0.5 0.5 0.5 0.5 0.5 0.5 0.5 0.5 
##$DBPOFFS= (0..7)
0 0 0 0 0 0 0 0 
##$DE= 6
##$DECBNUC= <off>
##$DECIM= 32
##$DECNUC= <off>
##$DECSTAT= 4
##$DIGMOD= 1
##$DIGTYP= 9
##$DL= (0..7)
0 120 120 120 120 120 120 120 
##$DP= (0..7)
150 150 150 150 150 150 150 150 
##$DP07= 0
##$DPNAME0= <>
##$DPNAME1= <>
##$DPNAME2= <>
##$DPNAME3= <>
##$DPNAME4= <>
##$DPNAME5= <>
##$DPNAME6= <>
##$DPNAME7= <>
##$DPOAL= (0..7)
0.5 0.5 0.5 0.5 0.5 0.5 0.5 0.5 
##$DPOFFS= (0..7)
0 0 0 0 0 0 0 0 
##$DQDMODE= 0
##$DR= 18
##$DS= 0
##$DSLIST= <SSSSSSSSSSSSSSS>
$$ [...]
##$SUBNAM0= <"">
##$SUBNAM1= <"">
##$SUBNAM2= <"">
##$SUBNAM3= <"">
##$SUBNAM4= <"">
##$SUBNAM5= <"">
##$SUBNAM6= <"">
##$SUBNAM7= <"">
##$SUBNAM8= <"">
##$SUBNAM9= <"">
##$SW= 18.0517328524113
##$SWIBOX= (0..15)
0 0 2 0 0 0 0 0 0 0 0 0 0 0 0 0 
##$SW_h= 3612.71676300578
##$TD= 16384
##$TD0= 1
##$TE= 0
##$TE2= 300
##$TE3= 300
##$TEG= 300
##$TL= (0..7)
0 120 120 120 120 120 120 120 
##$TP= (0..7)
150 150 150 150 150 150 150 150 
##$TP07= 0
##$TPNAME0= <>
##$TPNAME1= <>
##$TPNAME2= <>
##$TPNAME3= <>
##$TPNAME4= <>
##$TPNAME5= <>
##$TPNAME6= <>
##$TPNAME7= <>
##$TPOAL= (0..7)
0.5 0.5 0.5 0.5 0.5 0.5 0.5 0.5 
##$TPOFFS= (0..7)
0 0 0 0 0 0 0 0 
##$TUNHIN= 0
##$TUNHOUT= 0
##$TUNXOUT= 0
##$USERA1= <user>
##$USERA2= <user>
##$USERA3= <user>
##$USERA4= <user>
##$USERA5= <user>
##$V9= 5
##$VALIST= <valist>
##$VCLIST= <CCCCCCCCCCCCCCC>
##$VD= 0
##$VDLIST= <DDDDDDDDDDDDDDD>
##$VPLIST= <PPPPPPPPPPPPPPP>
##$VTLIST= <TTTTTTTTTTTTTTT>
##$WBST= 1024
##$WBSW= 4
##$XGAIN= (0..3)
0 0 0 0 
##$XL= 0
##$YL= 0
##$YMAX_a= 155168
##$YMIN_a= -179322
##$ZGOPTNS= <>
##$ZL1= 120
##$ZL2= 120
##$ZL3= 120
##$ZL4= 120
##$ABSF1= 10
##$ABSF2= 0
##$ABSG= 5
##$ABSL= 3
##$ALPHA= 0
##$AQORDER= 0
##$ASSFAC= 0
##$ASSFACI= 0
##$ASSFACX= 0
##$ASSWID= 0
##$AUNMP= <proc_1d>
##$AZFE= 0.1
##$AZFW= 0.1
##$BCFW= 1
##$BC_mod= 2
##$BYTORDP= 1
##$COROFFS= 0
##$CY= -3
##$DATMOD= 1
##$DC= 2
##$DFILT= <>
##$DTYPP= 0
##$F1P= 0
##$F2P= 0
##$FCOR= 0.5
##$FTSIZE= 0
##$FT_mod= 4
##$GAMMA= 1
##$GB= 0.15
##$INTBC= 1
##$INTSCL= 1
##$ISEN= 128
##$LB= 0.25
##$LEV0= 0
##$LPBIN= 0
##$MAXI= 10000
##$MC2= 0
##$MEAN= 0
##$ME_mod= 0
##$MI= 1.114404
##$NCOEF= 0
##$NC_proc= 0
##$NLEV= 6
##$NOISF1= 3.799351
##$NOISF2= 2.8
##$NSP= 1
##$NTH_PI= 0
##$NZP= 0
##$OFFSET= 14.38212
##$PC= 1
##$PHC0= -1204.783
##$PHC1= 31.39237
##$PH_mod= 1
##$PKNL= yes
##$PPARMOD= 0
##$PSCAL= 0
##$PSIGN= 0
##$REVERSE= no
##$SF= 200.129724274929
##$SI= 16384
##$SIGF1= 3
##$SIGF2= 2
##$SINO= 400
##$SIOLD= 16384
##$SREGLST= <1H.CDCl3>
##$SSB= 0
##$STSI= 0
##$STSR= 0
##$SW_p= 3205.1282051282
##$SYMM= 0
##$S_DEV= 0
##$TDeff= 0
##$TDoff= 0
##$TI= <>
##$TILT= no
##$TM1= 0
##$TM2= 0
##$TOPLEV= 0
##$USERP1= <user>
##$USERP2= <user>
##$USERP3= <user>
##$USERP4= <user>
##$USERP5= <user>
##$WDW= 1
##$XDIM= 8192
##$YMAX_p= 0
##$YMIN_p= 0
$$ End of Bruker specific parameters
$$ ---------------------------------
##NTUPLES= NMR FID
##VAR_NAME=  TIME,          FID/REAL,        FID/IMAG
##SYMBOL=    X,             R,               I
##VAR_TYPE=  INDEPENDENT,   DEPENDENT,       DEPENDENT
##VAR_FORM=  AFFN,          ASDF,            ASDF
##VAR_DIM=   8192,          8192,            8192
##UNITS=     SECONDS,       ARBITRARY UNITS, ARBITRARY UNITS
##FACTOR=    0.0002768,     1,               1
##FIRST=     0,             0,               0
##LAST=      2.2672688,     0,               0
##MIN=       0,             -179322,         0
##MAX=       2.2672688,     155168,          0
$$ Real data points
##PAGE= N=1
##DATA TABLE= (X++(R..R)), XYDATA
0@%%%%%%%%%%%%%%%%JrJ6j6J6j6K0k8L2l2M0m8N4o2P2q0Q8j04J18j32J48j65J83
39I6k01K24k51K77l06L38l73M12m54N00n53O08o66P37q16R01r98J109j238J390
59G36j567J780k045K385k832L449m364N857q680J5815o8161j21695J63102J32768
73A16548m4319j07070j8275O0189K5813k3369N328k3234l3666L5553N0026j4673
85B8851o1536k9897O6674N0478n2399m2760K4405L0713R667k0036j4764N728J046
98c830J7675J5550l5990k0556K9541J8006j3424k2623J970K1018r916p464K0687
111A0644r351k2821J4795K3595J05k7166j1965L4757J2676l0239n036J5821J355
124G170r943k813J6767m326l2191J2990L6123j4750l1552K766K9223J1680k8080
$$ y = [0, 0, 0, 0, 0, 0, 0, 0, 0, 0, 0, 0, 0, 0, 0, 0, 0, 1, -8, 8, -8, 8, -8, 12, -16, 16, -16, 24, -24, 30, -32, 40, -40, 48, -56, 62, -70, 78, -87, 96, -105, 119, -132, 145, -161, 177, -196, 216, -238, 262, -291, 317, -349, 388, -428, 473, -525, 584, -654, 736, -831, 949, -1096, 1289, -1543, 1906, -2458, 3399, -5281, 10534, -57627, -179322, -16220, 116548, 72229, -34841, -53116, 7073, 32886, 9517, 14845, -8389, -42055, -6502, 43524, 28851, -32685, -62582, 4092, 54570, 2171, -40589, -16184, 14529, 24196, 4160, -10604, -4876, -3830, 13845, 29395, -6595, -27151, 2390, 20396, 6972, -15651, -13681, 7337, -2579, -10043, 10644, 1293, -21528, -6733, 16862, 16967, -10199, -22164, 12593, 25269, -4970, -10006, 5815, 7170, -2773, -5586, 11181, 6855, -25336, -12346, 23777, 9027, -22525, -19759, 9464, 21144, -6936]
137f936j0705K3840K931q897M665j525n591j358P497J1253j5956j7731J7037J3661
151A2185j0146j1454j508J2643M104j0487K733L544p279O968P846o825o399J472
165b603J0697J065j5316K557J1971q214n915N155L143k384q953L455J3083p361
179C80q840P724M060j563j948K93N112n666m544J3056O88j4625j172R481O433
194H869p940j2970Q388R942o666k815K56j316M467K507L60k939p285P591J1049
209A1498q007q535J887O536N093q283p269O421J605j322K303n297k551M513L754
224B346J840p734m514J1872L481p754j680J478L998J289n383R72J009l926L865
239A159J887n987o2P31L155J362p193P03P294k247k027J505N0K204j969p93M651
$$ y = [-6936, -17641, 6199, 9130, 233, 4898, 3373, -2218, -3576, 3921, 15174, -782, -18513, -1476, 12185, 2039, -9415, -10923, 1720, 5824, -4663, -1930, 1614, -5665, 1303, 9149, 2324, -4075, -2603, 8094, 9159, -6157, -3600, 8371, 157, -5758, -603, 2540, 156, -8797, -5342, 7741, 380, -8460, -736, 3324, 1761, -187, 106, 5218, -448, -4992, 8064, 8752, -5873, -7045, 2436, 8869, 929, -12041, -3653, 6289, -377, -3192, -2936, -4252, 215, 2722, 3082, 143, -7142, 449, 11498, 3491, -5044, -3157, 3379, 8472, 189, -7080, -659, 946, -376, 1927, -3370, -5921, -1408, 2346, 4186, -3548, -8062, 3810, 7291, -463, -2143, -665, 3333, 4622, -761, 211, 1220, -2706, 1159, 3046, -2941, -3003, -2272, 883, 2245, -4948, -4245, 3049, 802, -1225, 280, 330, 2534, 565, -228, 4423]
256D423l836l012N329j121k904q1m07K165j085l498M202Nl019K488Q76n99O07
273E33k065K946K455m837R56K673j562l01j144j72J767k927J5L216l743o05L543
290G48r08m98q50J79M097k109k459L610k51p88J008j856Q81K67k157K560r75l315
308b816K519N83j145mj866K270K239l468P89K304j543J523k75j162J655j277J78
325E04J985l562j09K570j648k36m94j234K620q49j935K486m87nJ493j822J292
342E69P19j823K465k66k535K127r3j293O56j581N99J462l077Q10J376j826J515
359a96K46j427J491j15j26K164k207L60J595j348P84n07j686J949o93j334J775
376G25j661r46K073r36m5M57j537K495K92j779J507k99j07J868j313p96Q65j182
$$ y = [4423, 587, -2425, 2904, 1783, -1121, -1202, -1609, 556, -529, -4027, 175, 180, -2839, -351, 525, -74, 533, -1532, 1414, 3869, -968, -12, 2661, 1099, 798, -346, -518, 1249, -1678, -1663, 1553, -2190, -2795, 748, -160, -658, -1508, -1329, 2768, 659, -1800, 1810, 1559, 771, 1779, -77, 804, 1071, -1086, 1474, 499, -2816, -297, 286, -859, -863, -2729, -459, 1780, -1688, -899, 1405, -138, 1385, 1110, -52, 1603, 326, 504, 2489, -1073, -1182, 1388, -260, -496, -990, -2224, 396, -453, -2388, 98, -389, -394, 1099, -723, 569, 1288, -535, 1930, 1664, -871, 1256, 1163, -130, 526, -1055, -456, 1006, -2071, -1261, 115, -1711, -196, 50, -1377, 114, -1, -127, 2037, -170, 190, 1785, 437, 1221, 714, -972, 977, 284, -1050, 725, -936, -1882, 191, -745, -790, -333, -1870, 625, 917, -862, 645, 346, 239, 2107, 794, -2, 863, -319]
394c19J562J45k854Q49J91m00J621k286q64K276j82L03K04k354J641K068r55O41
412A287j707NL066j070j898L79r59J001J112k475p1k87K56K747j319k322J151
429a104Q44J398R69l602N84K968l79N0j788j158K247q1p51L33k520K30K702j074
447a32n90p69j009L382J188k819k14j14K235K249l459r22J689k96J068l38k487
464a338L47O65m9J714k427j909K034J094J209j118l562L124L208j463r44j486
480i01Q85K568j595j018P60k207J058J899j345o13j859k42M922q21m074K65J616
497g02K897J66m226Q70K618k72N55j041k026J313J33N19Q17l869q24L090J014
514A032k07k973j715M863J847l087q36n32K458K551k482j468J286j005J646L29
$$ y = [-319, 1243, 1388, -1466, -617, -426, -826, 795, -1491, -2355, -79, -261, 42, 246, -2108, -467, 1601, 646, 1287, -420, -415, 2651, 1581, -317, 62, -897, 104, 1216, -1259, -1330, -1617, -1361, 1386, 67, -2255, -1104, -260, 1138, 2107, -1495, -911, 2057, 1678, 1728, -60, -1218, 1029, 948, 197, 530, -1990, -1760, 942, -132, -722, -1491, -2500, 882, 2070, -749, -963, -1077, 1158, 3407, -52, -974, 715, 419, 1487, 1149, -1338, -991, -326, -375, 1339, -1088, -2997, -963, 131, 1340, 222, -3340, -216, 2992, 1529, 585, -901, -16, 2552, 957, -61, 699, -1508, -450, 1449, 104, -509, -2368, -2610, 2312, 1491, -2583, -2318, -702, 2195, 2361, -1865, -995, 1623, 1351, 1906, 865, -1161, 152, 285, 804, 1621, -2248, -3072, 18, 1032, 825, -2148, -3863, 1000, 2847, -240, -1076, -1608, 850, 3401, 919, -549, 737, -268, 1378, 1707]
530A707k243k02j203J329L048k431l626J530K300K098k450l486K993L272j667
545I69m48q55m0J920q68N15K49l127K46K995k54j768k814O25N229p47m320K98
563b195J510K267L31k829M93Q97j65J858m77k706N22L38J179J487m372j251L268
580A55R52j41k931j686L875K128k312q55o20J824K057j662q88R74j517J429J292
597B074k175p24j176J463L122k759l182K306J296J014j478k091K378J578j393
612B53O15l49n96J189n04L62L03k507M41K203j580l30r38k0K006l75j480J009
630b98l23N67J441j481N32M81j094J464J49j253L14p60L64J242j878j145J295
647c83k59P69j22j965J574Q57o16Q87j330K40J606j011M95M78k135J260J418j447
$$ y = [1707, -536, -738, -1941, -612, 2436, 5, -3621, -2091, 209, 2307, -143, -3629, -636, 2636, 969, 521, -334, -374, 1546, 678, 1193, 1442, -1685, -1439, 1556, 1302, -466, -3280, -2655, 2574, 1827, -2493, -2195, -685, 1582, 1913, -916, -423, 474, 309, 2167, 1690, -1016, -494, -156, 1023, 2510, -1862, -3113, 155, 1107, 966, -1965, -3651, 224, 2352, 40, -815, -1435, 389, 2446, 784, -104, 870, -647, 782, 2074, -101, -825, -2001, -538, 2584, -175, -3357, -1051, 245, 1259, -219, -2310, 68, 1646, 253, 868, 519, -77, 1112, 608, 970, 1273, -1234, -793, 1410, -170, -500, -1438, -1458, 548, 173, -1307, -298, -621, -54, 1387, -94, 438, 919, -175, 1289, 1438, 185, 499, -261, 103, 1345, -533, -1678, -383, -642, 127, 5, -1960, -386, 471, -145, 742, -588, -348, 1258, 247, 742, 1220, -915, 345, 1763, 316]
665C16l01n70l28J710j136q58P00o05J252Q3j224O97Q04m90J235p04r02J180n95
684B64K13L54j475M18P36j171P66j27j361J465l70o09J064q01M37J033q20O86
702G02p2j167J303J89q80K06j95j76O96q69m84O65o87M74O01j553J084J79m04
721c88J257p98k04P78m26N04J90j080O05L59j093O31p77l78R88l69o27O25p11
740i14P03M73q29O34o8j79J236p05o06J305n67m5L65j052L21N02j154N94o35j73
760g94Q42l53o47R49m04M3J107j285O70M95m47O55q05j83R17m70m50M88p23L23
780g2K57r07N28J54p01P56k98k38P71k94j06P13l31J44L32q77N79m6o41O12m62
801a27l16Q54q97J38N94j000L71N26r83P50Q6O6N35m36R3M98o13J9P16j188N14
$$ y = [316, 15, -555, -883, 827, -309, -1167, -467, -1072, 180, 263, -961, -264, 540, 50, 1285, 581, -321, 859, 264, 477, 831, -644, -226, 510, -661, 105, -22, -1383, 82, -288, -897, 167, -634, -197, 836, 16, 702, 630, -537, 766, 955, 75, 281, 86, -90, 606, -263, -747, -82, -769, -295, 306, -1247, -163, 16, -388, 869, 71, -133, 645, 219, 723, 913, -167, 438, 797, -296, 335, -442, -820, 168, -201, -828, -203, -914, -211, 262, -567, 67, -1, -180, 1056, 351, -255, 1050, 483, 438, 803, -249, 72, 574, -580, 14, -621, -794, 48, -305, -952, -3, -407, -364, 743, -542, 128, 623, 176, 831, 26, -157, 760, 290, -160, 328, -395, -72, 185, -722, -194, -40, -741, 15, -283, -521, 250, -44, -150, 563, 232, 376, 708, -169, 410, 364, -277, 335, -127, -443, 411, -486, -348, 246, -754, -383, 143, -840, -90, -4, 62, 597, 161, 254, 752, 139, 158, 874, -314, 200]
822B00m1n64L17n3m77N20l08k07Q34o32J28O55r34O90L01n60M74J40m88O97n96
843I6l70N17n77M79j33o02P10n1p00O46m49j16Q54l73l2Q03n16L41L05q76K64
864B20J28m16P10o98n86M60K81j03k35j01p6P50q32O18j50m63J006l44Q0K30p43
885b64P82Kp21r8N12p03O49r5m83L89n41M93ol93L5N20n1L50j68l34Q13l68k55
908F5M46l34m53N36l00K60l16o68Q32j0n82L65o09L54Q52r04L71L98n45O48K27
929F33p44N09k10r2L98o13j65N75p41O74Nj235M33O04j62K18n83J63J235n88n93
950b79Q20o19M49J88o21O58n56m06Q33j28p08P9m33O24M75j082J68Q56m63K90
970A45o6j41P34n29R9L85n15j10J14m9M08o13r32J221j07l75q4m92N02O23o66
$$ y = [200, 159, -405, -88, -141, -618, -98, -406, -613, 221, -411, -283, 372, -562, 128, 429, -131, 343, 483, -5, 692, 96, -274, 243, -334, 145, 12, -590, 120, 69, -631, 15, -434, -550, 304, -69, -101, 702, 186, 527, 832, -44, 220, 348, -68, 642, -56, -642, -182, 99, -4, -239, -340, -416, 334, -498, 120, -30, -493, 513, 169, 249, 479, -264, 518, 520, -201, -299, 213, -490, 159, 64, -419, -30, -571, -78, -84, -477, -442, 78, 27, 377, 209, -125, 688, 320, 65, 511, 177, -276, 260, -40, 220, -96, -764, 68, 58, -524, -159, -768, -414, 438, -466, -95, 303, -242, 406, 633, -111, 398, 188, 96, 494, -119, -284, 291, -450, 224, 229, -1006, -573, 31, -131, 87, -496, -333, 902, 314, -279, 541, -78, 371, 559, -62, 596, 40, -366, 467, 339, -369, -290, -723, -99, 376, -706, -538, 318, -145, 145, 79, -62, 672, 143, 242, 627, 112, 2, 116, 67, 475, -138, -1070, 151, 44, -331, -415, -907, -405, 218, -448]
991d48K10N28o77P31J55m88Q70m28p05Q90o29M0m43p7P16J45j243K88P37k80M3
1012f5o46M67J059q05o4O98k72j28j59J05O06q55o56J177j15p80j41K03M17R8
1032A44j240M65R40m62P9P7q7P15n64J20L96p20j07J81P5J77l52n49Q39m71l1
1053c75K53p00M01P45o96L94M90l79L25k63l33O81l10q13J440o08n08J09m23P67
1073A97P9j154M18O98l79j59L8K82J95k63J04R59p53n33L07l0L15n62j99J093
1093F53n94o92O29l52K19J24l91L33K33o26O31L51q34N46j38J85M76r29J04N74
1113E02m97j9J70n34J99R9l00M27n60N6R03o16j5N56n58O32k35k93P73n73m07
1134b90R18m90l76K51l02K82k9p33P68J13p22M91K66j60L36l28L40L82j047L50
$$ y = [-448, -238, 290, -387, 344, 499, 11, 881, 453, -252, 638, 9, 49, -394, -471, 245, 390, -853, -565, 172, -108, -65, -711, -244, 815, 10, -54, 644, 372, 244, 85, 190, 796, -59, -715, 462, 347, -433, -574, -371, 46, 144, -1096, -631, 309, -153, -74, 3, -84, 631, 67, 187, 583, -137, -244, -63, 12, 189, -163, -712, 127, -344, -375, -122, -822, -421, 324, -372, 22, 512, 133, 458, 195, -138, 543, 233, -580, 860, 252, -256, -147, -570, 197, 276, -878, -460, 238, -141, -300, -262, 20, 215, -48, 56, 1015, 262, -271, 36, 6, 321, -241, -440, 653, 59, -633, -4, -356, -137, -13, -404, -71, 162, -464, 167, 518, -316, 230, 92, 277, 753, -176, -72, 502, 5, -14, 156, -378, -179, -80, -380, 47, -513, -457, 446, -170, -185, 371, -187, 445, 210, -83, 690, 117, -290, 628, 138, -238, 13, -289, -7, -36, -769, -1, 112, -610, -119, 147, -13, 323, -5, 335, 717, -330, 20]
1154B0O33l57j14k08K15j26k46l40O65m06j83O12j30l89K56j54N57o5n26R57n17
1175A54K09rk38j00J78m83N54L3q65M68O6m3k61n1J57N25n27M5N23m71L15Q8j25
1198A42J84j72l04O06n72J4L82l89k30N1J47J62L0o42N90J96n11N19j07j25J20
1219I1j01L70l5m92J95K29m61l3J03J02J33m47P0L43m71N40k75O5K5J18l21N28
1241B76j87O9K80l01Nn6n78O97j17m96M25P8l13p3K20K14k1n09M74j17rK03J23
1264B87l27J29j02K80l4n61M04L2m68K38K14l08N3Q3j56M49m71O5L72q1N5K16
1286C69j74n8M70m87K86l79K74j69j65L8j50J1n8K79l02K57K33m85L42l14N2J82
1308E2r7j52N66k35r2K01l75L73k69p8J14j62k41N09k85k6J56j16K00L06m94K30
$$ y = [20, 653, 296, 182, -26, 189, 63, -183, -523, 142, -264, -447, 165, 35, -354, -98, -252, 305, 240, -286, 671, 154, 363, 354, 116, 16, 194, -289, 265, 298, -567, -99, -33, -76, -337, -388, -231, 294, -233, -188, 335, -136, 179, 267, 142, 326, 154, -150, 456, -116, -102, 280, -109, -339, -288, -141, 21, 51, -591, -1, 195, -316, 203, 96, -29, 91, -10, 360, 325, -167, 28, 257, -204, -237, -134, -32, 101, -346, -276, 67, -404, 136, -139, -74, -49, 69, -252, 276, 89, 158, 438, 137, 142, 86, -492, 205, 88, -408, 17, 95, -218, -291, -71, 143, 122, -387, 87, -30, -39, 164, 287, -40, 89, -13, 267, 233, -328, 76, 108, -360, -122, 92, -216, -163, -80, -236, 213, -258, -193, 179, 98, 153, 369, 195, 137, 607, 120, 406, 27, 301, 132, -33, 5, -145, -134, -192, 87, -215, 42, 275, -210, 132, -182, -130, 52, -45, -197, 369, 134, 42, 243, -132, 241, -28, -106, 8, -154, -395, 114, -171, -197, -41, -157, 43, 349, -145, 85]
1330H5j4j17M38k13l7o5k19J54L1m04R3M36n03K73p2k70L39j60JN80l41J07nj13
1354DK14j51j96L59j71k28K60j03K31k42n0q5R6j17r7L20j16L54j16l47L89j6
1376A92k8l4r2Q0L6l31L5O0m7L74k70m7M1k41L19j31j17N1L53l04J01P7L67m8
1400C96j95m10K87k34J85J25j53m3M2r2J50j37p7L39n86N22l70Q3L36J15j41Q2
1422B24j23j86K98k48K73j30r9Q6J95n17L61j06l59L30l19R0L82m33K90J9Q4j51
1444c9K00j73O7K26l51j02J57K51p3m97J73K35l01k1J51K51j00nl49J78L68l20
1466g4M8K14k05J61k4j0J32m7l10J54Q3j26k38Q2RJ33j21L24k24K16Nk12K70J37
1490C77k53Q3jk9rJ23k08J09l98J0K74j87K34l46q2L32M0m00M03l45K98J30k82
$$ y = [85, 71, -46, 392, 179, 142, 77, -142, 12, 43, -361, -268, 168, -335, -62, -134, -404, -65, -225, -224, 356, 15, 122, 117, 4, 218, 67, -129, 230, 59, -169, 91, -12, 219, -23, -73, -158, -62, -179, -276, 44, -72, 282, 166, -181, 208, 192, 164, 130, 38, 118, 154, -177, -142, -82, -129, 245, -25, -72, -31, -272, 47, -84, -201, -150, 203, -101, 0, 77, 444, 396, 201, -209, 78, -156, 29, 154, 1, -42, 0, -92, 58, -79, -156, 183, -403, 119, -251, -168, 168, 283, 142, 224, 101, -85, 213, -35, 238, 108, 9, 95, 290, -227, 134, 28, -331, -1, -320, -230, 152, -281, 9, 28, 112, -39, 161, -12, 55, 281, -70, -172, -15, 236, 163, -334, -161, 74, -227, -248, -97, 154, 54, 49, -300, -122, 246, -74, -26, 188, -17, 144, 120, 110, 242, 195, -115, 39, 122, -4, -242, -160, -151, -18, -139, 185, -39, 177, 182, -30, 240, 377, 124, 207, 206, 177, 168, 291, 83, 192, -206, -196, 78, -109, 125, -221, -303, 29, 69, -331, 72, -273, 25, 155, -127]
1513a27L31l24l6N0L15m50L82m14L9L87k86K6o6N1M5J41j08K91j29k43K87k0J7
1536A59K11n60N43j66o5k07M7K0j41K15k23J64j09p2J95j88o3N01l36K58j88l97
1558d02O43k68M3J37j41Q1J14j79r1P2j5r2j0J45k72L66l45M17l15L6K06l40L42
1581A32Kl05K78j30J50j68j91K75j11m25O34p0l03K90k26P9p7J65PL38m07K3K89
1604B49k86o1K49l43Q2k1J10l0J49j16m4n4j1P5k42K99OO2p4o1P2K02j4k36M47
1629D09p94L88o6K3mJ05j46L8Q1k85N50l20j09J76k05n6M20n5L9n0p9J29j00O3
1653A52N6k42J76K9n78M18q0n5j04K80j23MJ8J42J62k22j85L82N4l74K73o69N38
1676E2n7k52j2K88l44L52M8k13K3J00J08L1j31J13M1j48J41j33k45N19j89j51
$$ y = [-127, 204, -120, -156, -106, 209, -241, 141, -273, -234, 153, -133, -107, -173, -122, -77, 64, -44, 247, 118, -125, 162, 142, 159, 370, -190, 353, 187, 122, -85, -38, -18, -159, 56, -167, -3, -112, -184, 11, -177, -240, 261, -75, 183, -5, -402, 241, -27, 16, 153, 12, 93, 207, 28, -63, 9, -6, -98, -108, 37, -235, 131, -214, 203, -112, -76, 130, -210, 132, 134, -171, 107, -23, 127, -41, -232, 43, -68, -493, 141, 71, -232, 58, -168, -89, -166, -1, 6, 344, -63, -40, 249, -37, -98, 151, -192, -110, -131, -21, -51, 98, -18, -62, -116, -127, -52, -294, 5, 11, 73, -1, -62, 10, 212, 198, -38, 409, -385, 3, -63, -40, -44, 61, -85, -47, 34, -251, 299, -21, -130, 46, -159, -215, 205, 150, 189, 139, 60, 189, 89, 152, 208, -34, 142, 171, -407, 11, -69, -124, -228, 52, -71, -67, -49, 93, 255, 33, -152, 230, 284, -90, 183, -486, 52, -5, -257, -269, 19, -325, 27, 75, -138, -115, -15, 93, 124, -7, 106, 147, -1, 140, 7, -238, 281, 92, -59]
1698e9M37l77j90J4Nj97J56J93Ql82J05L44j38L04n1O9r8j12j97L46l3o5j08k4
1722e0P0q5j11L17j43k29J76P1j43K85j33k06K48J62k39K44k31K08O3l64K87l61
1744a64J19J20k49j3J68J97k90j2K18j14j9P6K42O6m03L32j95J99j45M0J5k07
1766a9j29J68j8l59K14P5n1R9K30j03J09l28K5K04m22M25K67k31M6J17j43k7j39
1789A0k78J19j46K80J50l99nM01O2N8k25L7o5O5M1r9m4oK16q3l5j18nN5L8l9K4
1816Ij28J02M1k23L36K08m13n2M64l38L0N1k45K04l37J66K48r3j71M85n06J68
1838Fk1r6N4j08K95n0j35K76j95J39p7Jm27J17J84L6J23l34n0J17M83l54J59r2
1862E1k47M00k23j83K13K4J79k38K94l67J38r6j8J07jj3n3k8K3n5kj91M60l06
$$ y = [-59, 378, 1, -189, -175, -170, -367, -211, -18, -10, -392, -287, 57, -81, 223, 172, 241, 143, 31, -166, 180, 147, 82, -26, -50, 20, -65, -176, 141, -2, -231, -55, 16, -127, 158, 25, -181, 67, 229, -10, 234, 3, 211, 274, -90, 197, -164, -45, 75, -174, -187, -19, 178, -112, -124, 94, -20, -39, 37, 279, 345, -58, 274, 79, 278, 133, 173, 188, -19, -148, 20, 2, -357, -143, -68, -119, -20, 210, 107, 216, -112, -87, 117, -305, 120, 387, 156, 202, 319, 176, 149, 10, -268, -149, -295, -15, 135, -264, -269, 132, 194, 252, 27, 64, -1, 64, 105, 6, -38, -44, 172, 89, 54, -64, -69, -14, 24, -15, 9, -119, -17, 24, -199, 137, 345, -68, -120, 344, 6, 36, 87, -158, 46, -291, -125, 123, 30, -141, 344, -162, 6, -15, -111, -57, -165, 130, 80, -55, 221, 26, 165, 88, 89, -338, -221, -37, -1, 122, -212, -262, -145, 338, -16, 143, 51, -196, 204, -19, -202, 11, 35, 214, -24, 270, -97, 41, -55, -73, 34, 33, 20, -33, -61, -38, -93, -95, -286, 174, -132]
1886a32L63k35j65K86Q1l07N2k6L4K3J90m21K79k14o0K65k92K38K4k46J59K78
1908A74k7l8j35k96L75n2J13N5k58k51K40L20n34J96J25O0J1r1p1q1L19k91n7
1931a94K09j55J07J7o4L49k02J9Nk30L98n54P20p53N51l26P3k7J8r3J26K6k29
1954b09O1J72o2J39k6j92K92j58J27R7n84N28m57L51l9M8j83J48k19K08q2j07
1976a47N4J90m1n9P1l14M03k46K00K19l77j43N58l49N4j56K92Lrl20M96m61r2
1999a74J36J70j26r0J55q5R9j53P1K21l90K85k16J93l66M46j26Q4k57j19M02k27
2021f7L46k91m2j47j3N78m63j60L51q9j11o2J97j72j08K03J09j50P4J94J5k1k65
2044i4J35qp5j42L6J38Q3l69J83J78q9K02k31J87p1Q4k29q6m2N16l08P0L4l56
$$ y = [-132, 231, -4, -169, 117, 198, -109, -57, -83, -49, -26, 164, -257, 22, -192, -252, 13, -279, -41, -17, -263, -104, 174, 147, 109, -26, -322, 53, 1, 114, 169, -89, -340, -100, 220, -314, -118, 7, 67, 78, -13, -84, -165, 154, -137, -194, 15, -140, -33, -16, -80, 269, 67, 86, 91, -139, 259, -295, 425, -328, 223, -103, -30, -57, -39, -132, -6, 20, -209, -148, 24, -38, 101, 75, -117, 175, 17, 144, 241, -343, 185, -272, 79, 40, 88, -95, 53, -166, 42, -40, -147, -93, 97, 56, -3, 68, -246, 157, -89, 111, 330, -47, -190, 368, 19, 73, -83, 209, 212, 203, -117, 379, -82, -174, -38, 132, 6, -84, 71, -14, 85, -68, 3, 224, -166, 119, -97, 96, -270, 176, 50, 134, -123, -242, 160, -67, 279, -12, -54, -201, -214, 364, -99, -259, 92, 3, -108, -170, 27, -145, -253, -50, 59, -91, -17, 177, 192, 171, -94, 41, 33, -42, -184, -148, -10, 73, -296, -113, 65, -24, 178, -53, 134, 63, 147, -82, -168, -210, 306, -2, 68, 102, -254]
2068b54K15j57Q2R8K72j83l16K24J13M5p2n5l1K19r0k0J4j03J20l54L20M0n06
2091c79O92l29Q1q8L0k4O5j36L21k38N3j68J42N9K83l16l24K98N7j75J63K5l05
2114b13J44k03R4M10j15J54j73N8j76Q0q4QJ3Q0l7o3J10j63J0j18K68j32L47m63
2138a64M6L08k29L40k89m5K95l2k62m2n6K16l24L15o7j61K14n1L0L0k83L29j52
2161c4K33k12Mq8M3M0M9j18j4P9N2j27P4J15J23j66j45K93l40J93N3o3Jk46J96
2186eK2j01j8M3J69j06J81k64JJ4K86l06J55k19J02N8M0Q4J65k13J93m67J10j2
2210h8N4K3KO5Pp6l7N6k27L6J23K50k2k47R5J30l06K81k62O47o79L86k54n9J61
2235E9J63j30O6q6l77L89j83O6J25M5k21O0L76l00j12J61Q7k21l2L24l93L03j40
$$ y = [-254, -39, -196, -114, -16, 256, 73, -243, -19, 94, 139, 67, 12, -19, 200, 110, 90, 104, 1, 121, -233, 87, 127, -379, 313, -16, 65, -23, 7, -17, 48, -88, 233, -5, 48, -120, 22, 81, 364, 48, -276, 22, 79, -96, 67, 92, -213, -69, -272, -178, 232, 117, 271, 98, 156, -20, 60, -24, -16, -3, 77, 40, -23, 87, -76, -66, -184, 84, -48, 299, -164, -118, 190, -39, 301, 12, -33, 262, 230, -32, -74, -130, 86, -238, 77, 10, -151, 63, 12, 42, 72, -211, 118, -34, 199, -13, -9, -97, -54, -14, 35, -83, -97, -18, 34, -93, -19, 96, 219, 53, -92, 201, -139, 54, 107, 44, 45, -201, -5, 17, -84, -102, -59, 110, 4, 185, -79, -78, -64, 222, -84, 71, -148, -46, 12, 52, 136, 301, 88, 281, -186, -76, -88, -34, -11, -9, 56, 63, -13, -50, 6, -221, -185, -62, 188, 166, -81, 14, 144, -162, 119, -143, 504, -175, 211, -43, -102, 59, 222, 92, 158, 72, -305, 84, -99, -33, 92, 137, -84, -24, 352, 52, -60, 101, 188, -33, -65, 259, -134, 169, 29]
2258B9Q5l5J8k63M70j91j88N0K35k46l4J74m3p0J5j25J79J14j79J67j83K54m01
2281a68K68j08m2oj08m5J05l8L37j44q8j78K78J66l09J04j73L4q9M97j96n9j78
2304a40L27K7m90M14k16q9K63k96J88K33k32k5k21J38M13k45k06M8N2j93L51J80
2326B81m20j34L42q9R6j69K75k56K02n0m3j14k2M2N2K13j48nO8J83n08M64j00
2349A60p5j29l8P9K25j70r2J73j52r1k70M04m96M14K13l12Q6L42k47M3J3j83J09
2372Fr8P7M5o0K11l83J23MJ34m07L43j62M87l50J14K75k12k23K7q6j7J44J25k88
2396a71n3K99k14K09o6j59J31j04R5k1J95l62L64j80k90N36Nj05k00n5R9J44p4
2419B3q4P8j03j07kJ08J25J11m2q3J62k47J5M28l71Q9l17K56R9k60M9N7K25j11
$$ y = [29, 114, 79, 97, -166, 304, 113, -75, -25, 210, -36, -70, 104, 61, -9, 6, -119, 60, 174, -5, 162, -21, 233, -168, 100, -8, -50, -56, -164, -209, -104, -142, 195, 51, -37, -215, 63, 229, -80, 24, -149, -115, -204, 293, 97, 38, -140, 187, 214, -276, 138, -78, -167, 96, -200, -12, 221, -11, -36, -257, -119, 294, 49, -157, -109, -57, -250, 101, 281, -139, -273, 69, -20, 76, -93, 182, -74, 128, 78, 35, -79, -101, -59, -7, 206, 58, 53, 121, 304, -204, 260, 160, 85, -44, -82, -3, 222, 52, -40, 133, -19, -110, -380, 24, -472, -58, 155, -157, -71, 271, 24, 67, 80, -103, 6, -92, -15, 30, -30, 181, -202, -79, -75, 59, -348, -5, -167, 320, -30, 84, 359, 147, -76, -49, -135, -152, -8, 117, -171, -224, 75, -139, 70, 4, -155, -24, -128, -33, -54, 141, -221, 143, -37, -327, 209, 214, 109, -91, -146, -47, 97, 23, -61, 17, -86, -193, -195, -87, 38, 149, 107, 24, 186, -61, -46, 382, 11, 100, -217, 39, 138, -122, -73, -16, 209, 98]
2443I8k64K41R9J08j02k06Q0kk20o4L44j33j25O9%j7J1M3L42k11j37M3j8J35p3
2468D1j62Q6J47lO0j33l28L37j00Q9J39l08L48m71L75Mj14l9K7J9n5kK4L7l0j83
2494a95K6k6J50P4j36K99j19k78Q3j5R7j08M5pJ45J14j07q6k13K49J77j76m2O3
2518A4j6K32k85k05J89j24K07k23M22j70O8o8l28Qj2M41N9j28j70J6j06m4J31
2541i2j88N1J20Q5J12J13l56K4K20P6j27O2J4m4R9j67J42n0l41K10k6n5L5L07
2565B24k83K09kq4j99K06j40J24o6p7K22k99J68K3M9j72n0K63j94r6K46Q9j77
2588a6j05O5j55K50k1Q5q6k89L47l02M15j80k8J76j79K45l4j93%J05k0j63O6J95
2612A78n7l39L00o4Om7J64p8O9k41NJ24LJ6j15oJ68j82k19M44k32M75k99k19K19
$$ y = [98, -166, 75, 174, 282, 180, -26, 54, 52, -168, -232, 112, -21, -146, -77, -77, -94, -83, -40, 302, 91, -46, -3, -21, 114, 41, -121, -35, 112, 109, 169, 36, -292, 45, -55, 34, 173, -135, 213, -258, 117, 121, 7, -32, -5, 14, -41, -43, -19, 18, -12, -195, -169, -195, -45, 29, -107, 192, 73, -205, -122, -137, -40, -148, -103, -110, 35, 149, 42, -44, -257, -8, 169, -7, -49, 14, -2, 230, -55, -260, -71, -195, 12, -211, 211, 41, 109, 41, -287, -279, -291, 150, 209, 81, -89, -73, -179, -223, -92, -280, -229, -109, -24, 88, 201, -155, -131, 89, 165, 38, 100, 114, 70, 169, 2, 144, 94, -247, -37, -63, -118, -83, 224, -59, 150, 148, 64, -135, 71, -69, 55, -11, -88, 134, -165, 3, 26, 75, -97, -147, 116, -78, -174, 72, 161, -16, -121, -56, -211, 39, 18, 103, 17, -272, 75, -227, 188, 8, -20, 156, -23, 222, 188, -5, -5, 100, 80, -83, -17, 178, 121, -218, 82, 18, 24, -23, 141, 63, 132, -109, -104, 20, 23, 39, -76, -82, 86, -96, -315, 129, -103, 372, 73, -146, 73]
2637G3j96J56k39M1K16k87L45k11M1M8J2J68j65J12J2J41k6j62K2l01K76L1J38
2660B45k44n4J81q7r7K2J72k65J47q7K9r3L91j5l79j30lL78N1m9l67o6L15j25
2684a30J07k7J77P5j32p3m2K45o7o8J61j26k68K53J25l54J88m1R6l42p8L59LK28
2708B69l94p9J5J79J28K6j40r8j67J32J78J1j32K20nk60M42l12k30J17K87j85
2730BM4k07j69K85O3N5j58kJ89nKk32K3N2l7j03J79j2P7J52j54m2P3j21l4Q6R4
2757A00M6%k62M3R7j50Q2J76j27J22Q5k57L3K27k55k2J17L3m40L75oK52k07M3
2781A05m16L32j57l6K68j7M0j66J21j41J18j58K48j55l9J42K06l01m8j70J89j20
2803a55OJ61l8K16k22J38Ok93J03k9J16J28o10O51m35M5K27p2K82j89J78m08J92
$$ y = [73, -123, 33, -206, -165, 51, -236, 109, -102, -61, -13, -1, 167, 2, 114, 126, 267, 241, 79, 101, -200, 76, 107, 245, 1, -53, 128, 41, -56, -34, 138, -127, 20, -67, -38, -131, 260, 245, -134, -264, -267, 111, 162, 113, -254, -320, -5, -130, -23, -50, 127, 202, 70, -3, -45, 200, 133, 65, 226, 100, -168, 85, 210, -144, 44, 3, 99, -243, -321, 38, 41, 269, -125, -204, -189, -10, 118, 144, 4, -94, -261, -129, 49, 60, -72, 148, 143, -117, 325, 13, -217, -100, 187, 2, 46, -161, -330, -45, 18, 73, -85, -87, 102, 97, 99, -133, -110, -58, -95, -198, -19, -31, 46, 198, 44, 2, 75, -46, -80, 6, 100, 146, 146, -116, -73, 24, -126, -44, 132, 5, 127, 212, -45, -12, 215, -40, -62, 55, 88, -352, 23, 17, 269, 62, 105, -311, 21, -136, -172, 96, 79, 119, -47, 74, -67, 51, -107, 141, -14, -53, 89, 295, -6, -54, -224, -35, -155, -149, 12, -26, 190, -32, 106, 112, -181, -78, -107, 9, 137, -473, 178, -257, -212, 15, -57, 225, 36, 214, -194, -2]
2826bJ57P8r1j42J62j93N6n2J34k7j62P4n4J98q5k09L69j86k33J14L86mn34K64
2850A8R4k08L48m82L55M9q0O7r7J3k15K4R7Q6j92J53P4J15k26j58J10k23N70j96
2874I6j41j88K67K5k53L09k99L33j66N2j81J37k58K36J10k89J27R0Q6o7J8k58
2896b14N9L20k15m2r1L85j95l82M49k67J30J36J82m06K82o3j25j93Q1l0L44m1
2918A04k42j3J38rk82K26P5q2K98k67J93l09J79nn7J20n5j85R2R5M8j93k76M99
2942I2K1k59R5Q9j68kp6K72l69N80L1k52J05j31J51n0l25K63k13j05J90Q3p2k43
2966b93M27k85m3L7J34J31j05J55j06K8j51m7lL65k35Qj46N22m44J26q7K8r9J99
2990A16l35K14Oj28O8Q3K20k60M1j05J15Lj07L57k83l45M24k61K87j39n5K24j46
$$ y = [-2, 155, 233, 142, 0, 162, -31, 25, -27, 107, 80, -82, -8, -62, 136, 51, -158, 211, 25, -208, -94, 292, 288, -246, 18, 112, -96, 252, -230, 125, 174, 94, 161, 64, 77, -138, -114, -17, 69, -123, 30, 104, 219, -7, -165, -55, -278, 292, 96, -45, -233, 34, 59, -194, 115, -184, 149, -17, 35, -146, -9, -267, -31, 79, -210, -83, 7, 93, 26, 44, -214, -155, 165, -50, -92, -183, 202, 7, -375, 74, -193, -63, 73, 255, -151, 131, 68, -57, -250, -169, -199, 145, 104, -138, -151, -13, -22, -304, -78, -3, -85, 213, -54, 139, -170, 9, 4, -53, 67, 12, -173, -81, 14, 62, -131, -407, 92, 113, -146, -51, 38, -130, -132, -208, 64, -305, 275, 306, 54, 159, 28, 179, 129, -196, 67, -146, -251, -61, 22, -50, -293, 134, -151, -194, -157, -23, 108, 3, 158, 52, 80, -71, -118, -121, 244, 9, 17, -129, 393, -51, 75, -12, 16, -83, 116, -219, -5, 1, -127, -59, 24, 244, -16, 25, -80, 35, 38, -69, 288, 5, -340, 84, -177, 110, -29, -84, 140, -6]
3013fL00j7k41L5j51K1Q4q6Jj15J95j51J95J57J75l18j15J84j28m2P4l3j64K66
3037A20l25J58j75J90P0l10K35n7J28J89j27l05J09M2j1M6J01L0l58K63j66N0
3059a03K46k62J07k33M28m5j95l5L94k79L1L2k8k62M13j01J59l52n4J7J61R4k39
3082a06O8N4J97n28R8L13j56J23J57n43M87l61mJ68M9L2J71l30K98m17K90P8O1
3105A99J8l21K10k52K31J33m28N59p4k42J58j11Q6k37K7J90n58K23Q8L9k3l6R2
3128b9J09l15L49m4j44n6L39j60n1J1j01K62j5j51R4k77Q9K22o0J51k61j22M7
3151a13J83QJ32j64j14L33l15K26Ll11K38k78L14Q4k87k2K70k57J15j46J43O7
3173A09k10K4j40L44m8j77M88n31r0J30J32j81J33j50J96j47M60n34J47P5j28
$$ y = [-6, 294, 277, 36, 71, -80, -59, 25, -61, -60, -175, 20, -131, 64, 221, 396, 78, -37, 147, 19, -23, 51, 18, -146, 120, -205, -47, -222, -32, 38, -272, -37, -94, 34, 223, 96, -209, -100, -58, -69, -23, 78, 108, -250, 13, -153, -103, 143, -119, -12, -245, 183, 138, -57, -92, 302, 23, 54, 86, 58, -204, 209, 108, 267, -85, -139, -122, 39, 133, -106, -38, 16, 213, -315, -217, 96, -60, 63, 220, -323, 164, -197, -201, -33, 16, 48, 219, -111, 187, -230, 60, 138, 199, 217, -104, 106, -146, 85, 218, -210, 349, 275, 33, 191, 80, 166, -71, -44, 146, -412, -189, -101, -62, -85, -121, -29, 80, -235, 114, 70, -74, -130, 209, 49, -2, 9, -92, 170, 155, 4, 98, -179, -90, 132, 72, 223, -38, -160, -113, 70, 78, 210, 46, -68, 265, -50, 176, 179, -132, 106, -172, 142, 226, -61, -83, 187, -70, 45, -101, 42, 109, -101, -77, -217, 127, 79, -98, 390, -141, -231, -101, 31, -150, -17, -167, 29, -118, 342, -192, -45, 30, -98]
3194i8R2j72J88J19k5kn6j21J36J50j08k8N4k86K76j87M6O5p8J64q7j91L40l58
3218a67k0K48k50L60k12j69p9M12o8P3J7j54J48j50l22L45q7J63N9q7j69J22j45
3241a32L66l71n7K38J22J8j35rk81L36k13L30l13l0J45J33j55l9kL7k0M4q5M0
3265c3j09K36o6O6O5m61L86k55K79k22L1K50l02j07M35j30O4j5j03K38m51M55
3287B51j7j52j33J09q5J38j97J0K04J4j41NJ08j88R0k49L14N6%k09K50k8r3k9
3311B8j43J57k7q1P7j17j96K22L25k07k9N8k04q2L50l27K12j99J01J84p3k35J31
3334g5R0J83j78j48Ml7J84Qj77K96p0J7l9n45L89L17k74j2K5r4J4J92l4Q6l97
3359b75J37J44M7K36l33pK8O9J23j07j13K4L7j27L03k29J40O5l42L87k28M6L7
$$ y = [-98, -6, -178, 10, 129, 104, 102, 46, -75, 61, 211, 103, 75, 129, -157, 119, -68, -22, 43, -35, 129, 42, -149, 191, -167, -187, 61, -189, 171, -41, -210, -289, 123, 55, 128, 145, -9, 139, -11, -333, 12, -75, 88, 147, 60, -109, 13, -132, 234, -137, -194, 44, 166, 184, 49, 40, -241, 95, -118, 212, -101, -131, 14, 147, -8, -47, -49, -12, -32, 12, -73, -33, -142, 94, 28, 94, 159, -302, 84, -171, 108, -114, -83, 167, -135, -242, 193, 63, 127, 112, 9, 247, -204, 251, 234, 82, -51, 58, -27, 111, -86, -76, 128, 142, 1, 6, 114, -74, 16, -233, 81, 137, 137, -72, 178, 150, 57, 28, -115, 42, 15, -66, 11, -106, -302, -80, 245, 38, 9, 67, -137, -219, 131, -196, 16, -183, -82, 102, 29, -206, -75, 15, 198, 20, -128, -124, -161, 23, 31, -146, 150, 80, 97, 58, -487, -98, 219, -55, -67, -42, -136, -122, 70, 36, 122, -275, -138, 6, 53, 289, -44, -51, -23, 46, 169, 62, -51, -27, 10, -117, 186, -43, 97, 162, -180, 207, -21, 25, 62]
3382F2J17k97K42k05K16k75K22Mr4J53J33k93J80k36P8q3j5J24j63R5j15j69N54
3405B35l82K13j41K37j06nJ66m57L74l75L07l9O8j01m2K2O6J05o9j67q1K83l50
3428b39L66j9J2j50M37l65j05J29k90L36j99L88m39J45j38K19r3n4K46L4p1j7
3450A33r3j00K64l34M04l68J40r4j23J31M3J62P5k43l4j36K05j96K90j55j17M02
3472B56l99M01k90r4K78J44l23N4J73k30K78r5k37K51m09K84j30J03K6k37J43
3493e3N9k1o4o0L82k18k88J97j69K35q9L8J72Mj63k78K61K22n5j45l09K76R0P3
3517I7j67J01j94N2J7K69k17p2J38j59L92Q7l39O1j95K56j67K8K18k64L65l50
3539d3K53o9j96J98m73M66j13m1J59K7M0l91K61k35K1M4K77k52q2J71k30L74l12
$$ y = [62, 179, -118, 124, -81, 135, -140, 82, 86, -8, 145, 278, -15, 165, -71, 7, -76, -91, 33, -130, -35, -150, -319, 235, -147, 66, -75, 162, 56, 51, 217, -240, 134, -241, 66, 27, 95, -6, -48, -26, 40, 145, 76, -91, -172, 111, -239, 127, 108, 120, -30, 407, 42, -63, 66, -224, 112, -87, 301, -138, 7, -131, 88, -5, -59, 187, 221, 150, 133, 40, -60, 204, -130, 274, -94, 46, -48, -171, -40, 3, 165, 240, -3, -37, -173, 32, -164, 126, -29, -146, 256, -143, 258, -32, -126, 152, 296, -27, 27, 200, -30, 248, 153, -84, 167, -242, 42, -88, 15, 41, -196, -53, 6, -15, -79, -139, 243, 25, -263, -66, -235, 0, -89, -51, 121, 125, -38, -316, -55, 167, 112, -33, -342, -66, 24, 97, -70, 31, -163, -111, -94, 175, -42, -114, 24, -135, 257, 344, 5, 66, -129, 127, -40, -12, 206, -58, 307, -43, 210, 141, -55, 143, -330, 136, 23, -18, 141, 168, 208, -183, 78, -157, -136, -92, 185, -67, -149, 22, -208, 166, -146]
3562a46L00M9k65J61k03J03J26k93K02k24K85K8o3J17j81N7j81J6J10j09K60l39
3584a90J69J07k41L48j69j24P7Lj42L06l65K97j15l3PQ5M3J5l5l10K71K32l41
3607a05N2l28M01K6k5k91J64M6j4M4J83j44n9J1J79m11K93k40J81K2Q7j90l0M0
3631a08K28oN9k02J08J10k09J52r8rk35K88P1J33l7k17j08k9J39pJ52k82r8K21
3655A6J4k14K71R3l23L44k48M9o9J95m5l0r1J51j15j61K80q1J27l18L97k05j81
3678a44K03j4l31L58k72O9L01j95m2J55q4j90J78J20p0J6j18n5L8k4K25j6l9j7
3702E2M5J9l05L38J35m73M34J25j92k69K60j66Lj02l4K08k57L37j47j79J78J38
3724A48l32J05L5J4L50k76j31Mj84K48J23N0M7k93k4P2k1l0n7M0J10J42%k43J90
$$ y = [-146, 154, 203, -62, 99, -104, -1, 125, -168, 34, -190, 95, 123, 60, 177, -4, 53, -128, -112, -2, -111, 149, -190, -21, 86, -155, 193, 24, -100, -23, -20, -162, 144, -221, 76, -39, -72, -65, 20, 63, 78, 43, -267, 4, 236, -105, -53, -381, 20, 46, 21, -270, -106, -60, -74, -30, 153, 9, -50, -39, 140, -271, 22, -218, -37, -15, 72, -118, -148, -108, 120, 114, 173, -29, 79, 189, -20, 132, 34, 25, -210, 78, 149, 282, 245, 28, -80, -109, 30, 23, 175, -107, -205, 16, 30, -184, 87, 180, -143, 201, -47, 2, -67, 128, 83, 53, -38, 113, -2, -163, 117, 36, 163, -155, 242, 37, -144, 59, 45, -286, 72, -200, -131, 170, -25, -67, 88, 4, -186, -8, 112, 42, 58, -60, -115, -77, -101, 124, 108, 69, 52, 97, 116, -189, 149, 284, -189, 245, 370, 178, -91, 169, 3, 6, -96, -130, 78, -179, 158, 11, -168, 10, 148, -184, -79, -44, -30, 320, 44, -87, -83, -267, -19, 104, 154, 201, -92, -116, -44, -65, -95, -152, -112, -2, 140, 140, -103, 87]
3749H7j59J92k55K35rk7j80Q3J83k37L1M82o62K95M3j61l6k38n4K03M90k65J76
3772B17l36n4J59K73k94M4J19q4K2q3N3r9K82k20n5p1J44n0J38k55J65Mj68r2
3796b41K09M5K40k16j15L8j35j47K39K31N3j98N7Pl39K46R9k13nJ89j11q9J15
3819d1o5n2J68l3P5j4j57M17k80j65J18M9J35l2q8j5k6K5j16N7L9J40k61k49J55
3844b16K73R2j92K16j80%k89K88m0q7K86k73L04k1l50L4m9K56o9l8J82j4j42o0
3868h9n2J04r7J6K20o1o5K27J25l44m2J34j1J19k59N2K34l24j39L23l6o9j33N4
3892a13jl05N37q0o5j14k2J38J41k68Q1J82k49J81j53q1p2L48q1l68K43K48k5
3915A02l71L60j12R0j88L7j29K95K28j76j06N7n1j74k7qK21j01K29l3q4l05J61
$$ y = [87, -72, 120, -135, 100, 91, 64, -116, -33, 150, -87, -56, 426, -236, 59, 102, -59, -95, -333, -387, -184, 306, 41, 217, -119, -173, -14, 259, -35, 9, 128, 44, 66, -17, 36, -63, 219, -1, -56, -127, 17, -33, 105, -150, 15, 19, -149, -241, -32, 13, 253, 37, -78, -40, -175, -322, -83, 148, 201, 3, 60, 67, -272, -26, 73, -140, -145, 44, -67, -156, -41, -106, -158, 10, -23, 52, 38, -119, 298, 18, -147, -29, 20, 155, 123, 35, 20, -6, 19, -97, -40, -1, 139, -122, -371, -216, 57, 149, -43, 173, -7, -7, -296, -8, -48, -135, 151, -122, 182, 161, -189, -155, -204, 52, -17, -55, 127, 113, -29, -89, -141, -37, -134, -118, 102, 41, -24, 203, 328, -16, -58, 76, 65, 184, -75, -23, 211, -113, -252, 71, 35, -34, -167, -113, -114, -419, 118, 38, -27, -141, -163, -25, 116, -152, -71, 111, -138, 43, -110, -191, -263, 85, 4, -364, -121, 127, 102, -269, 91, -21, 69, -119, -82, -211, 84, 312, 136, 30, 87, 36, -138, -165, -173, 48, -53, 176, 143, 59, -246, -85]
3938h5L36j63k5j61J26p8j50M56k31l02J53LO1L3K19q1N7j36j33qJ71l2o3j48
3962a81ko9L97l8k5l20K55J54k80J70j69m7K82j42j71L62J1k15p8L04Rm52N05
3985B60l04M3L3J56n8j55M3n7J35j87O9MO4K18k72np2J65k09K19j73n4J06Q9O4
4010A22p2r4K31m22K57K5l1K06l01J26oK49k55j27k02L17L4J5K10l78l2K50J36
4033B58l84K70k04jK27n8j90oJ91k32r3J49O4K8j49R6N1J22j07j08j94K14Q8J02
4057A34j03j94L80k18L6j03J27o9K52j74ql9J21k53K12j48P9l9P8j76J55J18j79
4080a1J83k11Q6j7jo2J92j52l0L0q7J06J00k38M9j13J83K38k96Q4J97k95L5p4
4104a04K65j22j65q3K7K83K84p39N27m18K11R0j89J30Mj1J47k58K32K11l60j1
$$ y = [-85, 251, 88, 63, -98, 28, -50, -200, 256, 25, -277, -124, -121, -60, -27, 192, 111, 168, 32, -101, -109, 62, 30, -33, -181, -183, -252, 145, 107, 82, -238, 17, 171, -109, 61, -108, -155, 127, -15, -186, 176, 187, -28, -106, 198, 207, -245, 260, -44, -1, 32, 188, 130, -25, 18, -39, 96, -91, -22, -18, 46, 264, -8, -13, -85, 80, -129, 90, -83, -137, -31, 58, 122, 50, -44, 187, -235, 22, 47, 16, 222, -79, 47, 41, 290, 35, -92, -294, 23, 57, 72, 282, -96, -128, 122, 258, -126, 144, -60, -61, 166, 108, -82, -88, 103, -129, -222, -73, -9, 19, -130, -34, 17, 139, 32, -76, -270, -56, 32, 134, 31, -163, 217, -1, 35, -68, 59, -10, 242, 68, 60, 21, 142, -111, 101, -47, 32, -7, 71, -105, 50, 168, -11, 172, -39, 47, 30, 29, -33, 159, 7, -23, 7, -80, 26, 126, -112, -63, -176, 7, 245, -51, 33, 230, -65, -30, -104, 161, 39, -126, -209, -182, 101, 385, -354, 173, -245, -34, 56, -133, -3, 1, -10, 137, -121, 111, 322, -38, -49]
4126d9j20K37j02M2j67L21J73m75nL28j25j94K58J46m03J35J29k58P0R9J32o4
4148A08l07N03n3m17L2Q6J61l2q7np7Q1j14L00J42l97K5r5Q1K3j46K60r1M0J10
4173A31l17R3K49k26J41j58RO7j48J92q7q9M11m37O1N4j35r2M15k52L78r5m4j65
4197d4J46j00j67J78K4r0L56j89j52J68n3Q2qk04R1o0m6K31k20O9P9o6r8o0J79
4222D6k53M34j54K0j05J22p6j78L29r0k13J76j55NJ82p0nl76N45l34K39j42Q0
4245B7L6PO8k83j60O04j66j97L13o9l26K65N5n8j18O8l63M10k86J68Q9q2r2Q2
4269hl0J91j29L1k4k8lk72K90J88rk80q6O6K45j54K71m17J95j47K08k32m9L18
4293A35l4k73N6R4o8K14k20N9q5L92l57J4Nm6j8K06J12j34l8n3N2r4j26L4J68
$$ y = [-49, -169, 68, -34, 8, -159, 162, 335, -140, -145, 183, 58, -136, 122, 268, -135, 0, 129, -129, -59, 40, 172, 108, -199, 304, 251, -166, -134, -48, 113, 81, -6, -11, -88, -7, -121, 179, 321, -76, -51, -146, -65, -42, -188, 72, -19, 21, 131, -186, -93, 156, -70, 71, -87, -78, -11, -159, 33, -54, -143, 268, -169, -108, -54, -189, -281, 134, -118, 260, 165, 121, -44, 102, 2, -165, 13, 37, -53, 303, 114, -38, 130, 77, 159, 151, -53, 38, -22, -68, 163, -57, 12, 91, 25, -73, -133, 46, -207, 227, 73, 93, -12, 110, 34, -144, 185, 95, -118, 58, -97, -92, 90, 20, 15, -361, 184, -150, 89, -53, 27, 63, 70, 138, -145, -305, 299, 133, -64, 249, 180, -146, 119, 174, 116, -2, 66, -297, 113, -173, -5, 84, 2, -90, -8, -38, 153, 24, 55, 31, 3, 0, -272, 18, 206, 197, -83, -169, -103, 142, -12, 259, -158, 37, -110, 98, -134, -183, 135, 101, -172, -116, -22, -90, 124, -96, -37, -122, 270, -87, -73, -68, -114, -132, 74, 186, 52, 14, -39, 13, -81, -207, -173, -5]
4318en2k5K3J71k29J27j04P8j21oK24j55J82j95m7K09k20K54J0L2m14j5K53o4
4342h9PJl0N3Q6lN8j54J96j02jo2M6n2rJ69k97K74L3k29L31k21J23j40Q6P3o9
4369G8j75K31k18o5OK6P6j34K71R6k72J37J13k57J42j85L38m2l09J54l15M57j05
4392D8m3K39k52%o7L11l70Q3j76M34o0j89J67p2N7o7l01L35j43K31j24j26p2K79
4416A22r1k17L65J68l35K29n6j97M2k65M18q4j30j79L24N4k03K04k79K81%j90
4438a9O1P2l14J41L6rJ74k39L62k29k88K29O6l3k46J64L04R3n23J05J55m7r3J76
4462I8n5l19J59K91k38J07j04J01J32k3n3n4j93N0K45j12O1n8q9Q2j24J80J4j88
4486i0M8J75l84RR2Q6K56j32J89j68Q8n17J39K14J90k33j44M57R8m42R2r8j5J46
$$ y = [-5, -57, -82, -59, 112, -117, 10, -94, -16, -137, -143, 81, -74, 108, -87, -134, 75, -145, 109, 119, 151, -263, -278, -25, -89, -82, -81, -111, -58, 28, 25, 83, -71, 125, 23, 22, -40, 6, -46, -55, 114, -183, 91, 124, -105, 226, 5, 128, -12, 74, 147, 78, -97, 134, -84, -149, -143, -117, -41, -175, 96, 192, -80, 57, 170, -87, 55, -130, 208, 166, -143, 11, -304, 153, 48, 5, 244, -8, -8, -75, 236, -134, -51, -227, 207, 147, -42, 125, 53, 110, 43, -258, 77, -66, 165, 41, -85, -157, 122, 31, -186, 179, 347, 12, 241, 185, -12, 30, -235, 183, 99, -31, -210, 114, 168, -35, 169, -110, 171, 171, -19, 42, 114, -200, -59, -23, -32, 142, -97, 265, 36, -252, -23, 43, 10, -236, -72, 232, 325, -198, -93, 62, 15, -78, 98, 43, -276, -117, 174, -64, 43, -61, 40, 172, 149, 96, 42, -151, -101, 144, 32, 93, 35, -54, 28, -96, 84, 98, -90, -42, 133, -251, -242, -150, -64, 192, 60, 249, 81, 169, -348, -209, 5, 195, -38, -182, 275, 373, -69, 23, -75, -90, 56]
4510E6J4j94r4K4L47p9l87M00q4m3N1J35k91j7K60mk1j44J63J21m78M29l8k08
4534h2J36j22l3R9N1k3J97l35Q1R2k7L1j01r8O6o0k4M40j81R9l58M05m78j50N34
4559A59p7K1j73o7K42L11l93o4LP6J24k09Q6j24j85L81J50m69P7j35M87l19M04
4582C06j87q7K27l77K42J12l66J43K25j27j99J04%J68l14J96m5Q8J69k83J69j98
4604c4j00K45j34K3L60j23k90j64K88r9L50l64K06l02O5K14j38k75M04k53KJ34
4626A5J40k63j98J91j15NK03J88p8J3k8l30K27J50m3J23k7k98R0Q8j72J95nj30
4650e9K0n0k5R6K14m56J88K0M9j7L6j62r5J25L77r8k04o9R8J53J09l20M3Q0J7
4675G0j48j13L23k12r8K49Nl32K12Q3L4n4r0Q0j46P4K5l41L75j41L05K41m64K4
$$ y = [56, 70, -124, -218, -194, 153, 74, -313, 87, 3, -40, 11, 146, -145, -162, 98, 94, 73, -71, 92, 213, -265, 164, 126, -82, 54, -68, -101, -2, 49, 26, 223, -112, -31, 61, 34, 65, -36, -134, -68, -128, -152, 288, 107, 206, -152, 253, -225, -375, 159, 82, 103, -70, -137, 105, 416, 23, -41, -38, 38, 162, -47, 39, -85, -270, 111, 261, -208, -131, -266, 221, -98, 306, 119, 32, 259, -118, 124, 236, -130, 13, 238, 111, -88, 16, 16, 184, -130, 66, 21, 109, 278, -5, 164, -34, -134, 111, -23, 0, 360, 237, -53, -217, 71, -28, 322, -42, 164, -138, -73, 141, 3, -272, 132, -121, -119, 15, 155, -108, -306, -115, -230, -225, -22, 166, 88, 101, 73, -257, -30, 120, 77, 200, 173, -125, -35, 53, -119, 76, 71, -59, -39, -89, -114, -18, 196, -260, -72, -52, -3, -20, 16, -146, -241, -116, 261, 163, -41, -110, -12, 141, 250, -70, -27, 53, 70, -78, -191, 132, -80, -178, 71, 76, -256, -44, 39, 73, 19, -71, 9, -137, -63, -38, -379, -4, -145, 160, 401, -63, -39]
4699c9R7n4K1k46r4L6L33N3J49k65J03j17j58J11K8N0l26K41PJ10l68J39K52p6
4723a3q1J90j40L8k4J1k60J2P0J75L1J55P5l93J86m9J02k48K17P1q5K29j29j10
4747C0Q4k40J92oJ29J5m10L06K54k01j49J72k32m0k8p6P0J05n6r9O3K06l82K81
4771a2p7r2M37l17O1m0K14k3o8J91l15j14J89k69J67K45l2j22j57Q2R3k38R7J59
4795E9NQ2o4L8L3j16N9j26r2J38rK36k79J78op5n5J8K99l17n6J22j71k2K02j02
4821b1J68j71J13j88K96j75kj42J83M3N0J32k21J56r0o4j67j2k3J23Q7j8K94k34
4845A17j02J52NJ24m96J40k19L00j30M0J81k2k69L84k92K45J03m66L62k02J47
4866A02l50K60j04K09k63K88mj44J15j15J43l74J17J64j40K16k07M4J0O2l4M8
$$ y = [-39, 58, 4, 25, -221, -315, -279, 54, 107, 256, -9, 94, -23, -181, -70, -42, 8, -318, -77, -70, 40, -328, -189, 63, -13, -94, 96, -44, -6, -30, -19, -279, -267, -197, -22, 9, 164, 239, -154, 32, -17, 85, -163, 54, 125, 40, 269, 140, 30, 114, -126, 66, 60, 189, 204, -206, 100, 354, 153, 4, 176, -56, -96, -124, -200, -130, -25, -81, -180, -117, 89, -293, -12, -89, -181, 256, -61, 0, -40, 174, 151, 83, 274, -41, -155, 34, -235, -68, 177, 145, 23, -134, -52, 41, -197, -100, 59, 64, 146, 82, 120, 153, 37, 96, -30, -122, 16, 7, 243, -36, 142, 136, 61, 6, 24, 323, 6, -50, 72, -99, -121, 81, -21, 147, -24, 89, -99, 197, 22, 20, -122, 61, 104, 154, 286, 65, 221, 131, 67, -100, -112, -135, -12, 75, 57, 351, 117, 15, 167, 172, 296, -200, -60, -279, 21, -109, -69, 112, 90, -179, 205, -87, 158, 261, -205, 157, -45, 102, -248, 12, -92, 117, -146, 142, 138, -6, 109, -6, 137, -237, -120, 44, -96, 120, -87, -43, -33, 29, -5, 43]
4888D3J11j33j67J98j82J14M0r8o2M2N1o3q3J59K15k17K61l2j3k64j3J05j89p5
4912b52L97j19M4K10k89N5k6j09K1L21k87K54l17j13J34J6J32M5q9p9J37k91L92
4935A87l02k01J97L06j68K75m16n2J81j6l2o6K1J67l51K16j07J49k3j5J23m8J6
4958D1j26K29j13M0n3J27k61R9m8Q5k45J46M01k76K22j42j07j11L53k71Q4j42
4980f8j17K02k06o4K28M2j25N8o8K86k58lR0j24J52O6K9j52J90k09Q0j51OJ36
5004B0j64L3K62k86K65l5j66J28l63O48k74r5J06n9j18oL43m64K60o0J24l16K29
5027A2j3l50N66l04j0K13Lj72j13L50J06k57m4K52l57J33j17J58r0J87j61J54
5049A46j98j98L39J45j17R6R1o17K60K81l13k06K89Q0J53k60J63l92L04j10k2
$$ y = [43, 154, 21, -146, 52, -130, -16, 24, -74, -136, -94, -43, -106, -189, -30, 185, -32, 229, 197, 184, -80, -93, 12, -177, -252, 145, 26, 70, 280, -9, 46, 20, -89, -68, 253, -34, 220, -97, -210, -76, -60, 72, 117, 28, -51, 86, -205, 187, -115, -316, -119, 187, 19, 294, -122, -174, 7, -9, -41, -107, -86, 81, -270, -54, -161, -12, -35, -50, 73, 25, 41, -85, 144, 31, 71, 18, 145, -116, -17, -65, 20, -225, -79, 322, 46, 268, 126, 19, -92, 261, -10, 74, -68, -185, 17, -189, -253, -25, 17, -108, -50, -118, 168, -90, -93, -3, -127, 25, 91, 120, -32, 158, -51, 29, -122, -116, 20, -144, -111, 151, -135, 130, 95, -71, 57, -306, 342, 68, -27, 79, 20, -98, -104, 239, -225, 35, -25, 99, -217, 12, -1, -351, 215, -89, -99, 114, 117, -55, -168, 182, 288, 31, -13, 239, -118, 15, -102, 56, -34, 153, -8, 146, -52, -250, 89, 234, 117, 213, 304, -313, -53, 228, -85, -291, -2, 78, 231, -29, 134, -258, 46, -64, -86]
5070h6p3L69k82J81j08K1j35R6j57L80j58m31N32j28n2J26l68PL65j27K02j36
5092C8J19q5j73NM6k4P8J60k73p6K53k61K43R6m8j7P5l54L59n0kk74K35j82K54
5117A42j59P5j17L74m47L58j12j66j18J7K52j15l3L7j23L09j92J99k35l03K66
5138i1n4M81m17J76L6L4jk01m2k9j7J17k9J2m6J86L6j33J0q3N3M3J04m2j00L0
5164C3O0m0j18o2J02j12Q5n8J37P4j3J3j43j69J04N2K14Q8r6j12q3K3lo4K11j24
5190ak7N4N7j00p7kJ00J41qlk2o4P5m1Q2j10j38R4J44k66K58j0k02J15j28L0m6
5217i5J01k08L37K8o7N3j57k5l1k6L04j74l58L07j99J48p5K83k01R7j77Q1J58
5240A04l48Q1N2J40m2J77j28j47Nm2Q0J16K8L7j96j4p1L70n4j70j65J33j30k27
$$ y = [-86, -159, 210, -72, 109, 1, 22, -113, -17, -174, 206, 48, -383, 149, 21, -31, 95, -273, -266, 99, -28, 174, 38, 157, 72, -101, -96, -50, -74, 4, 164, -109, -185, 68, -193, 50, 146, 98, 81, 156, -198, 161, 111, 109, -165, 70, -112, 142, -17, 58, -59, 315, -132, 226, 114, -52, -170, -153, 99, -16, -49, -12, -135, 174, -18, 181, -54, -357, -91, -145, 336, -81, 95, 131, 165, 164, -37, -79, -108, -125, -8, -37, -25, -71, 115, 151, 18, 28, -55, -2, 41, 145, 103, 3, 33, 93, 53, -65, -127, -25, -137, -52, -110, 27, 101, 88, 101, -42, -211, -107, -55, 159, 247, 151, 39, -44, -21, -24, -88, 123, -1, -28, 26, 83, -17, -94, -96, 4, 145, 137, 134, 112, 48, 123, 82, 164, 54, -84, 10, 154, -112, 146, 136, -66, 49, -79, -49, -95, 6, -202, 135, 163, 96, 149, -8, -33, -64, -90, 214, 40, -318, -11, -210, -62, -137, 146, -55, 42, -135, -54, 104, -244, -163, -111, 29, -13, 164, 36, -111, -106, -148, -68, 48, 76, 113, -83, -97, -168, 202, 148, -22, -187, -54, -184, -411]
5264d11M36l20P2N16m5j10k38K32l3k95K07K2j44J76k1q8R6J08k9k49L46l09J61
5287H0j48K6m6O3R6N5j88J22j44m7K42j70r9K7j25J65R6j81K94l30K35j13K04
5310A14n0k72K39J13j68n8k4J65J09j58J03R9k03J21k5r1J29j34R1j70M7q5J62
5333E4k28Qj80M08j09r8J38j96J37J06M0j21L5J11j17j57L41j71N4j49Q7j15J88
5356F6K1k21J47o5Q6J00p5K4k0j15J97p1j02J46j88K7J22q4J28l66J46J57J7p
5380G0k89J00N4J08O4j30j31K8J97k80K61j58J79rj90K92P3q0k42J11l5Q6q4l8
5404d3m8K52k85R8J17j88J13j26M3J18Q5q7k11K01o2J73Mj67k96M04J36j49j37
5427e5L48m12J40P8r1j16n0L6K52j42J88K6l12J49j22J36J38k71J08K28k65J73
$$ y = [-411, 25, -295, -223, 293, 248, 138, -100, 132, 99, -196, 11, 33, -111, 65, 44, -44, 52, 160, 131, -118, 228, -81, 80, -68, -42, -88, -25, 71, 126, -62, 60, -84, -131, 111, -59, -158, -131, -256, -91, 5, -176, 118, -212, 23, -90, 114, 64, -208, 31, 144, -24, -82, -106, 59, 168, 10, 113, 212, 9, 130, 105, 14, 143, 9, 100, -70, -23, -108, 54, -174, -166, -346, 62, -47, -145, -7, -203, -66, 40, 80, -41, -6, 105, -12, -169, 172, 1, 55, -94, -7, -122, 66, 87, -134, 13, -52, 34, 134, 59, 83, 63, -52, 145, 74, -28, 118, -70, -43, 79, -5, 123, -243, -97, 60, 77, 70, -219, -119, -65, 43, 107, -23, -154, -126, 71, -209, 52, -106, 73, 64, -126, 166, 239, 159, -83, 28, -7, 79, -5, -43, -91, 161, -124, -26, 91, -97, 16, -110, -67, 51, 136, 49, -162, 39, -23, 150, 154, -13, -309, 95, 231, 82, -55, 293, -119, 21, 99, 8, -108, -158, -122, 130, -12, 176, 202, -110, 39, -83, 53, 191, -80, 28, 256, -9, 164]
5449A64k41K7O3q7o4K75N9k26j8lj90L99K8l85J51J68j06K30j22k55L07k11j58
5472a95L94m36J90J88m45L32ol43K98L19k32j7o6r8L47l6j61r6l5J46j08K00j75
5495c5M18m74J42j01J45j50J68r8L65m23L4P6j50k7Q5o9k03N05O0k44J79l46K42
5518I9n7Lk67Q2j1N6K9M2L1K00k16N6j49O7j05M34k21k96K70j19j05J93j68M5
5542a07K1P0j55J32J14q0m6N1k9j04J86j57J15J17j03j81J47Q4j47L37k28l0J14
5565A21N8q5j36Rk57K62j58m9L02j16J59q0K8Q8r6k5nL3l85M94m4k8o2j55J19
5590hk47J95j80M25m00J76p8M4J33n11K70K96k19r1J31L9L9J02j12L1k78J36J10
5613Cr1K73l50K0J45Q6k62J84P6M5q7Pk12NP2K92k98K39Q9n05K02J13j96M2M4
$$ y = [164, -77, -50, 13, -74, -138, 137, 196, -30, -48, -51, -241, 158, 186, -199, -48, 120, 14, 244, 122, -133, 174, -37, -195, 199, -237, -47, 141, -304, 28, 22, -321, -23, 296, 64, 47, -19, -117, 230, 194, 33, -63, -98, 48, -60, 140, -35, 383, -91, 51, -50, 95, -55, 113, 15, 380, -43, -9, 67, -83, -110, -25, -94, -297, 208, 268, 24, 203, -143, 99, 42, 45, -222, -140, -151, -95, -66, -24, 7, 207, -9, 47, -102, -35, -140, 294, 73, -223, 47, -72, -177, 16, -152, -107, -86, -16, -171, -39, 75, -5, -51, 0, -29, -133, 53, -104, 11, 128, 25, -156, -9, 75, -72, 265, 37, 7, 121, 179, 94, -42, -33, -290, -28, -186, -235, 67, -49, 110, 30, 58, 146, 50, 25, 20, 53, -332, 162, 118, 90, 28, -127, -8, -255, -60, -240, 185, -215, -39, -117, -73, 60, -451, -181, 115, -104, -195, -64, -25, 14, 116, 4, 35, -243, -107, 3, -88, 185, -165, -145, 0, 86, -176, 8, 84, 129, 42, 49, -163, -158, -86, 206, -92, 147, 236, -269, -67, 46, -150, -108, -64]
5638f4j01M87l18n3R5j66J77M7J19k94J7J21k5j19J77n9K10k90l8J81k12J53j23
5661g8M54l96K17j73J09k12P4J36m2n1n3J26l91N08j65n5l3k37J30J96L09l47
5683B6J03k45L0p4K45j05J3j34J76K03k56n7j57J50O5P2J61l55R7R9L0k11J76
5706E2QK32j36m8j83N0j3K0j34K53k18P8k10L57k46J71l2r2J45k14n6J48j0J96
5730A18J2j65k53M63K5k33J24p8R8K69j70m83J21J12J78j43K02j65k72J26L24
5751B10k50Q1K1k05J90j17J16k04L03l16J77J23k92L03J92n04L27m9n3p5n9N5
5773b6P3j13Mk1K33k42L28k79n9r3L47p1J22m27M01m2K1j92J48R6k51J32j86L11
5797B14l89K09j3m2O0q2K08o0K0j36j34K88J46m94j10L25J12k13R9k16J21r9J94
$$ y = [-64, -165, 322, 4, -49, 46, -120, 57, 104, 223, -71, -54, 67, 42, -77, 100, 41, 251, -39, -77, 104, -108, 45, -78, 376, -20, 197, 24, 133, -79, -5, 131, 89, 38, -15, 111, -280, 228, 63, 8, -25, -262, -132, 64, 373, 26, 129, -116, -86, -160, 85, -20, -7, -141, 35, 238, -18, -75, -232, -82, -17, 55, 216, -139, -42, 57, 87, -124, 52, 60, 292, 156, 108, -75, -25, -38, -18, -152, 101, -117, -39, -249, 108, -138, 33, 1, -91, 54, -160, -216, -68, -78, 118, 130, -35, -288, 175, 200, -33, 91, 13, 111, 380, 210, -273, -152, -40, 138, -5, 197, 32, -240, -114, 210, -40, 41, 62, -143, 47, -70, 46, -158, 145, -171, 6, 129, -163, 140, 332, -172, 155, 106, 53, -22, -81, -26, 47, -66, -62, -83, 150, -92, 236, -43, -102, -195, 152, 81, 203, -224, 177, 135, 156, -36, 112, 208, -43, 89, -97, 214, -175, 34, 21, -21, 39, -43, 165, 105, 125, -11, -145, 143, 289, -205, -315, 10, 122, -91, 8, -208, -87, -186, 8]
5820Hj9m1K07j68k60K00mK89q7l95J67n9L9K44k42J37j13J10k0Q5n2J3q2J46o0
5845D3k7J63m13J91J23o5k16J60j02j03K73j41J59q4M4j8J25m26L84j05Q8k2J49
5868A80J64o41L73m5kkk21L34Q4j63j35K47k19j08K04k14L78j62n5m4J66j66J06
5891E9J97l66K13j33RJ7o6J45j26j55K05O6j08oR0q7K28j8n7R6k00J62p8n6l8
5916gj55J0L32k68K23k79J15J03r6K54m87K03k27J23p2K24q6N0R0m1J89r5j42
5939c9n4%j0j2J03%J65j73R8j00j59J88p7J40J22k49L1J03J77j66k08K3K90j62
5963C1J5k43k7K32j60J74o9J11j73J98j59P1j7J15M7l33L30m13K47J45k05J25
5985D2Rk24N5m8J66L6j27J18p7J50r6rJ38j49j6L1j13J7J24j87L56k36J4p2J68
$$ y = [8, -11, -52, 155, -13, -273, -73, -77, 212, 125, -270, -103, -162, -123, 121, -121, 16, -97, 13, -7, 78, 26, 39, -43, 103, 43, 16, 179, -234, -43, 80, 15, -201, -41, -143, -246, 27, -114, 45, -39, 5, -13, 112, -314, 70, -35, 53, 31, 180, 344, -297, 76, 31, 29, 27, -194, 140, 224, 61, -74, 173, -46, -154, 50, -164, 214, 52, -3, -47, 119, -47, 59, 256, -110, 103, -30, -21, -4, -70, 75, -51, -206, -1, 65, -43, -49, 41, -46, 182, 164, 107, 203, 3, 165, 87, 31, -7, -162, -152, 180, -88, 135, -144, -29, 74, -22, 232, -255, -52, -279, -156, -228, -4, -90, -40, 50, 9, 198, 103, -39, -93, -93, -103, -115, -12, -12, 153, -20, 78, -22, -181, 7, -70, 70, 192, -57, -26, 77, 254, 88, -120, -97, 193, 31, 46, -197, -224, 8, -152, 22, -47, 64, -109, 89, -70, 1, -16, 99, 146, -187, 143, -270, -23, 122, -83, 42, 51, -173, -118, -166, 0, 36, -91, 27, -50, 100, 4, -5, 133, -16, -32, -1, -114, -97, 27, -160, 196, -40, -26, -98, 70]
6010G0j50J63j47J53j22j30K45p7Q6N2q1K31k52K7o5p2K32j57P9m0j96n0J66L6
6034AK15m19K64j09J60j29J14j62P3k94K86m2l6J60k19J08n6J02j97j0K10Q0n1
6057D9j2Q4K17l81K05l8K14l30O3Q9j82k9J48m0j94j26L30j99L44m94J97K2r1
6080a54K89k02J0K04m29J24J16J50P8q9J0k45KJ16k5j08J87j8J17j58j35J81j26
6103a05L33n71K78L7m0k6j1K30k78o9L46j74J25j80Q6j64J73j15J26k64J32J57
6125B6j48L57k58j49K7J09Jk6J14J40k41K69l02Qj0K06N6m73J30j08L64m02L46
6148C6oJ39k05J07j70R9j97J07K5K06J51l17R9n2K0J83l15lL00k89k7K8q0q6K73
6173B6j10N0mJ8j7J15J24j87Qr2J10j67J27j20R4K15k36P1R7r5J66Q5j12m70O38
$$ y = [70, -80, 83, -64, 89, -33, -163, 82, 5, 91, 143, 62, 293, 41, 68, 3, -69, 163, 6, 85, 45, -151, -201, -35, 1, 216, -203, 61, -48, 112, -17, 97, -65, 8, -286, 0, -42, -78, 82, -137, -29, -85, 17, -180, -190, 20, 100, 49, 37, 121, 338, -43, 162, 124, 338, 8, 71, 160, -22, -51, 97, 57, -137, -263, 67, -132, 212, -282, -85, -63, -154, 135, -67, -57, 147, -282, -158, -42, 108, 186, 97, 107, -138, -136, -20, -45, -153, 34, 16, 133, -25, -160, 21, -105, 228, -343, -65, -28, -68, -94, -105, 125, -153, -222, 124, -50, 75, -105, -19, -183, -10, -125, 1, -263, -131, 26, -122, 235, -23, -172, -145, -36, -35, -61, 53, 193, -48, 221, -81, -73, -83, 123, 179, -294, -164, -272, 92, -310, 36, 30, 169, -36, 71, -99, 0, -197, -90, -65, 141, 292, -25, 74, 22, 42, 225, -90, -93, 207, -82, -109, -81, -161, -247, 26, -84, -34, -38, -20, -37, 78, 202, 15, 23, -69, 41, -126, 1, -119, -25, 190, -46, 25, 122, 27, 193, 278, 166, -304, 334]
6198C34J5k15o5q0k2J20k04N1N6j23k6k11J90K40m9k30L11M5o0k80L29k13K97
6221B10m7o1j81j07L46L3k24M7Q5k08K18J0j23m4J28q1n7K11k28K6j00M03J0k54
6245A2m2N1j34J21k5K04k93K8p3P7n6oJ29J00n1j45K07k39M7j91K19l8Q5K27j2
6270B02j13Qr4k08jK00J70k64N13k97r7j31L11n4j2k90J49j31L5j3K71k01K01
6293A54P4k48K86k91J34Lj17kJ0J70j71M2j50J19M0p6M0Q8j9j80J67j25K97k30
6317A5K64m35J13J6J31j63J30O4m2j03j4j18j26J55K94m52J23K02j08J84l73K93
6339E0k08k35N03j45J37j45J92j96L6J88m21L67j02oJ15j74j11K96j85k8J34k35
6361a73Q5M6J88m91O09k95M4J37k65L8O8l2L6J47j70J53q0j63J72R2j54J92n45
$$ y = [334, 349, 134, 69, -11, -33, 87, -117, -66, -10, -133, -159, -370, -180, 60, 11, -219, 92, 137, 77, -203, 126, -87, 210, 163, 102, -79, -186, 160, 193, -31, 16, 101, -107, 111, 121, -2, -46, 82, 1, -56, 155, -73, -47, -147, 256, 266, 12, -30, 21, -113, 8, -17, 187, -106, -78, -151, -74, -130, -136, -7, 93, 42, -103, 104, -135, -88, -279, -60, -98, -13, 214, 202, 89, 97, 3, -205, -206, -6, 164, -100, 413, 116, 19, -112, 199, 145, 133, -157, -8, -139, -104, -117, 154, -47, 154, 228, -20, 266, -25, 109, 112, -5, -7, 3, 173, 2, 44, -106, 13, 53, -23, 17, 105, 86, -94, 73, -52, 245, 15, 279, -156, -43, -27, 104, -59, 71, 135, 93, -10, -24, -142, -268, -113, 181, -271, -148, 54, -54, 130, -243, 50, -158, -393, 110, -35, 102, -43, 149, -47, -11, 177, -244, 123, 21, 15, 130, -44, -155, 141, -44, -72, 62, -173, -88, -42, 146, -345, 264, -31, 13, 150, -115, -77, -9, -41, -5, 142, -28, 125, 45, -118, 54, 146, -8, 184, -361]
6384c61J57M16l37M9R7p3j94J56L52n85N41j36j38N9j19K9p2J01p8J42P8Q9j98
6407b5n1J44j31M0j27L14o1PRl19J47J25Q4k25J79r1k00J15K61n64M75l12J42
6430f4J99k49K48m3p1Q3K2j40j6k77K03m7K78l25J26j11Q3O2R0j88j15J63o1J91
6454D1J88k35R1j62K91j81r1p2J14j53M58j80o1O3k88O9J45l6l9k74L67n7q4J38
6478E2l29R1M3K05j49K86n8j49J26j39LK95L6n58J81J39M1J21r1m1K04k76k35
6501b02J31J37n0kj38K32R7j32j41J62R1k08j19O4O1q9P8N5k79J68K54n5l70M76
6525B21j14j30L7m1Q4K88l22l09P1L02k18K20K1k04K3J12k74N15l68p9K9J51J39
6548A54m6J22k37J58l42L19q3k7n1p6J1q6r1J58J14j02q2J7M7L60n45L78J48l69
$$ y = [-361, -204, 212, -125, -76, 21, -52, -246, -90, 262, -323, 218, 82, -56, 3, -116, -87, -159, -58, -136, 6, 84, 173, -25, -76, 68, -63, -23, -150, 164, 103, 110, 119, -200, -53, 72, 156, -69, 110, 19, -181, -66, 195, -369, 106, -206, -64, 135, -114, 134, 91, 20, 103, 125, -15, -31, -308, -105, -152, 126, -199, -73, -184, -101, -39, 51, -137, -252, -89, -150, 41, 229, -6, 85, -77, 214, 33, -58, -130, -16, -169, 289, 109, 48, 111, -177, -108, 37, 1, -38, -312, 55, -2, -86, 52, -277, -186, -143, 62, -87, 199, 141, -8, 118, -21, -18, 277, 313, -245, -64, 75, 116, 237, 146, 105, 309, 33, -202, -71, 66, 16, 14, -124, 108, 205, 73, -68, 94, 185, -23, -142, -78, -17, -106, -28, 27, -252, -84, 170, 115, -255, 221, 107, -23, 14, -27, 57, 345, 23, -286, -215, 87, -131, 89, 110, -94, -71, 41, -233, 282, -86, -165, -136, 15, 154, 108, 230, -7, 151, -191, 128, 45, 18, -33, -109, -98, -184, -275, -117, -3, -105, -187, -170, -123, 237, -308, 70, 218, -151]
6572a51K31j11K94j59q2r9k7MJ10J1o6L77l74K11p4j9n8j57K16q0O4p0n4p8J34
6597gk61O4M3P7p8K04l7O6K7k33J84j32K10j78P4jK40j22k23P7j0J48Q4k46J34
6622A04m6k70L12j23j60Q3K52k79K32J24l03m0K59k62O9J97P5j00r1j3q7K39k53
6645h1K14p8o4j13K40r2n3j27K03p6L0J0N5j11R6P7l33J41j59Q2J66L4k3J36j74
6670@k5j10J24l8nK24k23k16L0K24j44NJ76M4MJ28m81M63j80oJ9k67J75L27n8
6695A90k15P6j98K90J18j03j03J67k40PNK72l46J70Q3k13j34J33K43j48k11J68
6717A1mn4r8K57j38L01j47K75l14p6M1J24k33l7L14m16K39j32J40k09jK09l2o1
6741d1M4J22j46L19k95q0p3j45L31l25J62k6K56l32L89j66j37K69J81m25Q7j28
$$ y = [-151, 80, -31, 263, 104, 22, -77, -104, -100, 10, 21, -45, 332, -42, 169, 95, 76, 18, -139, 77, -3, 61, -9, -63, -141, -7, -268, -204, -161, -84, -162, 42, 5, 71, 98, -135, 49, -83, 127, -51, 23, 22, 262, 140, -83, -6, -16, 132, 216, -30, 104, 58, -212, 100, -23, -183, -100, 152, -127, 105, 229, -74, -114, 145, -117, -48, 149, 224, 124, 33, 20, -67, 172, -81, 133, 55, -9, -122, 118, 26, -27, -154, 49, -27, 3, 13, 68, -43, 53, 130, -203, -62, -221, -139, 27, 61, 38, 174, 0, -25, -135, -11, -49, -54, 170, -53, -269, -239, -15, -159, -154, 22, 66, 70, 198, -283, 180, 0, -6, 13, -254, -79, 248, 190, -25, 51, -147, 143, 261, 158, 55, 222, -18, -11, -6, 266, -80, 90, 173, -40, -174, -41, 202, 54, -157, 11, 7, -47, -145, 112, -26, 275, 128, 403, 89, 13, 54, 178, -55, -92, 222, -194, 45, -87, 53, -156, -157, 52, 20, -41, 3, 125, -21, 298, 3, -77, -150, -295, 36, -289, -127, -153, 103, -229, 160, -6, -143, 126, 307, -118, -31, -159]
6763a59J0L86r4k57J34j21K87j77K54j59l05J61k27L07k47K70j4k57K45P3L2q6
6785E6j8l1K5k18L92j05j20l0m2K10j18J37j26j3K39j33j51M6n91N75J76j95K95
6808B60k38lK39l32J46ol70J12K63K4q7L79k26q4J35k33k7k26J48R7p2J49o9N6
6832C5J63J29m07P9K6m8J18k98P3j54L77J09l45l35M62K9J27k75L60l73J33J46
6854A31l3K2k12O1j50L24k00l1M0n5J39n3P1j06qj39O6J00J52j31O6k07K65l8
6878G4K45k35j70K26j07j45r5n0M0K80r9J9j72J21N1r8M6N3P6r3M7J45k24K12
6902A47l10K37j8J09n0q7J38l32K70m42N80l60l2L38j19r3J05k0l3n1rR1k99L39
6926I9l52J29L23j01l23L05l67K25k1K4j27J73o5OQ1P2L33n92%L8Q1K26k80M37
$$ y = [-159, -149, 237, 143, -114, 20, -101, 186, 9, 263, 104, -201, -40, -267, 40, -207, 63, 49, -208, 37, 110, 142, 56, 38, 7, 32, -186, 206, 101, -19, -49, -91, 119, 1, 138, 12, -1, 238, 105, -46, 0, -591, -16, 160, -35, 260, 22, 19, 258, -74, 72, 66, -304, -192, 71, 95, 8, 387, 161, 77, 212, -21, -48, -274, -126, -29, -101, 48, -21, 35, 198, 327, -80, -1, 25, -23, 95, -203, -130, -284, 93, 202, -143, -478, -16, 13, 140, -135, 225, -148, -15, 131, 98, 120, -92, -31, -181, 143, -57, -88, -48, -103, 36, -17, 54, -52, -60, -199, -133, -33, 119, -12, 54, -153, 112, 74, 319, 84, -86, 140, 33, -112, -207, -257, -217, 63, -36, -17, -189, -68, -17, -115, -69, -16, 60, -33, 14, 159, -65, 147, -163, 74, 56, 165, 115, 28, 166, -166, 104, -338, 242, -118, -150, 188, 69, -24, 81, 61, 28, -23, -32, 59, -240, 99, -253, -124, 199, 98, -225, 80, -287, -62, -83, -59, -186, -13, -78, -72, 9, 81, 414, -178, -178, -140, -59, 167, -113, 324]
6950C24l00j1p08O96k49J45M24k33l7j60j86K97m8JJ40L6k92k6J94j47R4j62L06
6973I8j71L4L1j13K46j81J76j20p6K31j25l09J67J63M5j74l4O0jj87M35k64m6
6996a15J7l84N72J18j63k20K90k84J45k8R8R4j76j9K34k26N4m3m7p6J35j43J62
7019eL55p6k99J87l31M3J89j13l3K6NP6J26J99l51J91J6k43M6j94L64k02p9L40
7043B37j76p8k89J89L74k83M8J23j9j77R3J06k55J03k39M27k32j13M31l39K04
7064A35l37J75L22j33n3q4K35n44N01k19K83j63L9j55R0j14M3q4J62j16j6q1J78
7087F4j54J86j30k70K76J22j07j27j30K89j57J60j36j28K58j9r9Nk2L09j64K08
7109B34j62k73L07OM1j96j41J51Q4O1j02K4l5k15J32L1%j15J32J07k70L61l02
$$ y = [324, 24, 13, -695, 1, -248, -103, 321, 88, 51, -109, -295, 2, -46, -45, 95, 131, -161, -187, 7, -140, -46, -208, 98, -73, -39, -8, -121, 125, -56, 120, 0, -76, 155, 30, -279, -112, 51, 96, -78, -112, -52, -53, -240, 195, -69, -115, -98, -482, 90, 208, 45, -175, 115, -169, -24, -52, 46, 140, -36, -55, 179, -47, 7, -36, -83, -159, -24, -167, -5, 350, 274, -25, 162, -169, -126, 63, -50, -83, -57, -52, 24, 150, 349, -2, 189, 205, -38, 8, -186, 178, -24, -103, 237, 61, -17, -306, -117, 257, -26, 22, 145, 126, -51, 42, 148, -107, -4, -243, 184, -48, -161, 270, -69, 135, -202, -27, 295, 162, 109, 25, 260, -284, 217, -2, 281, 118, 157, 2, 92, -22, 21, -63, 99, -17, -33, -114, 64, -90, 96, -34, -304, -28, 94, -13, -140, -270, 19, -138, 22, -114, -242, 16, -3, -102, -97, -119, 190, 26, 234, 72, -201, 106, 112, 153, -43, -184, -33, 51, 112, 10, 34, -1, -216, -84, -53, -53, -168, -36, 71, -199, 162, -140]
7132a40K01J0o0K9Q5o7N2j72P4m9k23K13j11O11l97r5J00%n8m0j37M66j38l31
7156a77L08j76N0L25j72j6Kl68M02j14j14M5L9M8L3k25K01q2j9j65J73n5q0L45
7180B08m94M0J65j03J69K18m24K55j58M33m16J02j07j6J74L2j09JJ90j72J85j01
7202G2k97K86j49K2J98p9k20K09l16L22M4o8kQ3j14n4L7PJ58l10L71j57j1L6j17
7227d9K04k22o6K71k04J22j13R7j04J81j05J9l60L28j19R0N5M2NL6n8J90k60J57
7251A37k14m7N5J50j09j47L18k41j13J65N0o4L5R6J14k64l5K51j92m7r4J69L2
7274Ek0k13K24J04j12P9L1j8q6q5J82J41j57K46m15J34j0r7J28m9j52K02r8P2
7298C6o2J91O6l21K54k51k36K20l9oK78N3k52K39M2k91j75N14l11J57l36L22k34
$$ y = [-140, 61, 71, 11, 40, 125, 58, 110, -62, 12, -37, -260, -47, -158, 453, 56, -39, 61, 61, 3, -37, -174, 292, 154, -177, 131, -45, 5, 330, 158, 142, 144, -224, 178, 64, -50, -5, 34, 82, 115, -110, 91, 9, -10, -175, -2, -57, -137, 208, -286, -246, -81, -184, -15, 203, -221, 34, -124, 309, -107, -5, -112, -128, 46, 78, -31, -30, 160, -12, 173, 72, -225, 61, -88, -66, 132, 53, -167, 42, -274, 48, 92, 24, 22, 105, -9, -63, -26, -19, 139, -171, 200, 43, 32, 68, -49, 155, -67, -133, 138, -66, 56, -57, 40, -64, 117, 12, 31, -329, -1, -120, -30, 25, 67, 72, 108, 50, 240, -20, 137, -77, -124, -69, 81, -28, -175, 143, -98, -211, -46, 4, -60, -25, 71, 185, -79, -114, 137, -55, -102, -196, -27, 5, -15, -228, -4, 100, -12, 67, 98, 80, -6, -91, 91, 232, 75, 321, -94, 40, 30, -67, 61, 12, -140, 62, -36, 36, -26, 165, 231, -90, 164, -87, -323, -103, -142, -148, 130, 183, -69, 170, 212, -79, -254, 260, -51, 106, -230, 92, -142]
7321a42J0K29J44j39l6J06m49J93NJ04j07L28R9m98N2K72l97K24J09j41j82J15
7343a01J71j82r9L12O7l33L69j56K09j30j8j83J51j41m3O5J41j10np4J35o1P6
7366F0l9k92J50LK05J13M4l20r7K06j76K78k82L73k25J48k15J87m9k45L38l56
7388a91J93j53J16K67j02k71Q4K43n5k12LN6O3K17m3l52J29o1j01j2L06j52k14
7411b42J42J35J4k21J48j76K62j99J85k26J18j2l8J5J42j44K28M0J3l14O5K1j50
7434a94k0N0K80P4n0r4M5p2k17J58j53M2L05k43R2j83J47n6P4K06n3j79K93m26
7458a74J07JK02l9j83JJ22R8j42M12m88Q6j32K09k36P9k7k16J88K43k13o9N3J4
7482a04K56l62K07j21N9J0K71j08J1j35J17J20k8j20O9j99j60J15J25j17J8j25
$$ y = [-142, -132, 97, 241, 102, 66, 172, -277, -84, -79, 25, -82, 246, 345, -153, -101, 171, -226, -2, 107, -34, -216, -101, 70, -112, -211, 101, 168, -165, 204, 48, 257, 127, 109, -74, 77, -64, -107, -42, 99, -11, -16, -90, 45, -16, 60, 21, -271, -121, -118, 87, 200, 244, -76, -173, 33, -143, 135, -147, 226, 1, 149, -66, 121, 72, -173, 165, -191, 2, -151, -35, 232, 130, -141, -57, 186, 131, -81, -78, -22, 41, 258, 215, -137, -8, -69, -170, -182, 124, -28, -242, -100, 35, 49, -172, -24, -200, 62, -137, 48, -178, -60, -72, -110, -95, 47, -97, 131, 171, 184, -130, -65, -44, -194, -214, -164, 116, 190, 140, 46, 91, 19, -198, -40, -193, -151, 154, -89, 3, -180, -33, -89, -15, 191, 138, -41, 252, -174, -67, -66, 136, 97, -86, -85, 37, 135, -7, 405, -83, 3, -129, 80, -156, -77, -104, -320, -132, 111, -102, -171, -118, -104, 152, -210, -3, -124, -65, -55, 216, 108, 119, -16, 101, 221, 193, 73, 142, -57, -217, -102, 23, -94, -76, -201]
7504b01N1K07j99M2R2Qj60o3L70J06l18K1r2n2L54Q8j86j0j04p0J24JK03l31J06
7529a3Kj1k21K96k09K92J04j09l01K63j9k26j9N1j24J21L8m1J53k55J81P3K32
7552B58n33L68l65K71k16J92J21k72J91M2k99N19l29N2j22L12j1l00J34k0oP8
7574F5k30K58R0J5j22k18K14l72J98J95j96M7J07j44k6J30l7j09K49nl65K61j1
7597fl6J95k12M4mJ92k53L21k30o1J63o2J72l90J66k79O78l44j1L7j13J4j84L97
7621A94q9j5j53J74M6k09L88n78M97m76K39Q9q9o5J62l12J65k50M78j97q7J64
7643G6o4J3j65K75n6L8j95L10m30K49Kk36J26j5o4j41K87q0L7KJ40j86K83l77
7667a71M52N9k27p2j95K72j34J11Kj96K97k36l4J65l93N85j76o8K73k72j83J16
$$ y = [-201, -150, 57, -142, -100, -8, 0, -160, -223, 147, 253, -65, -44, -136, -188, 166, 254, 68, 58, -46, -116, 8, 9, 212, -119, -13, -11, -22, -243, 53, -156, 136, 240, 131, -170, 93, 74, -152, -171, -120, -244, -123, -85, -126, 27, -228, -47, 26, 258, -275, 93, -272, -1, -217, -25, 96, -176, 15, 57, -242, 277, -52, 0, -122, 190, 179, -121, 13, -7, -13, 65, -165, 93, 183, 198, 76, -142, 72, -300, -102, 93, -103, -56, 51, -93, -119, 11, -26, -135, 114, 109, -256, 5, -6, -42, 153, -59, -15, -19, 173, -80, 241, 11, -50, 113, 51, 223, -167, -1, -280, 398, 54, 43, 80, -33, -19, -203, 194, 105, 90, -63, 111, 157, -52, 336, -242, 255, -221, 18, 107, 18, -47, 115, -197, -32, -282, 196, -1, -88, 76, 12, 25, -140, 135, 79, 117, -78, 232, -198, 51, 53, -183, -57, -72, -136, -277, 10, -70, -33, -31, 109, -77, 206, -171, 281, 340, 113, 41, -154, 118, -16, 95, 97, -99, 198, -38, -72, 93, -300, 285, 109, 41, 314, 42, -141, -25]
7689b5k52J29K33p5R9qJ10k46O7J53l02J73j29p4K30p3J77j58n7j40j05Q1k2K49
7713C5j86K43j37J5K41n02M04k62K6K72lj19k72PJ77J63j10J1j07K63jk23p9R9
7737d5j28R3j13L7K64j31K03k23J60k16m7M14m69K26k60J51j3J73j4o9QP0R0k99
7761a38j48N30j21m46K64j82M32L0k31K79l36O5K27r5j23K10m35Q1O4K43k57K76
7783A89k56l0L9J98j24K9J14o6o7R8Nk02J98J9j20o3q7N3m1q5j35KJ25nL1M6O4
7810g1j47L3M9L54j99k4O3j95K4J7J1P3j32p1q7M11k3p2k9J74l96K75l2pl9r1
7836a31N5J71j67L9K9K69m46M07k16k66R3j31K99L7j06M1L9M5n6K32p0m4j83l2
7860i2o7L02J6k10J62Q5j31J0Jm7L7j3p3M1nO1L5j19k87L15J8K5j23l6L9m7J30
$$ y = [-25, -277, -148, 85, 10, 109, 101, 211, -35, 32, 185, -117, 56, -73, -147, 83, 10, 187, 29, -28, -168, -273, -192, -214, 35, -151, 92, -45, -30, 211, -291, 113, -149, -123, 149, 146, 27, -245, -238, -61, 102, -8, 3, -104, 159, 158, -65, -144, -45, -173, -80, -193, -156, 108, -23, 180, -43, 117, -99, -146, 268, -201, 25, -235, -84, -97, 76, 62, -7, 1, 71, 161, -138, -286, 244, 123, -323, -59, -241, 191, 221, -10, 269, -67, -2, 225, 130, 7, 217, -218, -137, -73, 170, -87, 189, -67, -97, -58, 140, 16, 45, 159, 93, 26, 124, 129, -73, 125, 144, 24, -39, -126, -73, -114, -199, -334, -332, -207, -212, -181, -135, -71, -218, -185, -136, 218, 19, -5, 58, -137, -113, -96, -85, -12, -144, -215, -302, 109, 86, 14, -15, 159, -237, 38, 6, -1, -40, -131, -76, 95, -72, -33, -4, 265, -181, 226, 10, -256, -163, -294, 5, 42, -64, -23, 16, 61, 5, 237, 167, 123, -60, -92, -159, 143, 159, -51, 111, 196, 65, 75, 76, 29, 66, 53, -20, 21, 16, 77, 112, -7, -294, 21, 39, 64, -59, -95, -56, -103, 27]
7887B7k84K47k17j64L73k4j0J54k26K99j61q0L23l22J82k79P5J65J35p7k87R0
7909f1J90J63r6k85q4J05K11j99j45J64j1k8J21L1k26J15j34M92k65M9m8p4p7
7932i2k43K71j11K53j01j73K49JJ01k19o6O4l1j66L29n5j64J61K09k35J66k95
7954a47m0J33J72l76J57M2P6o9J27j79J28K14l10L8On3K03K0j49q4r8L21j00o8
7978c6k9j71K49k66L7L41r9O1J2j69j3R4J22j43J71j97K11j2K25l70K16k36K5
8001B3k62J68k49J05J52J22J02m5j31N9l07J49J08N7j66O9K17m24L22J12jm81
8023c01J17m5K82k1O4j46k2Q8J8pK77m02J1K33l4j01J22j48K17l54K04n5j28N8
8047g3J30M1Q2j06k38L3J6M6J14n1j18J94j20j1k17N02k98J70k5j16m9L04j74
$$ y = [27, -257, -10, -227, -391, -18, -42, -52, 102, -124, 175, 14, -66, 257, -65, 117, -162, -87, 78, 213, 136, -151, -61, 129, 292, 196, -89, -173, -68, 143, -56, -201, -37, -48, -76, 45, 76, -150, -35, -169, 323, 58, 107, 59, -15, -92, -335, -64, -175, 78, -23, -196, 53, 54, 155, -64, -130, -66, -97, -263, 66, 11, -153, 8, 217, -18, 148, -147, -187, -54, 118, -258, -101, -59, 17, -52, 75, -104, 24, 238, -72, -34, -28, -81, 122, 142, -7, -91, -189, 132, 32, -36, -65, -236, 13, -253, -216, 125, 26, 87, 99, -70, -83, 11, 133, -10, 161, -36, 175, 163, 388, 18, 234, -2, 23, -239, -71, -320, -215, -63, 59, 161, 116, -15, 44, -263, -114, -6, 51, -115, -46, 171, -253, 69, 181, 180, -301, -184, -229, 53, 32, 96, -50, -72, 16, 34, 27, 304, -98, -87, 146, 112, 11, 133, -15, 202, -152, 52, -3, -131, -73, 57, 98, 180, 74, -164, -131, -115, -69, 45, -6, -124, 70, -50, -61, -278, 224, -74, 96, 71, -45, -94, 210, 36]
8070C6K9P8l26L64J35j73j14K16j40P6m59K75j5k7K62k51Q3q4J46O4k21K77k46
8093a5J68k44L7r9L11k73p7m6K27J36j26K4P1p7j04M5p1Q4J07l7k71J83j01l5
8117a83J58J12Oj68j49K32O3J25m83L55P1k03J64j38m8r4qK51j11p5J13k64L34
8140F0j21j24m4J65J52J45j3l50L79m09L27j73J64q7l81L86K76j19j73l3o8K23
8162A82r3j9l57K46K15k82o0J71q6K43k24K4m0N1NJ1l4j96L50r4j42P9K42k60
8186f8K30l15P4Q8m34
$$ y = [36, 65, 143, -183, 181, 316, 143, 29, 245, 105, 181, -278, -3, -18, -45, 217, -34, 49, -35, 111, 175, -46, 231, -15, 153, -91, -54, -153, 158, -115, -192, -238, -11, 125, -1, 23, 94, 17, -87, -42, -113, -29, 78, 41, -230, -47, -148, -183, -25, 87, 93, -75, -224, 8, 71, 196, -287, 68, 139, -64, 100, -38, -86, -180, -188, 63, -48, -123, -10, -274, 60, -61, -185, -229, -64, 88, 233, 220, -130, 249, -160, 167, -6, 158, 71, -310, 76, 352, 233, 60, 27, -41, 182, 89, 70, -287, -41, 174, -108, -168, 3, -83, 160, -64, -40, -80, -29, -24, -13, -47, -243, 107, 13, -129, -50, 192, -68, 162, -153, -79, 9, -425]
8191d25
$$ Imaginary data points
##PAGE= N=2
##DATA TABLE= (X++(I..I)), XYDATA
0@%%%%%%%%%%%%%qJ6j6J6j6K4l2M0m8N6o4P2q8J04j20J36j55J79k07K35k65L01
35A60l39L81m29M78n34N98o62P34q15R01r97J101j214J339j475J625j792J975
53A035k178K405k659K948l277L656m101M629n268O063p080Q438j0351J3262j8297
68a0775K9430j01585O8859J69239j19589j06323k765R4701K3370l4653j6227M098
80b220k4297L8021L8993k7909o0290p612O1623M4549o5262m8092L7904L7036o456
93A5988k3647j6575J6417R940P886R052k7277j8583L6716J8958k1615k0481N063
106h158K1888n227j7382J4728k161k4172J3713K3016r040k4124p137L2876J5205
119B4025l3170q389K4356L367j0359j510J1498J40k5445P960L5098j6946l5061
$$ y = [0, 0, 0, 0, 0, 0, 0, 0, 0, 0, 0, 0, 0, 0, -8, 8, -8, 8, -8, 16, -16, 24, -24, 32, -32, 40, -48, 56, -64, 72, -83, 96, -111, 124, -141, 160, -179, 202, -227, 251, -283, 315, -347, 387, -428, 473, -524, 577, -637, 702, -773, 852, -940, 1035, -1143, 1262, -1397, 1551, -1726, 1930, -2171, 2458, -2810, 3253, -3827, 4611, -5740, 7522, -10775, 18655, -82930, -14071, 155168, 35579, -70744, -73509, 21192, 44562, 9909, -6318, -2220, -26517, 11504, 50497, 22588, -37702, -45314, 16309, 60858, -4404, -52496, -14592, 22444, 15988, -7659, -24234, -7817, 2123, 10009, 19061, -8216, -26799, 9917, 28875, 7260, -13221, -8158, 13730, 8503, -8879, 5849, 3688, -20484, -6771, 16245, 7205, -16919, -24056, 8820, 24025, -9145, -17534, 6822, 10189, -170, -1680, 9818, 9958, -15487, -7527, 27571, 10625, -24436]
132b4436R115K8691N213k9345j3404K7498P303j5838K257L243m646K684O643P102
146A2080j0872j5958J7756J5991j5664j2456L308J0530L575j3233j731P559o048
159e163K595Q178q012n818N183Q531J752j2776L89J5338o030q937P708K906m050
174A794o002J193J0778n764j2405Q127N752n049j932J95M186j643m958J0357L209
189G838j4201Q05J2003L701q434j0857Q060J1925q609p241L288n78K542J910l334
204a182k405l270N438J0397q323r644O438P397K530o988o893Q629M012m712M99
219A923k710l404N259K680k204n787m081J0264M697j0536k221N235K898J044m263
234a206m10M441k800J755K953n438j434L586R04K14n550j659P709k129n124K482
$$ y = [-24436, -15321, 13370, 18583, -10762, -24166, 3332, 10635, -5203, -2946, 297, -4349, -1665, 4978, 12080, 1208, -14750, 3006, 18997, 3333, -9123, -5815, 4715, 8290, -4943, -6674, 885, -5163, -2568, 5610, -2402, -8220, -3037, 5494, 7246, -5530, -5141, 10197, 4167, -4770, 2938, 5844, 1794, -4208, -3015, 7763, 1999, -10406, -2279, 3473, -1576, -3508, -3313, 873, -770, -5728, 4629, 7838, -6363, -5558, 6445, 10146, 1712, -9145, -1085, 10840, 2231, -5010, -1722, -2300, 242, 2152, -1182, -3587, -6857, -1419, 8978, 655, -8989, -2551, 4846, 7376, 388, -6505, 2124, 6136, 1424, 1923, -787, -4191, 1068, 3748, 1544, -4243, -8324, 1940, 6637, -3899, -6120, -885, 2013, 3057, -1206, -1616, 2825, 25, 1780, 4733, -705, -2139, 1447, 2351, 2565, -2985, -4644, 3065, 936, -4188, -1706]
250a706R73M82j63j840M208j156l778N551J070m193Q19J004Q03J8m210K649J598
267B129m817J645J708k276L56j242J598L044m120n57M950j431q76P14q02K345
283B368j480j319L419k647k451L767o33k648N42j011K864o88m050L590J198k079
299a258J920r81K3K350j845J179Q41l369K098J465k462j12j063N68K359l573j330
316c190L641j583J29J101j752J851J85o38K445j716j325L359p47j546O02j313
332d97J674o0k999J423O27j830J601j136k07J657j726J166J067j849J596J849
348B356k287N83j95o3J867k072o38J863k271K46J086k224J224K60j351J936j214
365h94j155K731o78j52Q54j418J792P71k265J519Oj825K164q45j239M48j274J002
$$ y = [-1706, -733, -251, -414, -2254, 1954, 798, -2980, 2571, 3641, -552, 267, 1271, 2074, 2092, -2118, 531, 2129, -2688, -1043, 665, -1611, -1255, -2497, -899, 2145, -1975, -2532, 2418, 987, 111, 825, 23, 2368, 888, -431, 2988, 341, -2110, 1657, 1024, -1624, -1082, -2093, 771, 83, -3967, -377, 821, -1258, 662, -319, -296, 2054, 209, 1388, 2229, -1140, 958, 2423, -39, -151, -1214, -646, 1713, -1860, -3190, 451, -1132, -1003, 98, -1654, 197, 382, -256, 2189, 473, -852, 2507, 1760, 214, 816, -497, 1177, 1117, -1882, -459, 168, -1662, -61, -1197, -1404, 253, -1473, -307, 760, -1089, 507, 2356, 69, 652, 457, 394, 2261, 189, -449, 1414, -857, -611, 475, -1749, -525, -265, -1616, 320, -894, -2049, 682, 4, -148, 706, -712, 1080, 1851, -414, 1105, 1111, -714, 1450, 605, -634, -186, -1460, -458]
383d58J036k613Q56J137j076J744q57j114J871P5m4J001j787L66J789j460O13
400A079q92k239K729K51j875N79j540N20K418j608m55O9l07L130k85k581J217
417B10L81L11J614k361r36J336n25J447n66l978J872J507j26j27k662j36M127
434A388n44j195j94q21K525J362k325M87r57k58K881j155k021l86k45K353Q02
451A697l854k96J389J289J543k766j657L194O68j89N00k491Q32J874o93R44j712
468B72k641K663Q86q35r34k976K070L680k363j891M92Q41K569q57j754J412n00
485A34J60K360j693j417k68O4L101p96m641K97K854J262o16l738L41M007n88q06
503A7N4j540K030J065n22N44k350j039L793L50k213j703j650M156J878m506j549
$$ y = [-458, 578, -2035, -1179, -42, -1118, 626, -231, -1345, 526, 601, 557, 1558, -229, 137, 1926, 466, 1079, 187, -2052, 677, 928, -947, -368, -1908, -1388, 1030, -578, -1033, -964, -1271, 1859, 1574, -1007, 210, 591, 902, 2516, 155, -781, 555, 30, 1477, 911, -3067, -1195, 312, 186, 59, -2603, -2739, 1388, 844, -351, -545, -1366, 1159, 2521, 196, 683, -274, -532, 2349, 1194, -827, -1213, -1458, 895, 1697, -2157, -2453, -1064, 225, 1768, -998, -2655, 539, 1207, 1018, 1518, -973, -141, 1733, 1040, 1984, 272, -2369, 294, 1180, 345, -589, -3565, -1495, 2185, -178, -2069, -1577, -736, 1833, 976, -778, 634, 134, 294, 2654, 961, -456, -724, -660, 2441, 1645, -2996, -2699, 155, 1417, 801, -2937, -2596, 1411, 823, 17, 71, -1469, 561, 1626, 1104, 1648, -702, -1741, 2052, 2402, 189, -1514, -3164, 992, 2870, -1636, -3185]
520c185J751J481K304k902j724K152P07J86J454k535j92O85P90K078k433m075
536c458K741K330Nk435l251K715M115k792k016J201q1J931N7p33P85k005p7L846
554B878p01k299j707O58M206r09n273R46K367P68k58l019k34L009m13O53M22k465
572a371P71J726M06J067l373j734M208J165k187k310j313L708J882l869j214Q57
588a581J158K068j992j328J550L8O69J602j979p88N40R33K422k700l605K864J860
605A731r67j501j881J918J768j806k84O89o29J457O0k78Q47j612K71K504j281
622A006j070j41N0J654m11k785J130M7k1O61j047k44J513r51O53Q92j612J057
640C81M05n3J253j537j290J665o8m73J51j804N32J396j401J78l02m02J698l98
$$ y = [-3185, -1434, 47, 2351, -551, -2275, -123, 584, 770, 2224, -311, -503, 182, 972, 3050, 617, -3458, -717, 1613, 1618, -817, -4068, -1353, 2762, -30, -2046, -845, -926, 1005, 1062, 329, 1114, -891, -968, 2878, 2177, -122, -1829, -1171, 3035, 2126, -3147, -2201, 166, 934, 676, -2343, -2577, 432, 19, 672, 1094, -1371, -600, 1126, 1532, 2599, -774, -2508, 1700, 2865, 678, -1632, -2945, 763, 2645, -1224, -2438, -1581, -423, 1645, -347, -1675, -125, -87, 582, 2184, 205, -583, -43, 890, 3312, 612, -2993, -129, 1731, 764, -737, -2618, -700, 1068, -738, -1022, -333, -962, 495, 555, 277, 1124, -488, -217, 2287, 1006, -64, -205, -155, 1499, 1088, -1697, -567, -520, -541, 120, -927, -1171, 342, -609, 44, 936, -676, 381, 786, 733, 1986, 449, -841, 824, 756, 283, 434, -1370, -838, 558, -843, -665, -967, -1369, 329, -69]
658f9k10Q04j032N05K028j484p08O96m21J513r23j771J169K15n00M45j139O3Q88
677F9q48O47K08j052J159K00j93L21m08j50J384j001j45L04j148P13M16q56j19
696d99K40o61J055p40k8Q78j056Q88N04p50L98K47l63J083o28p71Q84n45P6L18
716E30j375L38Q57j106P88k74r68J136O8k80M89j022J004R18p90J23N49j063Q68
735G90o7j088O17l23l03O06j097J48N49m03M06R6j100J499r7k66P42q55j3J239
755A080r40k25N98p09O87j22j214J060k66k59J93o06K4Q46n12K53M51o44N79K35
775E09o18P86l43m13O60l83j85N10r36L21J44r92R56L0p86O83l87j05J095r50
795d04L45O85n30J19M74o96M54j40m35O83o65k90N08q34r8J125r15M23L21p60
$$ y = [-69, -279, 525, -507, -2, 2026, 542, -166, 530, 109, 1622, 699, -1072, 97, 312, -188, 257, -882, -819, 69, -779, -132, 76, -976, 183, 383, 190, 511, 103, -47, 1337, 336, 191, 495, -653, 60, 476, -380, -499, -259, -920, 135, -605, -633, 245, -811, 77, 581, -169, 229, 476, 113, 1196, 568, -203, 681, 136, 212, 530, -845, -507, 350, -756, 32, -242, -1210, -74, -6, -286, 203, -819, 185, 1103, 313, 436, 985, -78, 790, 723, -365, 252, -71, -374, 232, -865, -717, -168, -571, -165, -69, -1169, 330, 233, -33, 709, -146, -159, 1080, 140, -85, 513, -196, 491, 369, -845, 215, -51, -310, -117, -723, -699, 147, -365, -112, 339, -305, 274, 509, -109, 677, 334, -79, 581, 198, 13, 523, -413, -92, 52, -940, 16, 46, -740, -57, -444, -549, 546, -404, -59, 626, 96, 215, 689, -7, 447, 307, -128, 555, -110, -400, 108, -726, -824, 301, -614, -191, 130, -630]
815f30R87o26P5J048o76J1K93l59Q1L51m92J74r0o67P83n30p9K21n98N02L82n46
837c85K80L81m65O99k44m18Q68l74q2K82m74j40P81j118M95l3n72O50l28l55N76
858B4m42l7M94m20O9R32o57O07k22m73O57k47k04N17p97j03P03o48j40J0m39P14
880a02K42p71O29k12K0Q73o99p4O56o08M99l6m82K81j01j30M33o58p1K82j49P1
902a07J34p62P18K04m88N92l07k33R69n05k38N31p33K16P17r49L44k18k56M01
922C0m19k88O46l25R3N81p45M45K16l51R78l94r31R89K7p56O88q26P8O71m53j59
944b05r6o74J177m0r64O75P8j53M33l28O7O88o55N63M34j136L58j59L5M86j190
965f06l03J238m13m51K05k06O73j90m64R62l55o60J230l87J00j72q45J110L85
$$ y = [-630, 357, -269, -194, 854, 178, 189, 482, 123, 204, 555, 63, 237, 147, -520, 263, -267, -346, -125, -723, -221, 161, -385, -105, 276, -189, 510, 266, -152, 716, 342, 260, 542, 68, -72, 709, -409, 86, 53, -519, 131, -197, -552, 24, -418, -455, 39, -381, -312, 620, -37, 570, 348, -125, 532, 285, 81, 598, -199, -302, 401, -247, -387, -377, -816, -102, 140, -631, -2, -214, -194, 679, -20, -94, 562, -46, 453, 417, -65, 216, 115, -15, 418, -240, -311, -29, -178, -107, 27, -735, -17, 187, -301, 291, -16, -249, 720, 215, -23, 508, -225, -9, 708, -241, 103, -115, -371, 30, -389, -677, -31, -356, -263, 318, -427, 18, 234, -117, 861, 467, -464, 525, 552, -204, 484, -342, -264, 407, -46, -205, -301, -975, 202, 162, -802, -127, -49, -202, 231, -97, -30, 658, 3, 566, 1000, -136, 222, 63, 98, 584, -606, -909, 329, -84, -535, -330, -536, 137, -53, -517, 445, 90, -570, 660, 273, 373, 201, -644, 466, 851]
984H51r47r7K43m10Q96q94m15P42l07J52J70l47L06M11n22Q24k80m79J51J87J90
1005D25K57j152n5J093m00l90m75J35J154p61l65O34P8o05M64k6P49o20m87Q85
1025E38K87q90n0J20R9L38j309N22Q48o06k98L33p3Q7r1q3N64l33k17R63r2j59
1047D98j90m69M50M24j049K07Om10O89N5p67L33k38L68J75n59M31L5n35P42M08
1068F04p94K82p6M57J63j047R8J127j088Q4N1j11J23j08J3O37n34k90O32P6j46
1089A53J03o88P94J85j022P85j7l13k9j66L49J32p97L39O19j172N87M04m53M71
1109B64m25q8P42l44k8O08o21N0K08l85J81j35n91Q52n07l91N57K64o00K8R7M4
1131b20K68m99P44K71m98L01k6p4R5p00K57N47p63L5N67m92P7l7M7M17o91o3P95
$$ y = [851, -96, -193, 50, -360, 536, -358, -773, -31, -338, -186, -16, -363, -57, 354, -168, 656, 376, -103, 48, 235, 425, 682, -470, -525, 568, 168, -222, -697, -562, 592, -169, -534, 100, 178, -427, 37, 11, 760, 140, -347, 538, 825, -65, -115, 5, 104, 442, -867, -345, 503, -103, -401, -68, -141, -54, -145, -228, 336, 3, -214, 749, 657, 498, 308, -161, 289, 713, -336, -129, -123, -533, 156, 211, -556, -223, -461, -93, 82, -477, -46, -11, -546, 196, 604, -190, 92, 16, 473, 636, -411, -313, 814, -274, -190, -139, -250, -127, -235, -222, 415, -119, -409, 223, 299, 153, 256, -432, 362, 547, -475, 310, 293, -20, -49, -215, 134, 266, -531, -192, 427, -745, -158, 246, -207, 264, -161, -249, 493, 149, 121, 729, 108, 158, 366, -19, 162, 27, -564, 288, -219, -610, -53, 211, -389, -361, -264, -220, 48, -451, 293, 564, 66, 367, 341, 267, 362, -338, -81, 466, -297, -262, 305, -187, -110, -147, -100, 317, -374, -437, 358]
1154C58l84m27L68j6P52n11k55L30J12p91Q57l46l40K91m01K89J84m15K80K66
1174B01m59K65q6K1L83j87J25L30q39J45L81m54M48l77RP0j83m29P45m65J1L15
1196c0k85M01r1m6L38K6o90M47J74j75R6j94J90P4n27L30N6p37N51l2n0L01l96
1219b69L53K40m71l4P14l73j29L24l66O68p47q4M16r2k41j15K55P4l19k52N43
1240I5Nn26N50k8j07K06j61L37k45L2o6K17n72j0L47k20L1k50L75j77k65K11O2
1263a59p2K57Jj96L08j54k60M63P8j38J21K1j89q9k87M88k38k11P1j06m01N61
1285a31K0R8K55n84K11M05k17K52J97n68J74m2j27K51l48J02J62l45K12k55J79
1306i9L16l20j63M84j53k2K36k19q4J56k36K73J37l84J23ol16K32j63j01K09j06
$$ y = [358, -26, -453, -85, -101, 651, 140, -115, 215, 327, -464, 393, 47, -293, -2, -403, -114, 70, -345, -65, 201, -258, 7, -79, -58, 325, 138, 263, 593, -246, -101, 280, -174, 274, -103, -94, -24, -207, -636, 109, -356, -345, -30, -315, 86, -5, -51, 287, 313, -377, 70, 244, 69, 165, -29, 161, 235, -292, 38, 94, -643, -92, -124, -174, 127, -269, 84, 324, -147, -181, 533, 160, 31, 355, -11, 657, -90, -174, 242, 150, -91, -206, 49, 123, -196, -448, 95, 100, -426, 124, 96, -11, 195, 34, 371, 126, 158, 92, 309, -263, -273, 74, -146, -115, -365, 10, -167, -432, -221, -159, -231, 26, 27, -169, 139, -15, -275, 188, 266, 128, 249, 270, 81, -8, -295, 193, -45, -256, -185, -291, -692, -131, -111, -13, 242, -342, -131, 274, 57, 309, 506, -62, 112, 70, -57, 194, -154, -52, 110, -235, -23, -278, -99, 217, -103, -266, 218, 65, 43, 279, 60, -24, 132, -104, 169, 306, -78, 45, 39, -277, -45, -208, -309, -100, -206]
1328b06J86K00o35O55q0j53J5K11k57J83n8j20M82m34jL66l80P4n6p3J51j24o2
1351a16J50l60K87J47k74M68j30k55M39k66j77N49j86j64l0j36j37M02l15O5m0
1372g9j39J77J65J5O6l31Q3L61l85k5J28k88P23k92o8Q1r7j27J45j60l22K84j56
1395b41M23l10q0L88j32p6NJ40j46n0p1K27J80l00L17j15j57J5j0q1qP7j86L61
1419A70m16K39K1L0j1j4k5P3m3J47J57j43j37J45j69J50j07K7l38J11o7K44j03
1442e9j10K89m7J2J78k11j8p8J57N9K0k09J30j52l6K69k10J54j51o7K10k15j33
1465b18J23J4K07O1k56Q5M19n94K44J4q4J57m1n0o2p5n5J92q8L7l8k47L79l14
1489a90N4J42Q2k2O4K36k92K19k21L3K12j42j82o5MJ77o0n32M39K6j04L09l86
$$ y = [-206, -20, 180, -455, 200, 120, -33, -18, 193, -64, 119, 61, -59, 423, -11, -12, 354, -26, 48, -8, -81, 70, -54, -116, 34, -326, -39, 108, -166, 302, 172, -83, 356, 90, -87, 462, 276, 112, 82, -54, -191, 211, -104, -39, -79, -218, -41, 124, 139, 205, -126, -43, 318, -67, -92, 36, -252, 471, 179, 111, 192, 95, -32, 113, -47, -369, -85, -241, 182, -128, -208, 180, 48, -28, -23, 117, -29, -79, -150, 77, 257, -43, 274, 159, 2, 17, 7, -74, -82, -5, -191, 170, -246, -7, 14, 44, 33, 19, -6, 67, 24, 171, 328, 185, 48, 193, 24, 174, 67, 94, -244, -133, -200, 44, -59, -169, 120, 73, 85, 263, 52, 34, -44, 113, 172, 192, -17, 113, -39, -75, 194, -16, 138, -13, -80, 130, -85, -218, -95, -81, 126, 187, -69, 16, 435, -159, 85, 99, 15, 172, 131, 81, 19, -56, -111, 81, -7, 30, -8, -255, 124, -190, -136, 6, 88, 66, 130, 366, 74, 293, 72, 105, 317, 175, -7, -72, -68, 109, 49, -483, -44, -18, -122, 187, -199]
1512a99J50J36j93l8M68m61J81J29n0k2k24J36N7L2j69K1p1M08o71K98P8J00k23
1535a27j29J39K69n4J49j83J41k39J67j20J11L4k55k09P1n4J21J82J05j15L5l04
1557b65K44J06k68L7K06j87K64n1k23N60n65L87l21N3J88Rn55M90j75Q8M6k12
1579a44m9L56m47K51J67j68N06n16L9K96k14m7K38m30o9K60j27L91k82k05R3P
1601i4j9k14J84j02L70M0j13K43k19j08q3R6R0m0p4j80K56k11M68o16J46L01p0
1624E1M3o2P5K82j59l08K16l0j29m3J89L5K4k03J32J4m08M19R5k14j3l76M44m4
1648C0j89M02j21q4J38n21L84L04l88K77l4l35k49M57k27L71l57o9J89K9L5M6
1670H8K5j67J31J82O4l81n9J38K09l40KR2j20K17O7l01K19k48Q7J72J7l1j12k33
$$ y = [-199, -49, 87, -106, -144, 324, -137, 44, 173, 123, 101, -123, 13, 70, 102, -67, -46, -117, 291, -380, -82, -4, 96, -127, -256, -117, 152, 98, 247, 64, 205, -34, 133, 13, 124, 158, -97, -306, -235, -289, -168, 14, 119, 4, 39, -265, -21, 85, -183, -146, 60, -127, 137, 86, -137, 423, -142, 245, -76, -23, 165, 174, -381, 109, -66, 22, 68, -144, -193, 163, -284, -33, 134, -34, 472, -44, -5, 291, 77, 30, 268, -162, -231, 29, -98, 293, 11, -194, -101, -94, -113, -327, -143, -245, 125, 165, 52, 295, 76, -32, -115, -19, 71, 31, -43, -223, 33, -178, 290, -326, -180, 121, 51, 94, 32, 107, 389, 230, -78, 138, 108, -21, -64, 125, 160, 184, -19, 113, 127, -281, 138, 233, 19, 6, -370, 74, 30, -159, 243, 122, 38, 176, -345, 39, 343, -45, 232, 198, -137, -386, 71, -156, 215, -142, -211, -22, 7, 42, 88, 113, -54, 77, 259, 323, -58, -117, 21, 230, -110, -108, -16, -136, 81, 148, -153, 66, -182, -95, 77, 94, 63, -49, -282]
1694b82N69k73J19M23m01k58J44N5j98J24m0K69q3l81K74J75o24K85M37m74M75
1715C35l60K73J17m11L54k34l69O33m41O0M53n10o7L2J79r1q9J80p2p1P6N6L0
1738F3JJ6J01o1j05k39J05L10k80K76l46J99j54R6pJ10j69J57k03K6N7l1J36L1
1762H9k7J42j44NN1j82J47K7j73j55K25j80K29N8k94k14M06j51j0L85k34j29L34
1785B05k41mk0k31J63J88j54j47J77KK33k18M00J6n12R3K78l36J72J72k67j30
1807a61J23m6K45n7j54R6l25J22M34k63P0p6j34K37k64L06j42j65J78L3K5o3J28
1830A47j04J40l26O7K01M4k48O1J93k58Q7q2J38l17L70J1k22J05jJ90k12K6K14
1853B24J16k67j51L05l13J97N5j79P5k75J68j27J72J4M1j19l7O8L5m7J15l39R4
$$ y = [-282, 287, 14, 133, 556, 155, -103, 41, 96, -102, 22, -18, 251, 168, -213, 61, 236, -388, -103, 334, -140, 335, -25, 248, 365, -46, 308, 74, -295, 338, -103, -43, 410, -100, -167, -135, 44, -47, -136, 44, -28, -99, -23, 33, 63, 64, 80, 181, 120, 15, -224, -119, 191, -89, 187, -159, 40, -114, -18, -25, 85, -84, 73, -130, -104, -47, -78, 58, 89, 62, 204, 60, 65, 116, -66, 81, 108, -65, -220, 5, -175, 54, 112, -182, -396, 10, -141, -151, 234, 0, -129, 205, -36, -40, -60, -291, -128, 60, -94, -241, -64, -62, 171, -47, 353, 369, -143, -50, 228, -108, 64, 236, -31, -161, -38, -84, 161, 104, -50, 46, -279, -157, 277, 14, 84, 8, -126, 111, -153, 153, 11, -154, 24, 57, 82, 19, 147, 43, 183, -143, -76, 125, 169, -79, -18, 175, -83, 4, -78, 60, -257, 113, 124, -98, 7, 6, 196, -16, 10, 224, 340, 73, -78, 227, -86, 111, 166, -13, 62, -213, -45, -172, 0, 14, 55, -64, -101, -33, 2, -45, 70, -269, -175]
1876a75M32R8n4k74P6j37j22N7L01l28M3J7N6l1J24L5l26J77j19M08L0m03L0n8
1900a43O4K78l78J47k2k37K71N3j46R2o4k9J64J78n8j28N7j75K06K15l54J21j29
1923a7K8p3KK44N8j13j54R1J32k50j58L04ll0m8J34j44j99J99k1R8j39p7O9J55
1948H8j16j68%l9M23k5j22J0j57Q6Lj73L31j66O1j69L07j81J20m4j47n0P4J44
1972I0K81l19O2L4k79J31O2o4o8K43m05L14m96N15l50K82L9m0m9j20L35j79K18
1995B37k56J17j74j33L25j13l0p1J00J40j85j23K66p0lp8l2P6K17nJ1j91R4k11
2019i2l6M55m15L8R6n6j59L57l13Q0Q7N3j68K48j14J5j93J22n0N3J54r3k10J1
2043a30K60M2r1j39O8k14J64j93l2J24K20J31k29J9p1J9m0l7j8O5P8m8pj37Q8
$$ y = [-175, 257, 355, 301, 27, 103, -34, -156, -99, 202, -126, -83, -66, -10, -41, 83, 118, -208, -31, -150, 258, 288, -115, -85, -143, -79, 199, -179, -32, -54, -291, -20, 33, -113, -21, -85, -114, 50, 228, 170, 42, 99, -76, 130, 345, -9, 112, -17, 11, -62, -60, 184, 242, 129, -25, 66, 198, -52, -210, 94, 91, 61, 13, 147, 3, -196, 3, -18, 80, -59, -136, -67, 88, -28, -196, -196, -235, 188, 163, 41, 51, -106, -20, -17, -190, 141, -25, 36, -133, 174, -7, 113, 69, -78, -128, -54, 90, 371, 52, 114, 148, -131, 0, 62, -2, -70, 173, -232, 82, -414, 101, -249, 33, 72, 32, -17, -137, 198, 19, 237, -19, 98, -76, -209, 116, 3, -27, -98, 2, 142, -43, -166, 100, 30, 27, -51, -83, -7, 210, 205, 216, 25, 119, -92, -128, 327, -88, -50, 46, -10, -169, 188, -125, -45, 42, 95, -73, 175, 61, 76, -117, 5, -45, 8, 162, 69, -141, -130, 130, 172, 81, -58, 10, -204, -40, -233, -265, -141, 79, 210, -19, 0, -71, -52, -92, -129, -147, -82, -4, -52, -59, -196, -108]
2068a08J33K04j99J33j52J04nj52K85j54r2K00n65M02k23J23j4j47N37m53J61
2089A8q0n2K6j17J26j22L59o8j83R0Q2k20N8q2L15n6j90R1J41j69J53j35J18n
2113I8k66j01K49J30j12J50j03kKQ9j76J05q5J39j97J00o2J70j54J47k19K35K6
2136A63n6m17K63m7q4j30L19j02J27j59j52J83K44j63nJ8o0P3l4j16J64k37K76
2159F8j86j4q1M9J87q7N4j6j76J75P6j14K99j04K9j60n9N14m53j47L66n97L70
2182gL0j61K32k89L02k62R6K29l87K12j73J5K47k44J21Q4J48k83J45J5L2k19Q3
2205c4P9l00N83n61K01jj93R8L66p4j92Lj37K51J00k61JK6M6N4K50k40k43J38
2229d0jj10J98N1o7N3p9R8j72Q6k30J88J67k51R9j70JK06Q6l32M83N2o52K3J33
$$ y = [-108, 25, 229, 30, 163, 11, 115, 110, -42, 243, 89, -3, 197, -368, 34, -189, -66, -80, -227, 310, -143, 18, -62, -114, -88, -205, -79, -201, 158, 90, -93, -3, 79, -141, -83, -165, 150, 94, -96, -5, 136, -33, 120, -15, 103, 98, -168, -269, -20, 110, -2, 148, 45, 43, 45, 134, -42, 63, -22, 117, -80, 20, -42, 128, -26, 121, -98, 137, 163, 107, -310, -47, -94, -178, -308, 11, -91, 36, -123, -275, -92, 152, -11, -16, 2, -58, 15, -19, -135, 29, -208, 68, -118, -132, -213, -164, 23, -64, -10, -26, -202, -27, 49, -65, 234, 130, 159, -1, -60, 454, 1, -146, 220, -377, -7, 23, -138, 94, -195, 107, -155, -59, 170, -217, -5, -178, -163, 84, -160, -39, 45, 193, -90, 55, 70, 102, -117, -34, 45, -255, 328, -233, -32, -33, -226, -128, 238, 164, -28, -25, -162, 89, 189, -72, -71, -45, 1, 55, 305, 65, -178, -40, -41, -151, 47, 98, 31, 84, 5, 103, -69, 17, -213, -25, 142, -109, -10, -180, -179, 27, 113, -219, 264, 316, -336, -313, -180]
2254a80J76K61l95k1L71k45J00j85j74L54l93L31J20L5J76l54oK22k49P9O1l41
2276b57K15n6j63J32L15m4k36J06P2J82j69J27j31k5J13L2j50O9L29o64J51j64
2298b16K08J53k08j09Q2K71j21j73l8J36j08L93n07M31K8l08l0J65j94K05k3j5
2320B2K04k48KR1P7k23m6J04J25k60M5p8N72n23M3M6J35k7k10J87l9O5j49l5K46
2345A26j95J55q6M8k24L51o8k29L04l23mlJ7J4J72k43J59O8j54K57j81N18l93
2368H6j65N3j20N4j03K16j07J63j96j39p1L72NP8k79L48K4o8j22J03J8l0j87K30
2392A63L4k68J94l11K73P0Nl68L10N2K1j46k51J05L45k19J04j68J92k07J58j90
2414a02K29k35J85n8k52N8J56Q1P0K4n26N13n1k32L56k68J94k91K14l1l24K34
$$ y = [-180, -4, 257, -138, -159, 212, -33, 67, -118, -292, 62, -331, 0, 120, 155, 331, -23, -29, 193, -56, 23, 84, -257, -42, -98, -261, -129, 186, 142, -94, 12, 84, 266, 97, 224, 93, 68, 181, 213, 63, 132, 461, -203, -52, -216, -8, 145, -63, -172, -90, 181, 60, -113, -151, -15, -123, 270, -237, 194, 222, -86, -116, 49, -145, 60, 37, 22, 226, -22, -20, 71, 148, -75, -121, -17, 108, -152, -107, -185, 387, -136, -93, -47, 88, 61, -149, 38, -1, 64, -85, -120, 126, -69, 86, 0, 48, -176, 175, 107, -122, 182, -141, -145, -148, -131, -117, 55, -188, -29, 39, -115, 142, -39, 479, 86, -79, -26, -146, -92, -195, 21, -86, 77, -119, -258, -329, 43, 48, 126, -153, 195, 219, 151, 29, 132, 150, 120, -67, 163, 197, -71, 123, -188, 85, 155, 160, -208, 102, 154, 175, 29, -222, -117, 228, 9, 113, -55, 137, -70, 88, -102, 127, -108, 77, 19, -233, -175, -19, 62, 132, 156, -370, 143, 92, -140, 216, -52, 142, -149, 65, 34, -290, -56]
2436e6j07K09j25l6J38P7N9N4k71O3l2J5K35k63l76L38J62m6r6K28o9k11n4M01
2460B37k98Q8J82j94l35J46K17j08J32n3M7M7K18l13j4k06J09K96l80Q6j24L68
2482A48j24j39J35L56o00oO51m98J02L16n63J47N9j57J37P3j98K39j56J7K26j88
2504b3j88N36k38j93P1M8J59n9j51j05K69o3O0rp5P4o6j43p2Q6Q4m9J59l07k1
2529b16J32J08J71k62M1l1J05Q8j56o7j02J92K43k50r9J2K16K5o3j70p4K33k75
2552a99K99j16k60N1J80k09K9K11j01J27MK06l9k15o2n9K89m52M55j69K0Q9k56
2575a77K56j14j02K35l87M64Q4k38p3J35j83Q8J8M6L5K4l8k29J5j21M13k21J72
2598A02r9l0N9o3k95M35j37P1J79k33R7J22p0j22j33k0L15k87J91k08j15K61m5
$$ y = [-56, -163, 46, -79, -115, 23, 100, 159, 213, -58, 5, -27, -12, 223, -40, -416, -78, 84, 38, -58, 170, 101, -110, -164, 237, -61, 27, 209, 15, -320, -174, 43, -65, 67, 14, 61, 108, 326, 13, -1, -207, -98, 198, -182, -96, -220, 148, 24, -115, 20, 376, -224, -230, 421, -77, 25, 341, -222, -75, -16, -173, -36, 37, -161, 78, -78, -61, 165, -23, -211, 325, 87, -106, -35, 13, 172, 113, -38, -143, 126, 63, 123, 114, 39, 113, 47, -96, -168, -82, 2, -47, 112, -195, -216, -84, 24, 195, -67, -26, -57, 48, 136, -20, -87, -189, 3, 246, -4, -103, -91, 125, 150, 87, -83, -157, 76, -199, 100, -16, -276, -225, -45, -254, -225, -14, -115, 12, 16, 222, 183, -32, -94, -153, 136, -316, 139, -30, -10, 79, -177, 79, -35, -137, 98, -289, 175, 259, 21, -52, 83, -100, -12, 6, 52, 87, 111, 73, -156, -141, -262, 151, -70, 102, 3, -27, 32, -31, -326, 109, -28, 43, 222, -11, 86, 208, 138, 16, -117, -137, 178, -109, 82, -126, -241, 20, -25]
2621b5R6J4j18k20M12Nk23p5O3J95j77J86L8j63j61L15Pk09J60r7Q1j44J38k19
2645a21r8L3K28j20j6J35R2m2pk18O1J27n1n3J15mj54R9j36J48k22O6J02k07J84
2670e9l2K45j65r3K2K5K43j00n5qpJ91l82K69k10k7L34o2m5k37K46j89j50J84
2694f2m0k6J97m18K86k7m4K26l19Q4L77l17O7j2K8j77j05K53J92j22Kr4o1J58
2718D6p7N8P4l24P3L5J32k18K01q4K8J59p0j0l23L72Q4j87j62qN1J46J55k88J58
2743B1K9K84n66L08j68K65k59K52nj58K01j64n4J40R1J12l22j13K40n4k46K77
2765A11L05j87l71J42n2P4J10m04J39P3K60O1j71R9l80J71j62J07K65k65J28k23
2787a70m1M44l23J70k42M04m29p3J02Lj2Q7N5K69P7m22N3K67l00k12M15j5l0j33
$$ y = [-25, 71, 85, -33, -253, 159, 164, -59, -134, -71, 124, -53, 133, 171, 8, -153, 162, 169, -40, 120, 23, 104, -40, 98, -121, -219, -186, 42, -78, -94, 41, 133, 91, 84, -134, -73, 54, 3, -50, 65, 61, -93, 6, -130, 18, -204, -138, -36, -243, -59, -91, 154, -11, -104, -82, -57, 186, 86, 31, 23, 16, 207, -175, 94, -116, -143, 191, 129, 84, -153, 93, -96, -246, -62, -102, -128, 69, -349, -63, -90, -134, 92, -227, -143, 234, -83, -16, -28, 0, -177, -282, -29, 163, 41, 43, -51, -112, 46, -31, 27, 101, -223, -150, -115, 17, -201, 0, -84, -56, 103, 33, 23, -300, 72, 156, -31, -193, -201, -150, -4, 151, -137, 21, 50, 334, -232, 76, -92, 173, -86, 166, 161, 3, 204, 40, -14, 126, 217, 329, 7, -106, 134, 80, -166, 111, 416, 229, -142, 0, -52, 22, 132, -272, -133, -60, 200, 261, 90, 189, -191, -20, -182, -75, 190, -75, 53, -170, -211, 233, -90, 80, -162, 242, -187, -260, -158, -155, -167, -80, -25, 244, 321, -101, -48, 219, -81, -293, 122, 107, 77, -56]
2811e6K39k24P2o9J1L08m04L32l18r1J21nN11n34J3L41k41J56j92J06kp1J18r
2835A12n4j45K24l46J17j5J61K4J38l77k56K59L33p0j68J20j41J96k9O0Q9j69
2857F3K6O8j04P2k27N5L8l40M9m4M51J12l53m8J36J72m02L82j05K9k17Q7K75j04
2881G1Q8r9K5m7j36L14l29l4L11j77lm1P8O0j64K92l38L33k70J88kM6j28j06r4
2906a62J18j70Q0K68k62L01k53R3q2R4J02Q7n51M92q2p4J86o0P4k84J85m6j67
2929a13K53l73K04q4J17j85P8J18J73Nl60K80j06L3K0j33M3P0k64M02k32J12j2
2952D6k13J90o6J25j64n7J55j94K33m17O93m76K88k59L2J83j77J52j02J31r6j28
2974a21L55k47J80k49n8N14m55J42k74j5K95r3J17j05j19j6J27N8j87K11j28J65
$$ y = [-56, 183, -41, 31, -38, -27, 281, -123, 209, -109, -200, -79, -84, 427, -107, -94, 247, 6, 162, -30, 76, 74, 3, 121, 112, 58, -87, 137, -209, -92, -107, 54, 78, 216, -161, -417, -158, 175, 105, -63, 57, -84, 112, 83, 143, 232, 63, 89, 157, 53, 125, -102, -47, -9, -349, -300, -344, 107, 219, -134, -182, -46, 126, -276, 106, 1, 30, -187, -100, 175, 71, 159, 60, 85, 38, -98, 216, -113, -147, 164, -13, -16, -57, 21, 81, -83, 209, -129, 204, -66, 122, 120, 166, 38, -68, -162, -44, -214, -134, 134, -128, 173, -80, 13, -69, 25, 127, 214, -337, 155, 73, -1, 185, 125, 199, -85, 100, 54, -113, 140, -233, -29, -113, 4, -181, -103, 15, 188, 193, -167, 113, 7, 40, 60, -73, -30, 40, -224, 178, -54, 58, 46, -167, 23, -43, 82, -82, -139, 16, -178, 55, -362, 331, -145, 143, -116, -84, 99, -78, 74, -28, 103, 7, -121, 234, -13, 167, -82, -140, 374, -81, 61, -213, -228, 67, -26, 91, -14, -133, -149, -22, 36, -151, 60, -68, 97]
2996I7n8j12q9J50j62L82j91k52Q8K83k12L46r2k2l54R2K41q9Q3k39K86k88K71
3019A59k33qm1q6J08J83k56J07K47l07K19l08K06o3L30m77M8L42m09K44k33P4
3041a54oJ50l88O15j20O2L5k35J74k26R7K8P4l2k22j07N50m52j10Q5K79k61m5
3064b09J38M4K75l02j64J88j82M12j71k91M16k38N8K39n7l24Q2j92K96k4r0K74
3086A78k83J90l49J00R5K00j12p6O3K69m43J10m8K35l3j79J0K93j16j9k11K14
3108H8k64j3K27l9n7P4J8P1q1J85k71n5J51J15j98l4K43j71j4j46LL4J87L80j38
3133B95k95l80J40J56k03K70m2k1n3P6M7J32r9k33P7M3J34J52q4l3n05L14r4J55
3157e1k1l4J54k71M88m81L10k83L15p5k84K83j69L52l70J45J14k41K94J67m45
$$ y = [97, 39, -73, -162, -12, -174, 208, 17, -235, -147, 136, -76, 270, 178, 156, -198, -106, 135, 46, 129, -110, 176, -112, 159, -74, -82, -123, -209, -101, 82, -174, -67, 180, -127, 92, -216, -10, -73, 257, -220, -172, 170, -239, 5, -228, -154, -160, -10, -398, 217, 97, 159, 194, -41, 133, -93, 4, 32, 106, 74, -148, -255, 295, -157, -267, -182, 97, -164, -209, -71, -27, 248, -54, -218, -30, -212, 200, 29, -262, 154, -84, -26, 213, 156, -168, -86, -278, 18, -6, -96, 178, -105, 85, -264, -164, -69, 131, 19, -57, 6, 275, -168, -58, -106, 129, 96, -83, -73, 220, 104, 85, -126, 88, -176, -189, 38, -1, -58, 16, 34, 105, 24, 209, -62, -117, 34, 149, -49, -83, 160, -11, -25, -171, -168, -134, 53, 433, 295, 0, -380, -240, -84, -287, -17, -59, -80, -133, -57, -10, 122, 23, -210, -133, -90, 44, 196, 112, 79, -426, -112, -206, -51, -72, -106, 48, -223, 265, -216, 94, -189, 126, 51, -233, 50, -119, 233, -137, 8, 122, -119, 175, 342, -103]
3178a03Q3l6o9L14j41j08K58j93j03R2J77j68J26k66J16o2K28j85jJ21J1q3MM3
3202E5l5K1l45L55J98m00J19j3J92p3n4j82L48Ll15K54m43M24j65Qo9K95Km02
3226b22L82N1kl45K4J62j5j21j25O2M01l34R4k80R8J97K70m57P4L67l39L64m36
3249a30K54k48J76o7K65k13Q5j32R2q5L6m5R7l49K63j07J15K8l09L98o8M2j09
3272a1K86o6k38k01J57K3J82j92j90N66n16J08J00K24k08%j15l9m7J39K77J36
3294C75l18j9j90J90Q8q8L4l6l07J95q3L61l20J2K38k66J40j29M6L5k37K84K7
3317C2K2l3k00L50k44J91k30L9R4k69L9K05j56J76Q5n7l5m2J49l48J74L9Q3k56
3341a92K50L6j48j18L91j07J4o0j74Pk4K27qR9k24j2k3Q5j72K57j14L7j37L73
$$ y = [-103, -20, -56, -125, 189, 48, -60, 198, 5, -98, -6, 171, 3, 129, -137, -21, -83, 145, -40, -41, 80, 91, 8, 12, 55, 20, 41, -304, 51, 249, -151, -32, -45, 147, 74, 20, -162, 186, 189, -126, 128, -315, 109, -56, -48, -117, 178, 180, -222, 160, 211, 209, -136, -112, 50, 35, -86, -211, -149, 252, -82, 12, -268, -170, 27, 297, -160, -86, 281, -58, 306, -130, 124, -124, 52, -15, 250, 37, 122, -10, 82, -3, 33, -12, 85, -264, -1, -108, 7, 35, -274, 124, 56, 98, -11, 275, 209, -29, -230, -73, -50, 132, -60, -250, 316, -200, -92, 8, 232, 24, 24, -91, -130, -177, -38, 239, 375, 57, 38, -152, 38, 126, 38, 72, 36, -271, -76, -159, 202, -118, -106, 132, -134, 6, -123, -77, -42, -279, 5, 32, 54, 21, -179, 171, -73, 118, -112, -73, 21, -248, -209, -4, -160, 16, 101, 44, 9, -33, 116, -232, -58, -19, 64, -192, 58, 94, -54, -172, 219, 112, 126, 66, -108, -101, -125, 102, 94, 193, -31, -43, -66, 19, -153, 104, -10, 27, -110, 263]
3365B63j12n7j44K15j13J73l33Q6m6J14j51k79L42J54J7K3j19q4J87j95N1J6R
3388A7J14n4J22k33K04k44O7J3ml06M24p0k82L39j99K28J31m35J80O5m3k29N4
3411a41P5J34l12J62R9r7L17j05o3K34l14J21O5k39J41m7LJ59j41p4j17L4J84
3434G8k8J33k39J2l1Q5j34L87r5m3j67mK26m64J57O1J03J10J47m46J02K81k39
3457h%R0k2mk32J5L79k85p7J45n2K13n77L00J62O6K26m35K01j54L24j37q6j83
3481a31J46n2O7rq2J02l1n7J51l14Q9J61k28r2N8L44m8J72j91K08n36J29J49J14
3505A19j58J29j34m0n8J47J36l20K35O7j14j26o7N7J58m4k34K17R8l14M67k77
3527e6J92n88M15r4M9J00m7r4j03K17j09j69J09K63j90K85l09L78l93J5rJ65j09
$$ y = [263, 151, 94, -50, 165, 52, 225, -108, -22, -68, 46, -105, -384, -42, 112, 129, 152, 33, -51, 136, -59, -8, 8, 17, 131, 77, 199, -34, 170, -74, -7, 6, 2, -304, 120, 50, -232, 107, -92, 136, 267, -168, 12, 77, 34, -195, -141, -66, 68, -244, -82, 17, -80, 237, 132, 69, 303, -11, 110, 175, -64, 77, 30, 33, 192, 51, -23, -140, -106, 78, 50, 183, -56, -44, -75, 10, -124, 263, 168, 125, -42, -46, 180, -284, -127, -66, 37, 147, 294, -152, -50, 231, -8, -8, 82, 60, 56, -176, -161, 218, -67, -144, 1, -51, 162, -415, -115, 47, 113, 339, -96, 105, -49, 275, 138, 52, -131, 15, -37, 30, 21, -61, 41, 10, -47, 104, -210, -121, 40, -188, -280, -222, 122, 74, 246, 55, 263, -273, -144, 5, 119, -39, 90, -44, -84, -142, 5, 141, -179, 56, 123, 9, -117, -184, -127, 31, -13, -247, -30, 68, -246, 221, -56, 136, -452, -37, -131, -82, 18, -29, -123, -226, -9, -118, -287, -178, 85, -105, 180, -129, 249, -144, -129, -138, 27, -82]
3550h2K10o4K98k73M3O2j84n0J16j11J67m59L43j23L62j46p6R9j00L87n78M75
3572C16l27l6j30J05J41j35J41m4j28J06k0J12P8J8k91J34j25J85P7j32j59J26
3594A2M56l87r1J10k80K86P8k1k67r9K88k69J21K52k68J39r0j0oP3j9M7N3k14
3618a06J84pmj8j45N9K07j42r5N9J11j5k43K68j04O1Op0l8r9J34j02L25l02J55
3643G9j17j61K07j64K5R6L41k46q8M1k8K10j51j6r3K6P5J9n0m6j34K64k43J34
3667b0R2j1j4n1N0j55o9L09L8j95R3O3J53l31p8J78l3O0k04J11J26r8J1nj63K35
3693I2p4k1J9k56K06k2K24j74K03j68L8k16K11j02L03l62R4Q0J03j84J57k46N3
3716d2J01j43k29Q1K90k45K79j06R1j48J47K87o72M81j45m2K4j63K74L9p3k02
$$ y = [-82, 128, 64, 362, 89, 132, 194, 10, -40, 76, -35, 132, -327, 16, -107, 255, 109, 33, 132, 32, 419, -159, 316, -11, -47, -177, -72, 69, -66, 75, 31, -97, 9, -11, 101, 179, 197, -94, 40, -85, 100, 177, 45, -114, 12, 468, 81, -10, 100, -180, 106, 184, 163, -104, -203, 85, -184, -63, 189, -79, 60, -30, -40, -46, 27, 8, 55, 108, -106, 78, 71, 67, 49, -96, -37, 170, 28, -67, -8, 103, 88, -155, 113, 9, 70, 76, 6, -32, -131, 3, -99, 226, -76, 79, -38, -199, 8, -156, -131, -35, 306, 60, -28, 13, -15, 195, 44, 28, -65, -39, 36, 55, 5, -41, -175, 89, -154, -20, 72, 61, 47, -4, 46, -109, -178, 131, 169, -26, 67, 130, 283, -48, -126, 52, 19, 79, -125, -14, 112, 14, 25, 20, -143, 92, 18, -3, 16, -240, -34, -56, 168, -6, 197, 29, 67, -149, 62, -40, 263, -99, -5, 75, 178, -6, 151, -95, -42, 59, -84, -313, -232, 58, -187, 92, -14, 77, -71, 76, 363, -309, 172, 27, -15, 9, -154, 120, 159, 86, -116]
3738a16J99j77J2K58K0m75K90J6j1J26j79N9Oj23K70k51M3k26j1N46l08J61k34
3761a05J18K91m77j2K54j32L5J3j9J03k7k9o7R6J58k52K14l01J76j71K5J86R3
3784A70k28j8M3K72k24P6j97P2J41j18J71k34L60n7r4m36K98l5j26K10P0k86J50
3807b0K37j18L55m16N9K1J21J3l10J97m76M05r2q9j00J30k0l2K70j76K02j33J36
3830A64k49J76k72K51J26k57P0k15J22n1J26J22k53K55j0k06P8k20K82J27N8k99
3852g5j09J71N9L29l86J49j21J50j30q3k4k37J91K52j06j50K17o3P3k55K83K59
3874C94m01J11q3j15p9LL75j27j02q6K33q0pM5J71m08l2J53K7J86n33L27k2j4
3898f4R4R5l28L03k28l6L11J48l23m1R9J11Q1l47J61q9J42Ok34o6J89P0J35l86
$$ y = [-116, 83, -94, -82, 176, 196, -279, 11, 27, 16, 142, -37, 22, 28, -95, 175, -76, -33, -259, -270, 276, -32, 129, -105, 13, 304, -173, -185, 69, -63, -28, -15, -34, 69, 42, 13, -54, 42, 200, -52, 162, -139, 37, -134, -109, 77, 170, -58, -76, -33, 239, 15, 91, -106, -34, 107, -11, 160, -74, 286, 229, 135, -301, -3, -38, -164, 46, 116, -170, -20, 217, 99, 454, 38, 97, 118, 239, 252, -58, 139, -337, 68, -24, -113, -213, -83, -103, -135, 135, -41, 161, 28, 164, -85, 91, -181, 70, 196, -61, 9, -206, -84, -135, -9, 113, -140, 115, 105, -101, -23, -243, 39, 166, 224, -75, -184, -13, 46, 375, -11, 138, 17, 167, 37, -46, -70, -307, -116, 136, 30, -120, 97, 34, 107, -148, 135, 394, -7, 104, 21, -94, -173, -170, 205, 78, -24, -110, 123, 43, 36, 81, 252, -156, -188, -35, -8, 178, -355, -28, -50, -64, 30, 125, -203, 100, -128, -164, 147, 295, -28, -69, 30, 141, 222, -125, 36, -53, 89, 95, -139, -205, -16, 54, 189, -197]
3922a97K10J30j48k41J78J45k94K38mn6J9o9o2K60k74K41k26O8J02r2K58k61M4
3945c1J32l72l5O3J47O5Q6k62J67Q9J37o0j82P3Q0q7p5J88q4j5m6K28m44J68k26
3970b96J21K08l4j70l8J07J71o9J30j9k8q6J51m09o4J89L72k39Q2k42K26Q1k31
3993h7O8Nm2k66M34N6k48N9P1r2K22j44PN9k66K09l6P8L0j31j54K10n0j6K98l34
4019f0J72%k70O6P2j01P5l3j2m4Q1J6Q4J3K94k66l77K51oj36L8k3J97P7K9j7k75
4046a55J34J50k7j45L43m09J91N5n2j33J54r2J43j13j16P8k62K96l8R3m2qL8j55
4070g2PO4j4m1Qj15K87j50K6j42n8L92k01n0rj0q8L29j63J4J19j45j1K71k83k7
4096f2J1k36M86k08M6K2k07J84k82L96j98K30n4j87J57K4p3k48K6P3j70J67J84
$$ y = [-197, 13, 143, -5, -246, -68, 77, -217, 21, 17, -39, -20, -89, -151, 109, -165, 76, -150, -82, 20, -72, 186, -75, -31, 101, -271, -306, -243, -96, -31, 55, -207, -40, 49, 186, 126, -56, 17, 97, 10, -65, 123, 39, 24, -22, 206, -238, -70, -296, -175, 33, -1, -171, -209, -102, 69, 0, 130, 111, 83, -3, 148, -261, -325, -136, 236, -3, 79, -163, 63, 144, -87, -19, -14, -56, -322, 112, 168, -80, -21, 50, -42, 180, 36, 43, 102, -164, 45, 9, 87, 117, -14, -168, 42, -8, -24, 274, -60, 112, 112, -158, -92, -20, -121, -46, -79, -91, -135, -54, -38, 46, 59, 353, 87, -290, -39, -45, -181, -143, -166, 31, 108, 137, 120, -155, -21, 129, 102, -43, 300, -109, 82, 137, 85, -48, 106, 14, 157, 44, -72, 6, -256, 40, 2, 95, 53, 45, 83, -72, -65, -1, -15, -56, -48, -163, 124, -26, 0, -142, -200, 192, -9, -59, -68, -78, -166, 163, 0, 14, 133, -12, -23, 248, -35, -62, -51, -287, 199, -9, 37, 59, -148, 36, -246, 150, -48, 182, 128, -59, 98, 122, 49, -199, -173, -100, -270, -103, 81]
4119H1j95J02j71K99j40j06K61j88L19l79J7J21M7j6L0J00j36J45j33j39J43l18
4141b56K15RJ0K27j39j61J03L03m53J28L9O1j29J23J28l17P0L39l53J90l37J55
4163d5Q9l09J2J89j33k8M12L6n9r6j23M36l97J37j93L6J82Rl9k03K46k41J5J25
4187E8j95K16J48P3n27J57P0q5L20l79L89k51Q3j38k28n5N03j99K02j30NN6j49
4210e6J49J4L4K2ML3o0k80K31J04k87J66K0p8J80k27j17O7QJ09R6j63nM2j09J58
$$ y = [81, -114, -12, -183, 116, -24, -130, 131, -57, 262, -117, -100, 21, 68, 52, 82, 182, 46, 191, 58, -81, 62, -256, -41, -32, -22, 205, 66, -95, 8, 311, -142, -14, 25, 86, -43, 80, 208, -109, -39, 300, -53, 137, -200, -45, 44, -265, -253, -64, -197, -225, 187, 223, 164, 68, -55, 381, -16, 121, -72, -36, 146, 155, 116, -87, 159, -82, -67, 58, -137, 79, 227, 300, -227, -70, 0, -85, 235, -144, 245, -6, 77, -61, -289, -344, 159, -40, 162, 32, 37, 93, -56, 93, 107, 141, 163, 167, 200, 140, -140, 91, 195, -92, 74, 94, 16, 196, -31, -148, -81, -73, 36, 132, -31, -36, 6, -103, 55]
$$ [...]
8191c7
##END NTUPLES=NMR FID
##END=
