##TITLE=1H_Pr NCS-eth
 CDCl3,8 sc, 
 21.9.2021
##JCAMPDX= 6.0         $$ Bruker NMR JCAMP-DX V2.0
##DATA TYPE= NMR FID
##DATA CLASS= NTUPLES
##ORIGIN= UXNMR, Bruker Analytische Messtechnik GmbH
##OWNER= root
$$ XWIN-NMR		Version 3.5
$$ Tue Sep 21 09:18:21 2021 Russian Standard Time (UT+4h)  she@DPX200
##.OBSERVE FREQUENCY= 200.1314
##.OBSERVE NUCLEUS= ^1H
##.DELAY= (6, 6)
##.ACQUISITION MODE= SIMULTANEOUS
##.ACQUISITION SCHEME= undefined
##.AVERAGES= 8
##.DIGITISER RES= 18
##SPECTROMETER/DATA SYSTEM= spect
##.PULSE SEQUENCE= zg30
##.SOLVENT NAME= CDCl3
##.SHIFT REFERENCE= (INTERNAL, CDCl3, 0, 15.7039)
##AUDIT TRAIL= $$ (NUMBER, WHEN, WHO, WHERE, WHAT)
$$ ##TITLE= Audit trail, XWIN-NMR		Version 3.5
$$ ##JCAMPDX= 5.01
$$ ##ORIGIN= Bruker BioSpin GmbH
$$ ##OWNER= she
$$ F:/spectra/data/she/nmr/H-F/1/audita.txt
$$ ##AUDIT TRAIL=  $$ (NUMBER, WHEN, WHO, WHERE, WHAT)
(   1,<2021-09-21 09:17:02.62 +0400>,<she>,<DPX200>,
      <created by zg, POWCHK disabled, PULCHK disabled
       configuration hash MD5:
       00 E9 B6 7A A2 85 ED C7 34 08 36 98 17 FE 4E 26
       data hash MD5: 16K
       A9 F6 3B 07 23 9F F4 FF 04 42 C0 5D 15 4A 23 E7>)
$$ ##END=
$$ 
$$ hash MD5
$$ FF 68 94 BE 8F E9 01 7A F9 79 25 2F 25 CD EC E0
##$RELAX= 
##$RELAX= 
##$RELAX= 
##$RELAX= 
##$RELAX= 
##$RELAX= 
$$ Bruker specific parameters
$$ --------------------------
##$DU= <F:/spectra>
##$EXPNO= 1
##$NAME= <H-F>
##$PROCNO= 1
##$TYPE= <nmr>
##$USER= <she>
##$AMP= (0..31)
100 100 100 100 100 100 100 100 100 100 100 100 100 100 100 100 100 100 
100 100 100 100 100 100 100 100 100 100 100 100 100 100 
##$AQSEQ= 0
##$AQ_mod= 1
##$AUNM= <au_zg>
##$AUTOPOS= <>
##$BF1= 200.13
##$BF2= 200.13
##$BF3= 200.13
##$BF4= 200.13
##$BF5= 200.13
##$BF6= 200.13
##$BF7= 200.13
##$BF8= 200.13
##$BYTORDA= 1
##$CFDGTYP= 0
##$CFRGTYP= 5
##$CHEMSTR= <none>
##$CNST= (0..31)
1 1 145 1 1 1 1 1 1 1 1 1 1 1 1 1 1 1 1 1 1 1 1 1 1 1 1 1 1 1 1 1 
##$CPDPRG= <>
##$CPDPRG1= <>
##$CPDPRG2= <>
##$CPDPRG3= <>
##$CPDPRG4= <mlev>
##$CPDPRG5= <mlev>
##$CPDPRG6= <mlev>
##$CPDPRG7= <mlev>
##$CPDPRG8= <mlev>
##$CPDPRGB= <>
##$CPDPRGT= <>
##$D= (0..31)
0 1.2 0 0 0 0 0 0 0 0.06 0 0.03 0 0 0 0 0.0002 0 0 0 0 0 0 0 0 0 0 0 0 
0 0 0 
##$DATE= 1632201422
##$DBL= (0..7)
120 120 120 120 120 120 120 120 
##$DBP= (0..7)
150 150 150 150 150 150 150 150 
##$DBP07= 0
##$DBPNAM0= <>
##$DBPNAM1= <>
##$DBPNAM2= <>
##$DBPNAM3= <>
##$DBPNAM4= <>
##$DBPNAM5= <>
##$DBPNAM6= <>
##$DBPNAM7= <>
##$DBPOAL= (0..7)
0.5 0.5 0.5 0.5 0.5 0.5 0.5 0.5 
##$DBPOFFS= (0..7)
0 0 0 0 0 0 0 0 
##$DE= 6
##$DECBNUC= <off>
##$DECIM= 32
##$DECNUC= <off>
##$DECSTAT= 4
##$DIGMOD= 1
##$DIGTYP= 9
##$DL= (0..7)
0 120 120 120 120 120 120 120 
##$DP= (0..7)
150 150 150 150 150 150 150 150 
##$DP07= 0
##$DPNAME0= <>
##$DPNAME1= <>
##$DPNAME2= <>
##$DPNAME3= <>
##$DPNAME4= <>
##$DPNAME5= <>
##$DPNAME6= <>
##$DPNAME7= <>
##$DPOAL= (0..7)
0.5 0.5 0.5 0.5 0.5 0.5 0.5 0.5 
##$DPOFFS= (0..7)
0 0 0 0 0 0 0 0 
##$DQDMODE= 0
##$DR= 18
##$DS= 0
##$DSLIST= <SSSSSSSSSSSSSSS>
$$ [...]
##$SUBNAM2= <"">
##$SUBNAM3= <"">
##$SUBNAM4= <"">
##$SUBNAM5= <"">
##$SUBNAM6= <"">
##$SUBNAM7= <"">
##$SUBNAM8= <"">
##$SUBNAM9= <"">
##$SW= 20.0188988654967
##$SWIBOX= (0..15)
0 0 2 0 0 0 0 0 0 0 0 0 0 0 0 0 
##$SW_h= 4006.41025641026
##$TD= 16384
##$TD0= 1
##$TE= 0
##$TE2= 300
##$TE3= 300
##$TEG= 300
##$TL= (0..7)
0 120 120 120 120 120 120 120 
##$TP= (0..7)
150 150 150 150 150 150 150 150 
##$TP07= 0
##$TPNAME0= <>
##$TPNAME1= <>
##$TPNAME2= <>
##$TPNAME3= <>
##$TPNAME4= <>
##$TPNAME5= <>
##$TPNAME6= <>
##$TPNAME7= <>
##$TPOAL= (0..7)
0.5 0.5 0.5 0.5 0.5 0.5 0.5 0.5 
##$TPOFFS= (0..7)
0 0 0 0 0 0 0 0 
##$TUNHIN= 0
##$TUNHOUT= 0
##$TUNXOUT= 0
##$USERA1= <user>
##$USERA2= <user>
##$USERA3= <user>
##$USERA4= <user>
##$USERA5= <user>
##$V9= 5
##$VALIST= <valist>
##$VCLIST= <CCCCCCCCCCCCCCC>
##$VD= 0
##$VDLIST= <DDDDDDDDDDDDDDD>
##$VPLIST= <PPPPPPPPPPPPPPP>
##$VTLIST= <TTTTTTTTTTTTTTT>
##$WBST= 1024
##$WBSW= 4
##$XGAIN= (0..3)
0 0 0 0 
##$XL= 0
##$YL= 0
##$YMAX_a= 613290
##$YMIN_a= -713297
##$ZGOPTNS= <>
##$ZL1= 120
##$ZL2= 120
##$ZL3= 120
##$ZL4= 120
##$ABSF1= 10
##$ABSF2= 0
##$ABSG= 5
##$ABSL= 3
##$ALPHA= 0
##$AQORDER= 0
##$ASSFAC= 0
##$ASSFACI= 0
##$ASSFACX= 0
##$ASSWID= 0
##$AUNMP= <proc_1d>
##$AZFE= 0.1
##$AZFW= 0.1
##$BCFW= 1
##$BC_mod= 2
##$BYTORDP= 1
##$COROFFS= 0
##$CY= 11.3945322036743
##$DATMOD= 1
##$DC= 2
##$DFILT= <>
##$DTYPP= 0
##$F1P= 2.36226072786647
##$F2P= -0.459571619588291
##$FCOR= 0.5
##$FTSIZE= 0
##$FT_mod= 4
##$GAMMA= 1
##$GB= 0.15
##$INTBC= 1
##$INTSCL= 1
##$ISEN= 128
##$LB= 0.24
##$LEV0= 0
##$LPBIN= 0
##$MAXI= 10000
##$MC2= 0
##$MEAN= 0
##$ME_mod= 0
##$MI= 1.114404
##$NCOEF= 0
##$NC_proc= 0
##$NLEV= 6
##$NOISF1= 3.799351
##$NOISF2= 2.8
##$NSP= 1
##$NTH_PI= 0
##$NZP= 0
##$OFFSET= 15.70392
##$PC= 1
##$PHC0= -14075.4
##$PHC1= 15.0009
##$PH_mod= 1
##$PKNL= yes
##$PPARMOD= 0
##$PSCAL= 0
##$PSIGN= 0
##$REVERSE= no
##$SF= 200.130013532006
##$SI= 16384
##$SIGF1= 3
##$SIGF2= 2
##$SINO= 400
##$SIOLD= 16384
##$SREGLST= <1H.CDCl3>
##$SSB= 0
##$STSI= 0
##$STSR= 0
##$SW_p= 3612.71676300578
##$SYMM= 0
##$S_DEV= 0
##$TDeff= 0
##$TDoff= 0
##$TI= <>
##$TILT= no
##$TM1= 0
##$TM2= 0
##$TOPLEV= 0
##$USERP1= <user>
##$USERP2= <user>
##$USERP3= <user>
##$USERP4= <user>
##$USERP5= <user>
##$WDW= 1
##$XDIM= 8192
##$YMAX_p= 0
##$YMIN_p= 0
$$ End of Bruker specific parameters
$$ ---------------------------------
##NTUPLES= NMR FID
##VAR_NAME=  TIME,          FID/REAL,        FID/IMAG
##SYMBOL=    X,             R,               I
##VAR_TYPE=  INDEPENDENT,   DEPENDENT,       DEPENDENT
##VAR_FORM=  AFFN,          ASDF,            ASDF
##VAR_DIM=   8192,          8192,            8192
##UNITS=     SECONDS,       ARBITRARY UNITS, ARBITRARY UNITS
##FACTOR=    0.0002496,     1,               1
##FIRST=     0,             0,               0
##LAST=      2.0444736,     0,               0
##MIN=       0,             -713297,         0
##MAX=       2.0444736,     613290,          0
$$ Real data points
##PAGE= N=1
##DATA TABLE= (X++(R..R)), XYDATA
0 0 0 0 0 0 0 0 0 8 0 6 -8 8 -12 16 -24 24 -32 40 -48 60 -72 88 -103 120 -144 165 -192 224 -257 295 -337
31 -337 385 -437 496 -560 630 -708 795 -887 989 -1102 1225 -1359 1507 -1666 1838 -2029
47 -2029 2239 -2467 2719 -2995 3300 -3635 4012 -4434 4905 -5445 6061 -6778 7619 -8631
61 -8631 9866 -11417 13430 -16164 20103 -26302 37521 -64208 263093 -70842 -713297 -26894
73 -26894 524149 234206 -343802 -240355 104796 183178 59978 13757 -154896 -189847 121109
84 121109 353226 -1982 -407708 -171111 389054 302036 -275916 -360822 125537 316140
94 316140 24759 -212378 -113136 64025 112581 67515 -44986 -174777 -57356 203941 136873
105 136873 -180259 -185911 103444 177122 -45481 -133411 15837 48469 -43847 29031 93797
116 93797 -79390 -160270 70568 213005 -24245 -243839 -32356 235489 66569 -189382
126 -189382 -65716 130120 37135 -83706 21441 85466 -83451 -118881 143863 179559 -158808
137 -158808 -226421 136344 263792 -68457 -260487 7957 229993 37463 -154458 -39044
147 -39044 73068 17618 -1502 31317 -25987 -88019 16153 142218 18421 -169372 -57973
158 -57973 156143 88212 -114828 -106430 60442 94176 -25049 -60981 3156 1737 -5513 45079
170 45079 12281 -79789 -37369 81716 56178 -81538 -72836 72326 62929 -72947 -44325 68716
182 68716 20830 -73329 -15183 81746 19680 -94790 -28507 98097 33014 -82643 -29878
193 -29878 58428 23669 -34657 -1673 33694 -26347 -43904 64211 70798 -79945 -92890 77727
205 77727 122481 -45896 -134670 14024 132808 18818 -95821 -32100 45401 35260 9698
216 9698 -14135 -41598 -23776 51901 73087 -40521 -112029 12570 123023 22953 -109053
227 -109053 -62090 73630 80382 -38955 -76683 880 39062 21106 2259 -33501 -46617 15151
239 15151 69797 14492 -85527 -54718 79594 74836 -63965 -80505 31639 67412 -4346
250 -4346 -49521 -10675 24915 6275 1954 9965 -22691 -24409 31749 39249 -20963 -47523 7635
263 7635 58063 7501 -52899 -7364 45182 9664 -26247 -3300 20497 1524 -16666 12324
275 12324 23530 -21813 -21416 31459 20732 -27436 -17080 21778 18533 -17703 -16160 20239 8220
288 8220 -23828 1362 22548 -8580 -24062 3870 24599 -488 -32992 -5301 32259 1364
300 1364 -31155 -4610 18584 3121 -15781 -6580 11426 -3131 -14069 12551 8925 -24631 -7682
313 -7682 26297 8106 -26517 -16141 25003 22038 -24618 -21058 20934 16080 -10219 -8235 2001
326 2001 6532 3531 504 3604 -5741 -7677 17289 15102 -17020 -15242 15408 23306 -3715 -26231
340 -26231 2033 30262 774 -20993 1465 11440 1734 -1882 -193 -130 -5887 1145 15217 -3573
354 -3573 -22858 3994 20828 -3392 -18383 -5520 13010 8843 -14731 -11439 9625 4195 -6873
367 -6873 -3516 -1807 341 -620 -2269 2306 -4495 -8869 8602 7802 -12856 -7684 8946 7986 -5656
382 -5656 -11572 4759 12604 -5632 -7096 6277 1341 -1080 5052 -125 -3320 42 5081 8233
396 8233 -3786 -9300 7429 11449 -1779 -5606 -1812 6411 8900 -4207 -4746 5169 881 487 6147
411 6147 -1903 -7442 197 8684 7755 -9956 -14050 9117 13378 -5865 -9980 -4090 2677 8645 -982
426 -982 -10550 -5879 1159 9097 3701 -14173 -10839 6142 9256 2194 -11538 -15437 6921 17156
440 17156 -945 -15127 -11775 6700 19510 783 -19661 -10582 10576 20174 1925 -24033 -9296
453 -9296 20270 15060 -5366 -13990 -6963 12114 17054 372 -13499 -12736 9195 27023 3245
466 3245 -26550 -11748 19522 25801 -2315 -30615 -9382 28472 19966 -13485 -23147 -2080 22014
479 22014 12970 -11540 -14177 -4412 8345 18668 158 -24615 -13292 15518 23124 -2703 -31872
492 -31872 -13846 25947 22553 -13083 -30957 -7529 27635 18029 -21299 -23345 3933 16208 9057
505 9057 -8928 -16077 -4110 8286 13974 4471 -20176 -18034 15255 26628 341 -29112 -18667
518 -18667 26605 33333 -14838 -34545 730 30659 15534 -18020 -18914 8496 13944 5054 2458
531 2458 -8665 -14078 7051 24309 9790 -23375 -26473 19073 40653 -4759 -41621 -12937 34403
544 34403 30185 -21338 -36560 6759 29024 5857 -14423 -14511 -2792 10346 11703 1250 -16129
557 -16129 -20536 9327 30521 870 -33780 -21350 22049 35955 -9261 -45027 -9156 37070
569 37070 21715 -22963 -31607 4769 29092 5588 -17721 -10549 341 7760 11972 1950 -13266
582 -13266 -15126 5792 29816 8990 -34271 -22280 29171 36776 -11869 -42329 -2903 42384
594 42384 15788 -28130 -17755 12713 17037 2373 -6548 -4143 -4535 -318 18152 12486 -21689
607 -21689 -23966 15153 34642 847 -39459 -18009 35597 28981 -22698 -33131 3411 28134
619 28134 10039 -19503 -17024 3559 10724 8568 -2544 -17547 -10753 11101 17924 804 -24803
632 -24803 -18728 19883 28440 -9184 -34053 -9543 30822 24117 -22913 -31773 9056 28845 5963
645 5963 -20023 -15972 9931 16954 972 -7074 -7330 -3203 9996 14723 -1587 -17735 -9338 19736
659 19736 24523 -13974 -29042 6915 30093 6504 -22287 -13962 16620 17448 -7029 -11422 784
672 784 4189 4114 1839 -2116 -4734 -4663 4908 11787 -3914 -15904 -1907 13254 7221 -9993 -13878
687 -13878 3929 12456 -1927 -8873 -3925 990 4424 1112 -4950 -3277 -1482 923 4570 -666
701 -666 -6604 -3797 2295 7469 1873 -11303 -6222 10309 8294 -4930 -9906 -991 11067 5631
715 5631 -7380 -5127 3047 5122 3428 -2225 -3775 1274 3142 4527 2913 -6669 -4299 8532 7563
730 7563 -3173 -8149 -260 10765 4185 -8417 -3721 4656 3493 966 -2720 -3397 1688 2456 227
745 227 -46 -3582 -1427 3436 714 -2370 -2876 -2473 2674 2289 -4186 -2709 804 -399 428 -693 -3294
762 -3294 -1087 184 687 1114 -3425 -2704 2497 973 -423 -762 -2995 392 4158 301 -2586 -1297
778 -1297 1155 4326 583 -4431 3 3154 2575 1592 -2756 -1862 4611 3354 -586 -1871 -1436 3268
794 3268 4622 -1355 -2806 284 2878 3954 -1081 -4886 1504 4432 22 -1445 -2295 -332 3478
809 3478 158 -3124 -1598 -213 2384 423 -4606 -2048 2268 274 -1152 -2480 -3116 1890 1764 -2650
825 -2650 -2782 -765 1115 1886 -2889 -3270 1840 1073 -507 -650 -2486 488 2761 -1004 -1742 192 567
842 567 1852 69 -2174 1227 1659 475 1197 -787 -650 3447 1201 -1177 473 1102 1834 1460 -1242
859 -1242 270 1877 60 1054 212 -770 1901 1472 -1978 491 615 -283 987 -440 -788 801 -439
876 -439 -524 -108 -2011 -224 791 -2256 -973 476 -1285 -155 -382 -1915 46 -195 -1337 133 -1097
893 -1097 -1135 819 -1094 -950 838 -1379 -646 1225 -1130 -622 895 -605 446 42 -485 1586 211
910 211 -674 1638 212 -761 1864 1247 -7 491 72 1061 2230 -653 -20 1717 573 1251 222
927 222 -1030 1405 1646 -102 469 -599 -1032 2357 1117 -2119 -1043 46 1769 493 -3275 -1059
943 -1059 1825 -576 -567 -631 -2198 91 1135 -1079 -1528 -1758 -205 1966 -1354 -3378 -323 666 368
960 368 -485 -2950 -769 2062 -82 -525 -504 -1490 550 2303 -745 -1673 -636 1652 2856 -1357 -2214
977 -2214 2324 2043 -52 651 6 -470 981 1732 1759 -628 -2404 2539 4128 -1028 -2746 758 3044
994 3044 1993 -1978 -2168 2729 1562 -1273 415 -27 -1205 -104 1050 1502 -1776 -4018 1655 4106
1010 4106 -2366 -4131 -184 2334 1470 -2821 -3007 825 1194 -675 -825 -1812 -975 1267 325 -971 -903
1027 -903 -1077 1066 1903 -1293 -1821 -695 606 2520 12 -3590 -1040 2740 2685 -843 -3785 474
1043 474 5794 732 -3845 131 3281 1585 -1352 -544 2925 -304 -2464 3139 3986 -2863 -3267 3149
1059 3149 5081 -985 -6186 42 7243 945 -5704 -1171 4069 1850 -2631 -2296 2351 911 -3357
1074 -3357 495 2787 -2290 -3859 1000 3147 -370 -5402 -1589 4764 1397 -4135 -2439 1153 2445
1089 2445 168 -3275 -1274 1783 580 -762 -786 -770 968 329 -652 1409 -382 -2029 638 2724
1105 2724 916 -2171 -2538 3291 5170 -2568 -5036 2181 5628 258 -4626 -517 6099 1492 -4551
1120 -4551 830 4186 -715 -2659 1652 3901 -1309 -4662 1936 6627 -1938 -6132 1172 5881 541
1135 541 -5375 -2253 5113 1858 -4888 -1381 3157 -136 -2862 -527 1727 -173 -3520 -469 3271
1150 3271 -1031 -3791 75 1703 589 -1984 -2388 792 1880 -680 -1498 -1004 386 2190 -473 -2481
1166 -2481 611 1665 112 -612 -90 1283 621 -1376 1291 2681 -1505 -2278 2007 3840 -312 -3905
1182 -3905 87 5414 522 -4692 270 4687 637 -3276 -506 3092 673 -3006 427 3767 -1572
1197 -1572 -3130 1832 2745 -1280 -3769 -30 3798 -506 -4545 -202 2918 -399 -2284 -663 1252
1212 1252 -26 -2271 -10 1179 -1763 -1478 1170 255 -1748 -1156 529 658 -1096 -1337 884 149
1228 149 -1304 1001 125 -1251 259 1295 579 -933 -1113 1713 1711 -1509 -749 2041 797 -665 -205
1245 -205 1399 1001 -1219 19 2759 431 -2274 875 2707 82 -2123 -45 2905 595 -2473
1260 -2473 518 2609 -497 -1646 960 1286 -909 -1441 724 1595 -1718 -2372 1295 1187 -1863 -1615
1276 -1615 412 542 -1057 -1742 951 1086 -2246 -1052 1453 -343 -2116 -555 1202 395 -1944 -758
1292 -758 2064 128 -2185 436 1150 -350 -585 324 1305 -232 -836 1374 1633 -1274 -658 1618 1046
1309 1046 -458 -372 1357 1664 -707 -667 1802 427 -1263 615 1229 -71 -647 -78 1495 216 -1896
1326 -1896 634 1785 -1008 -1176 678 800 -658 -1180 298 936 -1402 -1791 1078 444 -1541 -747 576
1343 576 -86 -1364 -1550 627 316 -2008 -808 786 -38 -1608 -166 739 295 -1403 -667 1700 -389
1360 -389 -1758 366 949 -415 -929 300 1400 42 -1080 885 1076 -813 198 1119 183 -424 -258
1377 -258 860 936 -633 -221 1478 645 -688 391 852 474 -462 15 983 282 -1078 545 1103 -807
1395 -807 -877 237 426 -533 -1175 113 615 -1072 -1019 816 -183 -1085 -486 -127 107 -979 -1080 159 -255
1414 -255 -1299 -336 694 -440 -946 -364 489 377 -1215 -201 951 -393 -1156 506 843 -241 -161
1431 -161 384 997 82 -527 1007 956 -234 137 1202 610 266 -110 525 977 -423 -55 865 667 7
1450 7 492 241 640 196 -165 681 154 -564 476 299 -254 -211 -7 -100 -106 -809 -44 241 -897 -297 59
1471 59 -535 -831 -102 34 -362 -929 -407 580 -301 -1222 20 266 -346 -391 -585 -201 178 -447 -132 534
1491 534 -386 -344 327 367 -7 84 19 886 12 -599 470 748 -34 407 238 232 662 444 515 525 9 399
1513 399 745 82 190 523 66 422 514 311 94 85 60 174 -87 -475 -9 -240 -91 -171 -686 24 382 -920
1535 -920 -681 -3 -167 -270 -312 -616 -256 -514 -696 -239 -335 -674 3 -284 -358 76 -715 -214 687 -184 -659
1556 -659 118 169 459 110 -604 467 679 -87 192 352 126 313 171 61 689 -27 64 583 541 -16 36
1577 36 352 831 671 -803 85 853 409 -114 18 200 638 -416 -306 474 81 -381 -58 -18 -127 32
1597 32 -857 90 469 -718 -907 81 -7 -185 -864 -731 474 154 -924 -676 166 151 -456 -688 -81 372
1617 372 -673 -781 406 113 -670 -504 418 968 -552 -960 752 1039 -565 -451 376 969 197 -497
1635 -497 -33 1072 220 -443 738 462 166 69 -96 735 436 -675 184 1124 187 -587 -132 536 589 -420
1655 -420 -357 554 68 -221 -345 -359 280 -101 -574 164 170 -287 -593 -339 69 -111 -760 -534 652 -371 -1245
1676 -1245 -369 92 43 -751 -1072 355 439 -917 -675 286 670 -344 -541 585 670 -280 -733 777 566
1695 566 -442 -357 473 803 101 -515 479 1073 281 -293 503 599 426 -91 54 861 59 -125 385 182
1715 182 -117 5 93 605 242 -404 23 450 -262 -134 -123 -320 73 -54 -386 -366 68 105 -204 -436 -73
1736 -73 71 -458 -386 205 -128 -538 -300 27 -63 -354 -476 154 90 -535 -593 232 512 -172 -615 -15 481 -297
1758 -297 -526 596 178 -252 112 699 750 -227 -644 660 841 -490 -112 638 424 151 201 333 732 22
1778 22 176 770 0 -390 299 314 81 -333 -229 296 142 -740 -101 78 -474 -408 37 -96 -477 -388 -303 66
1800 66 -598 -352 199 -398 -501 -492 -295 -367 -293 -149 164 -268 -497 263 71 -524 -226 178 184 -127 -471 -75
1822 -75 736 -332 -459 512 295 -362 146 381 470 282 -83 725 556 -138 180 577 232 -11 298 491
1842 491 555 -276 195 757 -64 -422 231 144 132 -118 -99 257 -83 -445 -15 80 -136 -262 -22 -71 -170 -362
1864 -362 -169 131 -770 -337 96 -175 -547 -230 230 -125 -586 -231 328 -205 -290 16 234 -371 4 92 -72
1885 -72 46 -671 154 249 -77 -138 573 87 43 85 252 617 205 -339 833 380 -155 381 679 -69 340
1906 340 70 407 369 -99 50 263 312 -129 172 123 -41 -234 -292 -140 -307 -453 84 -191 25 -205 -19
1927 -19 -409 -77 -711 -294 448 -432 -294 296 -407 -414 -201 137 16 -173 5 -13 -366 -546 -48 16 -315 -334
1949 -334 124 114 -108 -335 386 380 -451 -211 545 125 -56 -322 301 488 23 -171 369 492 -80 122 580
1970 580 290 -178 177 556 447 -6 235 112 -69 -183 223 108 -146 34 307 366 -368 -413 59 244 -172
1991 -172 -467 -278 154 -59 -322 -96 47 -560 -584 -124 -177 -210 -248 -377 -95 -401 -101 212 -64 -485 -155
2012 -155 -4 -95 123 -124 -163 44 -163 328 320 -58 66 158 141 103 47 522 384 -11 34 398 293 -162 114
2035 114 191 194 -346 -78 538 177 -97 -131 707 -113 -195 229 61 99 -259 80 192 -93 -236 284 69 -451
2057 -451 -353 -106 225 -203 -462 -95 12 -369 -443 19 -105 -257 -104 56 -74 -205 -330 124 -327 -745 338
2078 338 51 36 -26 -63 423 6 -247 161 509 -315 98 588 -116 331 -13 395 358 -318 164 521 188
2099 188 119 114 363 507 186 -240 408 256 -367 60 500 -96 200 162 131 189 -688 -58 334 120 -195 -210
2121 -210 -84 10 88 -204 -175 9 -540 -146 -445 -341 208 -330 -352 67 216 -530 2 127 -275 140 -39
2142 -39 -120 -194 -65 -243 121 420 215 -64 -71 484 85 -462 73 266 168 -92 33 646 434 -74 92 346
2164 346 234 5 381 280 496 222 -269 276 365 -160 110 150 43 244 -189 -243 429 -205 -343 53 131
2185 131 -249 -18 -385 230 188 -275 -143 309 162 -87 -289 38 408 -452 -403 188 67 -378 -148 -42 21
2206 21 -134 -601 -79 116 -244 -155 241 133 195 97 -48 466 -30 -190 127 266 213 -30 121 318 523 189
2228 189 350 42 171 -67 26 65 195 167 -292 123 216 -97 34 -187 380 117 -367 -22 268 33 -676
2249 -676 139 368 -237 -503 -189 333 -117 -506 -469 59 -148 -364 -810 151 -14 -335 -252 279 -94 -447 -267
2270 -267 80 49 -84 -237 135 30 -497 -63 292 96 -53 -184 21 292 98 -127 308 201 -211 86
2290 86 149 251 335 63 232 255 21 75 370 -37 95 227 -16 57 362 48 -12 -255 277 208 -239 -329 410
2313 410 -195 -237 -120 56 267 -224 -521 152 346 -724 -229 -222 131 -126 -327 17 25 -254 -694 264 336 -284
2335 -284 -233 -40 359 -244 -375 385 171 -473 194 353 -58 10 128 255 347 -160 -222 755 -65 -93 318 167
2357 167 -33 174 82 131 308 254 351 212 -181 204 370 -64 -149 -134 133 83 -395 -30 119 -110 -232 154
2379 154 72 -404 -101 -200 378 -324 -474 154 152 -417 -329 43 128 -141 -452 -242 78 -160 -379 307 -117 -248
2401 -248 89 -175 293 72 -261 76 159 -231 -59 285 -78 -55 -159 183 254 -73 -4 431 -294 -32 289
2422 289 157 -95 2 118 283 -282 -261 708 360 -134 118 679 -37 -132 33 252 -7 -742 -135 586 71
2443 71 -224 95 138 26 -383 -110 192 -256 -481 -24 376 -366 -89 -9 136 -224 -443 -150 270 87 -392
2464 -392 -17 -277 40 -122 -25 26 -187 -85 286 343 -333 182 266 238 -56 -195 138 168 -176 60 397 -148
2486 -148 210 312 288 -175 22 269 285 168 -188 463 376 -292 299 225 -24 -144 58 -95 204 -453 -76
2507 -76 658 -45 -174 -121 32 -123 -201 -200 310 104 -705 14 56 -389 -4 91 98 -95 -344 336 160 -504 -270
2530 -270 378 159 -350 -23 -106 227 0 -260 233 357 -306 250 177 208 -78 -260 371 148 -272 95 311
2551 311 162 -94 321 149 381 -85 95 426 -33 -49 82 134 -298 -13 -4 9 228 -22 266 336 -38 -103
2573 -103 -114 -247 -174 -228 -3 81 -186 -319 171 -202 -267 103 48 -350 -105 -85 72 -25 -243 229 -63 -352 -314
2596 -314 259 -135 -165 -122 -8 60 -3 -123 366 95 -248 116 170 454 -26 -56 252 155 -234 129 467 -89
2618 -89 -30 130 303 427 -273 -116 281 -88 -190 350 145 10 126 -11 -302 251 61 13 222 -294 196
2639 196 364 -328 65 109 33 28 -294 -13 150 -294 -91 89 -80 -308 -240 -125 -14 -301 -718 278 237 -739
2661 -739 -6 -21 -171 -26 -1 -322 195 -250 -70 307 51 -18 149 73 161 -110 -665 200 508 -92 -59 154
2683 154 201 420 160 97 -15 67 -84 284 86 93 249 -102 -2 372 85 27 62 -86 96 15 -254 227 122
2706 122 -311 -61 188 -225 -160 -238 -105 299 -89 -352 161 54 -317 -159 66 146 -260 -372 250 214 -522
2727 -522 -196 353 260 -14 53 -83 532 -120 -355 -43 89 65 18 -362 -160 404 -350 -136 543 207 78
2748 78 -332 100 210 -104 -346 423 412 -8 29 19 184 279 -90 4 422 -10 -69 -70 217 -28 -479 -36 314
2771 314 -127 -308 12 362 335 -500 -16 112 113 -286 -158 -53 -146 -304 -145 -371 -87 175 -369 41 62 -522
2793 -522 2 -18 -66 -34 -183 -289 350 -81 -121 -146 53 389 199 -434 116 504 -84 -1 128 343 101 -117
2815 -117 271 603 228 -151 508 387 -2 20 69 268 123 -549 250 619 -174 -275 -145 199 28 -249 39
2836 39 368 58 -612 104 76 -99 96 -270 225 107 -139 -331 34 -220 -207 -145 -141 -57 183 -104 -190 138 19
2859 19 16 -176 -226 154 -12 -200 142 111 -6 138 -106 234 169 -444 33 367 -51 -39 46 140 472 -341 -367
2882 -367 882 291 -511 254 276 -181 19 -198 405 383 -217 388 96 -367 -279 -57 168 268 -347 -382 312
2903 312 -60 -137 92 -42 -250 -252 -49 -67 38 -25 18 49 -393 -83 349 -407 -150 49 -80 -197 80 -20
2925 -20 277 -400 -104 435 -158 -421 -32 525 -4 -252 -385 114 319 -509 -71 420 369 -339 -149 180 419
2946 419 -192 -190 657 186 -382 110 491 297 -25 -76 481 364 -541 -3 180 -81 103 265 64 279 221
2967 221 147 225 -19 -390 344 113 -16 -161 -130 -36 -164 108 206 77 -572 173 242 -711 -389 197 46 -143
2989 -143 -624 137 266 -396 -374 340 15 -154 -231 262 233 -235 -369 259 409 -679 95 232 199 -42 -317
3010 -317 5 593 0 -115 457 274 -363 32 182 218 -62 -59 435 -196 -399 -179 593 -375 79 147 -21
3031 -21 -91 -58 -57 351 -663 -71 307 -171 -521 -395 -19 193 -419 -538 453 208 -477 -169 305 -447 -99
3052 -99 113 58 -131 -643 -233 658 -84 -583 219 290 -96 -309 -169 317 -149 -348 231 556 -231 -271 368
3073 368 169 -157 -228 350 324 -338 -10 572 45 -179 212 -49 189 -204 -68 177 182 -179 414 221 -145
3094 -145 -222 390 202 58 -393 192 681 -278 -519 371 -155 -549 -68 79 423 -164 -559 207 298 -892
3114 -892 -92 451 -122 -249 -154 443 184 -454 -204 452 -245 -335 -59 186 33 -49 -45 155 -171 -399 373 93
3136 93 -104 -42 99 301 143 -243 227 249 -112 -129 632 -156 -182 155 324 70 -155 -166 431 -259 -717 -29
3158 -29 500 -360 -414 239 194 -110 -353 -55 491 -576 -182 490 -26 -359 -235 50 152 -466 -521 472 16
3179 16 -542 -202 106 -26 86 -312 75 -32 -233 45 266 96 -43 -61 -36 37 115 161 110 -123 1 675
3201 675 33 -192 242 274 84 -136 25 630 370 -242 -7 531 -131 -80 109 18 149 -96 175 682 -98
3222 -98 -263 39 584 -75 -405 100 395 16 -852 -55 458 -349 -466 240 162 -49 -222 -202 328 -320 -270
3243 -270 76 395 -374 137 -277 79 159 -253 76 80 -245 -48 158 -373 -187 86 252 206 -142 -85 348 -52
3265 -52 51 372 11 -162 133 415 23 16 2 307 286 -517 234 655 157 25 56 -161 114 -135 -40 298
3287 298 36 -393 526 199 -212 10 -307 318 44 -545 45 469 -10 -383 33 -383 58 -80 -589 217
3307 217 75 24 -98 -267 -66 212 -554 -126 234 -392 -246 99 41 114 -189 -78 208 5 -230 87 58
3328 58 70 59 -213 -291 602 41 -56 277 162 46 -175 123 148 389 -584 -59 545 -339 -275 -119 -217 377 -185
3351 -185 -276 672 -97 -175 349 93 61 189 -198 -82 266 -451 26 128 -20 87 -248 -85 169 -188 -194 173
3373 173 175 -50 -134 -266 12 393 -151 -51 195 -148 -336 -321 -118 184 -83 -230 186 94 -309 -153 34 140
3395 140 311 -198 -185 658 113 51 -7 -200 192 -63 -117 140 309 -89 -138 232 -99 166 61 -381 429 -237
3417 -237 -127 205 337 -169 69 -152 159 554 -388 -80 329 56 -441 -172 65 413 -136 -395 506 401
3437 401 -315 -82 -62 286 16 -98 -180 222 -340 -423 118 153 114 19 -95 272 -47 -427 380 26 -302 -36
3459 -36 -10 -166 173 -374 152 153 -474 -62 309 -109 -61 320 -332 170 327 -83 81 11 118 253 -48 -107
3481 -107 320 132 -123 275 219 68 394 -345 351 393 -362 -80 201 179 41 -350 -183 232 -438 -311 82
3502 82 -91 -73 -82 -287 102 228 -292 51 325 -441 -111 80 -145 -92 93 -331 343 -92 -496 233 130 13
3524 13 180 17 3 143 -169 114 118 -84 164 539 -305 41 414 -284 -80 126 31 81 -116 -264 321 135
3546 135 -67 201 -40 14 92 29 431 424 -415 127 594 -63 -327 98 210 177 -356 -23 457 -407 -369 53
3568 53 485 -326 14 -14 107 126 -453 183 289 41 77 -51 -74 59 -169 -195 154 -318 -396 241 -38 -383
3590 -383 -117 128 81 -234 -25 221 -75 -137 49 261 -89 205 231 -245 74 -56 -4 368 -181 -89 520 -315
3612 -315 -5 277 164 142 277 -93 301 51 -276 -228 14 -339 -199 -118 -188 66 -204 18 205 -79 -205
3633 -205 201 -28 -19 110 54 108 -24 -350 -106 26 -367 52 76 34 147 -115 -251 366 133 -110 171 22
3655 22 -88 -240 -205 -52 -17 -424 199 -121 -108 250 271 -83 74 195 -40 148 -166 -238 369 -91 101 515
3677 515 -205 18 305 197 -152 -103 -166 125 385 -218 67 185 -213 326 -404 190 284 -24 211 176 -78
3698 -78 -83 121 -28 -322 -109 167 360 -87 -309 71 142 -140 -83 73 55 2 -35 -246 208 -214 -115 109 -4
3721 -4 -12 285 -63 77 115 -302 155 70 -184 116 190 -279 99 144 181 159 -463 -117 419 -122 -312 389 -14
3744 -14 -44 -62 -219 445 296 217 224 11 -43 371 311 32 -18 -101 -12 300 -178 26 111 -217 68 163 36 -12 72
3769 72 18 66 -78 -85 229 -189 -247 -99 99 -135 -24 70 12 192 -283 76 299 -105 -14 293 -88 230 9
3792 9 -173 430 242 -442 -100 206 -32 354 98 134 120 -221 71 50 19 -19 241 -235 51 12 12 146 168 8
3816 8 130 -83 -83 209 -267 158 257 28 18 213 -3 79 94 -229 -213 -129 -307 -233 -166 14 17 -257 -380 124 91
3841 91 -184 69 -10 -74 100 -161 -53 106 12 -32 471 -131 111 81 -287 193 -13 -317 168 -25 -281 16
3863 16 256 124 210 -1 207 81 -141 -78 -51 15 10 31 7 314 11 -39 96 91 -273 187 -150 -353 98 -78
3887 -78 -314 400 -163 -62 246 -166 210 13 -239 -121 165 -150 245 94 -232 329 -166 -58 133 325
3907 325 -95 121 87 131 208 -157 11 321 10 -87 14 -347 13 64 -90 180 311 -291 117 251 -400 126
3929 126 -58 -133 11 -411 90 5 -149 -81 74 -45 192 -135 -240 -54 83 108 11 277 455 262 -247 -105
3951 -105 82 -91 -236 -140 -169 148 167 -201 382 425 -220 186 226 146 -38 -15 -192 142 60 -140 -30 -76 -249
3974 -249 -58 -342 144 41 -491 -25 227 -6 110 -272 -192 381 -268 -12 210 203 -57 194 179 71 55 -304
3996 -304 -168 208 -118 -65 553 96 -31 35 -250 236 21 -351 237 162 93 78 -154 108 53 -7 96 120 48
4019 48 -191 207 -73 -59 -368 -203 46 113 122 -53 145 -163 97 -218 -338 89 -246 -70 14 42 198 13
4041 13 -337 151 98 -182 -200 64 -231 -111 88 -19 232 -320 56 390 59 11 -52 -15 40 190 -308 -49
4063 -49 440 -175 70 110 -37 77 51 85 130 -41 -175 -63 137 9 19 -219 14 -33 -71 -188 68 -71 -405
4086 -405 118 -284 45 81 -137 240 212 22 199 110 -24 -117 -177 -324 30 24 -34 -82 -217 -91 -85 -190 161 260
4110 260 -257 -227 53 26 216 29 -57 192 -273 -80 266 -187 -55 65 -241 468 196 -541 88 345 -109
4131 -109 -19 233 -101 38 -72 111 242 -23 -25 396 -49 137 27 -355 29 -10 -435 168 152 -64 225 22
4153 22 -143 -34 70 -9 413 -199 178 -16 -33 -205 -105 -83 -126 40 -166 -221 296 -181 43 302 102 -30
4175 -30 162 34 5 -4 99 22 -252 28 134 222 -421 -4 -320 72 47 -246 351 96 -80 239 222 28 -84
4198 -84 63 140 422 -422 -86 221 -50 -24 216 140 -173 534 2 69 101 -103 74 312 -75 342 24 117
4220 117 2 -118 -40 237 -103 -57 133 -355 -93 170 6 -241 162 -52 110 -75 -210 -190 162 -608 99
4241 99 -12 0 41 3 73 76 -105 -150 485 -54 -16 78 -99 164 -156 -137 -105 47 0 163 38 -95 176 65
4265 65 -77 73 -295 -139 220 -130 -36 22 -137 119 140 -80 -154 -256 -135 101 222 -344 108 411 -242 -195
4287 -195 -53 -80 -102 -404 -107 121 -60 -237 153 -150 -110 -304 -213 35 3 -86 71 127 -114 26 -101 -208
4309 -208 4 -134 -32 64 -338 400 137 -92 -75 121 -140 161 43 -116 384 -76 -135 183 142 -244 130
4330 130 -211 -74 145 1 122 -22 -408 -147 -11 -111 -387 187 70 -61 -193 -130 -56 -83 -155 282 36
4351 36 -312 78 -172 121 146 -295 4 283 68 278 180 40 145 -274 -51 52 -118 -226 147 -5 214
4372 214 -196 -41 381 185 -2 -99 69 -241 243 61 -202 -258 95 7 38 107 -100 -100 -47 60 131 -87 -34
4395 -34 112 135 -77 -18 86 68 18 -105 86 65 15 166 162 -42 -3 -204 -94 -53 -51 -228 36 84 -108 -80 -320
4420 -320 -90 101 -261 -96 131 -2 -91 153 -329 223 -69 -49 -220 -174 110 225 -74 -274 -134 1 37
4441 37 116 -170 -68 -38 9 196 32 -374 -208 265 -16 -174 -152 -218 135 -220 -19 280 -26 -130 -38 294
4463 294 201 51 1 188 145 150 -15 267 -163 -72 -11 -89 152 218 -179 16 101 -128 -135 83 203 37 -312 67
4487 67 75 -271 -157 -62 91 148 94 48 -76 110 -272 177 -116 -8 -2 -292 138 -40 -231 -166 169 283 181
4510 181 -137 -54 -63 98 -185 -94 -80 286 192 -36 -27 182 169 -310 115 -122 -212 77 346 176 26 -253 53
4533 53 243 -335 -170 -218 101 172 178 183 371 154 206 94 -51 -6 178 -53 -38 18 -112 -176 -103 -141 122 81 -235
4558 -235 39 275 -222 136 145 -176 27 42 -90 -236 -237 -19 94 -231 -37 98 -143 -161 72 -70 90 -63
4580 -63 -174 183 27 110 -108 129 -53 116 20 -13 -46 110 64 237 -100 -229 38 -173 233 -86 -89 268 245
4603 245 -67 242 -177 -203 288 70 11 47 95 81 66 -73 172 166 -203 -48 -48 -98 -244 94 57 -288 -148 -88
4627 -88 169 -205 115 -10 -239 121 347 80 -69 -19 92 -34 -46 -127 94 81 -179 -64 -144 102 -40 67
4649 67 -208 12 -49 94 284 143 273 176 55 23 -11 36 78 -166 -62 102 151 161 224 -3 73 345 -249 -159
4673 -159 107 144 130 -2 105 31 332 -243 85 127 -36 84 -289 -131 -138 -327 -83 137 -12 -212 -178 -203 35
4696 35 -141 -10 57 243 -110 -72 -52 87 -49 -10 19 247 -108 -380 81 -145 79 -184 -190 49 183 31 158
4719 158 40 79 -16 175 170 338 107 -309 -126 -179 -152 278 -35 -123 17 -334 -34 121 48 -313 89 -105 215
4742 215 -33 -501 -108 -41 22 60 -425 -233 -65 87 -25 268 69 19 -26 23 -75 139 209 -21 109 -40 -300
4765 -300 24 -264 -90 104 -11 -45 -21 -334 -30 70 -14 108 7 12 -39 173 107 12 -19 -92 142 -46 190
4788 190 -127 132 130 57 -74 -144 -322 -137 -74 7 183 56 -102 -203 117 -65 108 -3 -147 150 -156 -86
4810 -86 140 310 -46 -9 44 64 3 -59 74 -18 -17 -4 119 31 -68 10 36 -154 16 -406 3 -167 -221 -251 -52
4835 -52 -218 284 -223 -70 75 -201 10 91 2 -43 27 -160 289 -70 -176 1 80 -112 65 86 -344 175
4857 175 -224 60 -200 -119 -123 250 234 -92 -74 63 -5 244 -161 211 80 -196 -44 -135 -175 -40 230 -96 -67
4880 -67 -263 153 84 112 122 98 -72 -181 -86 160 95 140 56 104 11 146 -79 -49 64 93 -97 -44 168 200 202 2
4906 2 6 -5 211 -250 -322 48 -168 -175 309 56 178 223 177 141 106 -73 150 -113 -46 -221 158 -111 213 -153
4930 -153 264 85 31 33 -43 -63 -166 -82 124 221 -207 0 138 15 3 -19 165 116 222 -226 -181 -59 -296 51
4954 51 -259 -105 -119 -92 -189 -55 -209 128 -58 -194 -71 96 -58 -325 -137 53 128 -179 8 139 23 49
4976 49 185 87 25 31 33 -196 232 114 -97 143 61 111 54 74 242 -51 -68 -114 -131 -56 -25 135 110 36 2 -31 126
5003 126 -133 80 -75 8 -109 -162 -31 -162 -25 -226 -128 26 25 95 317 -40 -64 -2 89 -81 -116 -158 22 163
5027 163 -493 -106 -158 -136 131 56 36 190 -25 66 65 -377 -68 -157 6 173 126 69 -79 -6 177 -48 179 -32
5051 -32 -38 174 258 -9 -208 -211 -5 -28 90 -113 -151 127 68 21 54 31 47 55 -110 -16 -272 22 -160 61 18 220
5077 220 65 96 -64 154 -79 158 -17 -188 -20 105 -89 225 -72 84 143 -224 -68 350 148 -73 148
5098 148 -6 -35 291 80 -178 -38 -123 -120 -121 -89 137 230 338 12 -68 -127 -68 -1 -78 37 -65 26 -232 221 -108
5123 -108 -114 75 -84 -124 -58 104 -110 1 54 -240 32 -238 181 111 -2 196 -286 -82 -70 50 -63 -66 -67 -3
5147 -3 -181 -169 123 -269 67 261 -12 -213 -160 86 -56 -155 212 -262 -87 16 -18 41 119 75 69 73 -314 -35
5171 -35 192 119 -62 -25 25 -19 -122 72 189 -87 -213 24 -267 -15 -245 90 67 -25 -68 125 -55 -363 372
5194 372 -13 -7 222 28 -4 58 -20 -146 102 60 171 -124 40 121 -7 -14 -323 -98 48 -123 -110 45 205
5217 205 -238 -129 -96 161 186 -86 -137 86 140 39 174 92 160 -253 46 81 -335 52 -120 -132 40 -79 -11
5240 -11 25 290 205 67 -102 11 -2 118 -52 151 -202 -108 -258 87 90 8 -188 8 33 98 -55 -100 -2 152
5264 152 -85 -172 97 -5 110 136 -139 -88 -106 -51 94 32 -118 -5 48 -90 -102 -34 190 -11 -192 -207 178
5287 178 -15 -18 -71 75 243 -92 -245 -95 60 128 132 -12 -24 -34 -72 152 8 162 101 116 13 -34 -184 -218
5311 -218 147 162 84 149 4 451 -150 -58 96 300 -238 -10 -45 -112 129 190 -269 107 34 -211 135 142 -96
5334 -96 -37 47 -83 22 -79 103 70 -77 17 10 -149 92 56 -44 -94 -74 159 -205 -547 -196 -203 -253 -342 -87 44
5359 44 -39 -53 -123 98 62 235 -14 82 365 114 75 65 -24 3 -28 31 -8 -210 202 -105 350 67 36 -246 -82
5384 -82 -66 -41 -131 -30 -127 -103 -208 175 -23 -172 225 345 -37 -33 -25 -135 230 126 -60 -144 -242 -75 145 -148
5408 -148 -214 -85 115 -63 -93 59 178 283 -97 113 77 52 26 -184 134 14 18 74 -33 -74 -31 -154 112
5431 112 22 166 -52 33 97 95 -177 115 151 -137 -97 -34 -121 -9 105 -155 -47 164 82 25 46 -13 -151 -9
5455 -9 36 3 88 -41 -27 196 26 19 138 -256 126 -294 91 -191 -160 -20 -18 272 -111 154 -132 0 27 -1
5479 -1 -113 74 201 17 13 -151 120 -70 -10 94 -51 -94 171 -11 -124 -103 207 246 31 61 85 -7 100 146
5503 146 -207 74 -107 149 -126 86 126 340 -227 -273 -287 -28 47 -237 -34 63 -158 -223 31 -161 -198 -4
5525 -4 232 3 -312 -151 14 159 67 -88 169 -259 -51 -30 128 282 -91 -6 -99 156 -201 -46 -12 78 194
5548 194 33 166 53 116 96 3 19 100 47 90 -23 -58 64 26 -233 211 24 -173 72 114 -35 254 135
5571 135 -185 -165 -186 -102 310 87 58 175 -75 -279 -133 -4 -73 81 16 225 -60 -196 205 -48 187 -125
5593 -125 74 172 -159 40 -168 -12 -36 283 -85 -192 113 -208 33 -152 -184 31 62 39 35 74 -194 -27 21
5616 21 134 2 156 -72 71 201 -11 8 -97 -55 -79 114 235 -66 4 -216 37 142 -137 88 -90 -12
5638 -12 2 47 57 -251 105 141 -262 13 115 -133 87 -28 -471 -103 -136 192 -139 246 -160 -13 63 -229
5660 -229 139 111 102 -60 -94 131 32 -3 3 -126 -226 10 79 -64 392 178 -31 -265 85 54 -102 -130 314 -36
5684 -36 48 -170 74 133 -89 129 247 134 77 -80 -129 37 -121 106 -122 93 229 -41 200 214 -122 -252
5706 -252 109 210 199 -183 -97 128 18 -99 71 10 -22 -29 -43 -247 -69 -86 -256 61 167 121 -348 53 0
5729 0 -68 -21 -99 127 -7 113 -79 161 -72 -213 12 51 491 -229 -121 85 -94 177 49 53 -159 -76 88
5752 88 284 130 -77 -33 -14 208 85 96 136 -133 75 -254 46 -106 10 47 13 -145 177 87 -99 -11 70
5775 70 438 118 59 60 200 199 146 131 -168 -36 113 -17 73 -216 -12 305 -51 -40 -167 -187 -123 -92 -104 -8 210
5800 210 -235 -44 110 -77 29 38 -149 21 -43 -82 -227 -32 139 -234 170 17 110 -12 563 121 -257 -102
5822 -102 -54 163 22 100 161 138 16 -191 -118 -164 82 38 -50 -87 137 63 314 255 81 -5 85 106 345 18 57
5847 57 154 -261 4 -209 -108 33 141 48 39 -73 -122 -83 92 -262 153 10 229 -31 143 -63 166 109 -217
5870 -217 62 95 114 55 91 40 141 123 -163 70 -71 30 -3 -47 102 -210 70 52 196 37 9 -21 117 65
5894 65 216 44 57 -29 119 65 305 -140 -30 53 220 40 -148 56 174 -24 -34 -120 433 -371 29 -17 -48
5917 -48 -88 -195 17 -174 4 5 225 -37 -153 18 108 117 -219 282 -59 -122 -161 -292 -244 21 -44 -2 -12 192
5941 192 -2 5 -131 32 -124 55 -103 24 36 56 108 -94 152 201 117 80 -194 183 129 -219 43 147 -145
5964 -145 20 -129 -91 8 -36 32 -83 -138 88 -94 -232 88 109 -149 -238 49 -47 -116 -84 90 -45 63 6 191
5988 191 165 49 1 -8 121 -149 5 60 -48 181 -10 -35 -232 40 139 -154 -50 -101 -89 133 -70 -142 139
6011 139 -46 -89 29 -63 115 382 4 154 -213 25 11 -209 -153 -103 -23 -28 -86 62 3 31 125 101 -196 200
6035 200 74 97 42 -128 243 -307 94 -242 45 -2 184 130 265 137 79 -259 -63 124 173 201 -54 -37 27
6058 27 -94 87 110 45 20 -105 26 -61 15 -9 122 112 -16 -56 85 63 36 -245 -96 -96 -103 98 77 -273 -4
6083 -4 -64 93 78 135 203 108 -137 -76 -215 2 176 12 -104 79 -147 -127 -159 -56 -36 150 33 -207 -167 69
6107 69 -105 281 -32 -164 184 -11 210 -117 -10 -165 202 -257 84 -123 -99 151 92 230 38 20 -43 219
6129 219 -182 264 57 183 111 -2 -297 -48 64 88 132 -183 -137 130 -4 62 -56 185 -142 18 -38 201
6151 201 -198 89 139 7 83 21 72 157 126 251 65 34 154 -310 120 -68 72 168 -80 272 240 -1 -22
6174 -22 171 37 -216 -21 101 -142 -272 88 -173 407 174 237 125 -181 -7 -253 -103 -5 -65 -158 116 -345
6196 -345 -183 256 -165 -85 -73 -6 22 -124 -226 54 15 303 73 -97 -130 -61 11 -74 -61 114 138 114 -221 80
6220 80 254 157 70 38 -240 157 -130 -121 114 115 347 93 -82 33 -94 -128 44 120 -70 -375 -17 -63 107 159
6244 159 119 -209 40 -126 -94 -275 -147 97 24 111 24 8 -171 -123 -157 -62 -22 101 189 96 62 80 79 -154 80
6269 80 -206 30 -76 -8 243 -1 -53 -100 -43 -77 -3 123 -51 44 216 12 55 -152 135 274 -144 -54 58
6292 58 68 14 36 196 -93 20 -273 208 -43 37 -153 -19 -371 123 -216 -71 -237 -89 -78 207 -56 -118
6314 -118 6 115 -280 101 17 -322 68 -31 18 4 -76 -285 -142 140 355 34 -40 -81 -33 -115 -147 -75 -48 19
6338 19 16 106 125 -158 -94 -57 31 -144 212 194 161 -185 -38 -96 -2 38 105 232 66 -23 -138 -119 -4 -118 90
6363 90 227 -21 -64 38 104 267 -161 -103 62 51 64 11 -182 -219 -72 -71 38 -142 -132 4 23 -162 109 196
6387 196 280 57 -20 57 81 168 -282 -185 14 -29 164 -238 29 74 -182 93 86 83 -132 174 17 86 179 -77 39
6412 39 -245 -296 28 295 -113 -210 170 54 243 178 -183 -68 99 50 -48 74 -67 393 127 -250 149 44
6434 44 226 131 -157 7 156 -118 -19 -267 133 270 88 -183 -160 -80 -90 233 -192 -50 -54 -73 -5 -228 106
6457 106 -134 -249 171 -89 -163 -61 -23 -26 -113 87 -115 27 -202 -54 -120 -24 34 -198 77 -209 314 7 94
6480 94 12 -119 -127 95 -43 -21 108 106 -374 89 192 38 98 50 306 -54 -4 145 4 -102 -75 -129 -177 -172 -21
6505 -21 174 9 -21 86 -112 -110 -621 -88 19 -138 95 -48 25 136 -118 -219 4 131 319 227 12 -234
6527 -234 291 -93 85 162 -89 158 240 -108 -283 -171 48 395 -151 -98 -35 7 240 31 144 -117 106 73
6549 73 -45 101 51 77 51 -278 -263 21 -46 -295 -118 -18 1 34 120 -53 -429 -11 93 -29 -6 -80 -142 170
6573 170 -38 -218 203 -38 -95 -132 -63 1 136 -294 16 -120 80 -41 -148 -295 -104 -15 -176 238 143 90
6595 90 19 74 -93 -119 113 -8 6 227 -132 217 59 430 28 -106 91 -100 -43 214 -62 134 -124 -133 27
6618 27 -9 442 -191 -192 -10 43 -186 -74 -14 64 121 113 -243 61 90 -90 -114 -94 121 -128 201 -27 -9 -142 233
6643 233 1 -19 -35 -64 -59 294 -22 93 -199 97 -33 55 78 -113 67 -46 109 -115 116 -60 -47 104 144
6666 144 85 41 131 -103 -139 -130 -191 27 100 153 71 -315 219 -55 52 -1 318 171 -74 85 37 -66 55 121
6690 121 111 -229 138 135 28 22 -86 104 76 67 40 -114 -137 -1 2 -85 -55 310 -211 -15 -116 -33 -235 -174 -158 -47
6716 -47 30 -86 124 228 -33 55 -114 108 155 80 251 353 -116 -95 83 -56 -125 117 97 255 108 -42 272
6739 272 -179 -92 -30 140 -286 70 -231 -96 -16 93 11 81 18 -99 -29 -114 -278 327 -21 104 -24 -235 -92
6762 -92 -26 -12 99 34 68 208 176 -12 24 -1 106 140 -187 168 59 -103 -201 -100 32 16 -15 -280 -24 140
6786 140 262 67 176 87 136 -76 -59 346 35 -68 180 55 124 -171 -155 139 160 137 7 -48 39 -111 -269
6809 -269 367 71 -107 23 401 -24 -29 116 44 -126 -180 -124 85 31 -192 86 51 -233 13 40 -147 99 95
6832 95 -95 -112 161 -214 -270 30 261 68 -100 -200 18 12 -182 224 -69 -143 -28 -163 -123 -51 -121 97 63
6855 63 -31 35 -134 -158 218 -65 33 -96 128 49 171 -236 102 232 -200 -81 97 172 -88 108 -100 -196 -207
6878 -207 -33 68 -249 325 131 71 -112 -35 -157 -179 -240 59 -26 -150 3 132 68 -40 -145 15 -65 86
6900 86 70 117 7 -95 -55 24 -59 51 -31 72 374 127 -157 322 21 55 147 -121 9 -256 -99 -81 39
6923 39 -101 -287 156 -46 -61 -23 -66 16 45 70 -23 8 121 151 -93 57 134 -52 48 -205 -20 105 2 207
6947 207 4 -189 82 -7 -7 -6 75 110 135 89 -167 143 -28 -97 -168 -114 -98 79 -15 -26 -111 82 -26 -14 19 -15
6973 -15 241 349 50 138 41 2 2 169 289 -106 52 247 43 -138 -109 -145 -76 -97 152 -35 -167 -100 329 -11
6997 -11 230 43 -42 48 -53 -50 136 -114 159 -130 -12 106 -137 151 87 -115 -64 69 -178 48 -13 -137 50
7020 50 44 -299 -18 -68 42 65 -165 -90 270 229 0 -232 -65 59 218 36 93 116 89 230 431 -111 240
7043 240 -47 148 344 -61 -7 -95 -123 89 132 -4 -178 -7 -13 -61 51 11 -48 -24 90 243 -295 -101 -150 -55
7067 -55 -121 -127 -110 52 -66 -156 -176 -84 26 -43 -59 34 -32 -99 95 -47 -56 -33 15 -388 -68 170 -277 -141 -248 -131
7093 -131 -13 -29 -147 -69 -104 122 17 150 95 113 -12 -84 116 254 0 30 312 -76 85 -153 288 83
7115 83 -45 64 244 48 69 163 -36 5 219 68 37 58 -107 -4 49 139 -71 -90 -52 131 87 -167 -119 242
7139 242 -240 145 -205 -57 174 -105 150 -170 185 -130 50 -185 -88 -11 28 240 -46 -18 19 -139 -47 -95
7161 -95 -47 253 -159 -128 109 66 -39 -19 -127 -274 -5 -19 -3 254 13 -127 9 26 32 207 37 142 242
7184 242 38 -193 211 -25 -115 163 -287 214 129 -200 -256 -90 -163 -60 32 -105 294 12 167 -16 216 239
7206 239 -115 -31 -108 -136 -97 -160 155 -102 35 96 100 310 64 -174 -315 61 -1 48 1 -107 -78 19 -37 222 -50
7231 -50 234 239 7 50 -205 20 68 -73 -163 178 -80 -126 118 70 6 103 -33 -59 -196 -138 -25 49 -177 -122 -183
7256 -183 -257 150 -39 7 52 50 -237 -5 -6 -15 68 -203 19 181 76 85 18 -19 233 95 86 -11 -229 -47 -132 10
7282 10 -176 271 -317 -59 117 167 129 -192 197 141 -16 -14 79 92 -118 42 118 -15 83 -41 94 -114 111
7305 111 -102 101 165 -210 53 -82 154 4 -26 245 147 252 235 90 59 86 -89 223 9 -180 -116 -7
7327 -7 -55 1 19 -58 -112 109 -303 252 10 154 45 9 -65 -120 290 -174 -13 -115 -27 50 130 -201 13 7 -317
7352 -317 109 -180 221 132 20 -120 169 -62 -52 -281 -109 -28 70 101 2 -112 264 -274 -6 -33 287 -90
7374 -90 -17 73 214 -172 -38 68 37 129 22 -9 -36 80 -178 -120 23 253 -121 -56 65 1 -60 11 -174 30
7398 30 -135 55 -127 73 -372 74 -36 139 225 -114 -21 41 174 -251 -125 116 -79 350 -97 79 176 -77
7420 -77 -29 -195 -147 -164 99 -212 85 133 47 81 30 177 182 119 -100 174 -91 7 33 48 -146 142 -78 -98 -118
7445 -118 -213 355 -102 -75 90 -43 133 -37 200 -233 177 -148 174 175 313 -331 -128 -246 -97 -86 41 -33
7467 -33 -188 0 -25 -19 -229 86 -160 -86 -36 -157 -178 -11 18 77 -16 100 164 -87 -244 10 -149 141 104 210
7491 210 -68 -38 -382 -101 47 -97 51 78 99 147 55 -478 -4 -85 -68 -92 241 -220 124 -24 -79 185 -251
7514 -251 -79 25 -355 -41 181 8 -146 -111 -325 243 -257 -56 24 -33 -174 43 -140 -351 219 3 -296
7535 -296 -200 -42 -209 34 22 -57 -40 -235 -102 -19 -138 -16 -200 47 64 315 130 -207 8 201 210 30 -140
7558 -140 73 126 62 -29 -135 -139 217 81 465 -114 96 -165 -75 153 134 238 107 13 193 -65 34 -15 -36 123
7582 123 21 179 -150 -61 -119 -133 140 -191 -293 -48 -181 -110 -123 97 432 -72 -83 31 -8 49 -122 23 224
7605 224 -137 14 252 -96 146 -116 -380 21 173 -64 -239 171 -149 40 -143 -109 85 3 55 -4 -174
7626 -174 -190 -48 105 0 65 -168 -33 260 -186 158 155 -52 -109 -115 150 -100 19 -79 99 -183 50 96 -124
7649 -124 -94 149 86 -414 -143 -105 3 -14 -163 167 -68 -186 -5 -2 -17 -54 -231 -166 -54 -137 -138 14 179 -3
7673 -3 201 -248 -58 78 124 21 -13 -133 245 186 130 33 -325 -295 225 215 190 204 21 44 13 3 -12 -8 80 140
7699 140 35 -83 2 12 -137 -60 134 -203 -354 311 -25 146 49 -8 58 -13 33 97 -70 36 101 -64 233
7722 233 54 -43 -29 -70 -64 -57 138 -28 -45 8 106 260 5 -77 31 -131 62 475 -86 220 -63 -78 41 61
7746 61 -197 111 234 57 21 -100 143 -58 -97 176 -23 -55 169 102 -28 76 7 281 4 -210 -18 309
7768 309 -186 -311 -330 192 96 -51 38 70 118 36 24 69 -99 -69 138 -190 -204 34 -57 -66 -37 -225 -49 2 -315
7793 -315 -54 -65 -48 -229 -134 71 161 22 434 -8 -15 177 47 -136 284 43 -242 62 -171 112 3 -127
7815 -127 -17 70 -95 156 127 117 -232 -55 -16 218 45 -34 -165 -132 -114 -99 44 249 -23 101 -80 139 2
7838 2 -254 150 29 1 55 87 -273 -117 -116 220 147 -19 90 328 97 125 39 -135 208 -168 124 31 -114 -114
7862 -114 93 19 -2 90 52 324 44 -4 9 -38 -138 212 -99 27 -219 -71 15 -7 80 129 -60 -91 12 -107
7886 -107 5 -124 282 -7 4 46 54 102 -101 336 -109 62 106 76 -27 -43 4 -183 6 -242 25 186 138
7909 138 -184 14 80 -110 32 -34 -202 -146 -148 -189 243 -80 46 28 -151 179 -35 3 7 152 -260 -136 -121 -170
7933 -170 -58 -126 -9 309 -151 -42 241 -125 31 -67 -87 -138 188 -149 156 -101 -35 158 79 -173 -226 101
7955 101 -101 31 -21 122 -61 -91 -126 107 -90 -388 167 -64 -169 148 223 86 171 -119 -92 -5 -29 -200 66
7978 66 -157 193 208 -66 -6 -60 41 -94 -67 -100 120 -46 79 -261 36 184 182 -54 131 -164 183 285 -57
8001 -57 -254 -144 -73 27 -77 -12 97 241 -4 26 -146 1 13 -155 -108 -46 -118 -54 -279 261 -126 106 -62
8024 -62 -68 -243 144 -211 -160 -225 -55 -46 68 167 -362 118 -160 -170 108 120 61 186 8 3 -13 85 24 -83 -275
8049 -275 -215 -78 -55 -23 -105 -100 44 -50 104 158 28 190 -86 -61 -56 -203 202 55 89 -42 -112 104 -156 -62 -25
8074 -25 -225 40 -266 10 100 65 211 -73 164 -136 -102 2 178 96 124 180 67 -19 -54 -12 -317 -28 -72 15
8098 15 137 88 145 -149 56 -162 107 -62 33 159 143 61 -220 -50 57 -43 165 -133 116 -166 -192 121
8120 121 -113 192 -125 -76 -53 -101 100 87 33 25 -103 -4 72 -157 3 11 14 67 135 -43 82 -140 134 -167 58
8145 58 201 162 -49 47 322 -44 -7 108 53 -144 148 9 -53 114 57 1 -94 -31 40 102 148 103 16 138 -119
8170 -119 92 266 -104 -11 -186 -217 284 -435 233 -34 317 -201 -39 -32 37 -97 195 -28 229 -28 5
8191E
$$ Imaginary data points
##PAGE= N=2
##DATA TABLE= (X++(I..I)), XYDATA
0 0 0 0 0 0 0 0 0 0 0 0 8 -5 8 -8 8 -16 16 -16 24 -32 32 -40 48 -56 64 -74 88 -101 114 -133 150 -170 192
33 192 -220 247 -278 311 -344 384 -429 478 -529 587 -651 716 -789 874 -962 1060 -1167 1283
51 1283 -1416 1562 -1726 1909 -2119 2358 -2636 2963 -3352 3829 -4420 5189 -6220 7677 -9897
66 -9897 13661 -21233 42290 -221594 -709561 51497 613290 153140 -448259 -245665 217379
77 217379 232822 -16046 -86430 -122005 -98772 152340 285457 -70057 -387386 -82076 415040
88 415040 246468 -336051 -340811 208111 351649 -41974 -268725 -75552 142231 126693 6555
99 6555 -82805 -126673 -3617 199359 102263 -198995 -166527 143464 187322 -72117 -161235
110 -161235 23412 91902 -26247 -9606 64016 -62682 -129779 79160 186263 -53687 -235688
121 -235688 -8135 241715 50300 -219381 -73455 156765 52471 -105299 -12425 76773
131 76773 -54263 -100028 114990 147340 -157829 -205320 153016 248214 -104714 -266286 37524
142 37524 251427 19974 -194527 -40666 115489 33648 -30791 7344 -15072 -56476 27978
153 27978 119666 2273 -157680 -35790 170412 77214 -135681 -97468 89233 106161 -38284
164 -38284 -79296 13014 33414 -1519 24003 7998 -65599 -23798 82672 46887 -82870 -67718
176 -67718 75334 69237 -74224 -56471 68898 29566 -72580 -18601 74405 14279 -91067
187 -91067 -26451 95747 29027 -94871 -34369 68951 25558 -46875 -15762 30180 -12583
198 -12583 -38118 45125 56051 -75574 -82090 82367 108353 -63653 -130088 29990 138129
209 138129 4808 -116411 -25542 73571 37160 -14716 -25223 -26275 -786 51829 50513 -46174
221 -46174 -93008 30388 123705 6143 -117078 -41752 94200 75832 -54963 -80897 20373
232 20373 61346 12058 -18419 -29600 -25500 26994 59200 -2231 -80068 -36597 83387 65800
244 65800 -75215 -81634 47074 73411 -18572 -61259 -7635 35521 8234 -13326 -663 -15361
256 -15361 -19630 27231 30584 -29638 -45008 13004 52081 -187 -57658 -9150 49820 8501
268 8501 -35704 -6448 22568 3304 -16959 5504 21343 -16087 -21896 28814 22913 -28646 -17006
281 -17006 26185 19561 -17202 -15822 20441 15158 -20370 -1501 25630 -4414 -21617 8384 25158
294 25158 -721 -27570 -2052 34352 4330 -32135 -2253 24768 3676 -17080 -6059 12458
306 12458 1757 -13590 6827 10409 -20474 -9200 24932 5386 -28114 -13446 23844 17646
318 17646 -26932 -24132 21772 17486 -17731 -13334 3960 5951 700 -4524 -1908 -3608 -6444 11365
332 11365 11342 -18563 -15097 17290 19207 -9020 -24067 3290 29944 606 -24846 2086 17648
345 17648 1455 -4488 -59 1895 -249 2311 12116 -193 -18123 5945 24027 -2889 -18591
358 -18591 200 16273 8761 -13207 -10120 13097 7863 -8507 -3171 2187 1491 925 -2526 149
372 149 -1406 -7108 5385 7407 -12636 -9001 9590 5622 -8710 -11150 3153 10846 -6773 -12264
386 -12264 5115 2869 -5166 1367 -1232 -5975 213 3513 3475 -4809 -9719 5402 11079 -4837 -8209
401 -8209 403 6001 6466 -4417 -7250 6072 4221 -1502 4477 -479 -5947 3253 9374 5157 -7611
416 -7611 -9828 11515 15746 -6763 -10526 2439 7437 8070 -806 -9639 -1531 6788 7879 2023 -12187
431 -12187 -7676 11372 9796 -2749 -11206 -10264 8976 16435 -5749 -18179 -6148 9985 15414
444 15414 -4315 -22313 -7058 14534 14028 -5818 -24099 -7527 22335 11313 -14815 -15770 -1934
457 -1934 12841 12153 -7233 -16807 -6842 11888 20919 -3124 -28543 -6835 24531 19783 -10321
470 -10321 -28213 -3298 31709 16372 -20759 -20996 6526 24579 9751 -16534 -13454 5010 13037
483 13037 13603 -2937 -21927 -5017 22625 19639 -8694 -27977 -5224 30971 19499 -20281 -27149
496 -27149 2507 30022 13917 -25745 -22013 12248 19671 2313 -13790 -14928 1462 12269 8220
509 8220 -3506 -19219 -12953 18063 21695 -9798 -29794 -10905 27578 26030 -22907 -36282 7325
522 7325 32438 7492 -25376 -19343 13199 17553 -1514 -6250 -7580 -8485 9543 20411 870
535 870 -23577 -17465 22868 35869 -11572 -41475 -2830 40116 23586 -26688 -33627 15303 35756
548 35756 1041 -21217 -10119 6597 14901 8912 -5064 -14181 -10386 13956 27250 -4752 -33584
561 -33584 -10911 28559 29211 -16393 -42713 -292 41939 15268 -31458 -28407 12722 30799 211
574 211 -25424 -10210 7825 8863 5933 -5102 -15268 -9327 9461 22017 364 -34110 -16567
587 -16567 32467 29362 -21524 -40869 4159 43499 9980 -36431 -17409 20983 18365 -3995
599 -3995 -11727 -4065 1936 3661 12409 6890 -20355 -17491 20492 30930 -6720 -37027 -8628 39975
613 39975 25505 -29481 -30910 14324 32001 5332 -23968 -14488 12378 15373 3294 -6594 -13916
626 -13916 -4306 15713 14671 -6252 -22778 -10609 23320 23893 -16199 -32796 -729 32478 16817
639 16817 -28695 -30463 15536 30361 -2237 -25805 -13113 13700 16795 -4996 -13474 -5379 1161
652 1161 8995 8993 -7495 -17209 -3652 19186 17066 -17601 -27430 10878 30740 -182 -26395 -9915
666 -9915 20454 17219 -11396 -14292 4503 8608 3281 88 -2904 -2514 391 5811 9472 -3675
680 -3675 -13771 2342 15735 4843 -11052 -10349 7603 14320 -2865 -10805 -891 4793 4359 236
694 236 -5013 -3212 1488 1883 2662 -1187 -6976 -2048 3683 4636 -960 -10515 -5323 10244 6636 -8820
710 -8820 -9899 1080 9528 2912 -10445 -6510 4735 4576 -5 -4417 -4594 1693 3647 1325 -316
725 -316 -5702 -3766 8068 6322 -6106 -7470 1989 10121 3400 -9014 -3695 7468 4633 -911
739 -911 -2449 -1794 3522 4011 -244 -488 -1329 51 4816 1673 -2309 -1287 97 3083 3070 -3640 -2588
756 -2588 2776 1087 35 -223 -2913 -448 1542 209 -166 -2735 -2511 2374 1055 -2288 -1378 -2278
772 -2278 -330 3414 -1385 -4240 -1457 908 2494 -806 -5580 -907 3466 822 -1134 -2998 -2247
787 -2247 3898 2478 -2955 -2369 -87 2604 3309 -2382 -3646 1913 3248 2461 -1502 -3899 2561 5885
803 5885 -278 -2146 -172 1417 4122 1240 -2864 93 2331 2748 1391 -3324 -1111 4189 1316
818 1316 -1365 -1120 -1280 2049 2740 -2654 -2778 971 1858 1085 -2661 -3281 2071 1758 -2032 -1466 -1794 -358
836 -358 2068 -1410 -3294 -44 203 117 -903 -3031 -60 1226 -1298 -851 -840 -1525 1974 565 -2810
853 -2810 -103 1561 424 550 -1227 -473 2109 199 -195 718 -514 1922 1772 -1348 401 1988
869 1988 44 1075 570 -220 1705 1069 135 1296 56 637 2026 -700 -800 1966 168 -204 757
886 757 -1044 421 813 -841 107 -415 -950 639 -468 -1651 427 -767 -1302 552 -1195 -1698 341
903 341 -472 -1328 -674 -1204 -321 -283 -1541 270 -3 -1907 212 787 -1515 -595 -114 128 1193 -844
921 -844 -1281 1281 686 -101 497 -995 1055 2134 -668 159 434 -329 2105 1708 -1503 -125 1911
938 1911 2048 861 -2026 100 3155 887 -956 539 -263 940 2370 -588 -1233 -99 552 1997
954 1997 -450 -3241 380 1838 -182 -998 -2053 -1020 2189 -397 -2015 -609 -988 218 1417 -1623
970 -1623 -2699 -579 1009 1153 -1922 -3372 1195 1743 -1973 -1089 -165 -675 512 776 20 -963 -2059
987 -2059 1521 3577 -1722 -3417 1134 3045 1337 -1909 -1751 3065 2597 -1517 -63 1251 81 741
1003 741 1722 1246 -670 -2159 2103 4716 -1793 -4148 1660 3867 1126 -2429 -2288 2107 2594 -934
1019 -934 -853 -685 -153 1650 -148 -1678 -1080 -476 837 1307 -1694 -2550 -126 697 963 -873 -3816 -876
1037 -876 2687 853 -2564 -4133 143 4698 -390 -5514 -546 3182 663 -2248 -1324 1598 229
1052 229 -2444 1659 3368 -3201 -3110 3563 4611 -1416 -5212 887 7454 1012 -5890 -552 5306 2217
1068 2217 -2666 -1530 3001 2159 -2064 116 3707 -1203 -3022 1860 3872 -607 -4131 -788 5541
1083 5541 1509 -4817 -2046 2120 2413 -685 -3207 -1242 2474 783 -1907 -1401 -655 711 419 -1382
1099 -1382 -139 -302 -2220 -156 1607 -727 -2761 -1740 2262 3318 -3411 -5381 2215 5152 -1220
1114 -1220 -5355 -738 5163 1276 -5348 -404 4711 -423 -3353 1474 3253 -931 -3763 1923 6204
1129 6204 -1427 -5925 1995 6440 -110 -5105 -719 5479 2715 -4465 -948 4510 776 -2591 203
1144 203 2137 94 -2438 56 3499 -414 -3622 560 2894 -67 -2099 -1612 713 1811 -1201
1159 -1201 -2043 -512 120 1417 -620 -2726 -112 1442 -508 -1518 -933 340 -40 -1719 -5 1867
1175 1867 -1829 -2752 1786 2400 -1655 -3397 400 4740 42 -4974 24 5019 138 -3501 -157
1190 -157 3265 895 -2721 273 3917 -653 -2753 2364 3327 -987 -2750 1138 4194 125 -4169
1205 -4169 702 4170 -126 -2201 38 1685 591 -1670 27 1959 -1054 -1570 1763 714 -1974
1220 -1974 -886 1033 657 -1000 -1617 526 386 -1627 7 248 -1693 -537 974 -381 -1646 -1558
1236 -1558 696 891 -1741 -1616 1703 286 -1616 -479 527 340 -1257 -862 1978 192 -2609 688
1252 688 2998 -242 -1885 372 2755 806 -2266 330 2843 -113 -1817 1072 1679 -485 -802 1055
1268 1055 2213 -1014 -1633 2074 2136 -1067 -1142 1346 1420 -506 -1386 699 1323 -1270 -827 1636 136
1285 136 -2112 -373 1243 -5 -1673 -1143 1783 -226 -2640 -56 992 -771 -1442 62 402 -281
1301 -281 -1656 275 1230 -1679 -1106 1092 431 -1400 -893 755 866 -929 -1115 1266 834 -1498 181
1318 181 1744 76 -655 119 1516 619 -1452 355 2399 -420 -1094 1454 1359 71 -238 1036 1532
1335 1532 -529 -966 1690 1244 -1126 -430 1224 581 -541 -758 1065 1065 -1674 -1027 1568 85 -1123
1352 -1123 -505 549 289 -1280 -830 1102 -377 -2187 -65 968 -923 -1299 -323 477 -428 -1594 233
1369 233 770 -1229 -742 745 79 -1064 -335 448 518 -827 -688 1293 549 -966 170 1134 -28 -192
1387 -192 -28 1408 566 -859 549 1592 -271 -496 944 884 108 -602 287 1433 -143 -589 1306
1404 1306 477 -731 -14 938 294 -516 -514 727 688 -1045 -39 506 -513 -937 -143 107 96 -944 -576
1423 -576 711 -580 -1614 7 453 -875 -1125 -147 761 -126 -1485 310 751 -1045 -515 533 121
1440 121 -314 -354 296 714 -310 -487 747 286 -186 106 158 302 438 50 445 854 -277 361 857 -349
1460 -349 158 667 436 228 275 416 943 51 -234 797 177 -296 270 272 253 -103 -363 476 253 -1072 215
1481 215 467 -291 -264 -546 -51 -21 -558 -466 503 -130 -707 -148 -130 -449 -632 -461 116 90 -905 -54 316 -680
1503 -680 -29 -14 -84 28 -65 -179 -115 -185 221 694 -257 -156 392 34 464 480 2 192 562 307 526 446
1525 446 -18 455 597 45 379 0 242 774 -161 -297 545 181 280 82 -84 -37 -128 -438 104 19 -387
1546 -387 -12 103 -536 -354 -500 -654 232 -356 -756 -231 -119 -3 -228 -1036 -114 481 -702 -650 46 -108
1566 -108 -130 -299 -299 251 -311 -684 248 249 -406 -252 198 346 351 -835 -58 891 502 -219 -22 301 610 296
1588 296 -495 475 645 -213 105 577 75 369 -99 309 1071 -149 -355 218 613 124 -414 -606 1055
1607 1055 460 -843 -252 397 84 -542 -539 -107 233 -591 -854 385 -146 -952 -854 307 440 -755 -988
1626 -988 559 378 -768 -1269 53 364 -15 -992 -193 654 -230 -797 172 790 93 -346 -128 430 103
1645 103 -563 50 1127 232 -280 -61 929 653 -432 -251 1085 756 -182 240 220 542 464 -299 246 937
1665 937 -37 -9 169 319 44 -280 -84 782 238 -1275 111 582 340 -504 -899 0 459 -575 -958
1684 -958 -6 96 -555 -797 -84 411 -265 -1140 182 282 -657 -650 452 229 -77 -954 70 717 -366
1703 -366 -590 337 486 -40 -470 -194 260 324 -442 438 526 -159 170 365 595 480 61 168 802 313 -131
1724 -131 410 305 517 217 48 299 573 156 -5 -4 -86 406 -216 -372 167 100 -573 -261 85 255 -513
1745 -513 -832 105 450 -809 -810 -5 186 -433 -721 -143 174 -495 -872 100 51 -665 -651 74 129 -461 -602
1766 -602 221 334 -312 -711 663 -29 -191 177 24 375 -78 122 158 293 53 486 229 37 184 20
1786 20 453 533 -88 288 694 338 4 383 266 146 97 427 309 143 -170 595 333 -483 -22 43 -158
1807 -158 -325 -119 -18 -156 -256 -177 -138 -491 -244 92 -92 -331 -573 -94 125 -301 -760 -199 -213 -460 -345
1828 -345 0 409 -421 -154 -52 255 -380 -366 364 -110 -538 328 434 194 -292 45 704 134 72 456 594
1849 594 104 -47 539 508 300 -186 179 893 180 177 606 242 215 190 -105 238 -68 -209 299 367 -510 86
1871 86 179 -82 -140 -146 64 130 -301 -136 -97 -562 -282 20 7 -532 -255 -146 436 -367 -483 229 3 -494 -567
1894 -567 22 84 -216 -490 327 262 -428 -125 469 190 -326 107 164 513 -401 -41 676 -74 -45 347 324 213
1916 213 129 7 369 399 1 179 513 70 -6 380 350 390 149 -282 202 -97 -148 489 -74 -204 133 23
1938 23 -39 -547 -99 183 -22 -745 -242 -36 -418 -206 -187 -31 -163 -563 32 30 -319 -512 220 -326 -558 -389
1960 -389 -51 -1 -353 -189 168 39 -245 102 439 75 166 315 447 338 -124 135 843 78 -229 343 339
1981 339 255 258 -21 529 39 -249 783 530 -226 186 711 251 247 39 432 404 -348 -82 447 48 -56 74
2003 74 23 28 -334 -463 188 -96 -365 58 11 -410 -368 263 -38 -259 -562 2 -110 -466 -494 4 -194 -182 -232
2026 -232 -13 218 -87 -208 255 23 -542 124 402 184 94 231 503 309 -340 60 518 31 -128 300
2046 300 578 288 204 242 564 217 -220 400 234 -87 -89 127 177 -141 -443 39 -18 -290 -354 -192 144 -103
2068 -103 -67 -303 -100 -115 -456 198 -132 -479 -33 -3 -407 -268 41 110 -176 -605 51 394 -654 -267 8
2089 8 14 -259 -33 -180 194 -180 -289 213 3 -275 38 168 288 31 -74 346 531 34 -357 390 124
2110 124 132 -62 410 531 -41 17 557 377 -160 -115 165 -5 102 -149 39 92 -46 94 -141 87 126 -46
2132 -46 -391 -260 24 -207 -208 -186 -281 -127 -152 -8 273 -489 -291 -26 127 198 -61 -590 184 284 -629 -377
2154 -377 204 -6 -442 -540 -76 249 -273 -186 43 11 -84 34 88 116 88 -77 353 379 -175 -135 25 419 142
2177 142 -166 -51 394 301 -136 350 103 77 -6 47 148 351 -265 -5 415 149 115 41 7 32 -102 -334 357
2200 357 489 -292 -139 -84 -83 -126 -491 -361 449 -194 -345 -148 113 -77 -352 -371 288 -104 -144 -174 110 19 -270
2223 -270 97 -54 227 -145 -113 192 -59 -258 98 34 107 514 -149 63 129 -29 -46 346 262 309 -56 -126 700
2246 700 261 -181 39 463 85 200 -4 257 510 -430 -147 460 217 -11 -264 197 248 -35 -321 365
2266 365 528 -559 -255 298 -63 -282 -142 262 14 -489 -145 15 -78 -290 -177 -145 -58 -318 100 73 -47
2287 -47 -344 -106 -49 -180 -32 -220 202 295 36 53 329 -94 -78 -45 -44 430 45 95 157 -118 160 544 61
2310 61 -83 693 227 -87 53 118 340 293 -151 354 423 -315 59 373 72 -243 93 1 309 -235 -227 288
2332 288 209 -721 -431 38 240 -272 -535 378 159 -588 -276 35 -44 -378 -311 -333 103 -350 19 195 -108
2353 -108 -315 216 215 -197 -11 16 61 139 107 -197 179 -393 -139 8 -87 -170 262 260 107 -290 -6 522 44
2376 44 -88 557 60 -108 -28 97 606 23 -176 202 685 -480 -168 127 275 91 -258 -200 80 131 -464
2397 -464 420 165 -4 -541 -95 5 -99 -637 7 357 -259 133 414 141 -163 -88 -315 -242 -449 -233 172
2418 172 -252 -287 28 19 -290 -146 -73 -25 -295 141 335 29 -349 262 211 -130 -156 211 384 173 -334 160
2440 160 770 -3 -390 264 320 74 -25 -19 301 -124 -161 361 370 -304 -84 129 17 155 -329 63 510 -64
2462 -64 -504 123 146 -266 -20 -155 72 -115 -653 186 91 -659 41 285 -99 -279 -169 121 -195 -245 -169 389
2484 389 -378 -172 245 -2 -116 43 22 -58 47 -24 390 224 -210 166 368 67 -124 -257 182 114 -282
2505 -282 -135 685 190 -351 398 313 -29 -43 -142 606 51 -328 61 561 -75 -96 325 -12 -20 -46 6 339 -385
2528 -385 -23 238 -100 -181 105 -48 63 -24 -373 -81 227 -499 -148 521 -372 -141 -352 208 -325 -261 -252 549
2550 549 38 -255 85 70 -190 -303 120 -7 44 70 403 139 -220 -205 205 119 105 -73 -99 54 38 -106 323
2573 323 131 -80 298 94 264 -58 39 431 149 -168 -84 140 -379 -1 67 78 -135 -366 -3 68 -371 -231
2595 -231 462 -168 -409 -35 -201 72 -229 -308 41 58 -451 -55 23 -65 -70 -42 -199 78 -299 -510 480 109
2617 109 -321 112 115 38 -91 -105 14 382 -194 25 320 -189 283 158 -161 274 18 132 412 -202 115
2638 115 468 -91 15 237 -170 302 249 192 341 -7 -287 201 343 -134 40 224 211 -188 -441 232 536
2659 536 -100 -96 73 -165 -227 -210 -321 76 -239 -385 30 176 -592 -363 179 -180 27 -347 -301 112 5 -94
2681 -94 82 -9 3 17 -318 280 261 41 132 37 -22 44 83 -117 295 225 -371 202 506 203 23 -34 500 231
2705 231 -272 55 340 191 323 68 -47 422 -34 -197 231 165 -114 -195 210 326 55 -272 -80 367 -472
2726 -472 -460 256 -66 -237 -569 -294 51 -39 -274 -382 192 -74 -347 -149 46 422 -266 -348 239 23 -391
2747 -391 -223 -28 24 -62 -131 126 408 -452 -127 -143 305 168 -153 0 327 96 -150 303 7 307 144
2768 144 -54 49 136 -348 107 293 -338 -285 -85 -45 147 42 -390 -14 70 17 31 -197 31 310 34 -321
2790 -321 40 -241 -29 3 -273 48 -44 -264 239 43 -584 45 63 158 0 -502 -351 545 -174 -253 253 283
2812 283 -72 -267 -291 361 190 -435 280 284 27 -446 4 101 61 -129 -118 582 47 -415 327 330 14 -91 -47
2835 -47 446 320 -303 201 500 -42 -4 89 133 212 -6 -41 180 -501 -137 267 -328 -180 261 -259 44 72
2857 72 232 -121 -141 -107 194 -23 -405 -148 310 -68 2 -171 85 118 -701 -303 139 -297 -455 12 183 -29
2879 -29 -404 -157 234 226 -496 54 380 -81 -370 10 81 203 -392 71 508 -190 -94 228 335 -49 -167 4
2901 4 194 482 -211 237 226 -94 38 42 -103 215 -103 -43 106 -72 175 426 -92 -154 207 -146 -121 -217 -213 14
2925 14 -213 -343 430 -20 -479 -216 306 74 -283 -495 70 362 -133 -151 444 -76 -243 1 355 135 -295
2946 -295 -250 546 18 -504 95 297 72 -446 -175 162 467 -387 -146 365 60 238 168 68 83 -152 -157 133
2968 133 114 -181 351 187 -266 -17 15 23 61 -120 122 145 -442 -53 406 -385 -239 235 142 -244 -248 -126 401
2991 401 -250 -527 136 83 -625 -296 246 -61 -331 -484 122 332 -682 -387 204 204 -567 -460 324 480 25
3012 25 -564 657 348 -612 38 374 201 -219 -137 515 199 -433 81 440 -191 51 338 219 -23 -187
3032 -187 -173 228 -24 -342 183 292 -275 150 361 323 -113 -56 216 -87 -558 -105 438 -128 -93 137 108 94
3054 94 -291 -209 347 -116 -641 22 451 -76 -235 69 224 -70 -645 234 296 -497 -195 362 -150 -130 -221 140
3076 140 267 -163 -156 382 264 -167 154 249 218 310 -148 -2 50 -491 399 572 -122 20 189 125 -42 -46 386
3099 386 533 -71 -440 485 83 -84 -234 -19 -105 -82 -57 304 293 -476 -369 428 -350 -496 -70 179 223 -398
3121 -398 -254 429 -138 -437 0 -39 -203 -383 -210 157 -79 -567 62 262 -559 152 147 -139 -52 -177 -1
3142 -1 224 -379 -214 171 -12 -437 240 290 -94 -104 -257 294 286 -494 10 661 -365 -210 284 298 57 -166
3164 -166 436 538 -333 -639 779 449 -261 -143 291 342 57 -565 375 461 -321 -35 9 68 -164 -119 56
3185 56 323 -434 -203 373 106 -477 -144 381 -145 -265 -36 -97 -3 -353 206 -150 -429 302 170 -214 -421
3206 -421 -165 268 -56 -445 22 573 -242 -330 175 42 -211 -12 170 468 -244 -425 361 471 -296 -458
3226 -458 0 159 203 -540 -89 557 -35 -660 180 146 -245 97 159 172 96 19 162 372 -259 58 -224 133
3248 133 362 -443 8 -84 210 -49 -16 13 -278 202 -258 -206 12 -286 80 164 -196 -44 -17 -274 149 308
3270 308 -340 -55 402 307 1 -368 -266 746 -228 -294 220 123 279 204 -302 246 -340 -451 125 229 -46
3291 -46 -141 -113 387 206 -198 -126 542 214 -85 283 -127 201 -73 -369 317 275 -204 123 182 103 36 213 -205
3314 -205 117 -9 -289 216 58 -178 -6 -357 6 183 -168 -400 4 -140 69 -261 -339 301 -76 -316
3334 -316 -145 228 -29 -72 -6 110 247 -267 -100 337 -194 -335 103 -33 140 -193 -243 221 79 -483 23
3355 23 158 4 358 -375 119 410 -206 -219 297 -54 -98 132 -332 245 102 -241 125 84 -8 9 -372 113
3377 113 316 -83 -276 171 89 -134 -127 -221 94 -44 -177 12 286 -352 -264 272 -164 81 -194 -238 72 2
3399 2 -423 306 -23 191 -213 -406 4 129 -447 -222 322 65 -273 69 -90 181 221 -197 584 236 -259
3420 -259 261 249 412 436 -266 -61 440 59 -230 77 115 370 11 -141 -105 154 -461 -45 -3 -206 -2 -344
3442 -344 -125 376 26 -313 324 -109 -17 41 -25 299 42 -570 281 228 -468 -252 -32 -41 384 -295 -115 107
3464 107 172 -241 83 23 -85 152 -133 85 2 -129 -62 131 1 -43 -46 -150 393 257 -336 -56 -145 112 188
3487 188 -220 -38 391 -245 -91 548 -102 -363 -158 -88 351 -29 -375 307 289 -339 99 210 27 182 -521
3508 -521 -50 203 -301 -286 456 -75 -175 -268 -276 107 13 -170 375 206 -384 -63 48 -392 130 -258 -3 69
3530 69 -2 65 65 -374 -133 194 -216 -228 241 -17 -17 -47 127 614 -346 -181 330 6 -182 211 54 80 355
3553 355 -242 -85 925 -257 -14 292 179 71 115 48 508 126 -400 289 472 -107 85 28 43 -5 -320
3574 -320 41 424 -104 -168 104 77 61 -147 -117 142 184 -246 281 -37 -146 -202 -171 -278 94 -372 -114 389
3596 389 -345 -120 188 -240 1 215 -168 -177 49 -246 -113 -216 -259 571 262 -125 395 -104 74 -250 -104
3617 -104 9 581 -352 279 375 -232 87 149 86 217 -17 -177 493 -139 -321 145 204 -171 40 -62 -140 282
3639 282 -294 145 154 -85 -218 241 -190 -119 77 44 73 -253 -317 147 25 -201 332 -41 179 227 -166 -115 167
3662 167 -176 42 108 -399 -160 249 -190 271 -57 137 437 -17 -345 338 -185 -186 458 -200 -147 9 -125
3683 -125 51 238 -577 112 290 -90 263 20 -273 314 170 -231 267 60 -54 441 18 -410 86 213
3703 213 -171 43 -68 5 405 -105 6 139 -213 41 139 54 429 -153 -226 419 -296 -406 142 207 -165 11
3725 11 -284 122 169 -583 94 208 -263 107 105 -22 -2 -228 -153 282 -109 -279 265 131 -34 -90 -83 75 72 -75
3749 -75 129 403 -326 175 288 36 -99 296 -111 423 -24 -146 189 171 76 4 -44 -436 91 -54 196 43
3771 43 -315 233 181 -175 -128 69 -123 -69 -35 -239 3 -203 -56 245 41 -113 86 40 -29 -230 -241 361 340
3794 340 -215 -103 103 -290 -275 -102 -22 324 -109 66 525 16 -253 229 -98 -304 88 15 208 147 94 358
3816 358 375 -347 90 120 -294 154 93 -126 -123 128 -175 238 -14 -352 289 56 -562 182 163 -120 130 -235
3838 -235 236 277 -262 172 129 151 -12 -287 39 204 -65 19 289 149 -91 252 -44 149 203 -501 49 176
3860 176 -235 85 -7 -135 36 -137 -151 287 -237 -304 54 -349 -3 251 -223 36 318 -65 6 -133 -96 157
3882 157 -146 -217 193 169 -209 233 174 -42 -3 83 158 209 -114 -65 268 133 -115 -34 -149 176 60 -243 100
3905 100 320 -59 129 115 250 72 -132 -153 -131 -211 -438 54 322 112 57 -59 305 146 -505 164 86 -262
3927 -262 -25 -158 66 291 -86 -382 197 -88 -106 -24 -250 276 233 -222 87 355 -197 6 -3 119 53 -136
3949 -136 -125 171 -36 -28 91 -5 77 156 -223 145 212 -133 -88 31 -278 170 70 -344 447 288 -258 -239 60
3972 60 -144 12 -59 36 462 -271 -128 127 -134 -121 -9 160 15 -288 -352 42 60 -201 -63 29 218 348
3994 348 -202 208 211 -206 -176 106 209 -238 -23 -125 75 173 -86 172 279 -95 35 -83 -23 161 -59 -175
4016 -175 681 212 -317 248 -93 -199 259 -19 57 134 -11 -182 26 67 295 -102 -167 131 96 -147 -208 26
4038 26 -88 130 -80 108 234 -326 -41 229 50 -220 -160 41 23 -287 -397 218 49 6 35 -51 -6 147
4060 147 -396 -203 327 140 -262 220 5 73 259 -55 119 -33 -10 196 -18 -222 -134 189 -121 468 1
4081 1 -163 -128 21 27 27 -44 118 240 -73 -118 43 -117 177 -91 -130 287 44 -72 -203 -78 -49 111 -121 15
4105 15 130 -186 -182 203 -55 -198 81 150 -16 -222 -231 142 131 -215 179 -71 -97 83 -172 77 54 -386 -181
4128 -181 77 -172 -184 109 249 66 67 134 103 -139 -30 216 181 -200 63 165 32 -181 -184 -73 318 -113 44
4151 44 365 -85 51 27 177 53 280 -15 -15 -198 -103 152 -261 -307 150 10 -45 -103 -92 297 397 -10 -94
4174 -94 -14 -199 -88 88 156 30 -114 -53 61 -72 -193 432 213 -119 -125 140 289 -77 293 -186 -33 -181
4196 -181 -189 405 42 -59 45 -2 92 -106 -199 68 -188 -142 257 -103 122 173 -187 135 206 -128 -195 94 -37
4219 -37 -70 287 189 89 -397 -84 180 221 -31 47 125 105 87 -1 -161 62 124 -21 317 -369 149 -48 -209
4242 -209 -139 92 -44 117 -52 -293 103 10 -124 337 -115 8 243 -233 -163 320 -21 -91 24 -202 63
4263 63 181 10 201 34 16 22 115 -39 217 101 -109 27 -104 -16 152 -103 46 -25 -139 -5 226 60
4285 60 -38 142 71 104 117 -33 272 -81 -159 12 -33 101 259 -171 141 -97 -436 -26 244 58 77 59 -28
4308 -28 309 -288 -67 108 -138 2 231 59 -26 101 -239 -174 18 -60 225 -226 244 -149 318 -273 -94
4329 -94 196 -71 -23 47 21 363 -211 64 222 -83 37 -33 52 -63 189 -51 85 -182 -245 -54 177 -79
4351 -79 209 199 -215 -93 -117 113 110 -131 -178 159 86 -21 54 -490 22 -99 -44 86 -89 -1 -248 108 -146
4374 -146 -266 -167 -208 36 -129 -307 -106 -187 -23 23 -58 -348 -242 -26 -148 -199 -57 16 7 77 125 -75 -41 207
4398 207 -8 29 169 -334 136 144 -250 -53 105 -124 90 -79 90 249 17 -241 -193 329 -120 0 292
4419 292 120 17 113 142 376 -177 -198 136 22 -219 262 6 292 47 95 -33 -108 -282 212 191 -259 24
4441 24 -228 -437 -3 -696 -291 400 -199 -274 24 -62 -333 89 14 -45 93 107 414 -51 -165 221 148 -42
4463 -42 -61 -233 -16 209 -69 -87 76 96 57 189 31 213 -20 -249 27 59 112 312 -117 -4 -60 -261 -88
4486 -88 160 138 47 31 -51 66 -33 158 147 93 36 -3 105 -110 -237 133 -5 -147 87 -63 125 112 90 -285
4510 -285 -228 -96 -108 12 -20 25 -199 -185 -235 -53 -50 -105 -222 -40 44 -139 -28 -83 -73 -93 -262 -64 -85 -202 -4
4535 -4 331 -150 84 84 60 177 96 -62 -35 163 -120 238 186 25 74 -266 -112 124 42 186 -15 -25 536 154
4559 154 12 -61 -27 -14 25 122 124 284 -171 223 -65 74 111 76 -18 -51 -145 38 -12 228 -272 -199 3 -74 42
4584 42 75 -323 153 89 -92 130 -145 -35 94 -65 215 209 -103 93 -5 -64 -4 -142 60 150 347 100 48
4607 48 216 -28 -171 -57 156 31 -121 -25 192 165 -8 69 -75 -222 -5 5 -162 -103 -70 73 56 -115 -120
4630 -120 110 -43 196 -80 -50 10 -338 80 75 -89 288 -138 -11 165 -106 -302 -108 -173 -179 92 77 41 128
4653 128 -163 27 149 136 -189 189 -30 53 467 -285 140 51 -163 193 71 171 57 -158 -55 146 276
4674 276 -147 66 40 -153 72 43 121 433 44 188 142 -25 133 -75 282 -143 37 -98 -24 -188 -299 220
4696 220 6 138 -123 -140 113 -52 -110 26 144 189 -124 -134 -27 4 49 -23 -139 217 14 255 -148 89
4718 89 36 -94 65 -65 83 55 -186 -159 -220 206 -95 219 11 -319 394 -138 70 145 -16 -145 79 22
4740 22 29 45 77 23 175 228 49 309 38 2 -23 3 96 -12 -63 -50 -173 -107 -16 -129 30 111 54 47 -74 -145 206
4767 206 44 -24 98 58 -46 -62 73 24 113 -98 -1 -170 11 -80 -50 -41 -301 348 -110 17 -64 34 104 -32
4791 -32 -14 379 82 165 46 2 -5 218 19 -272 -1 280 11 41 -247 55 108 -237 -7 132 71 184 207
4814 207 -231 139 -7 226 -17 -15 -119 -168 -240 206 243 -388 -133 75 126 -121 77 146 136 -10 180 205 343
4837 343 156 -164 -32 103 5 -6 -140 348 250 63 66 -79 35 -128 -132 180 -35 -210 263 66 -88 -85 -506
4860 -506 -16 -56 -251 -188 240 3 -18 18 -80 -37 121 -23 375 -158 -88 132 -68 -266 -168 71 -244 161 78
4883 78 -19 85 -311 229 345 -128 123 15 -310 -141 -54 8 -66 -9 -251 107 2 -31 169 162 -20 81 -95
4906 -95 112 186 94 216 9 418 -220 41 34 -334 -216 140 -26 115 1 -51 184 -195 140 82 -81 85
4928 85 -265 -168 5 152 89 -34 -22 117 -392 -116 184 277 143 210 260 -85 38 -187 -124 -38 -244 43 -27
4951 -27 57 64 126 28 -101 252 -174 -154 109 -56 -86 -88 -678 205 -194 -53 -15 148 -129 -62 53 55 13 46 -65
4976 -65 135 -196 -49 89 149 81 -159 29 -181 -146 -105 110 -31 45 217 147 19 41 1 209 67 -275 -75
4999 -75 18 36 22 -98 -303 46 74 223 -366 14 -41 58 -84 -10 -45 21 -100 235 -34 -57 237 88 -58 -35
5023 -35 -53 -109 -26 75 -83 -87 -80 -20 26 -80 186 87 -102 246 -153 -94 14 185 139 175 -3 -163 -180 -112 165
5048 165 -152 -53 -64 108 256 196 21 221 38 -89 -78 49 -258 206 5 54 -80 -58 -87 127 -133 28
5070 28 189 81 64 60 -188 0 -28 105 -8 -108 13 -47 -36 61 8 -94 -8 -46 -73 -46 60 -64 55 159
5094 159 30 -105 32 -29 -41 61 -40 -26 -52 43 112 28 -9 220 201 -190 -25 147 -167 -106 -388 -212 -46
5117 -46 124 -240 176 69 119 132 47 -40 -59 96 332 138 -149 360 107 -87 -53 137 31 181 88 -9 42
5140 42 -72 -62 -70 46 -47 -195 -208 -84 -3 -43 -121 44 219 128 -87 44 -124 58 231 -165 -217 57 -71 130
5164 130 49 -114 60 91 31 -240 83 151 139 -143 253 -137 348 -113 259 49 -369 -138 112 -151 59 115
5186 115 55 -80 -139 320 45 -50 225 96 57 -282 253 127 -179 70 -11 -205 77 -266 -194 144 -7 -57
5208 -57 261 -250 -14 24 -143 -60 -105 86 128 -10 -116 -202 320 -17 -88 167 -26 125 -151 18 27 -299 -136
5231 -136 -30 -208 -174 -105 -171 156 111 -167 -93 59 -443 -22 -112 129 -162 -180 20 44 -90 57 302 128 252
5254 252 -56 173 -66 205 63 155 159 26 159 -180 -102 26 -90 -222 -16 -188 -8 100 -40 -169 93
5275 93 96 22 37 -76 128 23 -321 -33 -164 38 -33 -153 -284 -314 142 -94 -217 67 28 73 -71 193 153
5298 153 91 -35 -73 45 -58 -3 -201 -173 -136 23 52 -224 -129 123 231 -78 -69 15 -303 19 15 -217 -27 -81
5322 -81 -9 -13 -126 151 109 -54 174 -71 -21 71 16 -152 56 -99 153 -106 165 104 -124 -56 -1 -286 -97 -42
5346 -42 -142 71 -38 122 -123 219 21 -53 19 -32 159 -23 235 365 71 -215 138 15 116 60 -248 72
5368 72 -46 100 219 -247 49 54 -84 211 219 -230 -257 -97 223 267 154 -277 -128 -53 139 137 -93 100 18 12
5392 12 122 7 93 -56 133 92 -181 -59 137 -39 171 -185 93 108 -350 -137 -159 -123 -76 -49 -6 -21 -246
5415 -246 144 -159 -269 -64 44 167 -176 -79 57 62 155 65 -177 21 -421 40 -90 318 -36 128 34 -51
5437 -51 -223 -282 -121 225 -448 97 83 -97 -2 21 289 79 -209 74 -143 30 -277 150 -77 -146 -222 -226 -54
5460 -54 88 324 61 95 -239 -58 -23 344 -44 -114 121 315 14 -55 -118 99 -58 -114 -17 -22 -203 -379 68
5483 68 -177 124 -114 176 -22 -21 99 -72 43 76 -142 71 36 -85 29 -71 345 112 211 80 -19 -212
5505 -212 175 244 -99 -65 -37 -133 3 -95 16 -110 -107 -404 -68 -23 179 188 31 98 0 -32 -75 -67 -29 -42 12 39 -99
5532 -99 -71 128 79 -204 45 168 -170 32 -184 40 329 -117 -112 176 160 -108 123 -361 62 57 190 -42 105
5555 105 -109 44 -169 66 -93 149 -107 63 -70 87 193 -131 -59 64 -34 -71 -84 101 1 -54 33 -3
5577 -3 -241 80 -40 7 37 -144 121 -47 115 -57 122 -3 -184 153 -39 77 -20 355 28 -36 55 86 -84
5600 -84 -67 161 -60 71 0 -45 -79 130 190 25 -124 -249 28 -54 65 -130 77 66 54 -54 102 -64 -257
5623 -257 -280 -105 173 37 30 67 -58 168 -72 -229 -55 179 19 -25 -117 -116 15 110 -8 -47 -40 -63 16 -29 -78
5648 -78 287 198 -37 -196 -118 -92 -99 -90 107 -112 -222 -204 -125 -100 -322 -21 -126 -42 42 107 -56 -139 -57 -152 -32 -76
5674 -76 59 -228 -30 -191 -168 -55 34 -198 154 64 -6 87 -243 252 10 -52 213 -112 -59 -91 101 112 -215
5697 -215 85 -341 54 -183 53 -448 -46 -142 163 170 -310 -400 -87 105 -33 138 -50 126 40 32 -86 261
5719 261 30 -136 73 217 97 79 45 162 220 232 110 223 -39 -192 -184 260 113 4 -3 -51 -112 69 -295
5742 -295 -323 173 -48 -174 19 -68 107 -226 -120 211 -436 61 78 129 -11 -263 258 182 12 -1 -168 -40
5764 -40 7 213 95 -122 -77 -15 -79 72 18 79 -57 -312 230 198 117 233 209 74 -15 -125 39 -23 162 144
5788 144 -13 -152 -54 -156 255 216 66 65 91 25 112 -2 -59 -13 9 -67 -122 -218 -138 205 -113 134 -75 3 -96
5813 -96 125 59 98 -92 -109 -22 3 -124 -69 59 57 -48 -84 -242 234 63 51 257 -115 -36 -42 -76 19 -125 -90 -185
5839 -185 141 103 169 110 -78 -28 -157 53 23 -117 -56 305 -135 31 141 -164 18 108 285 94 -15 59 -177
5862 -177 42 -116 8 -123 -162 -77 184 -34 -13 110 -44 113 -306 299 -15 -48 -31 -118 193 166 185 87 -161
5885 -161 -93 -223 -125 68 -88 205 -71 -199 -100 31 244 83 375 25 -129 42 136 38 15 -230 -291 12
5907 12 -149 -217 -382 106 -49 142 100 64 188 193 59 224 -228 4 -43 137 78 100 -86 146 105 -54 -68 54
5931 54 -22 141 29 -95 187 308 24 -40 -164 221 -152 106 -49 22 -101 49 107 -183 136 -155 49 27
5953 27 -167 -41 -123 -59 62 120 138 4 127 60 15 -91 -37 238 103 43 340 177 -88 -33 9 26 -138 205
5977 205 245 -80 51 -159 -88 -172 -55 210 19 -21 57 96 -83 -72 -241 -2 -15 -160 -44 -134 -112 140 -202
6000 -202 -118 -46 -218 3 125 -156 -37 -108 172 98 -72 -84 72 137 -42 30 89 185 69 -241 16 50 -48 231
6024 231 75 19 151 61 -21 209 114 178 -83 13 -191 -94 7 -124 199 -214 245 -15 86 153 14 206 16
6047 16 -126 -176 -51 56 -43 352 37 -255 88 91 -48 192 167 90 61 158 -18 -56 -13 -123 136 -228 -132 19
6071 19 118 67 142 -149 -56 -57 -49 -138 -23 -5 -128 -265 52 156 -64 -216 39 181 -64 18 31 392 123 -19
6095 -19 40 118 294 94 225 123 -14 0 22 -45 -163 51 -36 -31 -29 -129 -53 62 187 301 185 142 -71 -114 131
6120 131 -8 -154 -227 -10 106 -69 -374 -222 22 92 195 11 183 -42 -126 -81 -125 -276 -111 51 27 16
6142 16 172 -156 -92 132 6 276 -15 251 18 143 373 149 273 88 -99 -88 317 55 -33 -4 114 -144
6164 -144 23 -309 113 90 -83 157 -87 27 97 -33 -20 -16 86 34 46 -155 79 60 -56 31 -172 61 -50
6187 -50 -55 -58 -71 270 36 27 180 82 -19 -37 -39 53 52 194 -172 -44 -338 -88 208 22 -265 368 211 -125 -141
6212 -141 -64 28 174 -77 121 129 71 96 -5 5 160 -83 80 -7 118 96 -26 92 173 157 -207 73 16 -22
6236 -22 119 -47 230 75 -24 -15 157 -111 -68 -55 -102 -65 159 -112 -26 21 -63 15 -143 -90 60 -19 -124 -26 -129
6261 -129 7 40 -34 -182 -96 257 140 -98 103 21 -257 -295 -1 52 -298 32 207 -204 -118 -83 41 -88 -180
6284 -180 250 117 -43 64 -24 35 -161 -195 61 209 -229 -92 -121 -86 73 -87 -144 37 -60 167 -33 233
6306 233 -76 -125 63 74 -94 -133 256 104 143 8 14 -95 59 100 -111 -212 139 8 -18 107 -183 -49 52
6329 52 -96 -18 -4 88 56 349 109 14 170 -75 21 -38 129 35 175 -149 -75 -73 -47 -163 167 0 126 107 3
6354 3 75 -116 -161 302 82 -157 129 54 -53 45 32 -85 -25 -118 -43 -3 74 -183 -26 -401 -98 87 28 -24 -24
6379 -24 18 98 -4 -18 -85 73 163 -97 277 -396 25 80 174 -37 -72 126 149 22 300 -179 15 -128 6
6402 6 9 158 80 -129 136 57 111 -135 -78 220 -138 -71 147 -85 190 -95 65 33 -65 -240 6 -23 -183 -158
6426 -158 131 153 -123 53 158 50 -300 -209 -145 46 -67 67 -79 -121 222 -288 -2 275 -313 62 75 -28
6448 -28 113 16 -250 -178 -145 40 178 -287 42 -96 -66 -21 121 1 -52 372 -232 353 -223 78 162 -39 240
6471 240 100 -41 70 20 55 -2 -90 85 225 -58 -230 3 246 124 2 184 7 -101 -13 56 -247 129
6493 129 -17 -47 264 261 -52 -87 127 373 -68 -23 -79 94 238 168 318 72 13 -96 -29 64 371 -87 -58 -219
6517 -219 -149 -232 -24 67 109 13 83 1 -106 -180 46 126 -59 151 41 -91 -51 -189 93 -158 181 164 -166 133
6541 133 -13 105 -80 -19 -151 68 55 -157 -129 -165 119 164 -96 345 209 258 -61 -37 -150 -155 -143 137 33
6564 33 -79 -120 -73 40 -188 -164 -2 98 -90 -363 -45 38 152 319 68 161 10 4 169 223 -294 -163 -83
6587 -83 45 -187 397 -142 -143 -1 -4 -228 5 215 97 -354 170 -15 -185 36 -280 201 -198 109 -363 85
6609 85 -142 -72 77 -114 -50 -137 -8 -106 48 -123 114 101 171 -126 40 113 -343 -56 65 -69 197 169 64
6632 64 62 58 -18 192 487 176 287 -142 57 -37 -80 -149 -174 100 137 -194 37 28 -62 -211 -71 29 34 260 50
6657 50 -51 65 50 266 82 -101 273 -92 -101 -60 204 79 -70 -5 211 -152 61 -36 289 -28 6 18 -28
6680 -28 -3 54 47 79 79 -133 -177 213 -262 -147 -19 88 48 -178 -95 -5 34 22 287 -120 -132 -196 -92 81 83 -28
6706 -28 179 -307 6 121 181 -98 162 88 136 38 54 25 -163 189 4 -189 -33 -357 146 16 124 -171
6728 -171 34 101 -150 104 31 -27 -1 75 -107 -36 143 80 0 -238 100 0 -39 78 75 139 -87 -264 -25 -8
6752 -8 -206 109 189 -121 66 -64 -18 -147 184 -136 53 -95 2 -229 -98 284 -35 111 98 81 229 107
6774 107 -41 -71 -156 69 -14 -119 5 2 -92 -33 -57 -42 234 88 17 8 -30 -225 123 67 -89 -130 40 110 -181
6799 -181 -113 -65 -144 -55 -63 105 -51 19 64 -68 -136 -31 -89 -93 244 -176 111 108 98 8 -137 117 -49 19 2 -162
6825 -162 5 158 -224 -90 228 56 -239 93 -9 1 -142 -39 -328 161 -76 -140 -275 -226 -112 -328 -252
6846 -252 -188 5 -218 62 -38 -110 -92 -197 -318 -162 -80 182 288 119 -68 185 191 -187 -133 266 36 176
6868 176 -63 195 271 -42 -4 -49 3 74 -121 -225 38 -59 -150 -27 72 -224 -224 76 -18 -42 -265 -45 -96 -180 -98
6893 -98 40 -92 214 -192 -182 70 -247 -135 -59 -300 131 -70 -46 -41 65 -26 -119 93 32 198 -315 -39 -224
6916 -224 46 52 -170 -198 179 -1 -108 -109 1 -26 -22 -109 12 48 -85 96 213 154 -74 144 92 61 -17 -132 -50
6941 -50 -153 54 -134 95 151 -139 160 146 -151 -142 -151 235 12 -59 -64 64 -101 13 175 -9 73 213 232 128
6965 128 -212 -26 133 -105 8 134 141 -55 11 70 -348 -94 -230 -139 213 -116 -98 31 -113 9 -181 -139
6987 -139 166 121 -118 117 50 -367 -108 -30 -31 70 -56 120 -60 368 -121 -2 63 92 150 353 159 -204 182
7010 182 257 -105 -52 114 93 189 61 -105 165 -28 -238 -226 -120 -129 105 -83 83 -119 94 -61 25 -18 -13 294
7034 294 105 19 79 -113 -339 -45 38 61 86 -161 121 -117 -64 60 -161 -113 -130 -65 8 381 92 -83 246
7057 246 -237 190 -48 224 6 100 78 -156 -36 -150 227 0 -277 214 47 149 97 -1 261 135 -225
7078 -225 71 257 67 -145 87 -229 143 -75 -129 162 263 96 -114 39 -97 -84 -26 -66 15 3 -20 179
7100 179 -25 -82 55 -23 -7 137 137 -165 301 -120 83 -42 -105 139 144 -9 101 -110 -125 223 159 -210 -95
7123 -95 -46 70 -82 -54 100 -154 -211 52 -4 -30 26 -221 -55 178 63 -16 265 -114 11 -5 -265 2 168
7146 168 -75 139 187 42 63 -64 -128 219 -146 -34 -149 33 28 -51 -109 -79 86 -138 -135 -111 -338 2 76 -186
7170 -186 34 -54 184 190 -35 36 -52 88 77 78 138 -59 46 -85 35 151 -69 98 85 27 8 160 241 169 86
7195 86 -149 147 -164 93 95 32 128 165 12 25 274 223 144 -235 -131 -54 123 -134 253 160 92 56 -130 -114 -14
7220 -14 -162 -68 216 18 57 114 -204 -98 -178 -43 106 -45 -80 -12 176 -147 109 -43 -271 557 167 -63
7242 -63 151 -170 -119 -1 166 -76 -202 -40 -181 134 83 -36 -34 -211 141 -90 55 37 8 -30 147 119 -255
7265 -255 -29 -202 115 21 2 78 80 79 -98 -58 -57 92 109 -303 88 -49 6 39 -33 -211 179 -127 78 -502 159
7290 159 132 34 101 57 -79 76 170 99 -277 -66 41 36 121 237 -133 -27 170 -47 133 61 -172 126 -333
7313 -333 -23 11 -110 51 120 118 -38 -16 58 203 6 46 165 -136 -80 22 -115 38 -126 -94 176 47 -40
7336 -40 10 288 108 91 168 154 137 -21 43 37 50 -27 110 220 164 -12 59 70 -173 103 -178 -79 -298 -234 -126
7361 -126 146 35 -99 109 31 -39 -91 231 -22 -83 -45 352 23 220 -4 -147 -92 -48 82 34 -249 124 61
7384 61 -78 302 16 17 101 54 167 274 -76 -65 3 109 151 -267 138 171 119 96 209 138 -318 -238 82 -255
7408 -255 -248 -89 -56 41 -306 37 62 -386 -103 -212 13 -20 23 -194 -117 171 -255 98 -83 -192 138 -15 -107
7431 -107 -94 -276 173 48 13 80 303 -8 197 -252 -229 -28 102 53 -164 190 126 -33 -176 20 -84 180
7453 180 19 -47 -77 -158 303 -89 -303 -252 -231 60 50 191 197 133 -112 -110 201 187 -17 -144 426 -124 -158 -81 149
7478 149 -117 -62 -296 -328 -216 -107 241 23 -75 124 177 -58 324 21 64 77 -66 71 -183 99 107 -41 -104
7501 -104 -45 130 34 117 -30 -253 -185 69 -88 -31 204 -135 2 7 153 -13 94 5 12 293 45 -268 11
7524 11 -27 -15 90 -17 5 -79 162 118 212 -17 203 -8 -130 -48 -59 -50 151 112 -18 -59 -68 -27 271 31 110 73
7550 73 91 -85 48 113 -117 53 164 14 -399 26 -92 189 52 275 -223 -50 134 28 95 -54 152
7571 152 86 106 -39 -179 -112 -98 -67 191 -90 55 95 -159 38 -220 -91 300 220 -81 32 95 252 83 -18
7594 -18 216 170 76 22 17 -114 183 111 182 77 -149 -177 -21 -356 -113 28 301 89 -6 -2 -64 8 -111 305 -4
7619 -4 50 89 -146 -91 -33 -169 -252 -131 130 -76 -32 -94 -11 -96 -74 -84 19 -99 19 197 170 288 70 149 -173
7644 -173 232 -10 -206 -62 18 -139 141 55 152 -76 56 -17 -107 189 -19 -37 -125 182 -337 96 90 -62 -24
7667 -24 -89 -44 18 -150 259 43 86 36 0 -106 -90 -50 -301 130 39 -121 85 -223 92 -30 -28 59 134 -68 -157
7692 -157 105 -24 32 -114 -70 -59 -4 -48 -34 -21 -59 76 -17 -4 270 126 136 -134 24 -101 234 -92 90 68
7716 68 172 -350 -66 108 -33 311 168 -69 -60 -227 -182 -16 85 54 245 150 20 -105 255 34 -104 256
7738 256 -164 24 140 -127 -50 -40 -82 -178 -35 144 -73 47 -197 -65 -261 88 -199 -89 151 62 15 -388
7760 -388 224 -202 -270 -50 -1 60 10 -44 39 -4 42 125 -17 126 -213 -174 36 -144 33 155 132 172 53 87
7784 87 -175 -105 283 60 -192 28 -107 -94 45 -110 -59 -152 210 -69 39 99 21 109 -23 -221 -175 -160 193
7807 193 93 -84 4 -153 -16 -71 -54 41 125 -5 20 -25 51 -69 133 85 200 -27 -71 78 185 -229 -72
7830 -72 -30 80 162 -113 58 63 205 67 -94 -119 -202 -142 -23 -48 48 39 50 397 -117 70 -8 -26 334 243 12
7855 12 -70 163 -81 -64 93 192 53 101 34 140 -320 -47 -208 -152 42 -92 44 24 276 271 262 201 -124 -173 -47
7880 -47 -39 -27 159 155 89 -5 -93 -154 -15 -74 -224 68 -95 -91 14 -37 -228 -22 -45 75 15 77 109 89 -51 -267
7906 -267 0 100 -256 360 -7 -21 55 212 237 151 143 120 -142 -33 -57 99 -164 234 169 51 432 -31 -36 125
7930 125 74 55 -101 -15 -33 -113 328 40 37 -51 75 -10 -34 287 6 -314 57 -233 55 180 -64 -47 -74 -27
7954 -27 -100 110 -34 -317 0 -35 236 56 232 71 110 -63 -16 300 239 120 -30 -113 -121 158 -234 -6 -46
7977 -46 -47 0 -95 -35 -98 161 -69 84 116 -346 -94 41 104 151 203 206 -158 -57 134 56 -118 -78 9 121 259
8002 259 -11 289 232 -145 -470 -206 -162 71 -31 54 181 163 -377 336 -96 -143 250 -92 254 -7 117 -69
8024 -69 33 154 -115 334 -174 74 -160 -162 137 174 -39 163 176 105 -200 359 -163 -70 37 -88 147 -56
8046 -56 -79 -150 35 -190 0 -64 47 -95 -2 -131 129 72 21 -10 -202 178 -85 -50 190 -224 245 68 -99
8069 -99 -12 129 -129 24 77 -33 53 -73 -132 121 -47 -75 21 -135 -23 -100 59 -16 185 -46 62 65 -70 -145
8093 -145 -272 -194 63 209 -38 -93 27 -144 -3 -12 -4 -120 225 30 78 -82 -46 -192 -6 -293 1 -27 -54
8116 -54 105 -68 256 126 -56 69 167 142 372 -132 74 -286 -59 -133 -35 -159 43 100 162 206 -343 186 -35
8139 -35 -136 15 -170 -182 29 -12 -153 5 218 90 -212 37 -140 53 -157 298 12 279 -102 -62 -75 -59
8161 -59 79 229 -43 124 9 -39 -129 245 43 -382 90 -76 286 -235 38 5 -96 5 32 226 142 -31
8183 -31 39 24 176 -201 303 -269 7 -73
8191g3
##END NTUPLES=NMR FID
##END=
