##TITLE=1H_Pr NCS-dep
 200.13MHz,CDCl3,
 8 sc
 
 4.8.2025
##JCAMPDX= 6.0         $$ Bruker NMR JCAMP-DX V2.0
##DATA TYPE= NMR FID
##DATA CLASS= NTUPLES
##ORIGIN= UXNMR, Bruker Analytische Messtechnik GmbH
##OWNER= pz
$$ XWIN-NMR		Version 3.5
$$ Mon Aug  4 16:07:25 2025 Russian Standard Time (UT+4h)  she@DPX200
##.OBSERVE FREQUENCY= 200.1313
##.OBSERVE NUCLEUS= ^1H
##.DELAY= (6, 6)
##.ACQUISITION MODE= SIMULTANEOUS
##.ACQUISITION SCHEME= undefined
##.AVERAGES= 8
##.DIGITISER RES= 18
##SPECTROMETER/DATA SYSTEM= spect
##.PULSE SEQUENCE= zg30
##.SOLVENT NAME= CDCl3
##.SHIFT REFERENCE= (INTERNAL, CDCl3, 0, 14.3821)
##AUDIT TRAIL= $$ (NUMBER, WHEN, WHO, WHERE, WHAT)
$$ ##TITLE= Audit trail, XWIN-NMR		Version 3.5
$$ ##JCAMPDX= 5.01
$$ ##ORIGIN= Bruker BioSpin GmbH
$$ ##OWNER= she
$$ F:/spectra/data/she/nmr/H-C/1/audita.txt
$$ ##AUDIT TRAIL=  $$ (NUMBER, WHEN, WHO, WHERE, WHAT)
(   1,<2025-08-04 16:06:04.14 +0400>,<she>,<DPX200>,
      <created by zg, POWCHK disabled, PULCHK disabled
       configuration hash MD5:
       00 E9 B6 7A A2 85 ED C7 34 08 36 98 17 FE 4E 26
       data hash MD5: 16K
       A4 F3 BF 4F AD 2F DD B5 A1 D0 93 76 28 EA DD 86>)
$$ ##END=
$$ 
$$ hash MD5
$$ 3D C9 B0 77 D1 6D 4A D9 0E 53 9F 2B 3D 32 CB DD
##$RELAX= 
##$RELAX= 
##$RELAX= 
##$RELAX= 
##$RELAX= 
##$RELAX= 
$$ Bruker specific parameters
$$ --------------------------
##$DU= <F:/spectra>
##$EXPNO= 1
##$NAME= <H-C>
##$PROCNO= 1
##$TYPE= <nmr>
##$USER= <she>
##$AMP= (0..31)
100 100 100 100 100 100 100 100 100 100 100 100 100 100 100 100 100 100 
100 100 100 100 100 100 100 100 100 100 100 100 100 100 
##$AQSEQ= 0
##$AQ_mod= 1
##$AUNM= <au_zg>
##$AUTOPOS= <>
##$BF1= 200.13
##$BF2= 200.13
##$BF3= 200.13
##$BF4= 200.13
##$BF5= 200.13
##$BF6= 200.13
##$BF7= 200.13
##$BF8= 200.13
##$BYTORDA= 1
##$CFDGTYP= 0
##$CFRGTYP= 5
##$CHEMSTR= <none>
##$CNST= (0..31)
1 1 145 1 1 1 1 1 1 1 1 1 1 1 1 1 1 1 1 1 1 1 1 1 1 1 1 1 1 1 1 1 
##$CPDPRG= <>
##$CPDPRG1= <>
##$CPDPRG2= <>
##$CPDPRG3= <>
##$CPDPRG4= <mlev>
##$CPDPRG5= <mlev>
##$CPDPRG6= <mlev>
##$CPDPRG7= <mlev>
##$CPDPRG8= <mlev>
##$CPDPRGB= <>
##$CPDPRGT= <>
##$D= (0..31)
0 0.7 0 0 0 0 0 0 0 0 0 0.03 0 0 0 0 0 0 0 0 0 0 0 0 0 0 0 0 0 0 0 0 
##$DATE= 1754309163
##$DBL= (0..7)
120 120 120 120 120 120 120 120 
##$DBP= (0..7)
150 150 150 150 150 150 150 150 
##$DBP07= 0
##$DBPNAM0= <>
##$DBPNAM1= <>
##$DBPNAM2= <>
##$DBPNAM3= <>
##$DBPNAM4= <>
##$DBPNAM5= <>
##$DBPNAM6= <>
##$DBPNAM7= <>
##$DBPOAL= (0..7)
0.5 0.5 0.5 0.5 0.5 0.5 0.5 0.5 
##$DBPOFFS= (0..7)
0 0 0 0 0 0 0 0 
##$DE= 6
##$DECBNUC= <off>
##$DECIM= 32
##$DECNUC= <off>
##$DECSTAT= 4
##$DIGMOD= 1
##$DIGTYP= 9
##$DL= (0..7)
0 120 120 120 120 120 120 120 
##$DP= (0..7)
150 150 150 150 150 150 150 150 
##$DP07= 0
##$DPNAME0= <>
##$DPNAME1= <>
##$DPNAME2= <>
##$DPNAME3= <>
##$DPNAME4= <>
##$DPNAME5= <>
##$DPNAME6= <>
##$DPNAME7= <>
##$DPOAL= (0..7)
0.5 0.5 0.5 0.5 0.5 0.5 0.5 0.5 
##$DPOFFS= (0..7)
0 0 0 0 0 0 0 0 
##$DQDMODE= 0
##$DR= 18
##$DS= 0
##$DSLIST= <SSSSSSSSSSSSSSS>
$$ [...]
##$SUBNAM0= <"">
##$SUBNAM1= <"">
##$SUBNAM2= <"">
##$SUBNAM3= <"">
##$SUBNAM4= <"">
##$SUBNAM5= <"">
##$SUBNAM6= <"">
##$SUBNAM7= <"">
##$SUBNAM8= <"">
##$SUBNAM9= <"">
##$SW= 18.0517328524113
##$SWIBOX= (0..15)
0 0 2 0 0 0 0 0 0 0 0 0 0 0 0 0 
##$SW_h= 3612.71676300578
##$TD= 16384
##$TD0= 1
##$TE= 0
##$TE2= 300
##$TE3= 300
##$TEG= 300
##$TL= (0..7)
0 120 120 120 120 120 120 120 
##$TP= (0..7)
150 150 150 150 150 150 150 150 
##$TP07= 0
##$TPNAME0= <>
##$TPNAME1= <>
##$TPNAME2= <>
##$TPNAME3= <>
##$TPNAME4= <>
##$TPNAME5= <>
##$TPNAME6= <>
##$TPNAME7= <>
##$TPOAL= (0..7)
0.5 0.5 0.5 0.5 0.5 0.5 0.5 0.5 
##$TPOFFS= (0..7)
0 0 0 0 0 0 0 0 
##$TUNHIN= 0
##$TUNHOUT= 0
##$TUNXOUT= 0
##$USERA1= <user>
##$USERA2= <user>
##$USERA3= <user>
##$USERA4= <user>
##$USERA5= <user>
##$V9= 5
##$VALIST= <valist>
##$VCLIST= <CCCCCCCCCCCCCCC>
##$VD= 0
##$VDLIST= <DDDDDDDDDDDDDDD>
##$VPLIST= <PPPPPPPPPPPPPPP>
##$VTLIST= <TTTTTTTTTTTTTTT>
##$WBST= 1024
##$WBSW= 4
##$XGAIN= (0..3)
0 0 0 0 
##$XL= 0
##$YL= 0
##$YMAX_a= 347203
##$YMIN_a= -357735
##$ZGOPTNS= <>
##$ZL1= 120
##$ZL2= 120
##$ZL3= 120
##$ZL4= 120
##$ABSF1= 10
##$ABSF2= 0
##$ABSG= 5
##$ABSL= 3
##$ALPHA= 0
##$AQORDER= 0
##$ASSFAC= 0
##$ASSFACI= 0
##$ASSFACX= 0
##$ASSWID= 0
##$AUNMP= <proc_1d>
##$AZFE= 0.1
##$AZFW= 0.1
##$BCFW= 1
##$BC_mod= 2
##$BYTORDP= 1
##$COROFFS= 0
##$CY= -3
##$DATMOD= 1
##$DC= 2
##$DFILT= <>
##$DTYPP= 0
##$F1P= 0
##$F2P= 0
##$FCOR= 0.5
##$FTSIZE= 0
##$FT_mod= 4
##$GAMMA= 1
##$GB= 0.15
##$INTBC= 1
##$INTSCL= 1
##$ISEN= 128
##$LB= 0.25
##$LEV0= 0
##$LPBIN= 0
##$MAXI= 10000
##$MC2= 0
##$MEAN= 0
##$ME_mod= 0
##$MI= 1.114404
##$NCOEF= 0
##$NC_proc= 0
##$NLEV= 6
##$NOISF1= 3.799351
##$NOISF2= 2.8
##$NSP= 1
##$NTH_PI= 0
##$NZP= 0
##$OFFSET= 14.38212
##$PC= 1
##$PHC0= -1202.335
##$PHC1= 17.1923
##$PH_mod= 1
##$PKNL= yes
##$PPARMOD= 0
##$PSCAL= 0
##$PSIGN= 0
##$REVERSE= no
##$SF= 200.129724274929
##$SI= 16384
##$SIGF1= 3
##$SIGF2= 2
##$SINO= 400
##$SIOLD= 16384
##$SREGLST= <1H.CDCl3>
##$SSB= 0
##$STSI= 0
##$STSR= 0
##$SW_p= 3205.1282051282
##$SYMM= 0
##$S_DEV= 0
##$TDeff= 0
##$TDoff= 0
##$TI= <>
##$TILT= no
##$TM1= 0
##$TM2= 0
##$TOPLEV= 0
##$USERP1= <user>
##$USERP2= <user>
##$USERP3= <user>
##$USERP4= <user>
##$USERP5= <user>
##$WDW= 1
##$XDIM= 8192
##$YMAX_p= 0
##$YMIN_p= 0
$$ End of Bruker specific parameters
$$ ---------------------------------
##NTUPLES= NMR FID
##VAR_NAME=  TIME,          FID/REAL,        FID/IMAG
##SYMBOL=    X,             R,               I
##VAR_TYPE=  INDEPENDENT,   DEPENDENT,       DEPENDENT
##VAR_FORM=  AFFN,          ASDF,            ASDF
##VAR_DIM=   8192,          8192,            8192
##UNITS=     SECONDS,       ARBITRARY UNITS, ARBITRARY UNITS
##FACTOR=    0.0002768,     1,               1
##FIRST=     0,             0,               0
##LAST=      2.2672688,     0,               0
##MIN=       0,             -357735,         0
##MAX=       2.2672688,     347203,          0
$$ Real data points
##PAGE= N=1
##DATA TABLE= (X++(R..R)), XYDATA
$$ [...]
2008A92q33J036q63M34N17j551Q90N17j193J211n13j60P59p10k53J397r17k01
2026b41M32m69J015q22j251J832k11j066O60o3L83K34j414R81Q49j572L56P73
2044D06j71M30j442O97J460j373l44P65n63J02j10n07J286o68j038J136n8l87
2062c79P23n35O25K64j200O66K49p55P83m30k32O32k54o49R13r61O54M00j148
2081f34M33O51j195P07nk5Q52j099L34J195j196n85P59n7M50q09l47J472q84q09
2101g92P62ML1j72k00Q69Jr99R23J04o59J82L9K83M86j403L59Q25p42o9N17m57
2123a08n7K5p6Q28j023J8Q60o95K87K37k09K32k62p6P34o39o53Q76k00j06k16
2144b23j15O43m39p28R72K43j009N65M32q3P6q89Q92L54j175M67Q28o88j51r9
$$ y = [192, -641, 395, -468, -34, 483, -1068, -178, 339, -854, 357, -156, -316, 443, -267, -520, 877, -40, -241, 191, -278, 737, -85, -1336, 496, 285, -781, -121, -184, 199, 433, -981, 0, 849, -723, -367, 406, 235, 665, -777, -80, 1380, 7, -337, 428, -135, -33, -143, -650, 636, -32, -1070, 66, 8, -379, 344, -191, 434, 698, -502, 164, 413, -342, 441, 11, -221, 411, 157, -492, 421, -540, 114, 514, -634, -201, 450, -745, -38, -43, -68, 784, -315, 19, 1214, 18, -567, 192, 135, 585, -224, -571, 901, 17, -792, -30, -26, 5, -167, -367, 502, 503, -496, 427, 531, -128, 54, 93, 376, 862, -541, -182, 643, -99, -168, 349, -108, -165, -140, -216, 612, -411, -393, 467, -228, 59, 296, 87, 319, 57, -19, 715, 76, -577, 299, 99, -7, -223, -338, 305, -134, -862, 110, 353, -656, -91, 341, 258, 334, -555, 337, 691, -484, -17, 811, 123, -28, -127]
2164a27P9O44j050m57J632q05j90M13o18P34k73l16R17n60l21N36M8j38K1l73
2184b04O33l00q62J228j64q80M65j8k64N23p96P67M51j269O07P04o13L46j3j80
2204A61M37r99J28R82q58l08M01k19K57m06J93Q13p59o66J134on68K80l03J010
2224G04l66q39J047o0o22L55l09N8Q0l81M51M61j208N19N14q02L72O3q5L37n29
2245b40K34R05p50m77R07m33k53q0k44J029j004l70J220o41j49K38l68K81N03
2264C08q16R92Pj129R45P0l48M61p34N42N2j105P03O29r16LO20r13P25m41j79
2285e24J162q30k49Q84m56L20j77j60N13n39l26J038m00p15N67Q7R2o6o37L84
2305c2K9q33P94L5k48K39r3L1N96p44J12L81m84K17L50n43O40l39m19Q49q81j10
$$ y = [-127, -48, 596, -454, -911, 721, -84, -274, 139, -479, 255, -18, -334, 583, 23, -298, 238, 286, 148, 169, -204, 429, 129, -733, 495, 331, -549, -84, -102, -366, 157, -639, 128, 579, -690, -83, 621, 8, 354, 341, 161, 598, -401, -273, 709, -149, -457, -56, -275, -18, -424, -231, 582, -177, -843, 291, 285, -283, -3, -306, 704, 338, -501, 546, 486, -136, 219, -90, -32, 48, -333, 118, 579, -629, -110, 404, -398, -26, 37, -48, 289, -240, -6, 899, 149, -328, 579, 146, -107, -187, -431, 598, -406, -776, 444, -197, -346, -108, -476, -195, 308, -508, 484, 491, -638, 307, 377, 29, 490, -244, 298, 350, -755, -52, 577, -339, -336, 284, -629, 96, -345, -524, 638, -192, -441, 443, -13, 307, 130, -30, 483, -56, -382, 656, 256, -459, 108, 195, 287, 221, -416, -32, -3, -836, -42, -7, -255, -16, -109, -78, 518, -226, -114, 267, -217, 0, 350, -193, 447, 108, -311, 538, -343, -453]
2327d53P20n40O2P0J7N21l82k50O81k22m38N40l52J11K46o64N57P6j015O99K39
2348B23o40L58k15M5M04m11J99O29p82O5L47k26M12m61j14O64p58p1M45k34J4
2369a07Q5j84M2K6k02N37k64J85J86k38l52M74j81J24O9m06M55j23k47K28O4L8
2391B09m7m59J91K06m97j4O92o30L49K18j38L90n19j35O63m72j17J37k77M96k86
2412d0j48M26j11n99M44l49J82M27n78K03L27k05J35q8p4P10n43l23N39m22k78
2433c65M17l60M96pn75K53M53m38P5j88K20L37q35N81L41p61O65n4l16M72n14
2454a03l61P90m67J4J09l56O43J5j045R50j5m52N91k55m4M55o69n0M58l44K19
2475H3K3k20L82m32k84M46m2k67N21o33M17K13n36L92L70q13N34L6l72M08n98
$$ y = [-453, 267, -273, -211, -141, -124, 397, 15, -235, 446, 224, -214, 326, -26, 85, 331, -333, 224, 300, -715, -16, 223, -417, -59, -274, -229, 175, -236, -37, 592, -190, -125, 222, -4, 408, -53, -167, 497, -261, -332, 113, -121, -107, -22, -206, -164, -138, -340, 197, -67, 118, 304, 66, -286, 188, 7, 131, 200, -206, 249, 126, -121, 107, 171, 209, 162, -297, -106, 100, -397, -411, 281, -349, 0, 218, 80, 470, -49, -184, 479, 7, -110, 27, -250, 246, -40, -188, 238, 127, -472, -28, -377, -195, 232, -346, -143, 184, -21, 114, 26, -48, 662, 119, -204, 335, -87, -365, 52, -308, 188, 181, -394, -141, 312, -126, -51, -239, -19, 318, -517, 64, 405, -356, 309, 255, -61, 411, -103, -464, 326, -141, -127, -18, -374, 269, 284, -761, 189, 174, -278, 313, 58, 14, 469, -200, -250, 208, -136, 83, 106, -114, 268, -164, -448, -2, -44, -311, 210, -423, -6, 207, -329, 63, 433, -380, 154, 190, -182, 226, -372]
2496c72K46N30m95J89J09l09M07j80o53Q53r2n12O69p99O22J45o81K15P12q59
2516b55L12J15m87O90m13j13M79m79R2M61q02N81j12o91P82j02m17O00k53K30
2536B18L01p17N7P43p83K18j55J66J42m56j20Q53l41n75K72k8L01j48m28N12N45
2557E77r28O39k24L07j03l76M83J50n55j35M11m15L25k00k04N96m59k90J74J18
2577a09n6N75m84K5K34l58M84m12q0N14k58m30N94r5l16J38j02K76K73r39N98
2598G2J07n64Q31l51L7L04n76K40K24n18m4L19j50L43o22R7O94n17m20O44j05
2619D5M5l7k07K17j05m42Q17k87o9M41j98l10L19l71L53k17l71Q94m14k31K84
2640A56n13K37RmK97o9m03N71p2j79Kl13L29M42r23J56O09l75j67L11l57L02l63
$$ y = [-372, -126, 404, -91, 98, 207, -102, 305, 125, -528, 325, 233, -279, 390, -409, 213, 358, -323, -108, 604, -255, 57, 172, -315, 375, -38, -151, 328, -151, -59, 402, -400, 181, 69, -622, 160, 58, -359, 241, -12, 218, 519, -198, -141, 602, -181, 37, -118, 48, 190, -266, -386, 467, 126, -449, -177, -205, 96, -52, -480, 32, 577, -351, 288, 64, 371, 268, -108, 375, 525, -30, -165, 246, -169, 156, -44, -248, 348, -111, -401, -227, -109, -165, 410, -74, -49, 185, -173, 311, -101, -181, 333, 75, -355, 239, 144, -172, -34, -136, 140, 413, -526, 72, 179, -385, 446, 95, 132, 436, -140, 100, 324, -194, -238, 81, -69, 274, -348, -251, 443, -74, -494, 150, 45, 90, 53, -154, 63, -42, -484, 333, 46, -23, 418, 220, -90, 229, -142, 211, -6, -377, 517, 103, -128, 156, -357, -120, -111, -115, 182, 113, -290, 281, 209, 30, 32, -281, 48, 490, -433, -277, 332, -43, -210, 101, -256, 46, -317]
2663c17N9O07m03k54L49J41L5j93l47O98N2q07M26K14n38L43k01k86J91O2J07
2684f2L79n53K10j75j14L76k05L26J49m44kO14l54k68M75m60M80m98k34P08l91
2705d3o01O15jl23L06j45K74j8m96P78j37m07L08l21M42R3m88J27L47n17L3N36
2727C62n59J13P7j1L12m46j33L86Q6m77K12n3J30L23m38M57r0n84O82l54n6P6
2749A5k6J2R0n35O68l60n11O77M7k77M47n43K15M07q14N13l2k17L23j44J16K4
2771I5k23J57J81l71O6Q7J56j96J6M0M13m63m04Q47k24m25M05l02M54j81m84P76
2793D20l62k79K54J90l85R0N5J79Q2p57O96P8k96J18L25p70N51o1l21L31k40j72
2815b74K54o9r0R6j23L60j45l77N24j27m3L33n11L62o4k93M43O1p83Q61l11j63
$$ y = [-317, -258, 349, -54, -308, 41, 182, 217, 24, -323, 375, 427, -380, 46, 260, -278, 65, -136, -422, -231, -169, -62, 317, -236, -26, -201, -315, 61, -144, 182, 331, -113, -115, 499, 145, -123, 352, -108, 372, -126, -360, 348, -43, -644, -29, -30, -353, -47, -192, 82, 64, -432, 346, 209, -198, 110, -211, 231, 324, -164, -37, 310, -207, -174, 362, -197, -84, -7, -18, 294, -152, -285, 101, 187, -290, -78, -131, -1, 322, -116, 341, 251, -333, 349, -5, -61, 15, -11, 1, 91, -444, 224, -136, -647, 30, 77, -200, 247, -296, -81, 326, -488, 25, -7, -224, 99, -45, 71, 95, -128, 29, 210, -161, -95, -8, 148, -48, -32, 8, 421, -42, -446, 401, 177, -248, 157, -145, 309, 128, -356, 420, 58, -221, 33, 223, -162, -72, -17, 162, 244, -513, 183, 261, -35, 83, 408, -362, 189, 128, -193, 138, -102, -274, -20, -89, -179, -83, -206, 154, 9, -368, 156, 29, -14, 319, -192, 170, 106, -187, 256, 317, -466, 395, 84, -79]
2837g9jm8O4M69p30J58K21j77J47N7j78L02m04k5M49n66j09M69K49k56k00L8L48
2860A98k38j92M54r6k41K64k09L71k04m40M60J02m02P2L01j49j02R2O6m8l72K03
2882a10M38o01L74qm26J19%J60L21n13J38K58l60q9K34J30L18m73j37M59k8l12
2904a08L86m22J88j72l98P69l90m59N34L0j19L61k16J67J8j02lM05n78L16j67
2925D0%j63k3R8L27o09l6L69L6l03M91o8O5k60k22O40o27L15K73m60Q3J71k5R7
2949B09j81m34N27k43k32K71m3O4K13m13N00K54p95K00K35j77L87m17j2O01n00
2970A4l63K83J5j76K69l81N80l41k45M41q9L9J53l26Q1K95m80L15M3LJ13k60j90
2993b07L56m19J48L43k5k51K48o03O45J72r09P21l64N6N15l41oJ74m74L28J8j96
$$ y = [-79, -80, -128, -64, 405, -325, -167, 54, -123, 24, 81, -97, 205, -199, -224, 225, -341, -450, 19, 268, 12, -188, -150, 198, -40, -232, 222, 126, -115, 149, -60, 311, 107, -333, 127, 229, -173, -101, 200, 51, -51, 41, 107, 59, -313, -110, 328, -273, 101, 93, -333, -214, -214, -54, 267, -246, -108, 150, -210, -299, -65, 65, 383, -90, -227, 232, 204, -108, 278, -144, 44, -128, -526, 243, -147, -606, -72, -42, -161, 200, -16, 151, 169, 67, 64, 469, -109, 207, 40, 40, -123, -146, -48, 279, -330, -366, 3, 39, -264, 227, 159, 224, -36, -258, 382, -245, 70, 343, -117, -34, 137, 112, 209, 28, -406, 121, -122, -354, -83, -126, -62, 151, -262, 238, 492, -303, -103, 132, -45, 342, -75, -87, 514, 14, -349, -66, -51, -227, 42, -339, 241, -100, -345, 96, 7, 46, 199, -127, -46, 249, -231, 84, 127, 130, 243, -17, -207, 149, -270, -122, 221, 196, -55, 193, -410, 235, 407, -502, 219, -145, -89, 426, 85, 79, 253, -221, 107, 125, -71]
3015g1n1L60n66P52n27j73N17r9k90L00l74L61j58n7L81j79l51M01m35k64R37
3036D14k6m76K19k03q4L35m31L89N0m50L24K07m60M59k65J0K28m48J45L8R7j86
3058a14Nk34L01r4J9L24m98M48l1n38L36O9M7L12k38k21K40n21K33N77m77J91
3080A36J08j93J03j84P1K67k98j59K19k50j8L31j35K90j96j93K50J90k73k1O5
3101A10j86L71n13K38Q5p9j15O5j02J25q0j48O21n65O0j4k5P8L25k36J67k74%
3124i2N13k91l44K39j54J38m2j71L38q4m18N09M8n89J87M64l42O6k84J24M28n60
3146c17K65P3Q5R1q9n3N6k29k31M45r4J21k72j10L54J69m31L39j40N9np6J34J68
3170C12k52j16K36k67o7L35m40M20l19j0K07j47j53M67l46K79P0o35M04J8j27
$$ y = [-71, -122, 238, -328, 424, -103, -276, 241, 142, -148, 152, -222, 139, -19, -76, 305, 126, -225, 176, -259, -523, 414, 388, -88, 131, -72, -156, 179, -252, 137, 187, -263, 61, 268, -192, 267, 2, 12, 240, -208, -63, -25, 72, -114, -109, -343, -42, -136, -117, 207, -291, 157, 126, -412, -76, -7, 40, 352, 114, -107, 133, -388, -155, 422, -55, 136, 244, 51, 154, -30, 41, 308, 10, -149, 70, -180, -198, 133, -2, 288, 92, -101, 149, 339, 66, 45, 110, -76, 295, -218, 20, 105, 26, -89, -24, -126, -1, -81, -229, 392, -173, -113, -127, -152, -74, 251, 15, 182, -92, -92, 421, 130, -214, 25, -129, 9, -33, -204, 134, 50, -368, 141, 189, -400, -213, 251, -91, -25, -309, -185, 243, -317, -52, 21, 106, 197, 108, 55, 111, -118, -349, 96, 2, 123, -149, -259, 95, 264, -167, 172, 32, 91, 86, 10, 144, 312, 60, -56, 180, -87, -154, 181, -259, 161, -158, -168, 39, -108, -261, 206, -140, 139, 209, -426, -22, -4, -131]
3191a31L87l40K80L34o25J24M2k66O09m94k12L45K02n13K30K42j89N0k46J15L94
3212C38n03j70M19o8o7L7l8L01l53nL75o93L85o4j22J47j58p1M53j8qL5j80K20
3236A92r9l51K25N0j56K68k12j94L89j38l4K05k88R0J91l82J69K33k01K00l12
3257a55K85J60l62n5Q0k45j19K81R8K99m72J08M60l05o8J63j31j82J88J07k34
3278i9J99k9J67k28n27O57j72p8K98k26K46J5k15n5J40j64K40j69k08N13l42k4
3300f1K77l77J78j11R7N2j97q4M05j96m10N57k34p4m9n5L59N4l74L05k1k04J88
3323B5J86k56M40l10l4J96n47P56m03l38L53k75lM23m83N2M39j67J12J51l05n7
3345d5R7O8Q4k90p3M45m55R4J17j51K37J8m07M33l49j59M12j52J58L7p2j76K43
$$ y = [-131, 256, -84, 196, 530, -95, 29, 71, -195, 414, -80, -292, 53, 255, -258, -28, 214, 25, 75, -171, -56, 338, -165, -335, 84, 16, -51, -14, -52, 249, -104, -109, 266, -427, -42, -106, -228, -81, -239, -310, 143, 125, 117, 152, -28, 192, 93, -258, -33, 17, -139, 129, -83, -277, 112, -26, -60, 145, -143, -53, 138, -244, -75, 158, -43, 157, -155, 130, 290, -72, -127, -47, -292, -411, -130, -32, 267, -205, -97, 363, 58, -10, 153, 22, -160, 28, 135, -99, 100, 71, 238, 10, -517, 140, -32, -110, 188, -38, 208, 223, 8, -47, 93, -71, 169, 0, -208, 305, -37, -61, 216, -161, 17, -94, 3, 55, -142, -226, 179, -17, -427, 130, -104, -178, -227, -282, 77, 131, -243, 62, 41, -163, 25, 211, -45, 395, 85, 51, 247, -300, 456, 53, -285, 68, -207, -210, 213, -270, -218, 221, 54, 166, 317, 12, -45, 52, 120, 204, -86, -159, 286, -169, -75, 42, -109, 128, 146, -261, 172, -177, -336, 76, -76, 82, 119, 47, -129, 114]
3368A14j81M6Q8j75J18l35O9N57l87N6r7nO1j84P8q0L01q9K94l48NK2R3k04L22
3393A39l92L32J23l57M54l56p5L63k76p3J90k42K19J37k84j02L68j02k46K69k28
3414a39K05o9m9L24m18kK08k90L67l0k18K55mm11L28j75n3O1P0kR1j57K29L41
3438D62n93K23l2l0J13k82L48k09j86L97N1l85K94l03K17m7j8R3J51j34nJ57m66
3461a84L58m6k03J75n6l25L06K90k19r4k3P2P0r7R2j12j19K97l10L7K03j80j6
3484h4L44Nr7L3l27J69qk68L94j63j37K08l1k88M12k11k43L75k43K35J42p6j37
3507Dk0r8M3L2J98l7l10N12o61J49O0J56j26K34k19KJ00M2J4K48l35J38k48n4
3531a76L21M2j30r2j83k8L35j76J8L6j72P2K27k69J93J87k39M39o41L84k66J66
$$ y = [114, -67, -21, 67, -108, 10, -325, -256, 301, -86, -30, -127, -132, -71, -255, -177, -257, 44, -45, 249, -99, -94, -72, 21, -183, 139, -253, 79, 202, -155, 299, -57, -132, 231, -45, -118, 72, -170, 49, 186, -98, -200, 168, 66, -180, 89, -139, 66, -3, -52, 272, -146, -148, 60, -230, 137, 107, -111, 144, 140, -271, 57, -118, -171, -110, -40, -42, 49, -108, 121, 462, -131, 92, 60, 30, 143, -139, 209, 0, -186, 211, 262, -123, 171, -132, 85, 38, 20, 113, 264, 130, 125, 282, -184, 174, 128, -75, 100, 44, -281, 25, 315, 96, 2, -21, 51, 121, 24, 116, 4, -115, 182, -128, -91, 112, -68, -84, 260, 265, 168, 201, -126, 43, 35, -233, 161, -2, -139, 69, 38, -250, 162, -49, -292, 83, -160, 75, 217, 141, 4, -16, -114, -71, -39, 159, 122, -188, 324, -337, -188, -128, 28, -98, 136, -83, -81, 19, 61, 75, 323, -12, 126, -122, -176, 145, 187, 57, -35, -218, -246, 89, -87, -69, -33, -205, -133, 94, -175, 18, 205, -34, 405, -236, 148, -118, 48]
3553D8m4Q9%n6K8j71j1J74j71J57j18R8K37l80L98l04k55M83q7j01L19l29j95
3576a91M09l31kP7o0J3M3j43L8J64j41n7J49j69K83j32kK12n57M53k35p2K08r3
3600a36l0J57Kj97J33L9N7n1j39O7m3R0J23j0o7Nk0M7R3k91K18k9j73K39J22l03
3626i7j37J12M4p6R8P2J98j98qj50N5J28pn6M9j04J41Q2j13M2L23m39q4J21k95
3651b99N14j77m19K80L72m00K43j81J64K3k85J99K7j38R0P8j01QQk2K11k50J50
3674I5l70K29l2j22K00J40ll10Q0j8K17l0k06Q1J6K1j00j0J28K0j80J36p3k8O4
3699e5L42m21N3J37j64K43j86l2P1N3j91J69j53J04K24j46L9M7k1q4J09j74n5
3722i1K46k8k39P4j66L58k07q6R0j66N14m64P0J88m21L67K12j89q7J9k34L78l14
$$ y = [48, 4, 93, 93, 37, 65, -106, -117, 57, -114, 43, -75, 23, 260, -120, 278, -26, -281, 202, 115, 14, 333, 4, -191, 218, -113, -115, -38, -98, -85, -42, -185, -147, 17, -124, -181, -32, -201, 82, -50, -52, 160, -397, 56, -179, -251, -43, -136, -166, -9, -7, -204, -71, -32, 25, -26, -165, -98, -141, -51, 72, 62, -5, 0, -20, 27, 120, -171, 47, 18, -155, 84, 206, -97, -234, -122, -78, -154, -56, 16, 214, 16, 8, -142, -87, 41, 34, -22, 27, -77, 64, 146, 33, 75, 398, -41, -125, -4, -299, 215, 38, -381, -101, 271, -129, 114, -67, 97, 120, -165, 34, 61, -77, 13, 91, -10, -2, 6, -16, 195, -55, 95, -275, -46, -78, -200, 0, 140, 137, -173, -93, -111, 106, 76, -130, -49, -33, -12, -112, -122, 6, 26, -154, -18, -91, -119, -55, 287, -134, -81, 56, -108, 135, -51, -83, -12, 41, -150, 19, -134, -30, 194, 48, 87, 134, 113, 29, 138, -36, -91, 155, 127, -112, -38, -204, 154, -53, -139, -49, -215, 299, -165, -95, 93, -328, 39, 251, 62, -25, -6, -240, 138, -176]
3745a76n3L31l09L92Q2k66k74L82k15r0K31k30J67J22j99L04l98K15J56k83J0
3766a01j01Q3L82l13j6J59j39k21L68k82K08j82J1K00J33l46N2m3L02l6j56j74
3788b12J63N5r0J51j9o6J51k00J09o8k14K56j22QJ81j02L35l79k90R7L85j54N9
3811C4J62l6j89r4j52M52j95q5L26O7k78m5J93mj46k77L56L3l35K57J53q1K1k16
3835g9j35K95l31K38j4k34J57n6J32l2j5O4Pj37M06k15K6o7K06k56J13O0pJ8p
3860A37P0k31j20J76oJ33k32K53l22N4P8jJ73L9j93k10j3J14O5j34Q2l41L20j56
3884b65J05K26J29k69J53L00l06k07J54R6j92R4J62j52j08j1L56j80J47k07K9
3905E4L24n78L52j51j01M42o34K09L11m36J55J96k25J70K9J05k45J03k54K01j36
$$ y = [-176, -229, 102, -207, 185, 267, 1, -273, 109, -106, -196, 35, -195, -28, 94, -105, 199, -199, 16, 172, -111, -101, -202, -119, 263, -50, -66, 93, -46, -267, 101, -181, 27, -155, -144, 56, 189, -157, -105, -148, 154, 118, -38, -212, -49, 6, -84, 67, 48, -18, 133, -67, 42, -26, -240, 16, -106, -98, 83, -19, 316, -63, -353, -256, 129, -25, 34, 196, 160, -29, -123, -275, 177, -18, -103, 223, 290, 12, -33, 160, 156, 10, -267, 89, 122, -213, 44, 197, 116, 137, -79, -214, 81, -250, -12, -26, -260, -103, -159, -27, -59, -74, -10, -3, -140, 266, 51, 77, 10, 216, -40, 73, 133, 126, 144, 137, 207, -24, -144, 32, 26, 159, -73, 180, -142, -88, -10, -11, 162, 201, 8, -202, -215, -101, -36, -170, -88, -429, -109, -265, -160, 66, 195, -74, 79, 379, 73, -134, 20, 116, -76, 18, 180, 28, -80, -91, 265, 85, 232, 25, 54, 378, -200, 152, 1, -100, 342, -292, -83, 228, -208, -53, 143, -82, 88, 117, 222, -23, 80, -174, 27, -109]
3926a09K12rM9M0j73N1M7j24j60K37J31O9j51j05OJ53j04j20m9L2l1o8k43K47
3950a72K30P4o9j48Q7K97k94k38K88l6L86q8m68r6K46lJ59mk8m6r7l8K7K01k06
3975c6J85L9k41J38kO7k08n7J41k78K98K46m24J76p8k45N49m28PJ18L41m07P5
3998b4k01L28K4o1n7K12k99km0o8J6J87l65O4K05P4K1n4J60J17k87J26J18k53
4022e9L12m42J95J00Jj48j72K70K08n1P5l37Q8k01L96l36p2O6o5J38L51k32j3
4045G2J14l79K70P2K7J4l50J94L1j28k20K29P3N1L5k76J71k56K29oM3k8MK39j44
4070H1K2o5j24K37q6j90M51m75J25k1P7J70m55K56L6P7k63J15j39M69j13l29j17
4093b61J53K64j50l6l0M35n41L70j79r5K13l39J2N60m18RL5P3j48j56L18J0m56
$$ y = [-109, 103, 94, 143, 183, 10, 61, 108, -16, -176, 61, 192, 261, 110, 5, 11, 164, 60, -60, -109, -77, -108, -176, -419, -172, 58, 132, 63, -85, 2, 299, 5, -233, 55, 19, 405, 317, -151, -247, -1, -4, 155, 151, 123, 77, -20, -58, -31, 170, -36, 149, 188, -53, 85, 83, 150, -58, -115, 26, -252, 46, 292, -132, 44, -34, -279, 270, -158, -151, -33, 308, -99, -24, -225, 103, 127, 66, 9, 221, -78, -80, -120, -188, -172, 15, -350, -286, -81, -7, 14, -40, 120, 237, -50, 76, 194, -59, 253, -189, 6, 106, 107, -41, -213, 57, 265, 214, 289, -48, 40, -161, 235, -101, -173, -107, -172, -34, 317, 85, 72, 186, -193, 77, 149, 176, 190, -160, 34, 65, -63, -283, -54, 19, 70, 105, -171, 0, -256, -27, -33, 10, -18, -14, 225, 81, 103, 38, -86, 151, 65, -125, 326, -149, -24, -45, 32, 202, -253, 3, 39, 116, -147, -32, -171, 298, 185, -144, -261, -108, 156, 6, -30, -60, 375, -166, 204, 25, -70, 143, -196, -184, 376, -42, -33, 2, 75, -73, -229, 89, 99, -357]
4116c57J71K79J23k16j46M0K42j83lK4R0p6O9j12M7RJ87j91N6k12J72R0p9J39
4140A63k64J86J83j85o9m8j5K5m4J73j05k9L6K03j60j85K54n6q2L1j50K20k18
4163a36J26K71j77p2r7K15m86L81O1j68J63l22J05J86r0M1J05k19K87m94M67j32
4185A5m5J73l24J4K28j37n6L39k78O7Q7M0l8j13m5q8J76k65K14Lj83K1J64j2J24
4210H1j08J41j71J20o0P0qk5j22M71k98j48k44L36p5p5J57j68J45J31k85P3j17
4233a79J36N9k18j88M35l99K67P2p6J31r6n3Q7L69m19J00r0q1j95L98K26k64l9
4256a7j3J14j20K0Pj23R0J47j05j50J95J10k5k82K3K70k7rk25j5J56qOJ57p7J65
4282B64k63j10J42OJ40k1k44K01j74O3Q8j01l5J44J32m50N13m48J07k9m6J58J22
$$ y = [-357, -186, 93, 216, 0, -146, -106, 136, -47, -50, -26, 64, -12, 57, -55, -8, 1, 188, -3, 53, -159, 13, 103, 24, 163, -101, 85, 268, 83, 14, -34, -49, -24, -68, 105, 0, -29, 7, 210, 50, -135, 119, 63, -19, 12, -138, 82, -136, -10, 261, 84, 12, -85, 130, -356, 25, 86, -82, 81, -241, -136, 50, -40, 1, 106, -113, 174, -320, 147, 15, -30, 143, -181, -167, 61, -76, -132, 207, -71, -4, 83, 123, 85, -28, -73, -161, 15, -250, -36, -33, -216, -195, -31, -43, 81, -27, 114, -57, 63, 3, 73, 65, 40, -82, 389, 91, -57, -301, 35, -40, -115, 42, -126, 19, 150, -135, -62, -179, -43, 16, -202, -390, 45, -354, -87, -15, -91, 40, -56, -109, -22, 347, -72, 28, -62, -143, -338, 60, 286, 22, -17, -30, 84, -36, -16, -9, -132, -42, 105, 0, -150, 45, 155, 130, -152, -129, 141, 114, 105, -120, -135, 21, 13, 19, 176, 99, 264, 1, -109, 33, 39, 179, 158, -86, 115, -59, 4, 92, -9, -44, 100, 232, -218, 295, -153, -46, -75, -121, 37, 159]
4305A59r4N4l55L46L5J02j19m4P8k87M2j56O1L30j96J48l15K26l5k24K24J35o9
4328D6K47k41j00L5N1K3j91R1J5J15k48P9j22J82p4m1K74n33N54p4k99J71m0K00
4352A20k07n0J62j53J89j79L56l14K76j12J59m19L69L6j54Q2k59m6L46j59r4j0
4374f1k05M21k96L70l36l0J52l14K90Kk87K37J29j93n6Q0L42k9k84j45j57K42
4396a28K41j89K66Mj8k38J82j70J68k42J48n5p6K51k42MK58m8k19R5J19j5q7M4
4420E3m6J01j45J01k98M85j03m15L06k46L21k37K58n5o4j31K02j88J91N9k4k07
4442h2J29J24L3m25J85J04J0k41R1K27q1K1j28%O4NR6p6j70J25j45J02L73l71
4466c0K4J67j22J26k22J29n5K0J43j16P6N0l04J16J20k47K06j33k15K22K67k73
$$ y = [159, 65, 119, -236, 110, 145, 247, 128, 84, 162, -125, -83, -239, -178, 152, -44, 104, -211, 15, -20, -244, -20, 115, 46, 293, 52, -48, -13, 38, 61, -130, -39, -24, 91, -157, -78, -200, -18, -92, -133, 141, -392, 162, 88, -211, -40, -80, 120, -87, -137, 25, -128, 61, -118, 238, -76, 200, 88, 247, -172, 197, 233, 79, 161, -98, -144, 202, 43, -51, -61, -266, 155, -141, 229, -107, -137, 15, -299, -9, -7, -294, -57, 72, -121, -177, -97, 245, 216, -68, -213, -370, -128, 113, -76, 190, 194, 176, -62, 120, -50, 118, -124, 24, -31, -107, 144, -98, -94, 164, 116, -103, -8, 111, 96, 9, 53, 7, 108, -37, 64, -234, 251, 148, -267, 39, -207, 114, -123, 135, 80, 16, -115, 87, -101, 90, 149, 125, -82, 47, 171, 204, -221, -36, 68, 78, -163, -72, 155, 74, 95, -33, -33, 31, 36, 132, 56, -114, 11, -134, -32, 341, -30, -6, 161, 39, 165, -57, 72, 17, 37, 180, 64, 140, 190, -114, 2, 122, -125, 81, -52, -267, -45, 222, -51]
4488e1Q8J9J61k50k4J27k51M9q1M19p1rO0k83j03K17l53M31j15M5k09L00l8k85
4512b07K88K16l19oK80m40N36p24M15J2J84n00L81j02r5K01j53K06k9l74L20N0
4534A40R6m42L55k46l30L39j0r2K56Jj21J00%r5K11l7k96N44k23K8k85N2m7K0
4558h2L77l60P9j81K13J47Q8l10j64J73j09K13n6O7K20l80m8K49j34L71m0k21
4580A12Q3l38J05K0j3J25j60j74M08k91J11%j93J45qj8J49k29K57p5j82J36N0
4603B0m62J33J03r1M30k10o8K74m9k15oL52k09L89m44n1J99k84J23K4L3m5mJ98
4627A40q8j78J19J44k46R2j13M33l32j75M06k48j5j30J71O0J06j84k79L98q5N0
4649D6n2O3k60K64j0l07L40r9j66K22n5p6J1J68l08K54j52q6K53r2J87k80K71
$$ y = [-51, 37, 56, 217, -33, -57, 70, -181, -132, -213, 206, 135, 126, 186, -97, -200, 17, -336, 95, -20, 25, -184, 116, 78, -207, 81, 297, -22, -28, 252, -188, 348, -376, 39, 51, 235, -265, 116, 14, -81, 120, -33, 173, 144, -230, 90, 140, 236, -206, 149, -97, -427, -88, -98, -190, 66, 67, -54, 46, 46, -49, 162, 125, -171, 373, 150, 178, -107, -55, -102, -82, 295, -65, 14, -167, 46, 193, 281, -29, -193, -20, -129, 84, 28, 95, 315, -65, -113, 136, 2, 373, 333, 112, 195, -143, -38, -18, -31, 94, -66, -240, 168, -123, -12, -12, -205, -60, -68, -86, 63, -166, 91, 16, -166, -30, 20, -442, -309, -206, -297, 133, -77, -145, 129, 80, -135, -141, 211, 2, 391, -53, -104, 95, -189, -66, -42, -9, -54, -58, 140, 52, -126, -7, 137, -109, -17, -130, 303, -29, -204, 202, -46, -61, -191, -20, 40, 146, -38, -317, 81, -4, 46, -6, 57, -203, 61, 51, -256, 84, -15, -181, 41, -14, -90, -79, 89, -219, 35, -117, -203, 50, -42, 145, -135, 136]
4672A36Mj00J9M7n4j32J78j57K22k71K41J7q4J22j39k40L68j07k36K18R7Q7j20
4695A16o0j3nj11k29L09r9k3J37p3JM9J22Ll4l39L11j17j01q9J90J69j81m1J88
4720H0p9p0R0j09j30L46l30K72Q7k3r6j6p0J56j45J08k20J23J6j58J91K04k86
4743e9J31l5K21k29P6j81M6N6n3J31j58q6j4L0N3J17l02M32j89J4n1J83m3j2j19
4768d1qKj04O0P5j42J47l4l6j52K34j55M0k1O9p3J92N4p4k95K4O1K65j87J94k49
4794a54J54J74k11J84k8k30N3l5J44R9l67J4L0kK78k30k85L60J12k7k91L32l52
4817b78L05K1M9J62m16K62J10k63K46k37j0K66k15q4L33k60O7Q8L7j03j74r2J77
4840iJ02r0J83k95J13J42j12j21N8k8M3kj99R6J34qj40K77n5l94K70NJ35j33J73
$$ y = [136, 140, 40, 59, 106, 52, -80, 98, -59, 163, -108, 133, 150, 66, 188, 49, -191, 177, 70, -166, 52, 149, 236, 116, 56, 43, 38, -73, -302, 7, -92, -115, 22, -51, -50, -1, 121, 124, 90, -249, 62, -55, -156, -245, -55, 114, -67, -108, 80, 1, -69, 21, -88, -218, 128, -202, 70, 157, 134, 38, 22, -48, 108, -37, 71, -149, -26, -10, -168, 23, 227, -59, 72, 37, 258, 29, 105, -76, -30, 26, -27, 104, -54, -140, -154, -124, -71, 46, -256, 176, -13, 1, -50, 133, 90, 78, -41, -49, -47, -151, -91, -16, -158, -11, -45, -81, -233, 1, -154, -114, -135, -66, -139, 53, 107, 33, -262, -238, -177, 88, -99, 95, -154, 0, 174, -37, 147, 119, -111, -58, -93, 51, 150, -217, -203, -173, -175, 103, -127, -412, -52, 60, 33, -258, 74, -278, 27, 48, 97, 259, -157, 105, 215, -48, 198, -39, -49, 217, 2, -82, 251, -9, 58, 146, 183, 80, -94, -186, -9, 93, 3, 186, -109, 4, 146, 34, -87, -29, -57, -14, -16, -215, -119, 15, 7, -133, 144, 89, -305, -35, -30, 105, -28, 145]
4865A45MLj51k69O44m68O6J1M9M3N7k71O3J06Pj36j33K73M3L0r7j25l1K72k68
4890a33J31P6k22L60m67K24k37L82P9k71j0K19j71O7J80n68J42M53k96Q3m9K13
4912A85j61k88N2K94l6M7L5l8j52om8rL4J81k26q1J73k53L78m5j56K13j23j31
4936a61K63o1k1n0M8j4n3J88m63M46J98m40J07J88l34k8M8O5q5L14p1l18Q5N58
4960D09m40J6J55j31K20j16k59J8m%J81K84k94N7rl19J02N06m86n3J75j31J92
4983G3J20j11K12l34j48R4J77L5J27j85k82L02k44J36P7o7O0r2O1N6j83J26j03
5006i3K25o5j50j64J49N0m9K78k85K25L5j18O0J41k02p6l10K94Q4k01K88j09J34
5029A41j92Nj96M10m07J77j20R5j75J08J48k64M47m07L1N05r8l09R6n6R5j49l
$$ y = [145, 149, 152, 1, -268, 376, -92, -26, -15, 34, 77, 134, -137, -74, 32, 39, -97, -230, 43, 86, 116, 19, -106, -137, 135, -133, -2, 74, -148, 212, -255, -31, -268, 114, 193, -78, -88, 131, -40, 27, 207, -361, -219, 234, -62, 21, -28, 185, 24, -264, -212, 82, 46, 93, 128, 90, -62, -68, -116, -125, -91, 90, -136, -217, -44, -297, 81, 36, -120, 93, -30, -161, 102, 41, 20, -30, 18, 4, -49, 139, -324, 122, 320, -120, -13, 175, -159, -187, -139, -74, -159, 155, 84, -234, -149, 409, -31, -15, 140, 9, 229, 113, -146, -128, -132, -132, 49, 333, 39, 96, 87, -232, -130, 376, -110, -163, 12, -119, 73, 193, 82, 294, -40, -188, -94, 83, 118, 245, 60, -222, 80, -164, -28, 49, -18, 42, -50, 11, 67, -116, 10, -93, 132, 67, -83, -247, -98, -48, -97, 181, -104, 121, 156, 38, 98, 239, 37, -39, -349, -55, 29, -172, 116, 7, 141, -51, -46, -242, 168, -239, -62, -182, -87, -262, -154, -6, -270, 177, -230, -199, 306, 208, -101, -5, -61, 34, -115, -118]
5052a18K86k69J50j53J14q5r2q9L43k20l7K27N7j4k7k20j14L83j68q9L16k12K
5075b9R3j64l7K29l29K59l08K25l7K56l47J54%K91j52J33k17k20J50k1J1Q8J20
5098A48k46J77k7j57K66N0l98J8M17l32J05j35K16j78J31j87J13j89L19j85m9
5119a23N4O8j36J24m4j33K16J99k79L2q6j04K54L9j35J01m2k90L87k77M58l66
5141h3J84n8rL36n44J3J42l11K70m7k64L55j25J21j52J66J44k82K38j44M4R1k2
5164F3j27j79M16k94K96j41l64M16k76J43J22P3J54j93j70N6l4m9K56n1J69p2
5186B14n1k60R5j35o2L59j99O8K30l76J38o3m9L02j24j88J7k9l9K68n4R3j76r7
5210a18L0K07J4k08L1R3k4k4j61M10j76L2j66J91M4k90J07n3L57n38M07j98L4
$$ y = [-118, 168, -101, 49, -104, 10, -75, -167, -256, 87, -133, -170, 57, 114, 100, 73, -147, -261, 122, -46, -135, 181, -31, -29, 64, -100, -137, 92, -237, 22, -286, -61, -98, 158, -189, -35, -35, 256, 104, 237, 20, -200, -50, -71, -60, 28, 148, -98, 79, 52, -105, 161, 211, -187, -169, 248, -84, 21, -114, 102, -76, 55, -132, -19, -208, 111, -74, -123, -69, -1, -137, -13, -57, -190, 26, 225, -54, -22, -108, -212, 42, 81, -54, 47, 5, -285, 102, -175, 283, -83, 101, 43, 34, 370, -174, -161, -19, -330, -60, -107, -371, -16, -141, -20, -172, -6, 138, -144, 94, -50, -6, 85, 63, -64, -243, 173, -121, 175, 34, -330, 86, -190, -47, 75, 148, 302, 109, -61, -5, -39, -88, 168, 117, 286, 214, 163, -97, -2, -137, -199, 160, -39, 29, 259, -117, 21, -42, -91, 211, 87, -101, -84, -113, -152, 116, 62, 155, -21, -118, -88, 119, 133, -75, -44, 49, 25, 1, -160, 250, 74, 106, -60, 131, 175, -115, -8, -61, 296, -242, 165, -33, 1]
5233AK58l69k16K53K75l08K12P1j3m5k59K12L55m15k27J17O4J52j83J30j11l3
5255g9J6N9P8j94m6J86k6O3j32J47K0k62J2J31k05JM01n09K03R0J20N2l7m9m02
5280c62J30J16J09J93k47J7J06n4K79l56K7K00k43J70j82r0J33J56l11J22J28
5301D1N1J7J40l83k41M47k22o5M46M0o60M72k97P4N8O5N0J33j12k03M9L30l42
5324a12J93j08M0O0K05k72L2q3j17L3J2K06n7M0j17q3J09O2M7k31L14k55R3j03
5348i2J41k07J93k7l77M05j29M2J18j32MK31j41J07j51K14k61K5J6J33l67K48
5370gj18J80n3l3j58J93j55K33j78K8J15N5m47L28J50j56M6J19q3q8N0j63L39
5393A97N2l60R1K28r2j78p9K41q1k60J32k21M43L0j01l7O0J11j76M0j01L8j7k98
$$ y = [1, 259, -110, -326, -73, 202, -106, 106, 177, 164, 119, -140, 72, 427, 12, -215, -98, -34, 118, -65, 65, -46, -79, -63, -4, 74, -120, -166, 20, -6, 57, -75, 72, 92, -170, -158, -27, -232, -231, 170, -339, -136, -46, 74, 126, 89, 40, -362, -232, -116, -7, 186, -61, -44, 62, 8, 287, -69, -42, 158, -85, 85, -97, -187, -54, 102, -209, -87, 41, 92, 109, 249, -134, -375, 72, -150, -215, 231, 271, -389, 83, -214, -140, -82, -17, 33, 166, 54, -149, -100, 230, -112, 81, -27, 13, 73, 278, 6, 38, -45, -162, -129, -117, 89, 32, 72, -45, -128, -19, 43, 90, -141, 173, -82, 11, -92, 49, -158, 35, 8, -369, 36, -93, -51, 67, -65, -61, 170, 29, 136, -15, 199, -62, -37, -21, 112, -255, -7, -125, 55, 2, -31, -189, 4, -151, 82, -96, -68, 47, 102, -345, -17, 133, -23, 23, 142, 59, -29, 21, -142, 197, 249, -111, -20, 208, 116, -62, -141, 100, 19, -241, -109, -330, 113, 143, 42, 5, 65, 176, 0, 40, -61, -23, -40, -338]
5417c38L85j42J17np9m7O8k16J45J54j85R5j36J36q5J54O8J0lNk0J69m86K87J28
5442A79q3Jn4j08K84j43l1qp6M10k98j42J60j39k25M29k31Q2j17J88k07n0L60
5465A81j1N7k96j13K28J08k68L54l28J6k01J31J3K24J7k55q3M02q7r3L9j36J76
5488G5j74Q9m8lj1J50j73j27Q0J09j63K68k83K43o2K47m42J44O5k8K35J25j16
5511B00r2j26k36J47J43j39J67j07o0K29m55M53l41L07j82r6K61j02P6N5k85J40
5533d3k20J35RK9J22k0j54m5K96j2j32j56Q2L1q8O9J13%L20m33P7J50j25j75l
5558a73K91k76J18K3O7O8j01j05L65j19j13J95R0Kn25k0J99j28K00J76j29n2j39
5581h6J18j93r8J98N4m5J24j10k37K70p5K3J6k37N19k07j91Kj3L17j39J31j51
$$ y = [-338, 47, -95, 22, 17, -62, -109, -41, -257, -112, 42, -143, -48, -184, -48, -133, 21, 89, 99, 96, 101, 81, 250, -236, 51, 179, 96, 97, 43, -65, 219, 76, 45, 37, -39, 371, 73, -69, 91, -48, -273, 156, -75, 7, -110, 78, -129, -179, 181, 170, 227, -69, -182, 46, 154, -114, 240, -88, -72, -273, -142, -129, 95, 112, -143, -226, 176, 89, -4, 35, -101, 75, -99, -10, -58, -61, -72, 78, -95, -222, -142, -33, -196, 72, -211, 32, -30, 217, -225, -81, -16, -44, 191, 316, 200, 108, -18, -254, -107, 36, -103, 64, -43, -103, 126, -329, 124, -217, 90, -92, -188, 73, -29, 47, 102, -183, -43, -263, -128, -119, -90, 32, 12, -142, -187, 109, 97, -35, -191, -109, -78, -166, -97, 16, 16, 336, -97, -20, 130, 5, -170, -173, 118, -158, -40, -17, 50, 118, 17, -88, 277, 158, 45, 240, 330, 332, -193, -213, -14, -142, 58, 234, 105, 53, -86, 32, -161, -259, -61, -7, -52, 72, -38, -275, -5, -80, -57, -41, -278, 241, 34, -157, -155, -168, 149, 10, 141, -10]
5604a0N1M7K05k09k94J58J06k06J84Nj53K80j53J07o2k66M47l64K15q5k49J59
5626h7K78J14m82N8P4J25j16Rj26J91noR5p4Mnj2J56k74M2nj30L46q0j08j26O6
5653g8K18J3n2j33R7l77J75J43J0j22J97J12l81K68j12o8L54j75k69M74l11J60
5675A43j85J87j36o9J3K29k18n7R7o1P5l1l0j3L05k16J98k88R4J06j67K7k20J35
5699h2K49j90M9M8l1j44RJ37o4m6O6J96p4j78n5N2J83l35K60j43j51J61j75L19
5723F1O8k98K47Q0k70j5p5K39o1j90J78J63k99L40k09J48l5j62K24k24K74r7j04
5746a7J14q9j6R9ml7j59n6l4M12j88p8K18j05j57J63k11J63j34Q7j86L66l14J1
5770a52K51r4j25L0J19j31QJ39j79N3J58J56j90K54l54J17J20k22q8L48j77l3
$$ y = [-10, 41, 88, 293, 84, -210, -52, 54, -152, 32, 37, -116, 164, 11, 118, 56, -210, 237, -127, 88, 3, -246, -87, 191, 305, -177, -119, -45, 80, -36, -27, -153, 38, 33, 27, 122, 48, 52, 47, 35, 191, -83, -41, -46, -176, 170, 90, -18, -144, -78, 140, 153, 101, -32, 65, -312, -137, 6, 16, -106, 91, 203, -178, 90, -22, -90, 264, 89, -180, 294, -17, 143, -42, 145, 9, -60, -47, 182, -36, -93, 4, -57, 18, -13, -43, -56, 249, 33, 231, -57, 37, 143, -24, 3, -217, -82, 167, -23, 26, 74, 43, -101, -92, 45, -19, -65, 1, 197, 123, -55, -110, -58, 125, -210, 50, -93, -244, -83, -258, 61, 129, -169, 78, 158, -112, -127, -202, 37, -24, -214, -36, 127, -172, 168, -41, 107, 72, -90, 134, -90, 184, 87, -17, 97, 8, -8, 91, 87, 50, -109, -165, -199, 213, 25, -53, 165, 60, -97, 66, -145, 18, -116, -29, -215, 151, -163, -152, 99, 5, -120, -90, 29, -102, -94, 45, -134, -81, 77, 233, 43, 297, -57, 60, 180, -42, -130, 218, 41, 8]
5792HO6m8J20k46K03K19n12L08m7k53K44p6OJ29k84J44j39q5L07p3L29l62l6Q2
5816Dj77L84j45JP9J33K59o32J58K55j53j11j30R4qJ92j29O2p4l95N20m38K23
5839b8P0j97j01K33j47K89j65oo0r1M53k94L75o4l2m92M45k21P3Q2k20L18k73
5862e3j03M03j18r2O2j34j06K44l00J56j48J73O2N9k44J93M4K4j83N3k12R7N9
5885f4Kj55L73K96l83k54J63j75K71O3m1J86p1l33K40j70l18L25J70L3J44l27
5907b5q2N0K30k92J50q5L57j99k03K66l14J97J46J9n16J15J5%K72j35J81j05Q9
5930A31N0k17o4j23J68P6klK8J1k6l6R6o5n4L38l01M9q3O3Q4j24J55j0l45N4J56
5957Fk46L19K9q1j01J38k01K36k14J48Rk19J48k1k3j23J54lqJ36jk22K03q2j67
$$ y = [8, 74, 26, 146, -100, 103, 322, -190, 118, 71, -182, 62, -14, -8, 121, -163, -19, -158, -243, 64, -9, 320, -42, -78, 4, -173, 211, 66, 67, 146, 279, 538, -94, 64, 319, 166, 55, -75, 19, 11, 203, 74, 136, 62, -333, 187, -251, -28, 42, -155, -256, -23, -170, 119, -46, -52, -112, -203, 250, -44, 331, 267, 235, -257, 188, -33, 40, 122, -98, 220, -53, -156, 247, 129, 37, 99, -35, -141, 103, -197, -41, -189, -16, 46, 105, -139, 54, 98, 122, -61, -8, -220, -123, -64, -62, -217, 156, 452, 69, -185, -22, -197, 74, 137, 96, 282, 211, -122, 118, -52, -370, -45, 125, 158, 302, -25, -107, -57, 173, -119, 31, -54, 303, 104, -99, 167, -147, 50, 196, 215, -301, -186, -171, -171, 101, -34, 147, 42, 131, 181, -36, -100, -223, -55, 21, 19, 16, 44, 55, 29, -7, 89, 24, -30, 308, 7, 56, -27, 36, 120, -4, 151, 141, -204, -150, 6, -240, 79, 108, 27, -74, 64, -137, 99, -115, 33, 42, -177, -29, -50, -73, -196, -42, -45, -53, 83, 82, -140, 63, -19, -186]
5982a86J83J02k96K26K48k28M0m09K69L11l00j56K66L2k7k42K88j16n1L2o6P3
6004gK82k66j65J76k1J24j88N9J4J68j91J02OL13l31j78K37j24K65j11m3l02J44
6027c7K6R2j6k14J51q4J10j25J24J05q6j64K44l18K53l63M31r2LJ83j85l80N81
6050B39k58J9j08Q9Q9j59j58L56k23J53j30K83k21r2R6Rr0j00J92j70L09M3l12
6073a44J13J00j80K20m4r7K3O9O3j73n5N6q5R1p1o3o3M09J63l87q7P3J2M4k36
6098b49L79p9L2o8l9k9N9J65j01K8j21K91l73N6K04m05K90k88K41K56l38k0l2
6121a41J60J44k49J92m1o8J04j71l9K7O9K83j92j28J93j58K1rk05j31J44L71q1
6144I5j00J8J37j37Q1k67J51R0k83K58k16J60k06K87L4k26J89kQ5R8l52M13l70
$$ y = [-186, -3, 99, -197, 29, 277, 49, 89, -320, -51, 260, -40, -196, 70, 102, 75, -167, 121, 5, -46, -14, -80, -7, 275, 9, -156, 20, -1, 123, -65, -6, 8, 176, -15, 87, 93, 406, 75, -103, 134, 10, 275, 164, 121, -181, -37, -11, 81, 65, -149, 2, -82, 28, -97, 27, 132, 46, -118, 126, -192, 61, -302, 129, 37, 40, 223, 38, -342, 239, -19, 0, -108, -19, 70, -89, -247, 109, -114, 39, -91, 192, -29, -121, -25, -16, -106, -206, -14, -184, 125, 168, -144, -31, 69, -111, 109, 65, -32, -9, 60, 123, -50, -105, -49, -134, -43, -114, -177, -240, 169, 332, -55, -142, -69, -57, -13, -249, 130, 51, 83, 15, -24, -53, 6, 171, 70, 98, -23, 268, -105, -49, 155, -250, 40, -248, -7, 249, -89, -109, -141, 19, 163, -86, 106, 65, -3, 101, -70, -109, -82, -13, 270, 78, -50, 143, -15, 6, -3, -208, -339, -195, 176, 95, -5, 13, 150, 13, 94, -173, -22, 68, -215, 43, -173, -13, -219, 68, 102, -124, 65, 63, 148, 246, -106, 307, -63]
6167f3J53j19o7J67J85k17R6k08K67j0l08J71o0Q6j40o5P6J81k07M7o1M8J10j86
6191a24l4L0L73q4l99L70j1k04m0m8j6K38j56k5Q4J23Q1m1Q8l67R2M7J69k33J45
6216E8n7j37P9m7m1K38J35l83J15j87M18q9k21J97k5k82M87K0k03j62KJ92j85
6239g8O5j87J08M7J09j10j25L18l11L93k58J91j89NKJ59j94J05j40J76j12m2K12
6262A44Mn7j67m6M03L4l88L00l66M82k61j27k13K00M4K21j08k98K22n4J95k48
6284h4O1n9jR0J68k8r8Kn18M07l6K05J25l78K17O0o4M2J13l07J01r7J08rk5K53
6310B48k29k80N04K25p58J26J11p2j8qK95J65j86k30p4P7J16o8M2j04n5l3L76
6333A70o3l02K45k12k7l0M66k09l08K29j43J37k23Q7N4J31J00m8j12J54j01N3
$$ y = [-63, 90, -29, -96, 71, 256, 39, 135, -73, 194, 184, -124, 47, -13, 73, -67, -132, -56, 125, -82, -35, -96, -48, 62, -124, -158, -128, 245, 161, -238, 132, 121, -83, -123, -171, -187, 51, -105, -130, -46, 77, 158, 117, 205, -162, -70, -23, 146, -87, 58, 1, -136, -57, -104, -145, 93, 228, -155, -40, -227, 191, 102, -119, 78, 53, -229, 258, 278, 75, -87, -85, 107, -78, -13, -200, -92, -45, 64, -46, -171, 147, -164, 229, -29, 162, -27, -22, -20, 139, -55, 50, -90, 86, -26, -68, 144, 148, 91, -76, -122, 281, 315, -73, 227, -139, 343, 82, -45, -258, -58, -14, 207, 99, -199, 23, -31, 164, -84, -23, -82, -83, 7, 175, 147, 49, 51, -467, -60, -96, 109, 234, -144, 73, 133, 69, 111, 224, -83, 18, -79, 29, 20, -5, 248, 19, -261, 243, 468, -290, -164, -53, -125, -143, -151, 144, 309, 123, -107, -181, -104, 12, -56, -14, -118, -173, -206, 170, 107, -195, 50, -162, -189, -219, 247, 38, -270, -41, -184, -47, -270, -183, -129, 2, 102, 54, -58, 96, -5, 48]
6355D8J10R5m64L49l85jK27oM7J16r3j16N2m8M1n2r2M2Q2k42L77p8N8j96J18j56
6381a67M0J23J84k52R5l48J60K30L8j36K06r5j26J0L49l06O1J01l6j45j40L09
6403A55l36j3K30jp4P3M41p51L93j81P6J16m65L19J47%O2j33j52Q9J2J79j59l39
6427c12J75K37k31K70j59k8J85k61K6J43j38K08l89J24O10n40M30n53m4J74O8
6448eMJ81k8k35J14m5Jj13o4pL04l49M10r3P9j56j50J16J63O1j03l4j0J35k16
6473d0K06j13L30j44l59J30J08l48L02j73J70K3l66K21L6KJ31j2j5n3N1k14L91
6496B64k24M4k09J1J50j37J59n4K41m10M40n78M76p1j51M12o03J18l8J59L0k98
6518b69K14j11N09k47n5j1o4M4l11L33j78J25J98o5j08M8J45Q6l89P6l0k6j0L91
$$ y = [48, 158, 253, -211, 138, -247, -248, -21, -27, 20, 136, 43, -73, -21, -69, -28, -80, -172, -130, -48, -290, 87, 9, 67, -129, -11, -167, -127, -4, 180, -72, 23, -325, -165, 65, 103, -33, 173, 78, -48, -38, 311, 5, 66, 167, 131, -14, -154, 155, -181, -194, 36, 35, -39, 34, 475, -276, 117, -64, 12, 128, -337, -18, 129, 129, 191, 58, -94, -5, 7, 186, 27, -312, -137, 100, -131, 139, -20, -48, 137, -124, -98, 45, -93, 115, -274, -150, 460, -80, 350, -203, -247, -73, -5, -1, 180, 152, -83, 31, -14, -13, -126, -190, -197, 107, -242, 168, 75, 154, -2, -152, -36, 127, 188, 85, 51, 41, 176, -40, 166, 53, 383, 239, -120, 10, 118, -230, 72, -101, 69, 92, -274, -53, -17, -15, 116, 104, 89, 36, 87, -127, 264, 40, 84, -125, -114, 36, -101, 58, 4, 245, -165, 275, -303, 173, 102, -49, 363, -240, -122, -160, -1, 29, -269, -55, -166, 343, 96, 41, 30, -34, 10, -301, 32, -146, -21, 177, 112, 4, 52, 197, 283, -106, -30, -60, -86, -96, 295]
6542B95l80K48m8q9K09k41j67J39l3J71m2J09k77Q0N3k44K47k70K43o3Kj43K30
6565B9oj57K35k60J15N5K04k98P9n7R2j20K62j22l16M06j06k60RL45j51O9k20
6588a73Q4K3P3Q3j94M61n78K97k30J6R3k46L95L1j41J81m7K5M1n1j10j62M2J31
6612D4j32K59j88R2p6O4j76J64J28k36L4J21k52K2Q3m7J65n0K4j21R7r2J05j04
6636g2P5Nj80J0j12J63J71J51j13l8k29J73L9m7rJ1l1L9J16k96J06j42J91J60
6660A41j71n2K89k00l00J58j12J24O8J28k09L30J14m32K45p7m19L99o6j98L38
6681I8k09J50m3J73j29j12K70j34L20m41l84L71m5J30o6N3r7J73p5J27j78q1L9
6704i0o0K28j24j11M21p0k20M6k29M26k8j20j01r1j37J73l2K54o3J00j79r7J04
$$ y = [295, -85, 163, 115, 26, 235, -6, -173, -34, -67, 104, 62, 171, -106, -26, 27, -217, 30, -240, 3, -60, -58, -201, 29, 23, -134, 101, -159, -44, 11, 215, -83, -4, -61, 31, -89, 173, 51, -265, 141, 35, -225, -216, 129, -22, 47, -173, -89, -66, 7, 90, -104, 357, -221, 76, -154, -138, -45, -291, 104, 135, -6, 175, 128, 153, 194, 143, 33, -129, -87, 44, -88, 171, -17, 75, -1, 63, -113, 51, 179, -57, -23, 98, -154, -132, -49, -96, 69, 19, 43, -78, 19, -73, 32, -72, 3, 8, -172, -162, -274, -111, 60, 211, 98, 60, -169, 4, 43, -4, -13, -2, -33, 6, 122, -174, -68, -210, -19, 141, -30, -82, 207, 7, -293, -135, -247, -123, -55, 73, -136, 194, 308, -124, 121, 44, -375, 24, -42, -240, 98, -111, 39, -4, 169, 40, -72, 198, 64, 384, -57, -441, -70, -115, 15, -51, 2, -95, 78, 3, 130, -48, -129, -90, -150, 78, -46, -157, 264, 194, -26, 20, -209, 217, 189, 69, -32, -123, -260, -87, -119, 135, 72, 172, -7, -104, 0]
6727@R0j71J58l32K75j79lL82k54PJ70J63l99j5K07J51k93K89Nk60Rn8n9k0J50
6752A3r5rl%j12J97k12q5M4K36Kk20L34q2m3J32O8j79K85j93K93l53q6o2P7J67
6778A14j92M2m2O6j81J9n3K62l29K24n1J58k54K82l3k39l6L35k33K89k63K49j27
6801GJ31n9k6P6k05K3K73l31L9k13J59L9m4K55j25J09k71P6j14L03J6l85K64R9
6825I6n6K37k47k65K91L6k38R2j66K37m7j8j4J50O5j79J78k09J49k26K53o7k9
6848B3j02k9K00j37l36M75P2q0l9j70J53k7M5q2q2L03j71P1K57n49L46m52K65
6871d6Q5r3J39km17K46J81K04n49J40J97q7J38k02L7o8M02k02k17Q3O0n38K69
6894b40K62Oj14N8k64J35N8OM34m39j56L21L1j96K64m06K27O4k57K42l30L40J52
$$ y = [0, 90, -81, 77, -255, 20, -159, -162, 220, -34, -27, 143, 306, -93, -108, 99, 250, -43, 246, 251, -9, 0, -58, -117, -137, 13, -82, -91, -94, -94, -206, -9, -221, -306, -262, -26, -24, -244, 90, 8, -35, 97, 165, -14, 271, 78, 371, 18, -68, -130, -53, 114, -78, -36, -78, -12, -193, -174, -227, 35, -294, -70, -121, 37, -217, 65, 32, -207, -243, 92, -141, 148, -115, 134, 7, 138, 79, 53, 129, -76, -53, 220, -111, -72, -285, -126, -87, -131, 124, -1, 108, -163, -87, -201, 102, 118, -267, -3, 96, 40, 277, 30, -235, 56, 92, -146, -54, -220, 17, -30, -48, -62, 88, 153, -26, 152, -57, 92, -134, 119, 52, 23, -79, -108, 92, -45, -381, 94, 166, 86, 47, -123, 30, 3, 48, -34, -116, 187, 16, 87, 344, -205, 141, -311, -46, 39, -54, 85, 83, -334, -88, 93, 297, -252, -112, 85, -2, 136, -66, -29, -97, 305, 103, -114, -31, 29, -509, -240, 22, 28, -86, -28, -292, -157, -99, -93, 341, -98, -254, 67, 98, -98, 166, -240, -13, 51, -206, 36, -294, 46, 198]
6917A98j37k00L14k31J82J66n09L83r2j04m7R9M9j75k02K27l5K67l77J64K91j90
6939D1Q4j55q2L1O1J75o0p2l49J72L09j66N5q3n5L05j64nM7L6j52L15k13l81L47
6964D1M3Nk6l8j1M7j88M68l08K71l41J13k3j42j8K9J95J61M7j81J23j26j09R5
6988A27l42K79J75j00j91N2m2j74N1N32l25J34k16o1k1J43j07J57k53L95o8j32
7010A3J58k44o9K79j10J32j66k03J35j69K12J71k02J45j61k37K70K25l27J05M39
7031C96m72K9J86K0j85L2M2L0O0l02R0K11L1n3j68J05j4Oj33J14P4R6j19l41M23
7056A58J2m3lj65n2r3K85o9K2j38K40l60L43J69m41J78R8o4J03k02J19J94l2k74
7080a5K27n1j71J36l36K62PO1k45K10J3l22M80k53o9J70M2k80M7l2k3L25j14r4
$$ y = [198, 61, -139, 175, -56, 126, 292, -217, 166, 74, -30, -77, 22, 71, -104, -306, -79, -114, 153, -224, -60, 231, 41, 125, -30, -112, -81, -20, 155, 95, 23, -326, -154, 155, -11, 44, -39, -94, 211, 47, 42, 89, 125, -27, 288, 75, -306, 41, 84, 89, 63, 25, 14, 61, -127, 341, 33, 304, -37, 76, 53, -89, -107, -78, 117, 278, 325, 144, 267, 141, 32, 127, -215, 64, 239, 139, -52, 0, -42, -216, -165, 367, 42, 176, -40, -101, -122, 21, -86, 71, -182, 213, 145, 13, 171, -73, -142, 137, 27, 159, -7, -210, -75, -244, -32, 139, -63, 82, -79, -316, -46, 179, -148, -43, 396, -76, -47, 139, 159, -26, 6, 48, 78, 138, -164, -74, 137, 168, 115, -53, 52, 38, 44, -89, 25, 99, 195, 76, -265, 158, 170, 127, 124, -41, -93, -186, 99, 30, 52, -86, 154, -206, 137, 306, -135, 43, 141, 77, 180, -22, 97, 291, 259, -15, 212, 161, -10, 126, -210, 52, 59, 120, -125, 85, 98, -224, 256, 3, -66, 104, 146, -134, -87, -119, -142, 183, 69, -25]
7104b5k54K34J7J31K00k57Mk2J39n38K42K04r0J94j87q3L9mj63J14Q8R1p9L1L
7129B9J08k29K2k48M17j1l04K77l50N63l55l4J14J09k07J18j93Q6R0k4J00J05
7151A83k53J43mQ7o7j94j22M24l16k8K2O9J95l05J35k10J56K26O6k55L80k09N7
7174A80k53n6J55j67o7K47j15n0j85m7L98k26L26Kj72L50j87q7K6m9r8J09p2M9
7198A1j51K37n8K41r2l21J26MK0k71K26K02l40L02j06O2j40k1K13j43K03j81q9
7221f6O6l05M80j02J74k47Oq8K42k96J57O8k7j77j38K15P7J41o7j37j73N74m09
7244c2K40o4j38j2j09p2K83Km1j96L34l08R3k44M10j39J28k49j39K02M6k3r5M
7268a19J09J39l40J98J02o6o4n2L3MJ20l7O6k3J66m05o1L08J2n22P44l91K05k63
$$ y = [-25, -279, -45, -28, 103, 303, 46, 50, 28, 167, -371, -129, 75, -15, 179, -8, -91, -52, -56, -219, -105, -17, 74, -5, 26, 29, 137, -92, -70, -318, 99, 88, -216, 61, -289, 274, -81, -115, -1, 108, -99, 19, -174, -88, 2, -22, 78, 183, -70, 73, 69, 156, 89, -105, -227, 197, -119, -147, -125, -56, 139, -166, -31, -241, -85, 141, 207, -48, 332, 123, 180, -73, -129, 26, -141, -208, 39, -76, -126, -311, -358, 40, -186, 140, 142, -30, 320, 133, 46, 72, 23, -75, 34, -38, 11, -140, 97, 39, 280, 188, -133, -7, -3, 17, -254, -28, 174, -166, 136, 30, 92, -48, -69, 144, 1, 204, 23, -66, 0, -305, 175, 73, 247, 0, 6, -82, 160, -136, 21, 89, 62, -115, -253, -38, 39, 180, 113, -24, -197, 377, -32, 208, 144, 6, -6, -115, -187, 96, 98, 57, -139, 195, -113, -20, -264, 146, 7, 135, -114, -253, -51, -5, -28, -123, -119, -10, 129, -211, -13, 89, 23, -41, -93, -60, -56, 64, 27, 93, 70, 236, -169, -230, 78, 90, -432, 312, -79, 126, -137]
7292a37l0K30N5p2q1J23K1p6J62r1O5jj08k77J2M7K85l04J84L2k1j0R5k71Q2q2
7318a68J87K0J12K60m40N8L14l50N8O4r2M4j75J18R8j53j12J02J67j2O7l99J58
7341g4R1J98k96JJ92j49r4J71%j83L38k27J05n7J10j03k9n9N6J89j58k35K58n1
7365fk16L61j95J66j75N0K36m33K72k73K1L41l52jL55Lj11J36j2j98J62R0j83
7388C8J35j56j10n2M2L59l27o7J69n4J01J71jj46k42J13J75j04J0m9K11l60J21
7411b3K5k14J56j05J87p1K46j06k03J36mJ73r4k29J11r4J46J38q2l63J64P8L2
7434Dj50J94l8J72k58J84k61N7L71l63m4L5J37O1j10j9K34l3k04M3J32o00P54
7457B98j47k02J38j64K53J4m70J27K46j30k3P7N7J73l34n8L15j94K69l01M4k9
$$ y = [-137, -167, 63, 118, 46, -35, 88, 109, 33, 195, 104, 169, 168, 60, -217, -205, -158, 127, -177, 7, 39, 18, 8, 103, -168, -86, -168, 19, 39, 151, 411, -29, 29, 343, -7, 51, 115, 23, 67, -108, 10, 108, -45, -157, -55, 112, 100, 167, -232, -74, 17, 215, -81, -80, 112, -37, -131, 40, 40, -143, 195, -32, 73, 16, 126, 23, -6, -65, -9, 180, 22, -213, 45, -6, -222, 139, -56, 110, -65, -15, 221, -212, 60, -213, -192, 149, -203, -204, 151, 154, 43, 179, 167, -31, 131, 221, 38, 173, 17, -93, -145, -103, 256, -71, -138, 31, -23, 78, 249, 248, 102, -140, -27, 148, 44, 54, 5, 216, -144, -23, 2, -212, -56, -161, 26, -45, 201, 95, -108, 28, 24, 197, 103, -126, -15, -109, 37, 175, 93, -270, -106, -28, 4, -146, 48, 10, 182, -76, 108, -153, -96, 275, -88, -132, -97, 40, 101, -9, -28, 206, 173, -31, 12, 144, -456, 298, 151, -51, 87, -77, 176, 190, -280, -153, 93, -37, -60, 17, 74, 247, -87, -145, 170, -24, 245, -56, -12, -41]
7479d1n6K4K17o3J00l29O2J75j48J36m7K43l92K67J0q7J24l33J57J10j85K92k39
7502cJ54K09m95L92l02P5k1k60n1L10P5k10P2J6O2K04k71m2j9n6K68Q8l69K40
7526F6l95L71J38k30oL03j48j37k0K80j56L5l22K94j19K00j59L41l31J68k65P9
7548a3Q1J28m8k45j2J71m5L7J18j91R3J68j20l26L41k21M9k09L56j74J20J4k58
7571a86N8K81J5o7k64m7M00n61L28K21k36J53l6m3L01k91q0J96j43n1L6J83r3
7594G4o6J36o4k89J73K6K98l18J39j33J61Q1l54J48k05Q6J61p0j55P4R2K29j68
7617E6r3q6j36M27o8k2k37J7K12m7Q1j11Q3p6rM0K22j16Mj9k56L95j61j39NL59
7643C25k23j04J37m28R5M40j28k02j09N24l23J05R8k03J2j17j04K23J00j54L60
$$ y = [-41, -97, -73, 144, 81, 181, -148, -86, 89, -59, 77, 30, 273, -119, 148, 158, 71, 195, -138, 19, 129, -56, 236, -3, 151, 360, -135, 257, -45, 30, 9, -251, -302, 8, 83, -127, -55, -39, 23, 227, -44, -86, -105, -161, 107, 195, -174, 66, -329, 42, 180, -50, -56, 247, 99, -38, -58, 222, 66, 101, -221, 73, -46, 154, -5, 336, 5, 173, -92, -13, 68, 196, 148, -97, -109, 62, 17, 54, 172, -19, 74, 242, 122, -204, 137, -84, -35, -244, 112, -62, 58, 72, -186, -128, 153, 168, 101, -163, -210, 190, -371, -43, 178, -58, 95, 59, 16, 317, 26, -54, 142, -1, -52, -16, 167, 74, 8, 144, 80, -209, -36, -10, 288, -30, 109, -24, 137, 218, -136, 12, -193, -107, 54, -16, -171, -97, -5, 224, 56, -37, -123, -259, 168, 100, 78, -159, -142, 70, 23, 104, -7, 76, 0, -9, 31, 253, 137, 141, 122, -134, 261, 100, -39, -34, 325, 102, -2, 135, -293, -198, 242, 114, -88, -197, 327, 4, 109, 207, 4, 16, -101, -205, 18, 118, -36, 324]
7664C24l21R5p1Kq7J06K8K04k38j75rL5K18N4k20j6K67m87L32mp6q7k21K87o0
7689a20Q1K03M1o9L7J34k30j21K4RJ09k47j36J19J75P3l73L23J43k21R1J07k03
7712e1K1J58k74K65l06K54k14J17L9m21M83k76K14L7j19P4K54k79k00L83k34J83
7734A08J49l37q9L04k23J52m8L0J99l41K28j18m0j75K19N5o0j96K58j51J1K77
7756B12l53J55k60M35k67M1M2m5N2j65K61k19L1J86l2n5J2n5J19J34p8j16mJ92
7780B23j88r1k0J11j98J70K4J3k00oJ81j36K02l00L54l45L56j54j33J22j97K33
7802B1j08J80k02L8R4N8J08l93J27L14l91n8K46k35L92k65J39J30n1J16j14O9
7824B15j20k08Q1l4K16j99M6p0P5l8j31J39p2j34J01j33J13k9J81J8Q3m11J12
$$ y = [324, 3, 98, 27, 29, -58, 48, 76, 280, 42, -133, -142, -107, 111, 165, -55, -71, 196, -291, 41, 37, -39, -126, -347, -60, -120, -39, 164, 205, 136, 173, 307, 77, -44, -20, -11, 98, -149, -285, -166, 9, 82, -291, 32, 175, -46, 45, 152, -51, -30, 128, -146, 119, -187, 67, -147, -30, 9, -412, 71, -205, 9, 46, -73, 1, 255, -24, -224, 159, -75, 108, 257, -80, -169, 135, -88, 64, 16, 46, 245, -96, 132, 14, -26, -201, 18, 73, 13, -183, 75, -76, -65, 212, -141, 14, -246, 189, -78, -37, 5, -40, 12, -153, 108, -111, -80, 106, 74, 19, 31, -24, 95, 229, 151, 35, 31, 223, 35, -56, -76, 35, -163, 7, 31, 44, -156, -162, 19, -117, 85, -215, 139, -206, 150, -4, -137, -15, -212, 21, -87, 93, -109, -71, 23, 81, 189, -204, -77, 237, -154, -212, 34, -201, 191, -74, 65, 195, 144, 260, 146, 215, 95, -113, -32, -66, 150, -49, -3, -73, 2, -36, -167, -28, -100, -234, -133, -266, -153, -182, -1, 17, 100, -311, -199]
7847a99J97J09j71R3l9Q8j4K84m92J84k2q8J56m9J62k13PR0j99K93k96J2K05j7
7871H1k18o6L22l62L32j69QP2K0J26k22K80m08j12M01J41l38K70j97K70k11ro9
7894e8l2J46j08J6J20k46M9K3K07k99K37k44J58j74L67k08%qJ45p9K4J47l2l6
7918A15r6j46P9K08J39j75l3k44K45L25l34q7J1j50M1n3J12j64L81q4J36k50L2
7941HK20j75MQ4k93L15j51K26l03j16L12N6o1j59l7RJ23O2K58k12j29r4Pl7k21
7966c04K85Q7N4jk9k06j4J62l9J06J5k08J56K66n21R3K93k27j16R1J46Q8k25j10
7990a58J58k12K14O8k01L60m10L25j72k88L37p3o5K10J76N0j49j53J3n4j60L14
8012A30l0J46r7l07K32l93K99K44k09J32l52K40l94N30k74M0K53l33N8K64m57
$$ y = [-199, -2, 107, -64, 29, -10, 78, 64, 348, -144, 40, 18, -70, 86, 37, 199, -14, -7, 83, -116, 177, -119, -107, 98, 81, -137, -203, 119, -243, 89, -80, -72, 0, 20, 146, -76, 204, -204, -316, 85, 226, -112, 158, -39, 231, 20, 11, -58, -90, 56, -52, -36, 84, -162, -113, -90, 117, -182, 55, -189, -31, -205, 162, -46, -46, -54, 91, 12, 36, 183, 151, 115, 19, -127, -48, 160, 299, 124, 91, -153, 92, 417, 83, -4, 7, -143, -102, -155, -43, -207, 174, 90, 226, -24, 8, 228, 53, 57, 141, -152, 163, 12, 238, -65, -181, 131, 187, 126, -33, -70, -61, 62, 124, 382, 170, 41, -53, -46, -83, -304, -19, 68, 122, 121, 92, -114, -128, 34, -5, 101, 116, -92, 64, 330, -191, -98, 195, -32, -148, -57, 89, 177, -48, -158, 0, -212, 2, 70, -131, 229, -181, 144, -28, -316, 21, -52, -117, 93, 269, 319, 170, 17, 30, -24, -184, 130, 100, 246, 149, -158, 74, -319, -20, 224, 15, 147, -205, 35, -359, 171, -103, -63, 190, -143, -85, 179, -278]
8033b78J82p8J83j10Q7J39O4l26K01l3j31J96j40j24K17p5Q5O8k70J23L5O7K16
8056B98n3l12J27k28K26n1K76j17R5r8j71q8K50j17j69J92l86J80K45NP4j27j25
8079g4L8l1j30L11K2K9k30Q4m5Nj07K09J10k26J18OK6j10r1j2O5k19J34J71k77
8104b24J66J61J07m28J78K42l07Q7k94J99L47k02j3r2j76K86k60L52o4r2J90k2
8126A41j25K9J55l51j12J45K1K44k41J28j58K66J07l19j05K32J96k87J20j42J11
8147E5k1OK10o5j68J13j9k91R7k7o1Q0J92j50j57R9J25r4p0J69K26j98J62n28
8171c15L55j29J02J8Nk04M8J57k13Q2J13j3k10L53k53k37L19q7Q7r
$$ y = [-278, -96, -174, 9, -101, -14, 125, 189, -137, 64, 31, -100, 96, -44, -168, 49, -26, 59, 127, -143, -20, 15, 82, 298, 245, -67, 60, -168, 58, 7, 283, 166, 261, 163, -8, -96, 154, 37, -132, 60, -326, -146, 99, 104, 178, 51, -74, -36, -67, -197, 114, 136, 165, -65, 19, -26, -21, -128, 81, 191, -35, 83, 89, 115, 5, -86, -98, -33, -252, -118, 53, -224, -58, 103, 210, -218, -40, 202, -105, -18, -312, -113, 234, 32, 19, -73, -249, 37, -223, 129, 65, -27, 163, 141, 16, 45, 200, -151, -263, -118, -97, 147, -94, 34, -124, 142, 249, -70, -175, 57, 253, -34, 86, -56, 55, 34, 40, 250, 185, 17, 130, 111, -180, -83, -110, -171, -91, 101, -49, -206, -107, 18, -76, -146, 23, 249, 51, 213, -315, 40, -89, 13, 31, 36, -168, -120, 37, -176, -94, 19, 6, -204, 149, -104, -341, -22, -109, -22, -31]
8191c1
$$ Imaginary data points
##PAGE= N=2
##DATA TABLE= (X++(I..I)), XYDATA
0@%%%%%%%%%%Qj6J6j6J6k4L2m0M8n6P2q8J04j20J44j68J92k25K60k99L44l93M47
33B38n08N75o48P28q16R14j022J139j266J404j556J725j909K107k322K558k819
50a478L106l423L773m161M594n080N630o257O984p834Q845j0070J1590j3536J6129
65H812j9783K5345l4933N5971j86184J56170L41805l13594k56126R0976K55997
76A24456j4884j24082k4336J0179m3011J11593J05024j08658k00110M0644K59716
87A36531O4419k82156j22700K00880J49393q3952j34841j7197Q9193M3654O436
98D9660k5015r6916o144J40147L4969j11734o3585O5538O8894m0997l0893M3641
110B7565m5696n4211R7237O8239r5886j01332N7407J41362k7325j47732K0320
$$ y = [0, 0, 0, 0, 0, 0, 0, 0, 0, 0, 0, 8, -8, 8, -8, 8, -16, 16, -24, 24, -32, 40, -48, 56, -64, 80, -88, 104, -121, 139, -160, 184, -209, 238, -270, 305, -343, 385, -431, 483, -539, 600, -666, 738, -818, 907, -1002, 1105, -1217, 1341, -1478, 1628, -1795, 1978, -2183, 2411, -2669, 2961, -3296, 3688, -4146, 4699, -5371, 6219, -7317, 8812, -10971, 14374, -20559, 35412, -150772, 5398, 347203, 33609, -222517, -131541, 124456, 109572, -14510, -38846, -28667, -71678, 39915, 144939, 36281, -163829, -123185, 136531, 200950, -81206, -203906, -3026, 146367, 62415, -72426, -89623, -430, 43224, 49660, 24645, -72271, -78415, 61732, 96701, -15033, -78618, -13080, 55814, 14817, -16076, 27565, -18131, -72342, 24895, 93134, -2752, -104084, -46677, 94685, 67360, -80372, -60052]
121f0052J13380k1713o7540L4495N8569o8916q4347J21637J15687j53886j36535
132a49221J31311J50063p7234j61488L1139J43034j7983q6596K4515K2779l6661
143b6342J0430O3564J286j02100k5369J29392M4617j16611n9043P1463P1665l4331
155B8621o9861K0835L4164k4166J4120K6779m5854l1813M8777M9053l9794o3766
167e2905M3596N8194m8898l1757M6990J3719m1738j9430M6523L2396o0458l5523
179d9291N8134K3805l8220j5487K1301P978k6699R438N1995l1942p2146M1658
191a9476Q2698j9868q9062j2447R0896K9171p3379k5017L0542R792Q103P249k1373
204b171l4955N434O8945J7655q5388l5723P1146N4421l3231o9070N307O4806N091
$$ y = [-60052, 53328, 31615, -35925, -1430, 57139, -11777, -96124, 25513, 141200, -12686, -149221, -17910, 132153, 54919, -106569, -75430, 67604, 49621, -36975, -12460, 10319, -26342, -15912, 47652, 48938, -53162, -78531, 50861, 95478, -21133, -80176, -8713, 62952, 28621, -41240, -20405, 13759, -10407, 3713, 30492, -15362, -47175, 1602, 50655, 10861, -52905, -9309, 48885, -13, -31770, 15220, 28939, -12799, -32229, 14294, 46690, -13768, -49291, 8843, 32648, -5572, -21059, 242, 8220, -18479, -9041, 42954, 11012, -61134, -19476, 63222, 43354, -45708, -58155, 32741, 61912, -11467, -36484, -5942, 3850, 11953, 19202, -2171, -37126, -31692, 37253, 54908, -30480, -66203, 4943, 59364, 26133, -42937, -37630, 27176, 32267]
217C2267l1519n521j1526k64L4006J6782l3672m9957K2617P6884j5012p6673K510
230c9078N3998J7610k9565k6916J9275J4283j0587J3814q29l0341M510K8784Q950
243B3908k4773l1075K5712L6918k8224k5305J6822J3259k785j3155N667J5395
255A2364k1302l606L1606r042k4312R911J4917J087j7797n089K4104p293k1055
268a5507J7517O907j3697m562L807J6027m690k5107J5631K0296j6749p170O550
281g47O728J146j4200Q305J2903k3345Q7K4080r852j6563J330J4691R986k3847
295i298r241K7634r93j4536M551j89M599J734o682R279n430j2122J8217N245j6618
310c850m494L494J5337n34k6712P968J9560j1096l696L145l155N189j514L317
$$ y = [32267, 748, -4773, -16299, -16563, 17443, 34225, 553, -49404, -26787, 50097, 35085, -41588, -39078, 14920, 32530, 2965, -23951, -4676, 9607, -980, 12834, 12005, -18336, -13826, 14958, 23908, -865, -31940, -6228, 30690, 2466, -22839, -6017, 7242, 4457, -8698, -3031, 12364, -8938, -12544, 19062, 10020, -14292, -4381, 10536, 11623, -6174, -11263, 12841, 5548, -15507, 2010, 8917, -4780, -9342, -5535, 10492, 5802, -19305, -3674, 16622, -127, -7297, -747, 5981, 7127, -7073, 1232, 14135, -9210, -9123, 14957, 5105, -11458, -10128, 4563, 14549, -9298, -18539, 9095, 8102, -6434, -1883, -2072, 2527, 4261, -2421, 6858, 1428, -10694, 7523, 12768, -3850, -8344, -4850, 10487, 9953, -16759, -8791, 10769, -327, -4023, -878, -4033, 1156, -358, 2959]
324B959M040j6517N538J9441j2115r630M095L322Q549r626j0930J3649M90p172
338c907M584m589J047M777n062O915k142j1584J4160O226j3848J5L823N667M21
353F503j3788N290R015j0137K324L019q583M704K441j393K619q932K183J2953
367H218o310m994J931n25R137k725j0271P883o04m373Q189m056o209J248J097
382b364Q373l453j3895P649P626l120K105o297l201J0275R44o30l113q753Q031
397A77Q791n345l671p157L82J5399j791j1755k633M07J1037O873j3426p112L399
412f425J0982J0209j4118j3870J1128Q841K120l785j3179P04J0210N121K40j4809
426f631r924J6404J2540n317j4330j0864J6606J9802j1462j6272j720J0750J4586
$$ y = [2959, 6999, -9518, -3980, 15461, 3346, -6284, -2189, 1133, 9682, 56, -10874, 2775, 3265, -3907, 677, -3912, -2865, 1912, -3150, 3765, 1623, -9961, 4199, 10425, -3423, -3408, 415, 6082, 6503, -7285, -1995, 7020, -3117, -793, 2226, -6357, -1653, 788, -605, 2014, -6918, -4735, 8218, 1908, -3086, -1155, -1680, 7457, 4732, -5539, 2344, 1740, -2633, 5556, 1500, -4709, -3461, -2364, 6009, 2556, -11339, -3690, 3936, 816, 2921, -3376, -6577, 3698, 4642, 4012, 899, -7854, 177, 8968, 3623, -48, -7205, -6823, 8576, 6785, -4970, -7603, -7196, 3841, 10714, -2712, -9824, -6425, 4557, 14766, 648, -13222, -2094, 6747, 8867, 5082, -8097, -7393, 2817, 7938, 8178, -6631, -16555, -151, 12389, 7072, -7258, -18122, -1516, 18286, 6824, -9448, -11168, -418, 14168]
439A4168o142j3440m22Q24R917R592j4084j3717L649J2897J2756j2352k2156O008
453a2502J8863R135j0773k2237O028K2811P65r724q616k700J1946O342l698m752
467H88j2679K492J9099L086j3224j5782L52K7998P926k7060j2254J3099J8547
480A2488K046j9973n255J1186J281N175K893j3259p716M904J5954R736k4779k1202
494b6521K1419K4238l777k6102j4893K6202J9970j5356j2362j572M488J3096J230
507A0060o629q088r905J4559K0509j1361k2253p542J9099K7787j5455l4543M916
520a8846K5955J2939j3432k4844O070K1044P44l830p106q875O725Q835P256l128
534I507k5890l569L1644J1763k2186k5911O786L6599K248l2603n275J4524J0585
$$ y = [14168, 8026, -5414, -5836, -5012, 4905, 14497, 413, -13304, -9655, 3242, 15998, 3646, -18510, -12502, 6361, 15496, 4723, -17514, -11486, 11325, 12090, 2366, -6250, -8950, 2996, 9338, 5640, 888, -11791, -9299, 9800, 12886, -338, -16120, -15768, 12230, 20156, -6904, -19158, -6059, 12488, 14534, -5439, -10694, 492, 1773, 6948, 9841, -3418, -11134, -6230, 9724, 19460, -5319, -26521, -5102, 19136, 15359, -10743, -25636, 566, 20536, 5180, -7182, -8754, -4266, 8830, 10060, 3431, -4657, -14562, -3, 20506, 9145, -13108, -20650, -1551, 26236, 10781, -23762, -18846, 7109, 20048, 6616, -18228, -12158, 8886, 9630, 5800, -1306, -10181, -3456, 5379, 12635, 9507, -16383, -19952, 11692, 23455, 1269, -24642, -17856, 18743, 20991, -11612, -16887, -2363, 8222]
547H222J482j0695k924J593m838J4761J0689k0052j6454Q517K4356Q836l2527
560i034j9383K7164K0142q707j9345r168J7027J4005p460n119p165k325J4633
573E265P235n551j1486j2349J5463K3098j1669k3704n296J8720K3022j4542k8686
586b0480O300K0262P949r368j7319L930J3649K39J443m331j1606L049J2120Q093
600A3930p815k3817M241K8833k48k2008r536J0577J8702m651j7411K566O542K129
614B034L188m152k806n44j667J0951L807j5974l962R146P366m42j2886l713J1818
629B164K413l398k564m603M505M912k779J707k498m310N304K782J162k861r377
644g441M800J1331l890p987l258L188J0090k883r574R99L246L315J835m983q40
$$ y = [8222, 9704, -991, -3915, -2322, -7160, 7601, 18290, -1762, -18216, -9699, 14657, 23493, -9034, -28417, -1253, 18889, 10182, -9163, -18331, -1304, 12701, 5241, 122, -7043, -9368, 5265, 12500, 6949, -4537, -16886, -1423, 21675, 10006, -13698, -18994, -274, 22748, 8206, -20480, -14180, 6082, 14031, 4663, -12656, -8726, 4923, 5162, 6605, 2274, -9332, -6283, 5837, 13930, 6115, -17702, -13461, 15372, 15124, -6884, -16420, -5843, 12859, 8208, -9203, -6637, -95, 2034, 5222, 1070, -1736, -2280, -3947, 7004, 10811, -5163, -9125, 21, 7387, 6945, -5941, -9654, 2164, 4577, 1179, -1385, -5988, -1483, 3429, 650, 2357, -141, -4451, 853, 3635, 4797, 1936, -7441, -2641, 8690, 4800, -3187, -6445, -3257, 6833, 3950, -5624, -4625, -1379, 1936, 3771, -1212, -2052]
659b052j14O88Q403j481j1615J386P660M103l434j0627J835R883j415l343l285
674c408j623O211J384l095q3k784J629O664k639k986r68m06O712n13o735J569
690a071J044l3L216l686k882K626l47K627j058m190L427O76r00L166k731k076
706b192L517n5P70L18n480K560L626k373J50l213p47N467j668k157J031l037L285
723a98L464m316o2k64Q33N136l307m144L597j6J221R92n814J253L381j915J098
740I39k984k050O017q14k525J331k905L157L751n019j82K037q35L265k002l848
756b667L976m94p39J687m800J637L872l943P43j71k034M823r09l396L218j495
772f92J299K862m949O70L444k747J721q98l802M618l91k409J820l099J360L421
$$ y = [-2052, -2166, -1478, 6925, 5444, -6171, -4785, 2875, 6978, 3544, -7083, -5248, 4635, 3220, -123, -3408, -5031, 1180, 2564, -531, -614, -3398, -1769, 4895, 2256, -730, -1698, -2104, 4608, 4095, -2640, -1071, -27, -60, 3156, -530, -3412, -786, -1133, 1494, 436, -3754, -327, 349, -551, 2615, -116, -2192, 1325, 1270, 2040, 2358, -3122, -562, 3064, 691, 841, -2372, -3119, 2348, 680, -1477, -446, -3483, -198, 3266, -1050, -1112, -1376, -543, 4593, 1286, -2858, 739, 723, 1944, 2936, -2878, -1625, 1756, -159, 939, -2045, -4095, 1922, 1108, -1417, -86, -2991, 166, 3917, -1102, -1284, 753, -82, 3183, 1181, -2667, 1309, 815, 76, 1763, -3037, -1400, 2472, -1471, -728, -899, -2933, 1890, 981, -2415, 803, -692, 607, 3469, -1480, -810, 2634, -113, 1608, 710, -3092, 1526, 1135, -1274, 546, -2553, -1193, 2228]
788B228m136Q16K038l169L605k6l641L816n46q34K502l567M42L138l398Q99M99
805F66l245L769m22l588L103q02r43L238l182M11K560k890K396J013m029L201
821A256L20k335K559k398n37L278l055K55J669l792K575J058k947K729r63j514
837a842M066k032j606L111j775J020J216l637K108K15j987L398j659l752L552
852C96l30j40K92l179K516K366l208J629l78j688L659q3j976J114k678K027L625
869C964m592j081J466J04K354k230l137L009l72J06K434m014p61L769M00O29k823
886g75k434N384Q66l209R20j579j93K736j397P7j055l256M684K379m586j544J080
903a902L560J941n627l81M417j502K92J101k373k5k62J632L133n497l139M873
$$ y = [2228, -1908, -1092, 946, -2223, 1382, 1356, -2285, 1531, 985, 151, 2653, -914, -472, 2666, -732, 167, 666, -2579, 1190, 768, -2820, 283, -519, -1462, 1776, -1406, -995, 1565, -1325, 1071, 2084, -1945, 1256, 1576, -759, 1800, -598, -1135, 2143, -912, -657, 1012, -2780, -205, 853, -2094, 635, -328, -1842, 2224, 192, -1414, 1697, -78, 942, 2158, -1479, 629, 844, -1143, 2255, 596, -3156, 396, 66, -74, 218, -2961, -445, 1921, -1287, 342, -36, -1724, 1935, 1852, -124, 990, -1688, 339, 3964, -628, -1709, -243, -139, 2215, -15, -3152, -143, -515, -409, 2025, -1989, -2750, 1019, 1419, 2048, -775, -3209, 2175, 3041, -168, 752, -827, -1020, 1716, 319, 396, -659, -3915, 769, 3148, -1438, -2982, -1902, 1658, 3599, -2028, -2409, 2008, 506, 798, 1899, -474, -499, -761, 871, 4004, -1493, -4632, 241]
919B41J647p25k651l047M672K723k912k20j556L72M083p81j768n83j185L331K021
936C662l942l82q82k9M678j255m846l64J821N570j231q579K378O601n01k793k055
953b149J927L282l431P29L382n003k554M430L418j332q386p15J1111L71r247o16
969d783M548L662k025m941L856J986m368K871K872l464k035o01M809L006p724
984b331k850N524J982R4m410l438O081K273l100j47k261K182L781l011o65J813
1000A517k915J215K246j99j45o184N95J0160k838r181R31N768M899n982o970P338
1016B55M633o279P5K994k61j946k588O328L228j0973j302R774J189n599o179L606
1032c045R431n411o157M869J253j463O73o96K117j670l195O024J081n167j31J023
$$ y = [241, 1888, 1163, -1488, -4535, 137, 2860, -52, -272, -1828, -1456, 2627, 1846, 78, -505, -1690, 1641, 3662, -280, -662, -1544, -1573, 3105, 1850, -2996, -3360, -1539, 4031, 2800, -5779, -3401, 3200, 2699, -94, -2149, -222, 3060, -371, 358, 3740, -1263, -3817, 613, 4031, 2699, -5687, -6402, 4709, 5080, -4167, -4783, -235, 3427, 1402, -3539, 317, 2303, -2065, 806, 3678, 214, -1821, -2422, 2387, 5393, -2331, -5181, 343, 2325, 2419, -1991, -5429, 652, 2925, -175, -322, -2583, -401, 3380, 369, -296, 1517, -1398, -183, 2063, 1864, 1719, -4465, -3870, 6290, 3452, -5729, -4798, 970, 5869, -113, -7083, 255, 4888, -1391, -1316, 1678, 1417, -529, -3117, 3211, 6439, -4534, -5836, 3938, 5127, -472, -6651, -3045, 6386, 975, -5182, -313, 940, -523, 150, -546, 1571, -99, -3294, 2730, 3811, -1356, -1487, -464]
1048d64K259K277o139j428L611L9K114k351m781M855K935l168n67r58K268J775
1064B277l871K530K754o413K30N178Q11l462n400L625Q416n868o897M718L736
1079B364q81l332j098N796j855n187O210K189n591j281L039M477k523p815M444
1094a044N935m527k564J248O62J311k241M1K574l841O27M770k191j926K1Q72L244
1111B971k155k408K831r46j390L103j327k735Q33R77K809l146l775N323J509m197
1127a723P32J217N93j055j378L812K35n540K172M352k412k693l25K911J711m939
1143b330m5M218k217j580J765J040l07k908R97N180l383l579L998J463j550j848
1159a086K93L236j915l209L810O94l935P41J821N15j450k397L545J699m272J059
$$ y = [-464, 1795, 4072, -2067, -3495, 116, 155, 2269, -82, -4863, -8, 2927, -241, -808, -1766, 502, 2277, -1594, 936, 3690, -2723, -2493, 2685, 3496, 34, -5366, -1741, 6675, 807, -6090, -1372, 2364, 1483, -1849, -2947, 2849, 994, -4193, 2017, 4206, -1385, -2666, 373, 4850, 2327, -5488, -1044, 4891, 364, -2200, -952, -290, 1021, -1220, -1179, 1395, -2446, -1819, 2951, 760, -1166, -1145, -273, 2971, 816, -1592, 1239, 293, -1097, 2006, 679, -2056, -1223, -246, 2563, -583, -4358, 965, 2474, -1723, -991, 226, 819, -236, -1614, 2198, 2433, -3107, -935, 3417, 1005, -1688, -2013, 898, 2609, -2330, -2375, 1843, -374, -1954, -189, 851, 544, -2364, -1367, 3813, 430, -3149, 849, 2312, 762, -1086, -793, 2443, 528, -2681, 1129, 1823, -2112, -1371, 450, 965, -485, -2882, 663, 2362, -1910, -851]
1175h51K418q53q14n26J498J101l675Q50L997l227k316K123Q59r4k422O19L357
1192B044k508j576L513p58j901O79O77J960k359j972M445Q8l893J290P95J49r85
1209c12j845L410J62m511K349K828k297j059K83K248O91l913J282L693k962j038
1225i91J697L38j11k196J84L470k734k386L523k97j381R6j29J928j103k284L966
1242A590l13l143J972J158n06n62k006L009N53m030J823J989k502K87M98J50Q71
1259H38l186J604L106l315l45K815j186K49j006oK825k287j766L598j483j478
1275a023P07l2J218j021k225L458k76l367K552R50j387O30j151K255M88l409J740
1292A07K293k979J95O37n79J670k768K83K826k701n10K652j473R1k0p83K870j806
$$ y = [-851, 1567, 714, -100, -626, 872, 1973, -1702, -852, 3145, -82, -2398, -275, 584, 490, -1932, -1313, 2044, -464, -2040, 1473, 715, -1186, -507, 170, 2130, -229, -2201, 2244, 2332, -1561, -271, 524, 673, -312, -2157, 1253, 1415, -3096, -747, 2081, -216, -1275, -992, 1256, 1947, -1966, -684, 3009, 47, -991, 706, 1044, 933, -1263, -1079, 2391, -343, -2729, 794, 497, -884, -788, -917, 1011, -92, -2376, 1590, 1277, -1866, 106, 1264, 758, 196, -1810, 1199, 1752, -2278, -455, 1534, -968, -681, -183, -33, 838, -2348, -744, 2362, -953, -1298, 1517, 331, 580, -426, -432, 2393, 106, -1660, 1938, 455, -1023, -316, -348, 870, -151, -2376, 1082, 806, -2561, -9, 941, -446, 184, -967, 1288, 1776, -1633, 107, 2400, -579, -384, 253, -326, 1344, -1424, -1141, 1685, -1016, -1526, 1126, -347, -256, -276, -1059, 1811, 5]
1310Ej783L373p99j252J373j312P10l7j226J978o38k221J964L37j575J109r50
1327i44R91J072k257M72J736j553R14O01j254O81p26J60K101k924o05K487q22
1344A30n46M10j084J867r60j105K007j193o32J749m44J33N52j546J780K27j910
1361e65P74Jp54J396j356j57J053j349N03R97j889R34N98q01J534j050n29J535
1379H75j019N27R06j659M9J281j107O77r29j053K182m73q95M79o22P26O61j371
1397g65R51M06j438J575j59n08N03p19N48J035j701m41P14m63Q81o50j709K012
1415G2N28j170N40r67R42J006j654J113N78j341O72N43n94O20j389j28K182j389
1433A64j011L07J22J243m74k095J603N31q14R01o06J34P12r80P28J001k109M25
$$ y = [5, -1778, 1595, 796, -456, 917, -395, 315, 278, -948, 1030, 392, -1829, 135, 472, -1103, 6, -944, 47, 1119, -1138, -666, 1070, -483, 431, 1032, -222, 459, -267, -107, 1994, -930, -1535, 952, 130, -416, -6, -1090, 777, -183, -1288, 719, -474, -1106, 643, 199, 332, 884, -662, 1118, 1345, -565, 209, 210, -544, 852, -504, -661, 392, -957, -454, 543, -1346, -412, 186, -615, 919, -131, -660, 875, -144, 383, 1289, -370, -321, 960, -147, 530, -399, -1452, 730, 257, -638, -159, -781, -55, 606, -765, 186, 592, -846, 729, 570, 62, 565, -154, 394, 1429, -272, -713, 1, -462, 419, -231, -1940, 72, 600, -570, -30, -997, -55, 951, -703, 410, 988, -353, 319, 862, 268, 888, -501, -629, 1553, 164, -847, -540, -418, 825, 351, -1744, -141, 390, -424, 477, -129, 5, 717, -263, 465, 1466, -643, -218]
1451b18N02K74N69k239n71K753m34j524N6j89J957k49k334J762P82j720J314J37
1469F28O9K13k116J484K277l007p09Q31O35Q52k383m18K723o51j541R45o6M07
1487A73L8j244K133J0k344J509R25r76L25j955O59K870k113j066P91k21J143o19
1505C8j898K329l0j285J116n13P39L29k009J955J519l169J13Q63N33N75k803J37
1523a461L063j490j722J238J8J174r92j222K795m94k556J829J147r20m81j354
1539a428K265J480l673N73J643r60K01o75l17J789j115r27J735j010k47J099p71
1556c38J172Q4k250J900L82q82O79j461L52J712j783k00O49o62J364p12j295J799
1574E10l60j180J352J51j17k58j341K143Q14k793P59J316m48j84j395O13J540
$$ y = [-218, 284, 558, 1127, -1112, -1683, 1070, 636, -888, -832, -1021, 936, 687, -1647, 115, 897, -823, 491, 628, 697, 910, -1206, 278, 2555, -452, -1161, -330, 305, 1157, -1226, -1644, 1079, 428, -1113, -168, -234, 173, 211, -1033, 1100, 1110, -1234, 275, 1200, 224, 549, -1406, -747, 2123, 10, -1056, -265, -486, 657, 38, -1860, 469, 439, -846, 270, -243, 496, 825, -1184, 771, 2290, -879, -766, 97, 630, 1205, -1598, -1461, 1602, 112, -1610, -372, -354, 820, -172, -1394, 1401, 907, -1649, 180, 1327, 407, -74, -1428, 837, 2317, -1356, -783, 860, -100, 101, -574, -891, 898, -217, -1144, 591, -419, -666, 433, -338, 834, 918, -1332, 568, 950, 68, 747, -714, -362, 1350, -433, -633, 16, -646, 718, 6, -1289, 510, 150, -1030, 322, 473, 356, 98, -1243, 900, 1714, -1079, -320, 996, 548, 364, -1031, -418, 1122]
1591A122j865k75J707j070m60M63K36J247j441j128K643n46j345P35J63O18k97
1608E07j406J214K12j640R51N56j063L56k42M28P06j975J228J182j430P23L66
1625F73p86O64m17j34R87j478j32J559j107l63M16k3J17n04j63J500r74j180J708
1644C63M7m79k66L13J304j036j198J583M17j384K45J88K1j34j500J362J174k304
1662a284L41J221j53J85p57O28Q57j380j72J551o57m28J82O3K74r28m02J786q26
1681A01j104J298l82q4J52o46R88j01p80J275n4j143P62l4J27l0r32Q47N14j554
1701g80O35O94q31r2l19O78O60j450K33J991j391n69J127m09P56j313J00J549
1719A269r10j270J486m79k48k59l18J459n27j704K158j19j531J016J05K95k3j049
$$ y = [1122, -743, -1018, 689, -381, -841, -378, -142, 1105, -336, -1464, 1179, 633, -712, 23, 186, 804, 507, -899, 315, 527, -1113, -162, 394, -669, -313, -555, -127, 579, -1396, -168, 1014, -416, 307, 673, -113, 551, 134, 0, 987, -491, -623, 936, -171, -534, -118, -141, -24, -528, -691, 809, -165, -1345, 363, 410, -69, -335, -22, 1282, 246, -952, 631, 1048, -336, -91, 97, 118, -16, -1516, -154, 1020, -1284, -943, 278, 125, 310, -447, 181, 1038, -342, -514, 1037, 380, -48, 134, 197, 471, -457, -859, 927, 101, -1003, 295, -87, -171, -19, -665, 323, 222, -558, 717, 663, -480, 282, 248, 375, 345, -587, 260, 774, -780, -145, 549, -282, -374, -693, -15, 645, -805, -572, 1419, 28, -541, 586, 177, 933, -380, -280, 1269, 359, -911, 575, 96, -152, -411, -729, 730, 203, -1501, 657, 538, -993, 23, 128, 423, 400, -649]
1737f49J184M85k034R02P62p87K28j56n6R04j570J18J342j157l42J060l56L95
1755B73l79l22J880j316p35J540m72l17K58l51M15l03j349J688j83j701J209J86
1773B1l62N66j084Q53Q63j865J119P83r42J23J15k99P50j075Q3J513j465p59J563
1792E01q73J84K4o56J723j169q18J980n29r89O91o7P45j9j807J668L68j443K86
1811b00P49o97K59p97L61O99j602N89J068j002R7M24j36P64n61k43J323j436j78
1830e19J885j182k60K80n53J265j100r98J757n06j171J101j45K58k9o31J244L8
1848G34j581J176O84q20l38j57O05M97j537J80J228j305K70K34q8M67p97L36J078
1867H66j206j38J142p37J11K16m35Q73n07n93J270n75q90P85q7j75j78o00J195
$$ y = [-649, 535, 1020, -1014, -112, 650, -137, 91, -65, -121, 783, -787, -669, 673, -484, -826, 234, -122, 273, -106, -428, 1452, 136, -599, 941, 469, 152, 410, 59, 474, 171, -1178, 510, 327, -1374, -165, 21, -341, 225, -859, -6, 857, -1008, 111, 894, -48, 75, 190, -109, 641, -434, -351, 1162, -303, -1062, 501, -372, -188, -164, -820, 903, -266, -1084, 896, 367, -622, 69, 2, 747, 728, -1079, 589, 957, -486, -200, 549, -148, 111, -686, -325, 374, -1228, -639, 429, -573, -476, -52, -188, 576, 15, -228, 1095, -341, -519, 1366, 184, -76, 204, -349, 916, -184, -1182, 575, 69, -1102, -1, -146, 112, 83, -548, 696, 734, -847, 329, 1013, 193, -145, -302, 303, 800, -737, -557, 671, -634, -364, -130, -218, 249, -548, -212, 866, -340, -478, 664, -73, 38, 254, -181, 692, 185, -408, 862, 287, -603, 182, 95, -80, -258, -858, 337]
1886C37k44o67Q22J73p47M04MK31N64j486N30J237j450q5M23k03M35p22r1J153
1906F18j102m65R67m53L89O1l54N83K1p51R26P9l22J77n98L18J65n97K16o0l27
1927e09J011n11p27P83p8k39O25m89K41M4q05J062K31p03J1kL33M10j287j6R85
1948C70o01j5L8n49J063m62p06J149j83l98M66j30J91L88j337J202N08j200j15
1967c21L74J88L16j221m4J295p87l38Q01r31Q29j05r98J431q3j056Q82J12O2K15
1987F21j320N68R35j143n2K37j02N14q91Q7J292r35m16R89q07L04K00r85J600
2006F96q9q81M54j90J45M90j261L17O20o30M27m3r78J166l43l81R49l55l93O05
2026C25j76J47K90j354J032N47j391N72J24M7K95j064K69J033j276j06J110l35
$$ y = [337, 93, -574, 248, 421, -326, 78, 82, 313, 877, -609, -79, 1158, -292, -377, 46, -157, 278, -444, -535, 618, -484, -949, 18, -435, -46, 15, -339, 244, 265, -486, 440, 519, 197, 374, -224, 94, 259, -338, -122, -182, -509, 502, -9, -736, 47, -31, -270, 355, -134, 107, 151, -654, 408, 639, -64, -53, -55, 278, 688, -599, -615, 370, -231, -246, -208, -757, 306, -156, -862, 287, 104, -294, 172, 42, 233, 621, -716, 486, 994, -206, -321, 53, 241, 557, -664, -708, 587, -200, -538, 263, -668, 161, 56, -942, 489, 406, -650, 232, 344, 406, 621, -699, -131, 804, -339, -391, -154, -256, 258, -633, -546, 746, -189, -605, 384, -423, -119, 81, -904, 696, 607, -274, 180, -10, 135, 625, -636, -319, 301, -329, 98, 55, -923, 243, -100, -481, 468, 113, -280, 325, 149, 296, 586, -768, 264, 811, -580, -8, 116, 163, 458, -606, -337, 696, -580, -686, 424, 89]
2044H9l35o6m9J208q64r93J520k46j87N4l74P22L9r74M24K55j091P17J00j97K89
2065D1n29J99N62q16K93R91j090P21J71j154J180n53N0M85j028K27O88q31n9M34
2085a8m47O44m36j09J016p39m75Q38L2j5l10l96J249j83j371Q12M69o30j84k52
2105e05N57J53q70J28J185j067J11O23LN0p80J29J174j000k66R26m01k3k6m57
2125c56P95n16n37J055o49k32M65l12l3M57o46J129l51o43O75J84q59K37L77J17
2145C57j31n56P04N51j663M65M20l48K81o75M87Q46j234j94J297n52j21O1K37
2164B32K89m12n47Q32j30o36M60j14K46l56m47P32k17p23Q43R5m05K85k81M54
2184B00K13o98O04L49q34J27K00k21J28n05L90N31j076K73P08n41m15N00K17q6
$$ y = [89, -246, -312, -361, 847, -17, -1010, 510, 264, 77, 131, -243, 479, 518, -456, -32, 223, -868, -151, -51, -248, 41, -488, -289, 273, -543, -250, 741, -349, 372, 543, -611, 569, 16, 66, 551, -477, -250, 438, -393, -452, -18, -465, 179, -257, -366, 650, -89, -564, 274, 306, 291, -19, -415, 834, 651, -720, 92, 561, -69, -253, -505, 52, 205, -665, -537, 648, -419, -308, 315, 318, 368, -412, -283, 891, -109, -375, 551, 150, 127, 101, -356, 439, -77, -614, 441, -208, -440, 25, -287, -320, 137, -509, 620, 269, -374, 301, 485, -374, -137, 240, 357, 226, -330, 374, 925, -738, -273, 147, -201, 80, -595, -108, 738, -496, -690, 607, 55, -66, -5, 232, 521, 109, -438, 394, 264, -372, 88, -26, 220, -136, -583, 149, -68, -791, 52, 147, -258, 27, -254, 200, 413, -285, 319, 668, -166, -39, 161, -60, 68, -437, -47, 484, -592, -319, 389, -152, -567, -67, 150, 64]
2204F4j25l11J478r02n27Q91k51m08l16m4J067p82n20O68N04q22K61j82L00J20
2224A63o94K45Q24j055L86P41o00L50l12j07P18q69Q5Q88j046j64R23o53J01k02
2244b78m24J273q50m87J406k45l64K78n47P58k13j133J080L17j252R52j80l39
2262b48M71o58L40P92j359K21Q35n46K47k10l1Q87j151J31P90o35k06R62n53p6
2282CK13n99R04p57k53Q59j60p78O97l81M17J81j227J239l5q93O07K42j44M0n76
2303d01L01P63j048J74O47q41J06N9K60N07n88p9Q56q77q1P20m12L85j5p29O60
2324C67l30n73J087n62l90M01l09J52K04o12Q80j35p75Q65k19l66K39J66KO35
2344G27q54L16M98j100L95L1j82L58o02J74Q40p21m18M38M4K14J20n20N87l11
$$ y = [64, -61, -372, 1106, 204, -323, 568, 317, -91, -407, -451, 616, -166, -686, -18, 486, -336, -75, -257, 43, 163, -531, -286, 538, -517, -131, 610, 10, 360, 48, -59, 659, -210, -125, 763, -283, -447, 476, -177, -76, -278, -702, 571, -279, -766, 640, 395, 31, 309, -238, 520, 307, -826, 254, 571, -681, 271, 91, -248, 223, -435, -95, 697, -662, -441, 394, -152, 95, -115, -146, 741, -410, -279, 511, -124, -330, 632, 79, 3, 216, -383, 521, -236, -489, 370, 210, -568, 129, -252, 165, 346, -881, 358, 323, -570, 37, 279, 135, 175, -401, -100, 663, -385, -211, 436, -405, -299, -240, 20, 527, -61, -140, 716, -161, -242, 478, 66, 451, 436, -293, 367, 37, -536, 551, -11, -401, 0, -309, -157, 47, -565, 315, 180, -595, 270, 51, -315, -76, 90, 92, 727, -127, 189, 687, -413, -18, 13, -169, 189, -413, -239, 601, -120, -538, -100, -56, 158, 278, -242, 345, 34]
2364C4m38P27K5l90M13l20Q6k2l14L15M7m89M10k9k76M09l04j77N00l62L89K64
2386D98p06J39P08p27R1r1k99Q39n61l64Q29l32l01M43k51K67l36l84P99j55l00
2407a94M74k65L5j8j88K36M50o22J48r6n5M63p16L01M05n49J26M72o98L18q7j68
2429b28N20l29J07J03j79l8K32n98M50M02m54J25j37k70M17k12m75O75j21k18
2449b28K15m90R09k25r71R07L27n59J94q8J84J72o83M51M31o76L06p3n50N90n12
2470c69K9O64k67l53N36n94N06J40n84M99L26r46M91j89o2M07q04R7Q16n63J41
2491g9p4q3P27l90o49J031k35l40K97m64K55J03p02Q76J0p12M64O3j91M85o38
2512b46n1R19j100L93N11r56P59np31R57J2o90O31m97N6N06o85K8N83o56M4K94
$$ y = [34, -404, 323, 348, -42, 371, 51, 137, 115, -199, 116, 163, -326, 84, 55, -221, 188, -116, -293, 207, -155, 234, 498, -208, -69, 639, -88, 3, -88, -387, 452, -109, -473, 356, 24, -277, 166, -85, 182, -154, -538, 261, 106, -194, 280, 15, 50, 32, -156, 80, 530, -92, 56, -40, -95, 368, -348, -47, 358, -191, -65, 407, -291, 27, -60, -228, 292, -37, 70, 173, -6, -44, 188, -410, 40, 442, -12, 113, -24, -294, 123, -89, -564, 111, -10, -228, -13, -503, 406, 181, -790, 117, 444, -115, 79, -9, 175, 347, -336, 115, 546, -130, 176, 103, -447, 143, -369, -340, 324, 57, -296, 240, -354, 152, 292, -292, 207, 533, -413, 78, -111, -173, 234, -570, -473, 343, -220, -79, -153, -236, 491, 101, -548, 483, 248, -92, 205, -259, -4, 99, -603, 273, 283, -429, 35, 98, -93, 392, -246, -297, 622, -478, -85, 426, -530, 229, 224, -507, 450, 462, -228, 403, -94, -38, 468, -217, -189, 394, -262, -218, 76]
2534G6l09N35l79l56Q39m15p1K52l26N03l99k87O87l7o80M33J52l63J83p11K05
2555d68P02n09OM64m96J01J26L0L25k41k60K95j4O5j35l55N58Ok66L4P0k20M72
2578B90m18j52L71k90p5K13jK79j08n80P00l3n49O52l13K63j61n76N32J74o27
2599d09NL76N1K03n51p0J001o85k96Q49j95j36j68J59K32j32n88N50k44k3j29
2620b00K1M3L22m46J74M29j115J047k5j02J71m86L25K73o32N97P0q98M95K76o13
2641b74L24m38L98J10n39nM54l36%K48j11K68j79m07R96k43k87J58p6K11l24l4
2663h6M72k48p38O97l07J43j4j8N0M53o84J17L86l59K51J48j22K19o22M50l7k13
2685f2k92N22j70n1j70n9O72k84k85N08n86k21P28k31r1j71J03N20j51m71L99
$$ y = [76, -233, 302, -77, -433, 406, -9, -80, 172, -154, 349, -50, -337, 350, 313, -367, 66, 218, -145, 38, -673, -468, 234, -275, -269, 195, -301, -200, -74, -44, 281, 40, -220, 75, 61, 126, -9, -364, 194, 200, -66, -32, 38, -182, 290, -128, -280, 91, -199, -274, -61, -62, 217, 109, -471, 229, 196, -353, 299, -14, 249, 88, -488, 44, 218, -409, -404, -28, 23, 226, -325, -395, 606, -79, -375, 474, 279, 143, -25, 134, 366, 234, -354, 196, -48, -71, -200, -179, -136, 186, -260, -86, 343, -772, 275, 250, 148, 319, -167, 158, 431, -201, 396, 466, -432, 63, 339, -274, 50, -388, 10, 120, -419, -424, 30, -306, -306, -58, -169, 99, -80, -487, 509, 266, -21, 137, 61, 272, -52, -86, 386, 138, -600, 97, -210, -67, -81, -99, -49, 404, -280, -163, 223, -136, 115, 263, 141, 360, -262, 188, 151, -62, -354, 168, -2, -53, -223, -282, 390, 106, -179, 329, -257, -478, 250, 19, -72, -243, -140, 380, 229, -242, 157]
2706A57j52m4PP2m5L53p68K43P15o37j87K68J37j19k50k8N64o07J57P08o07m5
2728a08P0k97L79j20j8K97n39j42P59l57L1K3k04N00k03j45K13J36p43N77k8L46
2750D27p4o88L45K66o20L84N2j84J58o84L98M20m46k15J001n07k29J54pK56l86
2771a79j14O08m37k06L49LQ3j90k2J29o3l15M09J81j67qQ4j02p2m6J07J27k64
2794a05p1M16m79K85q2K9L22n21J51K61l77Q8R2r3K05L9m73N32J61j077Q73K21
2816C97n05J39j34K10J25l28K11K11p96L23Q6k8K20n0O0K61o29K77Q1k32R9K54
2838B52l13M28m79M6J30p3k77J87l7J08k4j63O33m09n11O93M6m98L68j75P7M4
2860E3o55P86l6l44K60j44K17n3l01P6N73p33J48q6j1J90K35j40K23l48J26J40
$$ y = [157, 5, -39, -32, 40, -5, 348, -420, -177, 538, -99, -286, -18, 119, 0, -250, -278, 286, -321, -164, 544, -63, -108, -38, -335, 44, -76, -94, 203, -336, -478, 281, -76, -45, -22, -226, 274, 71, -74, 139, 275, -468, 109, 81, 427, 353, -335, 10, 276, -344, 40, 92, -92, 66, -618, -220, 200, -246, -461, 540, 33, -196, -42, -49, 207, -179, -293, 315, -122, -328, 21, 24, 107, -83, -105, 24, -39, -354, 55, 236, 69, 61, 145, 43, -29, -75, 32, 159, -105, -176, 240, -239, 46, -36, -7, 315, -206, -55, 206, -171, -83, 9, -84, 121, 160, -313, 219, 380, -697, 176, 397, -108, 31, -103, 107, 232, -96, 115, 326, -470, -147, -61, -89, 131, 81, 141, 402, -227, 50, 131, -101, -2, 252, -61, 367, -112, -66, 64, -9, -286, -99, -136, -28, -52, -215, 418, 9, -502, 191, 237, -261, 107, -68, 9, 53, -602, 184, 148, -196, 64, -80, 137, 84, -217, -141, 432, -301, -153, -239, -250, -60, 175, 35, 258, -90, 36, 176]
2882A76l00P8J68j71PR2j59N45p83M5J33M9k0M57l37J60lm34N44k53j45L23Rk36
2906e5J66m8j52M9m27M91J95n29K78q1J01K81l26k96O46o22L03L17m48K40J82
2927B65o17N71k97p1K46k67K32J70m52J73P5m81K84K41j55K51l40j07M62k08J6
2948iL26l76O3K10m34oM82m25J54l00J60K53k23r2K62j28N4K64n43Q06m41k2K08
2971B43o5n76M24k54M55Ro50L96j28%J33pn21P19l01O0K21j77M4k2k05L02n3l31
2995b84N20m41N9L34k39L8M58p77M27J33k93j8J30k83L43j56l27N97l44K31N8
3016A66j71N1K31k31j06K99n02K52j30J60Ml75M35R3k88j2K62j89L03l48j11M97
3038B90j22j51J16o5O0J79l82J19P2k76K54j69j24J73q4o6N27k69j75J0m4K87
$$ y = [176, -124, -46, 122, -49, -42, 50, -109, 436, -347, -302, -169, -120, -140, 317, -20, 140, 137, -297, 247, -6, -151, 172, 181, -55, 111, 63, -89, -40, -467, 24, 219, -310, -32, -113, -12, 269, -57, -353, 293, -329, -26, 291, -157, 83, 265, -352, 219, -78, -149, 97, -170, 62, 232, -220, -47, 28, -453, -169, 72, -83, 168, -172, -279, 183, -25, -9, 317, -59, 4, 214, -220, -226, 256, -169, -15, -315, -155, 98, -125, -217, 45, -83, -29, 235, -308, 498, 57, 35, 243, 178, -398, 26, -228, 227, 236, -414, -18, -146, -146, -13, -20, -541, 178, -123, -63, 158, -19, 25, 3, -202, 100, 47, -284, 236, -205, -146, 188, -51, -13, 445, -332, 95, 228, -65, -83, 47, -236, 107, -49, -376, 221, -123, 108, 166, -5, 46, 277, 46, -60, 239, -263, -11, -141, 19, 23, -352, 83, 176, -112, -124, 138, -51, 252, -96, -207, 290, 168, 17, 133, 68, 128, 307, -75, 44, 116, -160, 94, -75, -199, -26, -110, -176, 351, 82, -93, -83, -127, 160]
3060A60J81n00J60j29m2L39j02j91K98m43K55o6j21J03J87k04J85o8l5L02l42
3081g3J1K80l30j4L00m54L32j79K7L13l33K0R9J45j10j05R9o7P1k32N35l58k42
3104b65M30k83J92K42n71K61K05n50N77j48k18J11l45L50K56m95k0M94k92J05
3124C6J11m62M40Pk63L35m2l59L53Nj70K65l45q1K26l67J31q2o7L33m2k39K12
3147f5M50l44R0l20M61l03j70K78j64Q0J05l1O3Jm52J36L89l10J10k5J3M4k38
3170b02J84K88m11J88j39J69l31K55k57K18L89l90K52k73M8J26l15J01J6j3K31
3191A34j97l30L41K89k73P0j95J15K44k20k0K01m51K81j48j7K76j11J70m5n5j94
3213a35M19m21K07j44J76M41n90r1K31k0k22J18r7J93k99K7J10K74m24K63j32
$$ y = [160, 341, -159, 1, -128, -170, 169, 67, -124, 174, -269, -14, -80, -201, -98, 89, -115, 70, 2, -33, 269, -73, -62, 218, -112, -126, 174, -280, 52, -127, -100, 213, -120, -100, -1, 144, 34, -71, 28, -39, 32, -200, 335, -23, -265, 165, -118, 74, 316, -255, 6, 211, -339, 238, 90, -128, -17, -362, -12, 244, -251, -271, 223, -69, 36, 147, -315, 125, 132, -131, 204, 162, -197, 156, 161, -9, 256, -89, -170, 56, -311, -180, -262, -329, 4, -38, -277, -65, 385, 41, 131, -189, 272, -31, -201, 77, -87, -7, 98, 67, 130, 131, -321, -185, 204, -106, 4, -21, -8, 36, -202, -18, 270, -141, 47, -92, 77, -254, 1, -256, -38, 351, -39, 213, -60, -12, 114, -201, -100, -84, -97, 134, -63, -393, -52, 237, -36, 34, -161, -46, 198, -22, -42, 159, -292, -11, -159, -176, 100, -11, 159, 114, 59, -135, 284, -137, 70, -74, 102, 543, -47, -138, 93, 73, -149, -31, -128, 65, -234, -207, -97, 177, -247, 16, -116]
3234a16j27L70kj31J09k57J61O3j64K43k55J18L3k21J35P6J68k66Q5l84K78R7
3256A3o0J41k59J11N91n30l6K59k39k2k0J49J24q2n54O13q2k04K74p7k51o3J12
3279i2R7J90k07J4j2J23j52J84l60M41l18R4K63p19O11l48Q7L7K50j26J15n83
3301d11K52M13l92J32J80k51n0J04J86J37No56M10o3q7l8p4J79K93j90l28L73
3323A24k54J22K08j42L4n6j27Q6J19j78K34m10M31j69r7K73k21m0l0p2n9M34k40
3346c0O1P8j83M31J43m74l5n9J15M5o1J45n5l74R7n2K52m5J42k64K47k96K00Q2
3370A10r8P6k74L12j61K22k54L88n7r8k95J57m76L24L1K21M5l49J32R4l2J9K2
3393E9m3O1r1k0K05k05K24j33O4j42j73J04J11M2j05K66l21p1J85j73K46j42m8
$$ y = [-116, -243, 127, 125, -6, 103, -154, 7, 70, -94, 149, -106, 12, 45, -176, -41, 35, 203, -63, 22, -362, -84, 13, -47, 94, -165, -54, 537, 7, -29, 230, -9, -31, -51, 98, 222, 140, -414, 199, 117, -87, 187, 110, -141, -204, -92, 5, 195, -12, 2, -10, 113, -39, 145, -215, 226, -92, 2, 265, -454, 157, -191, -104, -67, 183, 57, 172, -411, -159, 254, -138, -6, 174, -77, -127, -23, 163, 300, 305, -351, 59, -4, -91, -129, -203, -24, 269, 79, -249, 124, -130, -8, 200, 58, 92, 36, -91, -5, 114, -64, 170, -240, 191, 22, -75, 198, -23, -63, -93, -165, -224, 210, -30, 31, 109, -74, 357, 500, 26, -9, -68, 47, 92, 31, 176, 121, -253, -156, -208, 44, -1, 141, -123, 124, -172, 28, 110, 12, 88, -186, 126, -35, 187, -67, 321, 264, 166, -129, 28, -448, -124, -93, 128, 173, -176, -44, 50, 18, 37, 59, 16, 77, -14, -34, 171, -34, 190, 57, 121, -21, -194, -90, 21, 63, -42, 224, -97, -168, 17, -156, 90, -52, -100]
3416a00J78j54M5K92m09l7L42m88L05J72r7N9J28n53J95O2p8K51K6k90K00l19
3438b70N16rj24o4j43K39L13n75j5L9M3k91M41o2J00j07k31L14k07J24K9j23M6
3461a7j4q0k39L62j7O9K32n47J39K85k29K16j91n4L06l59j4L2r7K01M12l77k6
3484gk7O4O6m1o2K22n07L54p9k36K30j5j18L56l12%M33j03k87j70J72J32p2Q0
3508G3J42k63J53j71q3ML90k46R8J25k22j02Q1L4J7l06K02K77j39k20K54k44J76
3531C0J15j41%L84n29K16j45j2K30k60R6R1J38l45k2M6P7N0j65J08J63k7o8jo4
3556c5k7j27K48J34m45M11O7j95o4J26l39K84l68L61K35n42L31N0l42N84m02L3
3578b2J50o5p8K6j10n0J80m5k74K31m2M07j02m09K75km28M37M5k88K63k46N6M7
$$ y = [-100, 78, -76, -31, 261, -148, -185, 157, -331, -26, 146, 49, 108, 236, -317, -122, -60, -138, 113, 139, -151, 49, -270, 246, 237, 113, 49, -94, 145, 458, -117, -132, -93, -50, -341, 100, 38, 138, 31, -200, 114, -93, 31, 60, -63, -17, -31, -111, -350, 12, -5, 64, 296, -251, -112, 173, -56, 160, -31, -85, 221, -138, -152, -120, -217, -16, 396, 19, -7, -34, 30, 96, 55, -7, 215, -292, 62, -17, -253, -23, -38, -156, 200, -112, -112, 321, 218, -69, -239, -67, 65, -7, 73, 215, -48, 105, -66, -149, -145, 245, -1, 97, 222, 0, -102, -21, 13, 30, -276, -74, 203, 64, -156, 98, -146, 30, 145, 4, 4, 388, -141, 75, -70, -82, 148, -112, -16, 75, 213, -132, -154, -108, -31, 19, -146, -38, 125, 98, 30, 29, -35, -62, -189, 59, 193, -252, 159, 226, 31, -33, 93, -246, 38, -330, 31, 266, -276, 55, 105, -237, 347, -55, -22, 128, 63, -15, 11, -99, -149, 31, -14, -288, -57, -99, 308, 206, -203, 72, 70, -358, 79, 124, -164, 99, -147, -91, -44]
3602d4K47l36K0J10J85%k76J28Q4j89K1J39j29j22K83j38M9J21K4k26m2L00o6
3625A43j39J27j96j00K25r6K02m13J71L35k22R5l27J59K07n3P0jm38R3J89J72
3647B03p3K1q4k05L42k47J83j33j19J82q0J58N9l65L03j5k98J49p0r1L22j64k17
3670b39N17m16K60J72o06M66q3n9J76l40P2M9J02k47K40j58L1J45j26K07r7k02
3692a36L79j92l17K52P5j62L56j52J49k00k09L56j93j25N7l0J31o2J15l13K37
3713A6J93l66K08mj69L1k66M05M6k75K62Pl52M05l26K92L0n7L8k11P4J37p3j60
3737a15L20l62l79M00J3L49j77k55J26J52L3j44r0j2J58l88L04K42k66q4L12j37
3759@R5ok48J53p0J03j57L5L53m06K01p1L44k99r7J21j6M5n5k93L95k54K52k68
$$ y = [-44, 203, -133, -113, -3, 182, 182, -94, 34, 118, -71, -50, 89, -40, -162, 121, -17, 32, 153, 177, -49, -91, 209, 143, 4, 131, -65, -165, 60, -36, 166, -247, -76, 259, 37, 132, -195, -36, 171, 118, 188, 187, -251, -158, 31, 203, 130, 151, 67, -138, 204, -43, 140, 7, -112, 70, -10, 148, 207, -158, 145, 130, -168, -19, -89, -180, 142, -22, -239, 278, -138, 122, 294, -312, 154, 71, 12, 188, -152, -80, -31, 71, -176, 64, -94, -63, 82, -44, 163, 66, -136, 243, 51, -266, -14, 61, -101, 255, 103, 252, 52, -157, 199, 6, -119, -62, -92, 39, -23, 92, -221, 16, 209, -157, 51, 47, -122, -91, -357, 48, 94, -181, 81, 88, -264, 141, -185, 107, 137, 80, 118, -93, -19, 118, 45, -115, 205, -157, -536, -136, -123, 226, 49, -206, -80, 72, 105, -39, -129, -141, 17, -371, -67, 175, -91, -175, 137, 0, 95, 89, -159, -6, -76, 27, -130, -95, 258, -148, 53, -18, 326, 27, -70, 51, 35, 80, 25, -268, 127, -127, 125, -143]
3783a43N5K21l98L99q4Qj88O0j8K1R0k4j45K56j7J71l76J38p5l5J81j88O1J88
3807A58L6j84l37M47n1j34J2J88L1m94L22R4j23J70k84o3P1K43Rl11K95l34L56
3830A17Nk67J03l9r9J48rM9J3k59L09l8J9j19J67m38O28k65j7j31K25k70K84j97
3854h1J73j10j15R8j35K14o6j37J4J75k39K68J25k17Q4l24K88jj34K25j68K11
3876A48J09j75j71on5j10P5MR1J77l21P7O8J18L28m17J43K07k96n6J86k54m6K50
3900G4j96J49J8m7o6J50m69K12J46k6r7O5J43k21J74J58Kl45l2L44J07om18OL00
3925A25J3l34L99k11o5L20r7j97J57j86k3k10K77J85j01p5j16J43j40L7j23K30
3947HM3j31J89j57J23K69l93q1N8l31N87l9r1j05k01K96J36j65k03L60P6k82n0
$$ y = [-143, -88, 133, -265, 134, 50, 58, -130, -70, -88, -67, 23, -1, -146, 110, 93, 264, -112, 26, -49, -84, 97, -91, -30, 158, 194, 10, -327, 120, 69, -65, -53, 135, 166, -328, -6, 88, -35, 135, -149, -212, -141, 102, 111, -200, 95, -239, 117, 122, -145, -42, -81, -180, -32, -41, 8, 21, -238, 71, 33, 52, -67, 100, -338, 290, 25, 8, -123, 102, -168, 116, -81, 92, -18, -133, -35, -170, 44, -22, -159, -145, 30, -209, 59, 184, -33, 51, -273, 15, 14, -120, 105, -63, 148, 257, 82, -89, -95, -150, -260, -185, -181, -90, 87, -234, -157, -89, 29, 357, -60, 83, 290, -6, -62, 124, -130, -176, 74, -122, 27, 45, -2, -68, 82, -387, -175, -29, -55, -152, -87, 56, -165, 9, 167, 169, -176, -208, 136, 243, 237, -181, -175, 125, 138, -196, 203, -8, -73, 247, 150, -47, 110, -76, -99, -309, -32, 153, 52, -23, -139, 4, -136, -99, -222, 8, 51, -80, 109, -48, 75, 344, -49, -130, -72, -403, 184, 145, 54, -51, -252, 44, 180, 15, -188, 172, 248, -34, -84]
3970h4L4k05L02j03J19m5m04L73r6K42mJk04Rj06l7L71l18L46l00M4K0O3K04J45
3995C67l82rp3k74L20j32M59k37r2K02k31j58J52J26Q1J53m85j2J97Q2j89N1J44
4018F0L0L9m94N46j42o9j30K88l4J00l01J45M3j49r3N4J35j29Q4P6j65Q7J75k09
4042e3k02O8N35l47RJ90k88O5K2J7K32l34J42k81P8J0P7L6j48K19o2K94k96j20
4066a37J78Q1k74K12j36K15k04k7J20P5q0r3O4J20k55j39pN73l65J55m7p7j89
4089b37M19l48K31J9m32K29J29j55Q9l8K3K7n8K38k61L8K44m43K67J0q8L05k93
4112h5k28J48L08j45m1O7o9J62K83m66j88K89j23m4K55j06j18j8J43j7N7Jr4J23
4136I4L9j68J8J57j48J28r1k39J39N8L44l58j43K97k2l30J42M0j12K02Mj80J16
$$ y = [-84, -50, -255, 47, -56, 63, 18, -386, -13, -109, 133, 129, 130, -74, -65, -171, -208, 163, -155, 191, -109, -65, -45, 18, 222, 367, -15, -24, -97, -371, -51, -183, 276, 39, -53, 149, -82, -240, -88, 38, 119, 272, -213, -225, -28, 54, -135, -84, 60, 90, 129, -365, 181, 39, -30, -160, 128, 94, 194, -107, 38, 81, -68, -161, -107, 28, -101, -17, 59, -106, -19, 156, -53, -255, -187, 348, 1, 10, 200, -88, -23, -1, 16, 248, -86, 56, -225, -147, -137, -60, -24, -172, 47, -15, 279, -17, -137, 41, 122, -152, 60, -76, 139, -65, -92, 28, 103, 23, -70, -6, 114, -141, -280, -287, 286, -79, 76, 29, -48, -237, 182, -166, 65, 84, -348, -119, 10, -145, -56, -94, -71, -44, -102, 136, -125, -87, 157, -286, -19, -9, -97, 208, -85, -313, -165, 143, -2, -43, 24, -45, 117, 400, -66, -254, 35, -88, -132, 123, 17, -101, -119, 24, 7, 64, 65, -29, 94, 133, -35, -17, 140, -8, 120, 29, -210, -71, -13, 331, -27, -170, 127, 105, -225, -83, -43, -155, 47, 51, -129, -13]
4159a3O9j56nJ93l49L46k35L3K07PO8k62oJ67j64kP2q3J58j9J18j83P7j72K06
4184G2j58J68j13K01k0j71k02L09j69J01kn3k09J15J28RK19m19K0K41M6k0j60
4207f7m0P5J23j96K01k3j50K55l17k2K17j44k10J96n5R0J55j22j20M78l14k70
4229b60M01j4j35j15K29J01j61K6M5j03n1J76k26J85l97O03k94k0j42J50K10j01
4251A07k85L25N7k53o7L57l70O1L2Q8k45J97r1K79l16K43L03m21J31m09J86K31
4273A40%k09J76l17K77k84J39n4P3L7L2N3j62J30p3j98L89j84qj00L61j80l6j66
4297a64Q9J22j64j5R3K87o3m31L51J29j18O4l18J83K2J02k39P0J19l64J90K41
4319A86j70L02l49j27J97k30K54J6K07m29Q5Q0j64J86Q3P0M3l61J39K62o1l47
$$ y = [-13, 56, -100, -105, 88, -261, 85, -150, -117, 90, 97, 165, -97, -103, 64, -100, -102, -30, -113, 45, 26, 144, -39, 38, -134, 72, -86, 82, -31, 170, 150, -21, -223, 86, -83, 18, 16, -37, -246, -131, -3, 6, 225, -194, -174, 67, 113, 93, -67, -107, -32, 91, -105, 96, 73, -77, 178, -139, -161, 56, -88, -298, -102, -157, -67, 88, -34, -154, 324, 10, -260, 141, 127, -8, -123, 106, 207, 46, 72, 117, 14, -37, 139, -87, 98, -299, 304, 10, -10, -152, -2, 208, 107, -178, 147, 204, -49, -116, 241, -129, -68, -36, 52, -193, 4, -87, 192, -124, 119, 422, 1, 132, -277, -91, 140, 140, -69, 107, -210, 67, -217, -78, -132, -59, -22, 10, 63, -99, 31, -42, -240, 149, -35, -43, -143, 218, 38, 2, -164, -75, 47, -117, -132, -39, 248, 185, -246, 105, 234, 116, 180, -138, 45, 67, 169, -70, 0, 119, -245, -55, 186, 16, 318, -31, -158, 39, -191, 63, 79, 286, -143, -58, 22, -142, 44, 127, 197, 240, -121, 18, 280, 219, -128]
4341a28J35q1j21L18j64J84o0R9l51L43l26J00N1O8P2j38K0l67M32p5J40j79k18
4364b46K30O6k3m4K13j19p7j22K08k21K12j80Q2J68N7j74j70J30J61l57L61p0
4386H5l16L33j71R9LJ36j76J28j00P8j08q3RJ81o4q8q7j25M30J69j01k18r0j4
4410i0o6J66j03K36j93m5J48j39K19o0j11L96j84m01M33o0l36K03l8K60l89L9
4432a15J48o2J06k24L25j91N8j87K35j73j5J75m4M0k21K91J15j00j33J84j07j0
4454I5k50J13K53j38k24K11Q3k56O8J2m1j50m8K16K3K17j52q6n3J00K04k39k0
4477f2p5n4K54R2r0l94K39L26k81J00q5M4j64p8M9K10j18K47l52K12j3J15K0J
4501A43N0l62J44mp6M6J71p4k76L05k11J8K18l81M09J7k70J54j39j43K15j8J20
$$ y = [-128, 7, -74, -195, 123, -41, 143, 83, 182, -169, 174, -152, -52, -1, 67, 139, 1, 21, -346, 86, 11, 151, -28, -246, -16, 50, 27, -17, 196, 77, 0, -122, 86, -135, 77, -103, -21, 147, 204, 30, -140, -10, 151, -206, 155, 85, -231, 102, -69, 30, 33, 169, -7, 121, 21, 99, -9, -92, -83, 98, 34, -54, -141, -266, 164, 333, 232, 14, -76, -90, -156, 10, -93, 143, -50, -95, 53, -86, 133, 73, -38, 358, 174, -227, 206, 146, -190, 13, -25, 235, -154, -115, 33, -29, 77, -147, 178, -13, 45, -142, 93, -80, -95, 80, 36, 76, -145, 146, 261, 161, 28, 212, 105, 95, -155, -42, 211, 73, -151, 60, 143, -113, -45, -33, -74, -224, -272, -56, -33, 184, 32, -54, -107, -7, 197, -42, -62, -137, -191, 63, 155, 65, -329, -90, 236, -45, 55, -30, 14, -150, -228, -179, 31, -87, 160, -192, 20, 7, 122, 142, 143, 193, -169, -25, -29, -105, -59, 112, 38, -238, 67, -144, -126, 92, -289, 120, 137, -133, 21, -118, -261, -46, -64, 56]
4524E6o2J15l14L26j72K10q1k1k94K94K3p0J9J64n5l16N21l23j2m4K54L6m18K87
4548A23k39J83j02J42k85J91j5l9K20j05O8l8l66J00J34o1K12k91P5qr8Q3J79
4571F3N9m70L50R4l64M66l11K0J11j13J88k65K2K49n7m15Q2N37k32j78J27j32
4593a69K71k06K7J37m37L68j3j48J16j08K51P7J68l29j21N0J97k72M2j31l2K98
4615C6j68K41P2j26j43Q2q1k50N03P6Q2k21k63K99nj26j23PK82j30J37m04K36
4638A3j53P2K00l30M4K75k21J27j14j7J02J12n4q5l8N1K5R5j46O8J63j14K0j08
4662a3J37J66j14Qm5Rk12P5k11L44j15j05J33k60L22o7j54M5J21l7j11l8K13k58
4686a67k29L62Q7k9J36j3j58k08L03Q2m10L43o4J93k42k25L14j47K75k20J77q8
$$ y = [56, -6, 109, -205, 121, -51, 159, 78, 57, -237, 57, 80, 10, 29, 193, 138, -178, 343, 20, 8, -36, 218, 254, -164, 123, -116, 67, -35, 107, -178, 13, -2, -41, 179, 74, 142, 104, -262, -162, -28, -89, 123, -168, -93, -101, -199, -116, 63, 122, -348, 2, 96, -268, 198, -113, -93, 18, -95, 93, -172, -150, 99, 42, -373, -291, 246, 14, -164, -37, -169, 102, -104, -77, 60, -377, -9, -22, -170, -54, -162, 89, 166, 334, 5, -116, -66, 131, -141, -99, -230, -262, 36, -132, 109, 181, 55, -88, -6, -87, -337, 166, 242, 324, 103, -160, 139, 134, 8, -115, -108, 174, 44, 181, -223, 13, -140, -68, 132, -198, -154, 121, -100, 27, -87, -104, -2, 110, 56, -29, -67, -16, 9, 104, -42, 26, 189, 75, 95, -13, 124, 290, 176, 184, 139, 148, -64, 11, -200, 144, 29, -76, 57, -203, 119, 52, -102, -57, 64, 27, -84, -122, 91, -167, -396, -34, 53, 24, 160, 147, -11, -219, 84, 166, -244, 99, 35, 228, -14, -239, 75, -72, 203, -17, 160, 72]
4708G2j61P9j21q5J97J79k36j62K42L2J41j95j50Q7K15j24Q3k83Q7Q0M9j02K7
4731d9j32K44N5k48K03j61n2J83nk4m7m83M19L4j09J50O1m5m0L5j19O1J41k91
4755b19J84j72q5K17J18M5n7Q7p9N0l61K94J6J36k55L03k23J26k69K00q1K02M
4778A81k08P3k52J57J87j43L11m53J12P9j46J00L6J09k16J30J01j51J1m4L2J00
4800A06k41K7J03J07qm2J1k6q1j58K68l9j18R5k60K92j37j59L52jR1l8K3j88J22
4825A01j52J97k24rJ22jK7k59J11Jk1O3o9M86l57P8j21Q3JK05k77Qn4K20l16J45
4851a2J52r3j66L52k2o2k48m4J49J45j45Q2m0J48q8m14N73m07L3J81k34J02J64
4874A06n4j04p2K4p9Q3J66J19r4q5lj13P7J82p5n8K5K0J65p3j1l03N7l2K29m09
$$ y = [72, -89, -10, -131, -216, -19, 160, -76, -238, 4, 36, 177, -18, -168, -81, 134, 10, 93, -190, -103, -23, 26, -76, -49, -181, 63, 118, -130, 73, -88, -140, 43, 38, 14, -33, -516, -97, -63, -172, -22, 39, -6, -46, -11, -130, -69, 72, -219, -35, -207, -292, -75, 43, 88, 31, 118, 39, 89, -272, 22, 38, 174, -81, 222, -1, 125, -144, 56, -25, 177, 181, -27, 46, -206, -49, 138, -5, 306, -147, -35, 44, -102, -2, 34, 143, -73, 57, 158, 7, 18, -26, 6, 106, -135, -108, -5, 102, 94, 52, 63, 37, -44, -202, 66, 27, -91, 4, -256, 36, -101, -260, 92, 91, 182, 144, 167, -21, 101, -51, 146, -78, -87, 35, 34, 61, -198, -87, -86, -107, -44, -113, 373, 16, 94, -27, 56, 57, 262, -15, -7, -61, 159, -157, -12, 140, 47, -119, 233, 211, 149, -99, -143, 6, 151, 6, 88, 48, 196, 108, -306, 267, -140, -107, 74, -160, -58, 106, 52, -52, -124, -100, -179, -96, 70, 189, 95, 10, 7, -106, -29, 153, 78, 20, 45, 65, 230, 157, 146, -157, -100, -132, 97, -312]
4900c12L19J7jm2O5K64k31k0j76L05o0k02k22K01K79j28j84J86j43m7K37l59M92
4923B38l83M37l77r3l2J31L20k90J76k84J82j3k4J61k50m3J67J56j85j17m9R2
4945h0n0p5K86j49j90L82j87l7L10k36o9J36j06M57k93j14N3j8p7R6J8q0k1J41
4969I7J85k04k54L37j85q6J30J91m88M77q4k53J29Q4K7j34j5RJ21l02L9L37o1
4992I7l10N6K70k06l1L1M8j08L64m39L75N6j74J11p5j90N6M14l91l7L23m5j58
5015C7J00l02L71k36l7J56k04L9R1J74l84K8K97j14j54K59j06lj36PK48k05n8
5038a32K20o6r9J97R1m0k68K71k34j73o0N11m52L44o8r9m8k7q7M5R8K5Q8r9J48
5063H6j74jJ29l2k2Q6o1j39ORP3k4J63q3p1J82m5J14k50K51Q5m12J66j76L39n
$$ y = [-312, 7, 24, 23, -19, 46, 310, 79, 59, -117, 188, 128, -74, -296, -95, 184, 56, -128, 58, -85, -132, 105, -254, 238, -145, 292, -85, -178, -210, -79, 241, -49, 127, -157, 25, 12, -12, 149, -101, -144, 23, 179, -6, -123, -172, -80, -130, -205, 81, -68, -258, 124, -63, -100, 210, -26, -95, 41, -65, 392, 99, -15, 38, 20, -57, 39, 57, -23, -44, 97, 282, 78, -176, 161, -24, -110, 20, 211, -277, 200, 116, -137, -8, 76, 103, -31, -46, -37, 84, -218, -179, 158, 97, -213, -157, 113, -93, -124, -93, -45, -153, 211, -228, 147, 203, 29, 140, 65, -125, -69, 345, -46, -83, 240, 195, 37, 137, -165, 206, -30, -67, 89, -115, -76, 15, 189, -195, -167, 130, 16, -138, 121, 15, 12, -124, -117, 131, -74, -132, 88, 22, -77, 120, 211, 171, -97, 174, -60, -233, -293, 218, -234, 110, 42, -57, -105, -132, -219, -174, -76, -51, 37, -62, 86, -88, -89, 40, 8, -14, 72, 11, -128, -122, -113, -40, -64, 99, 16, -55, 127, 82, 196, -54, 197, 282, -130, 36, -140, 199, 194]
5089A94J57n67J82K24m13L28L4j67J04j94J35k4K76o9k62K18p0j13o4J28K0p6
5111a9N4jm8j98J88jK93k74j2q9j3J67Jj19J15J0q6K30k04L1j30O1j38R1k7R6
5137b2k12N2J77m4L1q8j82J30J62N5j32Q2j00J56j69J11o3n0J08J39k08l4K07
5160A06j64m9Q6J56j94N6N0k46K23o9J55Q3k49J72j88q4L18j05j50J48j15J3J12
5183F5q7l27N31oj40L54n39L02j30p5l11J97K07j10N3j74j07K71Q4j36OR3J84
5206B05k46l8p3J25J19k63K3L39r5K01m89L80Rl65J93j27M76m13m7K27l06J10
5228e5M5K79l41Q4J48j44j80L45j60l9K8K4J4k16K66l29J52N4K37m8j45j96n6
5251b33M58j96j2K92l01K15j23o5j90M42m6m34K78K46l14o9K0K14o9j16l4Q9j6
$$ y = [194, 351, -216, -34, 190, -223, 105, 139, -28, 76, -118, 17, -7, 269, 200, -62, 156, 86, -27, -91, 37, 57, -19, 35, 34, -14, -212, -24, -25, 268, -6, -18, -107, -120, 47, 48, -71, 44, 54, -32, 198, -6, 25, -105, -44, -182, -91, -118, -22, -234, -182, -5, -49, -18, -106, -288, -158, 4, 59, -73, 9, -91, 65, -104, 7, -56, -106, 2, 141, -67, -101, 106, -58, -107, -21, 135, -59, -3, 47, -199, 24, -45, 110, 193, -56, 116, -72, -156, 162, 57, -93, 55, -60, -47, 65, -22, -349, 182, 176, 36, 390, -149, 153, 23, -52, -363, -166, 41, -69, -16, -190, -297, -26, 58, -78, -72, 21, 205, -41, -79, -152, -27, 92, -171, -148, 191, 96, 297, -192, 188, 197, -168, 25, -102, 374, -39, -86, 141, -165, -55, -10, 269, -72, 12, 160, 16, -164, 181, 21, -18, 10, 34, 48, -168, 98, -231, -79, -25, 212, 164, 19, -177, -233, 225, 29, 17, 309, 8, 223, 100, 35, -155, 287, 241, -193, 85, 331, 17, -52, -32, 182, 113, -3, -37, 52, 36]
5274C6j51J62j38K69k6k46J41po3J35k1mn1k64L45r6j19J53K26n16L42l3j2O5
5298A27j85m9j68K00J11j18r8Q8J56j01nK8O4K0m66N25j3k95J43p2n1k1J50J09
5322G9k00n7R6jR2R8k32R9J41j80J72o2J21m35K12N5j7J91k50q6K61l10J87j40
5346a66J95J41j25N5rR0r1O5O5k8l00n1K66j10M6k20O5J66j83K3j7J27M1L1j14
5371c8L90l00k43K29j58M46k61J3n6q5M22o28J43J78j3k1P3K14n79M29o3j49J82
5394A25k35L42m2P1m49K92J07m06M95m98J06j22L73m53K87J24l22N4M64l34K80
5415B59m7l05K3LK20m56L15J88j59k12N15l32j08m5mK47N7j55j54n0K39j83K34
5438I0j51j8P0Q1J00m71K37K74j04k79J62J76r7K6r6j11K02J31m18K14L2j22J06
$$ y = [36, -115, 47, -91, 178, 152, -94, 47, 40, -23, 112, 91, 87, 36, -228, 117, 21, -98, 55, 281, -235, 107, 74, 62, 127, -58, -107, -275, -75, 36, -82, -180, -92, 64, -37, -42, -14, 50, 70, -396, 129, 116, -179, -36, -108, -159, -180, -30, 79, -121, -178, -82, -83, 9, 107, -125, -26, 115, -65, 107, 45, 166, -269, -57, -2, -19, 172, -78, -164, 97, -213, -26, -166, 29, 170, 45, 100, 91, 181, 90, 155, 220, 192, -108, -159, 107, -3, 43, -177, -112, 54, -129, -106, -123, 4, 45, 76, -38, 352, 52, -191, 38, -120, 326, 65, 78, 22, -63, 359, -269, -126, 52, 39, 18, 91, 305, -274, 155, 92, -57, 125, -110, 232, 190, 261, -188, 104, 211, -195, 300, -198, -92, -214, 159, -294, -7, 117, -205, -151, 313, -21, 259, 212, -93, -70, -67, 153, -303, 12, 200, 41, -171, 344, 12, -96, -141, -145, 102, 159, 4, -150, -200, 39, -144, 90, -61, -79, -9, 72, 172, -299, -62, 212, 108, -171, -9, 167, 70, 96, 0, -111, 91, 222, -196, 18, 50, -72, 34]
5461C4j36K61l73L11l4N9O0k10r2L25j25P0J07k92P9k71L24j50q7K04j01J25k6
5484F2q5K55j12j69K07k14N5J46j17lj21K4P1mj11J15j85Q0M10k05k42O7m7K7
5508i6K14o0j1L02o21K92J37m06J25J40K4j38OPoJ43r7j50K70Lk72K9N0q1K86
5533I0K7k12l5L6K09p3l02J13P4L5j81P4K91m4q5j03p5pJ04M53k52ok56J61J78
5558B14m41L46k77j85L55j1m8K8k07J87J46m7M6K35m84J09l3K68q3n5J59j92M1
5581G1k51L27j57nP3o3J39j52l7J84m13J90N3J8L75n06L20l78J64J95%p8k4k47
5605b02L14N1j43N9Q5j45K4k87Q1L31j83k31L80k47j18M03j65J00r2J0j27j67
5627b69L66m9O8k08K23j18M9l37L55R4q6J3k18N4R1J04n1J29q2j16L7j8j92q6
$$ y = [34, -102, 159, -214, 97, 63, 122, 182, -28, -120, 205, 80, 150, 257, -35, 44, -227, 97, -53, -140, 64, -37, 88, 62, -23, 232, 120, -49, 158, -56, -1, 145, 28, 25, -96, -72, -1, -5, -116, -1, -186, -106, 304, 99, -143, -76, -123, -96, 118, 58, 47, 349, -272, 20, 157, -249, -124, 16, 40, -98, -92, -85, -91, 52, -45, -195, 75, 78, -194, -165, -115, -196, 90, 117, -95, -130, -94, 115, 42, -260, -147, -73, -38, -219, -145, 146, 102, 17, -86, -161, -168, -64, 389, 137, 131, -125, 36, 214, -227, 119, -158, -343, 12, 1, -47, -19, -226, -39, 107, 60, 106, 341, -143, -34, -67, 201, 118, 63, 222, 30, 71, -180, 147, -10, -15, 58, -5, 134, -18, -55, 129, -284, -94, -41, -23, 352, -154, 166, -212, -48, 147, 147, 69, 45, -202, 112, 163, 20, 79, 164, 19, 43, -244, -163, 168, -15, -246, 134, -113, -231, 172, 7, 107, 15, 25, -102, -269, 97, 48, 116, -92, 131, 13, 62, -275, 80, 174, 88, 101, -117, -63, 28, 132, 81, 210, 128, 12, 49, 31, -161, -247]
5651b47M36N0l59K24l99L72l10J22n4K68k38j17L05J7o5M6m7K20m90K11J2J77
5673A34j7j38J02j03j45L79r5l09J12j6K60j01k14J80O5j19K21j70j90QK42j60
5695g4N3j53K37J2Ol02J53NJ80l8k30J86M0L7l79N37l39N9j41K19k9Lj65j18M08
5720A67N3k1l58K70K61m68J95L7k5L3k1rm8j3j27L58k77L5L8j86K87k53O6o2J87
5745A19ql97J28K33L9K81m71K43l85R9Q2r7N79m29J01%j10k19J92J57j08J78k86
5768g9O7L61l38j04J75O8k52J00r3L2J05k02J2K13j6J47m00J29K30j79J2k4K06
5791A70r5k2k01M02k72J42j91J25j18J23j08J86j37j26L56j79M4j26m30M09N5
$$ y = [-247, 189, 239, -120, 104, -295, 77, -233, -111, -165, 103, -135, -252, 53, 70, 5, 51, 4, 224, -266, -55, -43, 134, 117, -21, 81, -22, -167, 212, 117, -192, -80, -96, 164, 63, -151, 29, 94, -25, 196, 26, -164, -156, 86, -74, -21, -174, 63, 75, 81, -221, -68, -63, 117, 79, -151, 35, 75, 112, -267, 270, -69, -10, -151, 68, 39, 42, -123, -241, 167, 220, 199, -159, 111, 372, -96, 99, 136, 111, 144, 123, 114, 66, 53, -74, 284, 7, 42, 80, -106, 181, -72, -6, -68, 119, 111, -286, -158, 75, 114, 395, -76, 167, -218, -119, -37, -134, 445, 16, 117, 117, 7, -212, -20, 137, 29, 207, -79, -12, 349, 11, -93, 82, 150, -102, -2, -95, -63, 42, -160, -148, 65, 49, 196, -204, -75, 155, -24, -12, -36, 170, 75, 53, -148, 254, -18, 124, -67, 58, -60, 63, -45, 141, 4, -122, 234, 55, 99, -27, -457, -48, 7]
$$ [...]
8191D8
##END NTUPLES=NMR FID
##END=
