##TITLE=1H_Pr NCS-dep-A
 200.13MHz, CDCl3,
 8 sc
 
 5.8.2025
##JCAMPDX= 6.0         $$ Bruker NMR JCAMP-DX V2.0
##DATA TYPE= NMR FID
##DATA CLASS= NTUPLES
##ORIGIN= UXNMR, Bruker Analytische Messtechnik GmbH
##OWNER= pz
$$ XWIN-NMR		Version 3.5
$$ Tue Aug  5 14:24:03 2025 Russian Standard Time (UT+4h)  she@DPX200
##.OBSERVE FREQUENCY= 200.1313
##.OBSERVE NUCLEUS= ^1H
##.DELAY= (6, 6)
##.ACQUISITION MODE= SIMULTANEOUS
##.ACQUISITION SCHEME= undefined
##.AVERAGES= 8
##.DIGITISER RES= 18
##SPECTROMETER/DATA SYSTEM= spect
##.PULSE SEQUENCE= zg30
##.SOLVENT NAME= CDCl3
##.SHIFT REFERENCE= (INTERNAL, CDCl3, 0, 14.3821)
##AUDIT TRAIL= $$ (NUMBER, WHEN, WHO, WHERE, WHAT)
$$ ##TITLE= Audit trail, XWIN-NMR		Version 3.5
$$ ##JCAMPDX= 5.01
$$ ##ORIGIN= Bruker BioSpin GmbH
$$ ##OWNER= she
$$ F:/spectra/data/she/nmr/H-C/1/audita.txt
$$ ##AUDIT TRAIL=  $$ (NUMBER, WHEN, WHO, WHERE, WHAT)
(   1,<2025-08-05 14:22:45.09 +0400>,<she>,<DPX200>,
      <created by zg, POWCHK disabled, PULCHK disabled
       configuration hash MD5:
       00 E9 B6 7A A2 85 ED C7 34 08 36 98 17 FE 4E 26
       data hash MD5: 16K
       8D 7C 48 1C 65 BC 1F 70 6C DE D8 E2 C4 E6 ED FC>)
$$ ##END=
$$ 
$$ hash MD5
$$ 54 7B EB 12 CB A0 58 01 CD F4 07 EF 0E B0 B5 BB
##$RELAX= 
##$RELAX= 
##$RELAX= 
##$RELAX= 
##$RELAX= 
##$RELAX= 
$$ Bruker specific parameters
$$ --------------------------
##$DU= <F:/spectra>
##$EXPNO= 1
##$NAME= <H-C>
##$PROCNO= 1
##$TYPE= <nmr>
##$USER= <she>
##$AMP= (0..31)
100 100 100 100 100 100 100 100 100 100 100 100 100 100 100 100 100 100 
100 100 100 100 100 100 100 100 100 100 100 100 100 100 
##$AQSEQ= 0
##$AQ_mod= 1
##$AUNM= <au_zg>
##$AUTOPOS= <>
##$BF1= 200.13
##$BF2= 200.13
##$BF3= 200.13
##$BF4= 200.13
##$BF5= 200.13
##$BF6= 200.13
##$BF7= 200.13
##$BF8= 200.13
##$BYTORDA= 1
##$CFDGTYP= 0
##$CFRGTYP= 5
##$CHEMSTR= <none>
##$CNST= (0..31)
1 1 145 1 1 1 1 1 1 1 1 1 1 1 1 1 1 1 1 1 1 1 1 1 1 1 1 1 1 1 1 1 
##$CPDPRG= <>
##$CPDPRG1= <>
##$CPDPRG2= <>
##$CPDPRG3= <>
##$CPDPRG4= <mlev>
##$CPDPRG5= <mlev>
##$CPDPRG6= <mlev>
##$CPDPRG7= <mlev>
##$CPDPRG8= <mlev>
##$CPDPRGB= <>
##$CPDPRGT= <>
##$D= (0..31)
0 0.7 0 0 0 0 0 0 0 0 0 0.03 0 0 0 0 0 0 0 0 0 0 0 0 0 0 0 0 0 0 0 0 
##$DATE= 1754389364
##$DBL= (0..7)
120 120 120 120 120 120 120 120 
##$DBP= (0..7)
150 150 150 150 150 150 150 150 
##$DBP07= 0
##$DBPNAM0= <>
##$DBPNAM1= <>
##$DBPNAM2= <>
##$DBPNAM3= <>
##$DBPNAM4= <>
##$DBPNAM5= <>
##$DBPNAM6= <>
##$DBPNAM7= <>
##$DBPOAL= (0..7)
0.5 0.5 0.5 0.5 0.5 0.5 0.5 0.5 
##$DBPOFFS= (0..7)
0 0 0 0 0 0 0 0 
##$DE= 6
##$DECBNUC= <off>
##$DECIM= 32
##$DECNUC= <off>
##$DECSTAT= 4
##$DIGMOD= 1
##$DIGTYP= 9
##$DL= (0..7)
0 120 120 120 120 120 120 120 
##$DP= (0..7)
150 150 150 150 150 150 150 150 
##$DP07= 0
##$DPNAME0= <>
##$DPNAME1= <>
##$DPNAME2= <>
##$DPNAME3= <>
##$DPNAME4= <>
##$DPNAME5= <>
##$DPNAME6= <>
##$DPNAME7= <>
##$DPOAL= (0..7)
0.5 0.5 0.5 0.5 0.5 0.5 0.5 0.5 
##$DPOFFS= (0..7)
0 0 0 0 0 0 0 0 
##$DQDMODE= 0
##$DR= 18
##$DS= 0
##$DSLIST= <SSSSSSSSSSSSSSS>
$$ [...]
##$SUBNAM0= <"">
##$SUBNAM1= <"">
##$SUBNAM2= <"">
##$SUBNAM3= <"">
##$SUBNAM4= <"">
##$SUBNAM5= <"">
##$SUBNAM6= <"">
##$SUBNAM7= <"">
##$SUBNAM8= <"">
##$SUBNAM9= <"">
##$SW= 18.0517328524113
##$SWIBOX= (0..15)
0 0 2 0 0 0 0 0 0 0 0 0 0 0 0 0 
##$SW_h= 3612.71676300578
##$TD= 16384
##$TD0= 1
##$TE= 0
##$TE2= 300
##$TE3= 300
##$TEG= 300
##$TL= (0..7)
0 120 120 120 120 120 120 120 
##$TP= (0..7)
150 150 150 150 150 150 150 150 
##$TP07= 0
##$TPNAME0= <>
##$TPNAME1= <>
##$TPNAME2= <>
##$TPNAME3= <>
##$TPNAME4= <>
##$TPNAME5= <>
##$TPNAME6= <>
##$TPNAME7= <>
##$TPOAL= (0..7)
0.5 0.5 0.5 0.5 0.5 0.5 0.5 0.5 
##$TPOFFS= (0..7)
0 0 0 0 0 0 0 0 
##$TUNHIN= 0
##$TUNHOUT= 0
##$TUNXOUT= 0
##$USERA1= <user>
##$USERA2= <user>
##$USERA3= <user>
##$USERA4= <user>
##$USERA5= <user>
##$V9= 5
##$VALIST= <valist>
##$VCLIST= <CCCCCCCCCCCCCCC>
##$VD= 0
##$VDLIST= <DDDDDDDDDDDDDDD>
##$VPLIST= <PPPPPPPPPPPPPPP>
##$VTLIST= <TTTTTTTTTTTTTTT>
##$WBST= 1024
##$WBSW= 4
##$XGAIN= (0..3)
0 0 0 0 
##$XL= 0
##$YL= 0
##$YMAX_a= 459937
##$YMIN_a= -297855
##$ZGOPTNS= <>
##$ZL1= 120
##$ZL2= 120
##$ZL3= 120
##$ZL4= 120
##$ABSF1= 10
##$ABSF2= 0
##$ABSG= 5
##$ABSL= 3
##$ALPHA= 0
##$AQORDER= 0
##$ASSFAC= 0
##$ASSFACI= 0
##$ASSFACX= 0
##$ASSWID= 0
##$AUNMP= <proc_1d>
##$AZFE= 0.1
##$AZFW= 0.1
##$BCFW= 1
##$BC_mod= 2
##$BYTORDP= 1
##$COROFFS= 0
##$CY= -3
##$DATMOD= 1
##$DC= 2
##$DFILT= <>
##$DTYPP= 0
##$F1P= 0
##$F2P= 0
##$FCOR= 0.5
##$FTSIZE= 0
##$FT_mod= 4
##$GAMMA= 1
##$GB= 0.15
##$INTBC= 1
##$INTSCL= 1
##$ISEN= 128
##$LB= 0.25
##$LEV0= 0
##$LPBIN= 0
##$MAXI= 10000
##$MC2= 0
##$MEAN= 0
##$ME_mod= 0
##$MI= 1.114404
##$NCOEF= 0
##$NC_proc= 0
##$NLEV= 6
##$NOISF1= 3.799351
##$NOISF2= 2.8
##$NSP= 1
##$NTH_PI= 0
##$NZP= 0
##$OFFSET= 14.38212
##$PC= 1
##$PHC0= -1198.06
##$PHC1= 8.792299
##$PH_mod= 1
##$PKNL= yes
##$PPARMOD= 0
##$PSCAL= 0
##$PSIGN= 0
##$REVERSE= no
##$SF= 200.129724274929
##$SI= 16384
##$SIGF1= 3
##$SIGF2= 2
##$SINO= 400
##$SIOLD= 16384
##$SREGLST= <1H.CDCl3>
##$SSB= 0
##$STSI= 0
##$STSR= 0
##$SW_p= 3205.1282051282
##$SYMM= 0
##$S_DEV= 0
##$TDeff= 0
##$TDoff= 0
##$TI= <>
##$TILT= no
##$TM1= 0
##$TM2= 0
##$TOPLEV= 0
##$USERP1= <user>
##$USERP2= <user>
##$USERP3= <user>
##$USERP4= <user>
##$USERP5= <user>
##$WDW= 1
##$XDIM= 8192
##$YMAX_p= 0
##$YMIN_p= 0
$$ End of Bruker specific parameters
$$ ---------------------------------
##NTUPLES= NMR FID
##VAR_NAME=  TIME,          FID/REAL,        FID/IMAG
##SYMBOL=    X,             R,               I
##VAR_TYPE=  INDEPENDENT,   DEPENDENT,       DEPENDENT
##VAR_FORM=  AFFN,          ASDF,            ASDF
##VAR_DIM=   8192,          8192,            8192
##UNITS=     SECONDS,       ARBITRARY UNITS, ARBITRARY UNITS
##FACTOR=    0.0002768,     1,               1
##FIRST=     0,             0,               0
##LAST=      2.2672688,     0,               0
##MIN=       0,             -297855,         0
##MAX=       2.2672688,     459937,          0
$$ Real data points
##PAGE= N=1
##DATA TABLE= (X++(R..R)), XYDATA
0 0 0 0 0 0 0 0 0 0 0 0 0 0 0 -8 8 -8 8 -8 16 -16 21 -24 32 -36 40 -48 56 -64 77 -88 100 -116 131 -148 165
35 165 -188 212 -236 265 -296 329 -364 406 -452 497 -552 609 -670 741 -817 901 -991 1093
53 1093 -1207 1334 -1480 1643 -1829 2048 -2306 2616 -2996 3483 -4120 5005 -6319 8493 -12730
68 -12730 24178 -126007 -297855 103673 459937 342251 84466 -41194 -21556 -54585 -138594
79 -138594 -116972 -175868 -177796 -27978 238366 312903 165918 7752 55842 100223 -59498
90 -59498 -187000 -196786 -158907 -89644 36039 165690 166615 73704 90054 165261 31768 -153664
102 -153664 -163764 -88688 -112435 -160628 -15728 195389 159166 4423 43107 156453 93258
113 93258 -118092 -225103 -117319 -33055 -69744 -28176 89599 110210 70348 92442 135406
124 135406 41610 -136094 -150030 -52388 -53505 -83018 -25206 55910 86628 81156 103232 100528
136 100528 -16933 -109072 -68584 -37834 -79490 -89160 -7769 78666 65075 47083 116331 110084
148 110084 -35511 -119885 -50163 18861 -59619 -151253 -47754 107386 102075 39297 39813 45922
160 45922 10486 -27959 -29168 -49006 -109697 -81736 38775 87093 34148 -830 50166 101295
172 101295 33022 -67030 -70957 -48061 -50776 -30787 1259 8977 6382 49292 111742 60901
184 60901 -57289 -59056 15591 7638 -73610 -94426 -3466 69090 41762 21447 40049 29494
196 29494 4679 -5202 -14222 -45346 -83815 -48137 37818 41091 -8611 3461 58531 67933 6321
209 6321 -37938 -19414 -23883 -48244 -20058 9007 941 2535 31992 60237 33070 -21614 -17149
222 -17149 592 -29344 -49800 -28830 5546 14581 -2410 21328 59433 29704 -12883 -8969
234 -8969 -1512 -16295 -39071 -29002 7391 3058 -3754 33240 41514 7900 -8479 -1705 3916
247 3916 -22185 -48496 -17736 11833 505 3005 20570 31495 25310 -651 -3664 2027 -24727
260 -24727 -30021 -5731 -2859 -9166 -1229 23957 38111 4201 -16748 8582 6728 -20837 -27363
273 -27363 -18413 -467 6505 4159 20317 19414 2650 11266 13736 -6396 -23585 -27520 -4123 10247
287 10247 -12072 -10470 18367 21942 11756 553 -2786 -275 -13884 -15060 203 -9390 -12774
300 -12774 11623 22045 15183 2272 -1689 12398 4095 -19785 -17346 -8819 -5158 24 -1362 7028
314 7028 13280 2823 7604 11688 -7767 -15223 -7599 -869 -256 -9729 -612 18269 10419 2577 7863
329 7863 2003 -3884 -7767 -11042 -4936 -7616 -9355 5716 9426 4762 5523 3829 6427 1940 -11158
344 -11158 -5792 87 -6837 -3370 4091 7197 7244 1064 4860 8265 -6043 -9998 -3990 -7265 -5481
359 -5481 -1947 -236 5550 3811 3795 10805 3969 -3964 -4446 -4332 706 -1404 -8685 495 7225 3690
375 3690 5797 3096 -1639 -2372 -4438 -1728 -2819 -11062 -3749 5446 3034 4629 4249 2529 5340 423
391 423 -2227 -896 -5893 -4421 -82 -851 2868 2121 134 5823 1701 -5607 -1766 -1300 -2986 -4496
407 -4496 -6461 2725 7329 2070 3965 2430 319 5058 1068 -4876 -3969 -4987 -1461 2972 -62
422 -62 1204 530 -2507 4193 3872 -2628 -3727 -7839 -3304 7187 2900 -2567 -1479 1803 9213 6138
438 6138 -3655 -1646 -3465 -5590 1871 1330 -1584 -2688 -6477 2450 11660 3682 -5532 -9587 -3279
453 -3279 10563 4474 -7922 -5385 -718 7067 10765 800 -3202 -2178 -3367 2968 4157 -3166 -6883
468 -6883 -10248 -592 15085 6452 -8532 -9319 -586 12186 8284 -8778 -9334 -1848 4736 9217 1909
483 1909 -3285 -854 -4339 1770 11005 1506 -10987 -13476 -2840 15035 8840 -10610 -12042 -438
497 -438 13146 13550 -6109 -12828 -1712 3823 7142 4446 -4655 -5436 -3726 3553 14130 3868 -12811
512 -12811 -12911 -1401 14361 10051 -14079 -16213 2808 13951 10454 -5355 -10919 1154 4862
525 4862 3326 3818 -3090 -6142 -3530 1164 10758 6464 -10186 -11032 714 11095 7430 -10999 -13683
540 -13683 2083 9090 6025 -1203 -6922 223 5173 1948 3306 792 -4954 -5288 -1269 8139 8425
555 8425 -8388 -11896 1868 9873 6489 -7784 -12591 1490 7942 1843 -2251 -3278 1347 3169
569 3169 -299 3570 4250 -4132 -4927 193 4661 4282 -5588 -7692 1564 5171 3173 -2969 -6831 849
585 849 4987 -549 -1671 -806 403 2007 -486 1210 5388 -231 -3804 -1368 2575 4764 -2652 -8597
601 -8597 803 5703 225 -3924 -3097 2253 3721 -2642 -1900 1786 20 531 -433 -191 3291 -19
617 -19 -1275 2309 449 -756 -497 -2129 1144 463 -3602 -1294 300 964 2545 -2527 -3700 2821
633 2821 3787 935 -2965 -3292 4399 4554 -1862 -1275 -32 46 1744 -1014 -832 327 -3719 -1751 2724
650 2724 527 -1315 -2681 -762 4650 989 -2144 668 -163 743 2604 -176 -200 -435 -1114 2083 1234
667 1234 -2234 63 -846 -2034 975 -117 -381 -403 -2990 1533 3863 -602 -1273 -781 690 3182 -578
684 -578 -1669 1642 -1293 -876 2435 -482 -1180 -1363 -1587 2296 -65 -3233 139 -37 -182 1792 -577
701 -577 727 1246 -1377 1651 2158 -1455 150 344 -161 1086 -1333 -511 1383 -2211 -965 1993 -805
718 -805 -1070 -1024 -491 2608 176 -1565 1688 361 47 2077 -346 -245 294 -1298 1549 471 -2863
735 -2863 -388 292 -49 159 -2039 -370 1976 -1324 -491 1220 -993 277 1555 330 821 -263
751 -263 -419 2415 -111 -1252 238 -581 556 -171 -2306 126 303 -1353 934 61 -1101 492 -265
768 -265 1094 1043 -1746 626 1897 -444 124 291 -69 799 -1090 -768 856 -1533 -897 262 -868
785 -868 -165 -110 -972 1385 463 -1105 1236 540 53 440 -328 1160 538 -1679 723 1010 -1570 2
803 2 -292 -784 486 -1255 -388 713 -1115 212 1130 -576 20 233 182 1950 -248 -688 1209 -248
821 -248 -22 421 -891 414 -346 -1381 1082 -118 -1649 230 -28 -54 406 -649 760 1365 -588
838 -588 594 1014 -483 621 -428 -192 1153 -919 -723 563 -1130 -484 487 -467 -149 -976 -955 1429
856 1429 356 -1007 961 173 626 1284 -206 470 273 -1196 1361 802 -1424 -337 -953 12 829
873 829 -1028 -725 463 -1223 273 972 -364 70 -740 212 2323 -84 -860 879 -494 -25 693
890 693 -408 289 -940 -1632 1252 762 -1448 -890 -1072 519 2155 -629 -580 734 -700 1174 1572
907 1572 -664 262 -686 -33 1900 -208 -913 -205 -1464 124 1690 -686 -994 -1405 -421 2744 230
924 230 -2138 244 481 1182 1165 -865 539 709 -1749 899 1739 -850 -1546 -1983 802 2525 -1465
941 -1465 -2500 -30 -15 1184 1191 -1423 -262 74 162 2204 291 -1276 504 -588 926 1567 -764
958 -764 -934 -1479 -780 2484 364 -3234 -1151 950 1754 473 -2474 -207 2201 -678 -57 1483 556
975 556 -380 -1170 482 2833 -479 -2869 -262 508 1337 -372 -2419 71 602 -469 859 -101 -1303
992 -1303 759 566 690 870 -247 388 300 -905 1462 1313 -1826 -1577 360 1389 466 -2862 -1464
1009 -1464 1820 173 -1000 -762 529 1549 -905 -1117 2240 1000 -1514 -706 789 1744 -159 -2181
1025 -2181 264 869 -884 -130 -551 -891 387 -33 168 482 -445 488 1183 -835 461 1111 250 -273
1043 -273 -670 945 1812 -1444 -1584 1213 772 -840 -1410 -203 1734 -461 -2254 695 1458 -490 -873
1060 -873 -149 1462 1296 -1043 374 1195 -292 -334 -189 229 352 -1155 -445 1024 -678 -854 537 -782
1078 -782 -495 273 758 512 -1362 -23 2398 518 -1109 126 782 897 -306 -1238 1198 326 -1944
1095 -1944 -335 849 -203 -574 -1626 844 1538 -1280 -353 986 298 -18 72 341 1186 -1015 -772
1112 -772 1930 18 -1083 81 -142 -28 -256 -1060 787 -302 -1690 785 978 -433 -389 -197 1433
1129 1433 617 -1737 229 1378 -765 -401 561 220 408 -1434 -251 1500 -893 -1325 220 48 404
1146 404 -424 -511 1167 -427 -1238 1341 958 -476 224 52 1057 278 -1305 417 671 -1112 -416 578
1164 578 -124 -110 -1218 513 1064 -929 -330 1075 390 -57 -386 148 1306 -661 -769 1299 38 -1158
1182 -1158 327 36 370 -266 -1482 946 188 -1291 33 579 65 -306 -506 882 948 -1227 -44
1199 -44 1095 -258 -380 -213 464 652 -1160 -574 795 -394 -996 482 28 20 -611 -413 976 73 -999
1218 -999 690 843 -15 -58 -195 693 255 -959 306 852 -705 -127 -342 100 224 -1248 -209 763
1236 763 -663 -344 710 358 230 -329 164 1308 -524 -1102 738 466 -335 -173 -310 469 -430 -1091
1254 -1091 236 259 -950 159 265 209 258 -730 585 821 -508 -17 709 110 1 -208 343 559 -985
1273 -985 -631 768 -222 -660 -289 -40 515 -268 -502 927 265 -646 476 317 264 62 -342 780 356
1292 356 -912 217 93 -210 -163 -537 -89 594 -909 109 835 -253 -104 702 55 280 -114 -283 1023
1311 1023 -107 -338 400 -101 -77 -254 -708 457 233 -1172 327 145 -360 55 -330 251 328 -806 519
1330 519 1051 -678 61 537 57 183 -34 -250 633 -530 -515 446 -285 -266 -186 -470 393 -52 -358 771
1350 771 -36 -306 591 48 387 218 -757 373 735 -686 3 328 -408 24 -418 -55 25 -713 -361 644
1370 644 -284 -289 192 -287 574 35 -348 733 -231 -386 677 114 -235 -5 -655 500 345 -1024 66
1389 66 94 -309 -166 -589 -307 244 -231 336 893 -118 230 41 -141 482 161 -263 166 -546 -632 165 -223
1410 -223 -436 -156 -113 444 -150 -573 128 139 -110 38 -63 197 304 -395 364 491 -499 -292 41 -218 518
1431 518 -757 -506 429 -266 -217 31 58 383 373 -105 438 104 21 606 -77 -79 533 7 -366 68 -189 84
1453 84 7 -833 340 16 -447 -165 -310 85 721 -445 -46 731 218 159 -140 16 599 -23 -633 553
1473 553 41 -33 114 -282 136 -50 -721 26 -240 -264 421 -288 -34 388 83 -126 247 -267 255 113 -281
1494 -281 2 144 -247 -41 -568 180 456 -597 -381 562 -8 -104 -164 -182 696 119 -336 277 218 -79 250
1515 250 -210 334 195 -529 -126 79 -140 220 -371 -190 517 -214 -154 122 -503 184 435 -74 62 288
1535 288 146 197 -273 -375 460 -139 -405 121 -27 -37 -305 -646 258 424 -466 186 219 266 72 -154 231
1556 231 661 -367 336 411 -348 45 -152 -350 418 -178 -365 434 -350 -202 362 -281 118 204 -448 436
1576 436 169 -92 596 166 -129 259 2 -49 216 -745 378 402 -637 -84 -27 -433 283 -287 -304 424 -329
1597 -329 -131 70 -69 120 -164 -459 512 117 -351 64 -118 -73 137 -307 -58 -125 -256 355 106 -611 186
1618 186 -77 -173 214 16 292 648 -205 -90 374 -251 -148 -118 -6 231 -592 -280 85 167 -530 170 39
1639 39 153 38 -368 548 104 -190 101 128 -121 15 -246 334 269 -612 -87 378 -385 -107 -269 -105 246
1660 246 -279 -153 612 -466 -200 261 38 155 205 106 533 -52 -421 469 -1 -185 -5 -299 186 57
1680 57 -493 279 205 -145 -125 -93 151 390 -325 169 418 180 366 69 -22 38 -91 -204 161 -300 -100 333
1702 333 -193 -141 -154 8 184 -248 -149 219 210 -128 25 148 -168 49 -518 28 417 -310 -196 50 -95 155
1724 155 -119 -21 309 -256 -470 308 -190 -20 -1 -55 353 -75 110 172 80 -207 121 -147 37 216 -254 -73
1746 -73 88 -537 59 104 -257 5 159 39 407 -422 215 360 63 -1 -141 137 90 52 -212 588 -162 -497
1768 -497 383 -19 160 -16 -316 16 122 -242 294 305 -17 231 -22 187 137 -123 -142 542 -361 28 205
1789 205 -66 114 -282 -142 482 -251 -134 5 -104 100 3 49 353 66 -98 360 -240 -454 399 -134 -62
1810 -62 -81 -429 156 140 -289 -40 99 -113 -31 -243 -151 408 49 161 392 -322 -144 218 -331 319 -24 -291
1832 -291 305 -116 -143 141 -372 -355 6 -184 149 178 -245 103 67 -139 134 -168 163 359 -206 154 77 -11
1854 -11 221 206 102 -92 200 -163 87 -243 -143 530 81 -153 135 15 239 377 -112 639 -86 -493 -24
1875 -24 -177 251 -188 -146 97 188 -341 -227 46 -234 -122 -156 -128 456 -214 262 230 -107 2 152 -153 173
1897 173 254 -160 276 -327 -178 39 -207 115 -52 -188 158 160 -77 353 13 -345 195 228 260 361 -306 -98
1919 -98 75 -225 -167 -302 -31 -345 -218 84 415 -169 -142 150 -267 469 236 -39 191 345 132 222 -16
1940 -16 44 -81 -175 -58 -161 -187 0 182 -591 52 -51 -56 212 -41 -164 480 -83 -167 242 139 -25 -51 -284
1963 -284 160 77 -287 80 355 -97 11 -30 -53 -14 -267 -18 52 -142 52 -93 129 229 57 -171 392 -245
1985 -245 -109 273 -168 348 -220 -210 -45 -404 -161 197 -286 -331 121 142 347 343 94 193 171 95 287 140 -3
2008 -3 338 -254 42 8 -257 207 258 -460 52 114 -89 179 37 -82 59 -380 -106 316 -413 140 -57 -97
2030 -97 384 -76 -152 236 -237 -253 48 -135 24 57 -282 -115 137 -34 122 115 270 235 -182 333 61 -166
2052 -166 123 126 -238 241 70 -91 -154 -135 -282 -68 -304 -117 177 -179 301 79 -2 107 244 277 374 280 -60
2075 -60 85 -35 26 95 -37 107 399 -69 233 -112 2 113 -172 -124 157 236 84 250 -131 76 -53 -298
2097 -298 155 147 -60 226 -131 146 331 -5 26 -6 -204 -229 11 -122 1 105 -217 270 -195 -193 261 -255
2119 -255 -174 178 -24 284 -140 88 264 171 -259 255 -147 123 -80 -63 75 127 -35 292 339 -140 175 -18
2141 -18 -154 85 -247 -153 63 -273 224 -77 -204 132 -203 -173 14 -210 -40 276 199 31 59 -95 293 185
2163 185 -86 -26 11 -27 -55 -256 -99 333 -91 25 -159 -223 118 66 -49 120 -285 70 187 342 134 260
2185 260 -173 121 172 -263 284 -63 -182 69 -97 -370 51 16 -88 222 -287 6 -76 -194 32 -38 111
2206 111 51 -8 287 213 -41 -89 -24 -139 -361 -256 -10 194 -202 -82 274 -206 -31 135 -201 123 33 14
2228 14 303 -21 -272 -190 -208 -106 189 -96 179 254 3 -115 -135 -353 11 159 -46 -35 192 6 276 72
2250 72 -135 -19 -44 -98 193 -128 164 -48 -375 288 -127 -182 -104 -224 187 -4 -178 103 80 -146 201 259
2272 259 89 106 -61 52 61 8 -106 -105 -297 133 193 183 415 -367 139 -180 143 -34 47 46 135 130 -129 251 290
2297 290 -105 103 -188 -61 73 -119 265 157 -291 171 117 71 -16 -189 -232 208 56 -27 23 -224 55 194
2319 194 -75 157 173 -180 108 24 112 138 -178 -65 7 184 141 -300 -273 151 143 -178 0 124 -41 99 -47
2342 -47 -108 93 -266 -51 260 -193 22 -56 -173 107 -20 -193 309 129 3 -84 44 -357 -102 -175 185 55
2364 55 -290 192 190 -276 -12 -180 -44 44 -301 51 -327 16 138 288 27 99 -106 -83 -22 -188 -278 -222 -223 -172
2388 -172 0 75 162 370 33 -214 -291 -132 33 -246 46 -69 33 -39 102 -284 -82 58 -137 254 -45
2409 -45 41 87 -50 -128 -103 -157 24 62 1 434 -277 -53 -136 -90 -30 8 -61 24 235 -90 182 35 0 208 -68
2434 -68 -27 19 44 323 114 -92 -23 20 -22 -23 327 99 212 26 -19 7 112 -119 8 14 41 139 -190 333 -28
2459 -28 124 226 -227 -120 75 145 -135 313 -358 171 148 -80 11 137 -116 -22 162 105 -3 1 193 -213 65
2482 65 -63 -42 -249 196 140 -153 -85 -185 -176 -206 -225 -65 217 300 35 241 -28 -116 -23 -39 -18 -226 66 137 -66
2507 -66 88 -10 52 142 -176 -275 2 7 192 87 -65 115 257 1 127 -81 -53 -66 31 -59 -84 -112 20 118 -39
2532 -39 -241 -138 -178 -145 159 -177 184 -36 310 178 -76 169 -34 -95 -47 -290 -161 -35 -26 150 -32 -27 -34 52
2556 52 -65 -49 145 199 -9 85 -74 -16 117 -130 485 -11 -28 204 -195 -15 -152 -11 95 94 -285 4 -220
2579 -220 62 98 43 -30 214 -7 -123 -123 9 30 99 336 14 26 151 -28 54 91 -6 151 30 83 -27 74
2603 74 -45 235 -108 -91 -45 -61 -1 33 1 37 -115 -45 -36 253 60 -242 -39 -91 -269 203 18 -91 66 -230
2627 -230 -136 -201 259 213 57 23 -2 117 -49 -66 51 160 266 47 182 -314 -39 140 -210 147 116 29 38
2650 38 69 7 31 -81 4 67 463 -105 -15 81 -40 13 -234 -148 218 -166 141 22 -14 -27 111 121 -100 106
2674 106 -152 147 -186 86 377 28 -65 -42 -146 333 134 75 319 -246 -32 -101 232 -204 176 44 -114
2695 -114 -28 -21 5 -150 -14 -85 -74 -55 44 -12 -149 153 105 302 124 -85 -41 -63 -14 69 -270 5 -39 -287 -24
2720 -24 -30 -102 -32 15 83 124 48 -129 -70 -224 -185 145 -32 -234 143 -105 117 98 42 -98 -259 -80 22 320
2744 320 26 15 -82 175 58 -328 115 -215 -252 15 -326 -47 44 -91 0 -212 134 0 -8 114 -123 20
2766 20 15 82 -129 289 -14 -123 -42 -91 43 41 -29 19 3 68 23 141 5 -98 -95 -20 125 45 97 206 201 100 -43
2793 -43 -311 -58 32 12 -113 39 20 -9 -82 100 -247 96 15 3 -188 75 293 -169 -119 294 -68 -113 -103 23
2817 23 158 66 39 -55 -206 109 9 -55 -114 -71 39 -102 60 -200 262 -159 -120 120 -33 233 196 -212 -166
2840 -166 5 -42 28 102 8 -122 -161 -141 -204 214 -44 -125 -183 -89 110 36 346 -78 88 109 -165 -50 73 -14
2864 -14 155 -209 -2 233 -182 -285 58 -85 -18 91 -131 -67 229 -48 35 -182 -246 132 -40 -142 54 -21
2886 -21 -296 -35 121 194 140 -97 -137 150 -53 -54 203 -158 410 164 151 8 11 -211 83 -34 148 -185 87
2909 87 8 26 -90 116 -122 -429 147 -57 -141 -55 -247 169 149 41 -67 29 -192 59 69 148 234 37 199
2932 199 94 -4 -212 -95 -28 102 92 -11 -32 -90 79 104 -201 -40 31 214 123 138 -59 24 -91 -276 -202 111
2956 111 99 -71 -15 -140 22 -2 386 41 -419 188 18 191 111 -219 128 -42 -76 248 61 -12 -135 1
2978 1 -68 -108 82 -14 -83 -246 -58 -61 49 137 -333 -199 245 21 66 198 -83 -6 -301 86 -196 -160 -40 44
3002 44 229 -162 25 -33 -4 26 133 -142 93 -45 32 -127 38 -67 -100 -95 -76 112 -89 22 -105 -93 46
3025 46 -21 -85 188 274 -188 35 -34 -10 412 47 -56 -117 27 127 124 -194 17 -215 372 168 -135 55 -77
3048 -77 -66 -71 240 -213 -137 79 89 97 -96 148 -12 -81 -201 88 113 88 127 -115 35 150 13 158 123 134 -77
3073 -77 46 111 -38 -209 54 72 156 152 -95 56 139 26 -32 78 35 -102 -125 -96 -40 -229 84 85 -192 14 -108
3098 -108 -253 -57 -265 36 204 40 85 20 -149 -10 -64 4 289 -131 -212 208 -178 19 -232 178 107 -160
3120 -160 -162 -58 236 -188 266 -240 -162 -82 -147 77 39 -213 41 128 -94 -89 -69 80 22 -9 25 113 -74 -32 -74
3145 -74 -11 176 96 168 138 101 129 -262 -43 146 200 -19 -55 -126 38 298 -24 4 -107 62 -20 218 -134 -396
3169 -396 -152 204 -368 1 16 -174 -205 -43 146 -100 282 -129 21 78 111 15 -117 -9 -99 11 -202 195
3191 195 -129 -139 -500 258 -98 -127 -162 -72 -199 23 95 -263 78 -142 -94 -175 -248 -85 -75 -51 -6 -109 -2 113
3215 113 -265 105 135 -42 12 191 -58 -106 -57 217 44 85 57 -82 139 -195 -139 -98 105 52 -30 58 -41 125
3239 125 113 -107 -179 -190 292 -16 -201 -204 -30 15 241 122 52 -6 62 -229 55 -54 -120 260 -38 -24 -67 -50
3263 -50 -63 52 222 4 57 171 -51 -68 -78 62 101 -236 63 -28 -103 90 12 -79 47 138 3 2 81 146 111
3288 111 -26 -128 -108 -154 330 -19 119 35 -124 118 173 -217 -13 -19 -103 -73 66 -236 97 -212 41 148 -230
3311 -230 -302 166 3 123 -58 111 -93 16 -56 72 114 180 265 -155 116 -110 36 86 80 -247 -148 63 -316
3334 -316 55 84 -35 62 -26 -114 -155 235 76 -198 -154 -134 2 3 -43 -44 -58 -127 182 101 -40 157 74 -100 -113 170
3360 170 73 -100 -8 -42 124 163 -198 179 -97 100 -193 -18 18 -31 137 35 202 -61 100 -129 -294 307
3382 307 -103 142 -170 -25 -19 365 193 14 45 -176 -194 -54 37 -102 81 -68 -14 -111 89 67 95 69 64 90
3406 90 -136 87 127 334 248 118 272 39 71 225 44 -96 58 114 245 -31 150 110 73 129 -124 -77 -148
3429 -148 -99 -171 -17 107 214 11 202 -104 -7 80 136 174 -73 -359 -109 61 291 223 -191 -155 67 16 -31
3452 -31 163 -124 182 17 141 -37 145 -9 17 128 54 -117 -163 -39 -120 -364 -205 -44 157 128 -159 137
3474 137 -223 -161 -84 -162 -114 150 47 131 -39 -27 65 -32 20 64 -226 -265 245 216 -150 117 40 -52 -9 153 126
3499 126 -83 -182 125 -43 -110 103 -251 -118 -86 -98 -250 0 -257 378 -181 23 93 -40 -134 -99 20 -76 131
3522 131 -100 -121 -13 -34 -249 -45 -338 146 -406 22 -83 -70 -136 -88 142 47 -1 -6 -258 -75 46 20 276
3545 276 -97 -84 8 -24 227 -166 8 -248 -149 -184 60 -41 -7 -103 -98 -22 74 155 175 84 50 -86 -103 142 -354
3570 -354 84 -6 70 85 -23 -34 6 -34 220 -40 -227 181 19 -72 -42 227 108 107 -194 -149 65 -167 63 258
3594 258 45 -30 261 -239 334 -70 -45 -114 189 -11 173 -434 -186 280 -112 -2 90 -147 125 14 137
3615 137 69 43 95 -118 -131 21 -66 -52 -93 -82 -319 -101 -89 -22 -106 10 -27 -324 99 -4 -203 -13 -145 16
3639 16 86 -108 114 83 178 99 -87 -243 40 272 130 -53 6 37 19 -76 139 -27 36 -222 124 179 94 25
3663 25 68 -88 -70 -142 -16 50 -115 102 -55 30 -321 83 -177 -30 200 -151 -157 210 -131 108 -10 -72 184
3686 184 -88 -192 -150 -136 -244 -91 -5 110 -169 -43 132 83 -142 -104 -80 88 126 144 159 -44 18 -138 91
3709 91 159 -108 -1 300 177 133 15 -144 137 220 -102 -34 67 -108 -199 -64 49 20 72 -31 182 -20 -159
3732 -159 288 -22 287 -179 -53 -61 -49 -243 101 97 41 74 91 166 234 -10 -160 239 -18 -15 249 -103 -88 98
3756 98 37 47 -48 -193 -151 -18 266 -85 -46 74 106 -186 57 14 -106 -162 29 -150 -129 94 80 193 -78 17
3780 17 245 41 109 17 65 -141 -78 176 201 -110 114 -11 339 123 13 111 -183 -143 28 153 -247 66 156
3803 156 -16 -86 -186 13 9 -50 -105 -17 150 -181 6 -31 3 74 32 -83 30 -33 64 6 77 103 24 146 131 56
3829 56 120 241 185 34 -43 263 144 101 43 -187 -126 -119 -26 42 -272 -3 144 106 -113 -239 59 -86 -151 319
3853 319 -160 138 46 -90 -27 -70 -79 26 68 -159 67 -48 83 -4 151 64 -23 -115 37 -117 181 -17 69 -109
3877 -109 102 -94 -60 262 44 100 2 -93 200 284 100 344 85 -162 39 -48 236 15 -308 -267 35 -50 -131
3900 -131 13 41 -124 167 -312 33 -39 181 -161 2 -66 -193 2 -138 -1 30 148 -118 84 201 127 -207
3922 -207 -64 23 14 7 82 106 40 -140 37 -43 -270 55 -156 194 5 136 -211 30 76 -91 33 13 107 -279
3946 -279 196 33 73 -127 -243 51 270 5 407 114 188 -53 -58 -65 -47 143 257 -91 -156 164 -219 -36 -63
3969 -63 -54 134 -14 -26 89 50 -15 -103 -6 -117 25 83 -1 105 -19 35 147 124 -55 267 -143 62 88 -145
3993 -145 -95 337 -73 127 -9 48 8 -243 -166 -36 102 177 -171 171 20 -173 69 -16 1 -179 135 86 136
4016 136 242 69 201 123 -65 54 140 18 217 48 -62 371 -64 88 55 62 -39 -51 -101 21 -25 -100 -196
4039 -196 167 -169 -81 128 -191 -74 -180 -1 173 210 -116 -182 121 228 -256 -263 -150 189 -9 -290 -140 -64
4061 -64 -204 240 -89 76 25 184 111 -53 -118 -40 -59 42 -75 -108 -169 -50 -25 -179 -124 61 83 -97 238 -120
4085 -120 -135 -88 50 127 -178 -40 158 66 -96 -9 155 -160 -60 10 19 -56 -101 -180 -203 -3 174 373 16 -211
4109 -211 243 -99 145 -112 168 43 33 237 21 -131 -15 153 40 -93 172 138 -74 18 -25 61 -214 111
4131 111 89 214 92 -66 158 31 -36 -20 -35 -93 -366 -219 -37 -96 41 19 -307 35 -46 -88 36 65 31 -265
4155 -265 -68 -106 -75 296 57 107 -15 -121 8 102 76 -209 167 -57 -31 -147 -2 -84 -55 -17 7 -30 152 158
4179 158 -57 -58 -131 41 138 27 -216 221 67 -44 -220 17 77 -2 -118 -65 -402 108 41 -87 190 -10 -144
4202 -144 -57 20 148 -165 -176 395 63 -14 315 50 198 348 87 -265 -129 120 -37 159 58 5 14 -15 -51
4225 -51 311 -19 -71 -212 138 -30 -144 -49 -137 -14 -48 -79 -156 -52 231 82 -151 154 1 115 83 -160 -96
4248 -96 300 -112 22 -43 51 -78 -125 11 118 10 -351 -18 109 -108 -27 263 213 306 51 86 85 -148 -48
4271 -48 110 -118 -89 -19 -312 37 -138 -190 203 -27 -74 -172 -78 -13 -20 216 17 63 -112 169 99 -144 316 0
4295 0 167 246 171 85 -101 275 6 101 -59 -16 39 -174 134 -52 133 -194 -228 -100 192 215 71 -54 -18 61
4319 61 -95 -109 76 -140 -115 -11 41 -116 -185 350 57 235 -80 -44 -105 -16 -127 9 24 -43 14 92 -39 -119
4343 -119 187 -67 -140 40 154 -113 -85 183 18 -19 -94 -120 1 -219 -85 18 -23 -308 -85 -14 -49 -24 249
4366 249 140 -48 -58 68 68 -24 -183 -89 -27 -52 -109 96 63 155 -95 45 -19 -85 -169 -120 13 66 31 -116 95
4391 95 -123 -225 224 320 287 -40 -31 158 -138 -24 -27 88 103 153 7 298 -78 -99 -233 137 154 -118 221 -35
4415 -35 -51 81 -17 -82 -1 -43 155 69 -48 -24 -65 -47 -192 82 43 -101 -21 74 286 237 44 204 65 -253 -30
4440 -30 -135 -20 2 -270 152 -60 196 209 30 202 60 39 294 32 -117 189 122 -379 -14 -4 -47 297
4462 297 -72 -2 209 184 -131 149 75 -139 99 -39 -258 -87 -26 -2 -114 -56 198 59 19 -13 -234 12 -229
4485 -229 -114 138 173 60 -154 -287 23 -24 -109 -19 42 -135 361 12 50 175 -99 208 290 -147 190 71
4507 71 148 -108 -271 112 168 -10 -3 123 55 75 -108 130 42 42 242 -99 -253 -151 110 97 4 -276 28 -86
4531 -86 -182 64 -14 -274 -96 26 -79 139 -125 199 -142 -142 -92 -101 98 114 6 -191 -1 -31 97 -89 267
4554 267 -16 -40 -3 94 430 -124 16 -150 -168 -37 131 -75 -53 120 78 102 42 21 57 -2 51 17 -232 132
4578 132 -117 -227 -36 -42 108 -54 316 100 345 -55 -144 105 -226 -131 -220 -16 -263 154 30 48 -55 55
4600 55 -268 25 107 39 73 8 -137 -164 10 -271 124 -63 -45 -62 -82 139 -59 -37 168 -347 -189 165 187 -13
4624 -13 -127 270 241 117 -106 42 82 201 109 3 -81 69 13 98 -155 -82 -146 107 40 -101 194 52 164
4647 164 -66 56 86 -17 -40 -209 -116 -48 -81 99 16 -79 -168 -72 -55 -49 -159 35 -140 45 321 112 -71 112
4671 112 41 33 118 22 7 -170 -77 -32 97 -181 -6 -55 301 103 14 -180 120 -74 155 -30 206 -28 66 3
4695 3 14 5 215 -8 88 309 123 73 128 24 -135 26 -272 -155 231 178 200 65 -173 -108 25 220 62 -54
4719 -54 -75 24 106 184 53 -262 84 -107 31 -79 102 39 -33 146 254 -50 -115 -50 -108 10 117 -95 49
4742 49 131 -26 35 -28 43 -8 136 -90 79 68 89 115 22 -78 73 -316 -9 -104 25 -23 15 -82 40 145 177
4767 177 114 -41 -123 -67 -309 -60 -73 99 19 215 -84 184 67 95 283 169 150 100 158 -21 200 -46 -188
4790 -188 -78 -48 -50 188 -3 61 58 -73 151 64 -142 88 -271 123 47 -106 123 119 -17 -228 45 235 3
4813 3 -39 300 143 114 -32 -15 168 82 101 -72 -336 33 309 -108 -138 182 51 -153 40 216 75 -161 -117
4836 -117 -26 -90 -250 -419 -247 323 98 127 -167 -128 100 -117 -196 -27 8 120 83 107 40 29 75 -38 10 32
4860 32 -148 16 160 2 -18 366 -99 324 -17 -163 83 51 132 148 -173 -165 78 90 -18 37 250 -240 -95
4883 -95 139 180 75 -59 -122 -42 3 -138 -127 216 6 -23 -102 2 -103 -79 -3 71 314 -94 -117 -30 135 -61
4907 -61 -103 -125 28 28 297 71 -217 5 150 -13 130 104 -346 -19 -27 47 -32 -93 179 101 106 34 -131 121 -10
4932 -10 87 180 -166 -114 -93 56 -141 85 8 81 177 142 -91 -72 213 -38 197 -229 -147 -11 204 -263 -90 62
4956 62 17 312 43 -167 -175 27 -81 88 19 -19 -114 -119 2 -297 256 -102 80 -53 4 -36 -155 10 130 -74
4980 -74 -72 -104 89 197 -34 -265 29 -66 415 -266 -43 -55 78 64 -65 -55 40 141 128 137 -47 -10 -40 111 443
5005 443 -73 -56 119 -248 -111 277 121 -140 234 -261 -150 -155 -183 129 47 6 -198 -24 -82 195 -149 -54 154
5028 154 -378 106 -197 70 -67 -64 -20 -81 -116 20 85 41 -34 -315 4 311 -15 -418 -62 46 36 74 101 -174
5052 -174 -26 20 90 73 -231 52 -32 -31 242 143 -39 -73 211 21 -181 68 -21 13 -80 4 121 17 43 -219
5076 -219 -108 -62 -106 190 -196 -172 100 201 55 -203 -80 122 295 -141 -1 -153 265 -144 82 106 -110
5097 -110 130 81 262 -61 -27 123 32 -37 282 93 -206 289 -22 -1 -49 -94 227 -85 242 139 57 -381 72
5120 72 197 227 -31 -215 5 4 48 84 -132 -66 -147 -112 -268 179 143 29 -115 -100 -164 73 135 29 -82 272
5144 272 116 49 123 84 23 196 -25 -70 66 122 72 -50 111 -228 166 -6 14 -84 218 163 -265 250 97
5167 97 -65 -163 108 -137 -61 -63 95 -88 -345 -116 9 -79 59 -16 29 6 51 443 115 137 -20 -43 -42 105 24
5192 24 -23 -221 139 -159 -88 2 134 314 133 51 -275 -62 224 -158 65 238 -208 -1 -93 76 158 205 -200
5215 -200 -13 -105 111 108 -108 260 86 -8 41 -119 3 61 -219 63 -28 25 43 3 220 -69 62 21 15 -117
5239 -117 9 -3 -30 -75 -44 175 57 190 -128 -41 107 -61 -313 -55 -84 -166 -98 -12 76 24 130 10 132 85
5263 85 118 17 3 8 56 -43 -229 -79 163 -66 110 8 94 68 123 -209 218 5 72 246 311 114 100 29 -175
5288 -175 -114 -50 -109 -61 59 -434 114 -88 95 -100 -21 -9 -84 -281 69 -194 -91 -49 155 288 -155 -127 -239
5311 -239 -84 5 -45 -122 76 64 123 143 303 -261 15 -262 -178 -136 -295 24 126 -125 -206 -138 252 -136 -229 -19
5335 -19 169 -76 -162 -6 24 -32 -46 325 19 -273 46 -122 149 31 107 204 -98 -15 44 64 -49 -242 122
5358 122 -99 67 -45 -35 58 28 -101 89 -103 -203 -54 109 -57 -6 -113 -17 158 130 -286 -76 250 -65
5380 -65 237 174 -109 -28 -166 154 103 -187 -25 -56 195 58 200 137 125 163 151 -175 1 -96 -268 110 40 -169
5404 -169 175 -231 -134 131 136 -22 -1 107 -88 -44 66 13 -26 -33 -49 101 -31 -23 187 -39 -24 -119 70 20 133
5429 133 -32 -55 -163 -34 121 166 -145 -7 120 -11 293 -115 -50 -32 274 80 -139 -164 31 -111 100 -10
5451 -10 92 23 165 16 -233 -113 226 -121 -45 95 6 -104 -136 -123 -165 -51 -114 -112 -13 -65 -272 -39 -223 225
5475 225 19 -167 65 -144 110 94 -137 -17 53 107 -71 -11 137 -35 -129 232 104 56 64 -120 94 96 -37
5498 -37 -4 181 -69 -89 -333 114 -69 35 -301 220 -33 -257 28 132 64 30 -189 -208 205 69 120 116 90
5521 90 -186 202 169 61 77 -52 11 91 199 -111 30 -104 -202 -6 167 135 -168 -32 -37 -77 -7 26 112 170 -125
5546 -125 57 269 -40 39 -296 -99 21 25 -17 -1 -11 111 65 -11 45 -6 -36 -16 -66 -226 203 133 104 -77 -8
5571 -8 331 -119 43 157 310 -68 -180 -29 30 -307 202 -245 -127 -84 278 136 -23 -94 160 -3 -180 102
5593 102 31 46 120 -34 226 76 148 177 -59 -114 -39 131 -52 179 129 -73 -106 217 -91 64 -51 223 21
5616 21 -2 -45 -78 244 45 -235 59 -46 -108 -41 -116 70 -140 -12 -251 187 65 -138 32 44 -12 -143 124
5639 124 80 -299 57 34 -145 135 -29 13 -201 -247 115 -128 -175 40 -107 -35 24 339 -208 50 48 112 -85
5662 -85 -17 -37 -267 -150 35 -68 -58 -38 83 163 -20 -155 226 -240 104 -36 -427 -16 -70 -42 -69 -36 214
5685 214 18 334 -64 -229 93 -50 45 -64 92 88 -106 152 32 173 -144 105 118 90 -296 37 157 -159
5707 -159 -191 -218 133 5 -9 150 221 15 -164 -230 0 80 67 -110 -13 -233 268 -86 91 -5 34 136 107 240
5731 240 -32 105 -320 274 -112 244 107 157 154 -50 -152 44 21 259 -112 8 145 -79 -115 -109 -13 -244 189
5754 189 113 -76 -75 -140 -145 -16 18 -32 -51 115 149 207 -136 -4 74 63 122 79 131 117 16 -25 182 10 -112 35
5780 35 61 146 -239 41 -30 1 40 12 64 -313 133 148 -14 -235 -67 -86 98 -30 180 120 -199 41 26 -99
5804 -99 61 -361 -45 74 20 -203 -101 -48 116 -53 -28 122 128 -67 264 79 -19 345 221 -118 96 -71
5826 -71 79 25 191 82 -59 62 -132 1 -207 -12 -176 -29 135 -28 -49 -223 -162 -37 -55 -139 -95 95
5848 95 43 -27 -21 2 -269 67 66 254 -207 114 -73 -17 -207 -144 12 -354 112 -66 202 -42 -50 -35 -24 -44 -37 27
5874 27 89 -132 -21 451 -16 256 -4 -192 -136 -121 -28 -138 0 87 -180 -8 -149 89 -118 18 -208 -7
5896 -7 -330 -236 249 -156 -141 -62 -72 132 -21 108 182 122 81 -275 58 -322 -27 79 285 10 116 91 -214
5919 -214 170 374 -72 -135 43 258 79 -9 212 31 -3 -1 -138 -163 -72 -46 -148 198 291 -80 -37 -19 3 324
5943 324 133 -37 198 5 62 -73 119 198 91 48 81 -112 -246 276 -94 -275 361 95 332 -57 4 22
5965 22 -109 0 27 -22 -246 -98 186 -136 78 -123 -48 246 -107 -182 -127 -139 -21 198 -36 -51 -30 195 -118
5988 -118 180 2 126 -141 15 40 147 -49 105 -97 -87 114 111 -58 41 119 44 -73 -130 -37 47 78 228 -288
6012 -288 -66 73 3 178 36 347 139 -89 -99 -57 296 149 -144 -161 -277 24 -70 80 4 -120 -68 29 -287
6035 -287 -199 -17 -10 30 12 94 -49 -76 15 -244 -181 -227 132 -10 107 -141 -35 23 75 45 -169 34 -189 -13
6059 -13 40 -34 191 -142 -31 -60 -32 224 -120 189 180 225 -198 37 143 -163 27 -24 87 61 -94 111 77 209
6083 209 4 -149 -79 107 51 209 -131 -156 -185 348 141 190 -126 -95 -24 104 66 137 -98 -28 100 35 -113 -110
6107 -110 -262 -92 43 -111 310 -84 224 -104 -49 -165 -331 120 -66 -207 -163 299 -114 4 126 -147 0
6128 0 133 2 -206 158 20 175 253 -116 -198 2 100 312 15 125 -288 -36 35 202 121 37 -218 239 130
6151 130 38 188 258 -35 -136 206 -16 -14 2 53 31 -510 -16 -89 45 -131 -113 203 -232 25 -206 43 20
6174 20 191 -160 -147 -111 -99 111 -15 35 -195 132 217 -141 -65 -296 -19 -52 -58 -123 -13 -11 -27 78 144 -122 27
6199 27 -252 -1 -189 40 116 -108 212 -5 -22 -190 1 227 279 153 57 -38 -71 179 67 -39 -163 9
6221 9 -132 313 -10 -123 11 -159 15 61 94 -22 -55 1 105 12 -201 99 -63 -111 25 -108 148 -254 -37
6244 -37 82 126 337 85 -126 -120 -229 4 183 -69 234 185 -257 4 36 -291 -155 182 -228 -136 -220 97 142
6267 142 -66 -70 160 38 -127 -17 258 52 -18 8 -305 -231 -67 -114 -38 95 68 77 110 108 -302 -298 -182 -94 127
6292 127 -4 -15 -94 -3 -88 25 132 -246 -256 59 277 -162 59 -90 97 7 110 -270 131 199 187 198 57
6315 57 -40 143 -222 -186 239 97 -14 -3 219 -15 129 -21 229 0 146 -128 -136 -73 -223 43 43 47 -47 96
6339 96 -315 -213 20 -259 -165 -185 50 -172 -34 -239 55 74 -29 28 -61 121 243 -333 -65 59 96 185 65
6362 65 -105 -29 287 -134 -132 159 375 166 248 26 -81 43 -78 -51 -289 -339 42 -171 25 180 97 150 -239
6385 -239 42 35 -94 -35 -212 168 -179 285 -205 -61 2 -22 -48 -121 -28 -182 52 48 -150 -34 145 279 1
6408 1 -243 102 131 -83 229 245 -66 104 -182 190 56 106 -43 -103 104 -151 40 54 89 146 15 246 204
6431 204 3 101 295 137 -134 200 -63 -34 103 -209 165 -99 160 -126 216 13 -120 -111 -36 -96 -11 139
6453 139 93 154 -108 -118 39 -58 -73 32 -392 469 -78 83 -12 -211 -173 -225 82 -132 22 300 244 305 -141
6476 -141 110 -171 -72 -38 177 -130 131 -82 60 91 -33 -135 -36 11 -109 -127 -22 -253 -334 180 53 233
6498 233 -177 -101 -171 -28 -254 -160 -187 -182 331 -117 230 87 17 204 -89 15 102 80 391 5 -60 -22 -175 150
6522 150 -46 -239 -248 42 -133 -109 -145 -83 -53 47 329 265 -145 -64 23 86 -89 199 182 35 18 290 -53 -95
6546 -95 136 81 79 -85 40 43 161 53 -135 -69 -21 0 22 -134 -63 -192 211 21 344 -94 84 8 -58 232
6570 232 14 -150 9 -129 -170 159 -187 -170 296 -39 249 -43 42 207 227 98 -174 101 -109 -40 -60 -58 -102
6593 -102 -182 -360 89 -277 -212 -4 -134 59 -87 65 76 72 -126 -86 -25 304 -175 122 8 -221 321 23
6615 23 110 152 -40 102 246 51 243 230 212 74 -160 157 -176 79 -14 210 -76 192 138 -43 36 101 -11
6638 -11 -158 -1 -278 88 -61 -247 103 -168 -182 -78 148 31 215 -69 135 -85 -32 -66 105 221 -111
6659 -111 -81 -31 34 -117 -49 -99 55 61 -131 227 -80 22 -68 74 -31 90 -37 -40 -149 -69 55 -105 19 189
6683 189 53 -50 -218 -186 -33 19 132 261 -170 63 -43 -36 164 177 -105 29 148 -38 340 -88 69 -54
6705 -54 124 -23 -118 -20 -16 74 128 -162 -241 -150 111 -275 181 132 155 -85 51 53 -48 168 -187 172 -33 -36 19
6730 19 -324 -83 233 66 103 -201 207 134 -60 -66 -32 3 21 -123 -79 -56 -162 -156 2 11 -240 -29 50 -203 48
6755 48 277 -47 119 71 43 -192 66 383 -216 156 -46 51 53 -51 152 -69 96 -185 -85 59 -8 -59 -223
6778 -223 145 -2 24 -89 58 230 -50 201 14 105 71 92 -40 188 76 -329 1 -197 -24 -4 -355 -50
6800 -50 81 73 12 -37 -153 -161 -278 -2 117 95 -53 -16 -55 -20 -111 195 72 109 25 17 30 110 121 -277 163 14
6826 14 -254 -30 -11 -219 -9 -19 58 104 -222 -387 125 -99 -40 9 -83 -58 7 152 88 5 -133 -163 120 -45
6850 -45 -89 -285 59 29 102 -90 39 -54 -40 -119 -263 13 -2 -139 100 25 -155 18 56 -109 81 120 70 215
6874 215 68 -110 167 60 -19 -205 -135 107 -140 94 -134 -9 22 -1 46 -7 167 -170 128 162 -50 -161
6896 -161 -103 74 -210 -91 76 -25 71 -54 78 -457 -19 -88 -105 271 -129 114 109 -166 79 38 -68 32
6918 32 -19 11 10 97 31 143 -39 323 215 -235 -49 -7 135 179 -13 -165 -185 -192 35 97 24 126 412 151 -2
6943 -2 -35 85 69 -81 40 -121 129 -56 -93 -46 -19 208 239 -66 -13 68 -96 134 294 1 -106 -169 -34 -20
6967 -20 37 24 -311 82 85 -101 122 -25 -284 283 -5 68 42 -98 -75 90 -203 -208 -67 -127 -114 -2 -68 205
6991 205 123 -28 132 2 230 -72 -16 -42 20 -148 39 129 -150 54 82 -254 -12 46 74 204 -41 -34 69
7014 69 -10 -65 -2 42 87 -225 -183 129 10 205 136 51 112 -121 81 -138 207 71 181 57 112 -53 -73 91
7038 91 42 -50 -131 147 1 3 -5 -241 58 358 303 118 -66 -52 273 204 -187 -74 82 -130 -242 97 -244 146
7062 146 -28 97 76 96 13 35 70 -186 27 -247 -112 -67 16 106 90 -109 140 -147 -29 -96 1 368 81 -177
7086 -177 51 -138 77 23 -266 -4 64 -28 -10 -49 -4 7 220 115 -11 -121 -196 37 -8 -54 -91 33 -125 203
7110 203 149 179 -93 112 21 -171 178 -7 -297 -19 -182 -78 240 136 -163 183 -122 71 287 107 -138
7131 -138 119 -55 -125 -36 -75 -239 97 -116 -91 10 -45 58 -317 291 -99 -265 -46 -232 117 134 -250 -60
7153 -60 24 119 -121 -134 -292 -111 85 -20 189 -140 88 178 7 -74 135 -8 -67 127 -44 200 49 137 -159
7176 -159 -44 161 173 140 173 -85 114 40 -112 -34 65 -189 -45 11 206 184 -77 -222 500 -78 207 299 143
7199 143 -74 125 -20 -62 61 -8 -303 -383 -184 -101 216 -131 46 169 -44 -80 7 -83 19 114 263 24 -59
7222 -59 228 -118 12 154 -204 -175 148 -96 7 -114 -318 136 -290 -115 21 76 184 289 27 -267 -51
7243 -51 157 -11 -200 -92 184 11 -107 15 -216 146 -173 -17 -32 -105 63 159 -214 -105 78 -37 -229
7264 -229 -126 -35 31 141 -98 -115 85 19 -250 -165 167 -246 132 -57 -9 87 11 126 203 14 -248 -191 118
7287 118 40 -2 -142 -245 58 136 261 103 -89 -97 -325 -18 102 -47 30 52 84 -11 -193 -139 -123 141 168 48
7311 48 264 -31 36 38 54 -37 25 -63 -156 106 6 -86 52 110 -264 -164 107 281 201 232 119 -102 -292 -84
7335 -84 -104 73 279 -2 -20 81 -62 141 116 -62 27 -113 131 -89 283 74 292 172 66 76 115 -23
7357 -23 -19 -121 -123 11 41 120 -47 -125 -60 8 244 -49 -8 -178 -322 -17 9 169 326 143 109 34 129 -337 -41
7382 -41 211 272 442 83 -101 139 112 149 190 42 -150 333 176 -41 -237 -135 -39 -66 -183 33 94 -44 97
7405 97 3 -16 -229 32 144 0 -182 262 194 -179 -14 184 -18 -50 80 146 -46 -161 223 83 44 96 -51
7428 -51 61 62 -45 -219 -34 -100 108 291 87 -104 -139 -186 -109 -139 68 -209 -9 236 51 144 55 169 -81
7451 -81 -98 151 141 -20 -116 183 184 52 142 124 -51 249 170 -35 -130 -53 29 -425 56 116 -100 -106 -7 -26 8 -30
7477 -30 8 -15 -127 -118 218 64 240 116 -22 119 -78 65 -172 150 -233 135 150 -171 -127 276 242 94 125
7500 125 -103 -137 -189 -127 -101 171 12 67 -93 71 -278 58 -85 -198 67 82 -4 -39 -52 -140 -34 -40 12 -48 62
7525 62 35 93 34 -133 -58 -59 196 50 28 -149 356 101 120 114 113 -40 -45 -143 99 95 -77 23 60 -94 -145 151 -101
7552 -101 70 27 -179 -7 94 13 -75 -7 41 113 149 -104 -27 -243 -48 -109 -120 -134 -73 -31 270 62 -2 -7 -192
7577 -192 -265 -19 -1 81 292 -177 132 242 19 95 -152 -289 -38 -49 -60 -26 -101 -160 -278 -9 13 -55 -60 -67 -242
7602 -242 -122 -19 -131 -247 -78 -17 429 46 35 -3 143 286 -18 81 -141 -170 12 -37 -68 159 207 -229 192
7625 192 -173 24 173 -147 164 172 67 -178 157 -92 -178 55 189 -222 -68 -74 293 -45 97 183 -52 34
7647 34 247 114 -208 -74 21 200 80 0 -72 222 -248 1 -7 11 2 284 202 -329 106 -7 43 -97 34 123
7671 123 68 -115 115 -6 -89 -38 48 108 120 -97 -271 243 27 37 -151 67 -299 -122 -76 -45 -17 -108 8 -134
7695 -134 152 -40 16 67 43 161 34 60 -65 -308 -178 -141 160 -92 210 81 -230 131 1 66 68 45 115
7718 115 -153 160 -107 206 -68 153 93 122 107 -116 193 115 -2 33 -250 -99 10 197 19 45 78 87 -26
7741 -26 -51 41 -274 265 43 -6 221 -57 -61 221 -105 70 180 88 195 95 -32 72 -32 -23 -84 164 43
7764 43 -178 8 -67 -82 46 -113 30 46 -343 -30 -65 8 -8 80 -51 -153 -162 36 194 -79 -135 67 118 -37
7788 -37 -191 -141 -41 -124 174 156 -102 83 -199 106 82 -170 -49 234 66 10 -143 32 -124 -70 -245 126
7810 126 209 15 -208 149 -168 -328 -20 -91 -19 -83 -13 -162 -128 290 -243 -197 -234 -123 -113 -36 147 -27 -79 -45
7834 -45 154 59 -19 183 3 -125 -153 120 -47 109 -94 100 52 -29 -238 -72 255 176 -138 133 108 14 -94
7857 -94 44 -126 -21 -146 -26 20 217 -14 -147 237 -48 101 -380 109 42 79 -7 26 -28 -201 -2 -184
7879 -184 -53 231 -39 -108 24 163 179 108 42 146 108 -92 -29 -108 -227 -46 -97 -173 -222 73 -120 -65 -292 109
7903 109 35 -219 80 202 190 195 156 -66 -174 -87 169 363 -5 7 -131 -119 50 -64 -146 39 66 -1 19 26 -105
7928 -105 65 -101 95 138 -2 -229 -76 127 -96 141 -171 -67 -57 58 67 -114 33 -316 153 44 10 -68
7950 -68 162 431 174 -176 -139 -114 -289 -58 41 166 -349 -48 65 4 135 -56 -255 -353 -98 47 208 126
7972 126 -21 233 -58 17 -63 151 135 -29 85 3 -65 -127 -52 174 -106 -166 -21 227 246 47 -69 136 -191
7995 -191 25 3 194 90 32 -133 -313 -123 -169 68 22 110 237 192 22 -104 -37 -36 153 286 42 -5 6 98
8019 98 159 -191 -68 -3 57 -93 -44 -312 268 143 -209 35 -2 -74 137 -104 75 -119 27 153 -35 -125 112
8042 112 100 8 388 -69 -73 307 -7 -177 1 -108 -208 -74 44 295 -146 27 10 -284 70 310 -53 -19
8064 -19 -70 -213 11 24 -46 80 68 76 -64 -219 206 -43 -21 -15 61 -56 -103 -294 173 8 -166 -29 57 62 6
8089 6 50 170 -66 198 154 -225 -30 -69 238 -29 181 -234 -58 -69 79 454 -210 -15 -115 -129 -203 -122 217
8112 217 -26 80 -27 -129 45 -165 0 -89 -68 -202 -30 205 24 -93 -19 142 172 55 134 -162 -3 303
8134 303 -110 11 0 133 295 215 29 -71 -52 54 41 81 2 -3 -15 120 163 -62 60 95 81 76 8 -103 -56
8159 -56 -214 81 142 104 -3 18 -144 -297 -79 -171 -76 183 -100 197 -29 20 52 -115 261 -211 -360 -305 111
8182 111 139 82 -79 16 -180 -211 116 -55 -185
8191a85
$$ Imaginary data points
##PAGE= N=2
##DATA TABLE= (X++(I..I)), XYDATA
0 0 0 0 0 0 0 0 0 0 0 -8 8 -8 8 -16 16 -24 32 -32 45 -56 64 -77 88 -109 126 -145 169 -198 229 -262 301
31 301 -341 389 -439 495 -559 628 -705 788 -877 979 -1086 1206 -1336 1478 -1632 1802 -1987
48 -1987 2190 -2411 2657 -2928 3227 -3558 3932 -4351 4828 -5373 6007 -6754 7646 -8740
62 -8740 10109 -11894 14314 -17814 23357 -33543 58636 -260590 -274045 108033 -53081 -146623
74 -146623 -56726 246639 273003 209356 58832 -61616 -238213 -199137 -76592 -61996 -145486
85 -145486 -128354 116268 311210 225232 80912 37993 -9608 -97318 -120801 -125891 -133705 -154368
97 -154368 -15081 189945 194403 81252 99770 138035 15598 -148901 -141851 -33791 -91435
108 -91435 -197272 -46297 188856 206550 61199 2622 85780 91391 -76375 -167018 -111883
119 -111883 -96175 -99411 -4400 124056 127702 35803 51276 131964 54453 -94351 -124479 -93582
131 -93582 -82808 -65110 4513 80741 63736 38036 101879 111516 -2748 -93039 -85557 -55901
143 -55901 -81444 -86228 21333 91756 31109 15785 111331 142766 6295 -139012 -94025 14788
155 14788 -28965 -101744 -44857 44497 74351 73092 76458 48488 -32559 -59691 -4760 -14530 -95304
168 -95304 -102767 -3091 92736 72330 9809 34275 67651 24687 -21946 -44337 -70566 -79109
180 -79109 -34160 37621 32712 -26650 16679 112425 83760 -31812 -78277 -22473 12318 -43481
192 -43481 -70733 -13778 27381 37836 54821 55560 24306 -20585 -21957 14111 -19212 -88600 -64824
205 -64824 16823 48138 16825 2063 41857 48771 705 -10012 -8541 -42464 -53554 -20128
217 -20128 16086 15619 -4653 23316 61502 29661 -11536 -10998 -7775 -25619 -51335 -34002 15807
230 15807 11899 -8625 22584 48320 30118 -2115 -12975 -1647 -19103 -43769 -12857 10598
242 10598 -7088 -72 30426 41645 18207 -14885 -5196 7551 -25930 -40094 -18138 -979
254 -979 6334 4364 14608 35229 17105 -1618 9347 -2998 -28151 -26623 -6929 7561 -7398
267 -7398 -13032 26933 38537 5399 -6180 -2522 -2925 -10850 -24425 -15921 -3998 -8267 10159 29128
281 29128 15339 3269 2862 11070 9760 -22501 -32939 -2519 4905 -4595 -1318 7598 18429 11529
295 11529 908 6635 -7139 -24403 -7872 451 -8601 -9466 278 21441 23520 763 617 8588
309 8588 -808 -7913 -14253 -13004 -2869 -5400 1481 15830 5399 -1098 8660 7991 -1800 -15632
323 -15632 -14697 2343 -1656 -9389 5274 11219 8678 9658 5036 4326 -1887 -12618 -5888 -2968 -10593
338 -10593 -5659 1635 7228 9899 681 3022 8496 -3808 -9027 -3149 -4320 -4328 -3905 2297 12726
353 12726 5213 580 8735 3772 -3788 -4117 -8038 -6563 -5825 -5577 4528 4892 -514 4328 6596 5421
369 5421 1345 -9322 -5641 1787 -3443 -2079 2239 1300 5382 6198 5716 3016 -7087 -6120 886 -5286
385 -5286 -7158 -3181 -1972 4226 4927 2774 5635 1527 -1458 1415 -2333 -3613 -1946 -3898 2932
400 2932 4761 -927 3769 6264 428 -2591 -5728 -2530 840 -6207 -5376 358 837 6498 6623 -383
416 -383 1567 1443 63 2124 -3024 -4729 -1428 -2281 3653 6909 -787 -1169 -1356 -859 5274 -1022 -10360
433 -10360 -6170 -402 5328 5299 -2919 660 4766 1233 4867 3761 -4648 -5200 -5399 660 9079 317
449 317 -7815 -4211 3007 11958 3920 -12376 -8539 633 3605 5122 -2993 -6375 1949 3990 7224
464 7224 7769 -2731 -6573 -5039 428 10666 961 -14599 -8011 4953 12274 6577 -10465 -10013
478 -10013 3189 5463 3706 -2668 -8150 -1190 1638 4467 11942 2322 -10084 -6290 4156 13572
492 13572 3925 -16951 -13637 3951 12378 8188 -9184 -13260 3117 9435 5112 356 -8324 -6788
506 -6788 149 5550 11043 2068 -12945 -6764 7695 15096 5939 -16837 -16470 6453 13324 2813
520 2813 -10455 -11796 3940 9700 2724 779 -3408 -5859 115 3812 7537 2955 -10776 -7663
534 -7663 7844 12753 4683 -11548 -12586 5549 9844 -216 -6705 -8986 -393 7139 2206 713
548 713 869 -3937 -2269 2866 6922 5179 -9293 -10837 5825 11809 3238 -8574 -10283 4620 10145
563 10145 -1427 -6639 -4499 -261 2928 -634 653 3307 -3468 -3204 4243 5694 2835 -4867 -6987
578 -6987 3653 6524 485 -3962 -5295 1562 6406 -813 -4407 -1154 -580 448 -1351 -812 3341
593 3341 -154 -3668 1318 4919 4399 -1964 -6861 1705 7099 -832 -5438 -2297 2238 3416 -2816
608 -2816 -3374 1992 620 -1059 -909 -1370 1664 214 -1948 1898 2046 -384 1403 198 1179 1849 -2317
625 -2317 -1185 1271 64 452 -2699 -3986 2487 3720 -1698 -3635 -2431 3690 4012 -3325 -2828 1693
641 1693 1235 2091 747 -758 1256 -1094 -814 3126 -69 -3198 -2476 -882 3334 450 -4055 -542
657 -542 1125 -100 1979 -29 -1726 594 -268 1880 2250 -1905 443 856 -747 1527 636 -1576
673 -1576 -983 -2378 64 2991 -1852 -2913 -145 737 2663 61 -2350 1703 616 -1167 2685 544
689 544 -1114 194 88 2295 809 -3344 -97 720 -1495 342 -906 -1424 775 -1038 91 2448
705 2448 -1519 -817 1486 299 1134 79 -800 1764 -439 -1306 2319 -239 -1627 -350 -507 1395
721 1395 -201 -3189 282 656 -1072 1381 -227 -864 1003 -23 1321 1628 -2096 -252 1882 155
737 155 -171 -1112 -965 2011 -867 -1961 1042 -1365 -972 1087 -708 -200 -115 -525 2411 631 -1556
754 -1556 1419 948 499 823 -1683 235 1480 -1414 73 253 -1625 59 -102 -414 558 -1449 -266
771 -266 1957 -642 -877 877 279 1133 515 -398 1474 -16 -1022 1154 -700 -913 15 -1310 336
788 336 -170 -1842 408 801 -884 136 -80 360 714 -843 679 1895 -777 309 972 -94 565
805 565 -524 -1162 770 -921 -1083 900 -1361 -916 235 -601 857 185 -1387 1161 611 -336 838
822 838 48 522 907 -684 638 760 -1839 -192 557 -695 -63 -1000 -618 1123 -1123 -387 1027 -484
840 -484 148 327 -404 1410 213 -516 1158 43 -569 908 -270 -444 -155 -1189 934 250 -1931
857 -1931 -153 363 -168 862 -487 -187 695 -442 957 1697 -1203 62 614 -125 1309 -358 -1267
874 -1267 663 -877 -497 863 -1000 -889 -399 -356 1380 -257 -1519 1306 574 -81 1202 -273 -23
891 -23 69 -1151 1210 1880 -1782 -990 -118 85 1339 -1148 -1914 461 -397 -51 1275 -1051 -254 317
909 317 305 2123 306 -1291 616 131 336 1581 -882 -1376 -772 -91 2093 -142 -2812 -278 1039
926 1039 152 427 -913 -78 817 -876 849 2630 -705 -1439 -296 1486 2793 -1168 -2983 672
942 672 1020 264 205 -1989 -838 634 -95 1156 -6 -1847 585 863 640 1568 -323 -1160 363 390
960 390 1784 700 -3339 -895 1837 1115 -338 -2763 -1032 1993 -363 -1128 1041 14 -828 -332
976 -332 583 2852 66 -2786 507 2188 1223 -677 -1965 -70 1565 -302 -159 -374 -1633 356
992 356 728 -131 351 -691 -227 535 -67 955 1284 -1550 -1057 1473 1830 404 -2394 -916 2583 585
1010 585 -2003 -756 244 610 -943 -1323 1613 1011 -1935 -631 1423 1097 231 -1731 391 1908
1026 1908 -414 -245 491 -554 273 145 -712 179 -892 -180 520 -1101 -567 879 -252 -467 -124 887
1044 887 1975 -790 -1860 1873 1391 -779 -1208 -9 1535 -15 -2496 586 1553 -1106 -1197 -59
1060 -59 858 475 -1600 -223 1663 -300 65 401 385 496 -427 -323 1811 -157 -915 538 -274 -856
1078 -856 300 -163 -339 -899 -902 1714 371 -1478 68 1142 487 139 -818 1296 1176 -1341 -283 1462
1096 1462 -46 -646 -975 475 1405 -1453 -1633 930 -143 -693 142 -32 652 -390 -1103 1631 550
1113 550 -1106 576 322 233 53 -533 618 222 -1392 531 711 -1037 -426 -211 691 626 -1577 -412
1131 -412 1820 -279 -210 1102 372 239 -500 -397 1735 -535 -1557 976 494 -456 -880 -646 842 51
1149 51 -1628 673 925 -762 -211 118 770 437 -974 794 1335 -742 -521 1019 76 -111 -911 -120
1167 -120 674 -1162 -1146 958 91 -652 -81 18 649 79 -618 1028 579 -1032 351 995 253 -270 -1010
1186 -1010 843 700 -1542 -653 660 -297 -326 -570 -136 902 -691 -355 1454 208 -553 460 512 678
1204 678 -379 -686 1243 19 -606 390 388 -286 -595 -708 330 -220 -1268 421 729 -344 -159 -25
1222 -25 563 367 -759 277 1354 -327 -137 432 -30 -4 -699 -423 944 -487 -977 624 41 -196
1240 -196 -416 -229 896 -138 -693 709 628 -324 -193 387 512 365 -581 385 679 -852 -239 353 -362
1259 -362 -90 -484 77 666 -696 -277 978 274 -55 -112 164 744 -301 -327 959 116 -850 308 -17
1278 -17 30 -7 -776 429 175 -690 -57 245 -241 -21 -318 375 757 -425 -52 894 -416 121 329 -124
1298 -124 366 -530 -276 908 -481 -521 256 -155 -231 -28 -399 932 78 -821 552 592 -236 122 47 538
1318 538 520 -1046 192 555 -451 -292 342 -376 425 -442 -278 923 -509 -397 544 -232 276 103 106
1337 106 618 -103 -158 439 352 -570 -35 -241 -370 170 -716 3 298 -781 262 430 -143 31 -347 50
1357 50 728 -512 120 545 -157 125 272 -366 234 -6 -643 708 -438 -748 301 -360 -157 10 -579
1376 -579 428 265 -502 620 313 -120 53 -119 553 622 -594 37 543 -292 -202 -252 -463 48 -587 -475
1396 -475 412 -318 -142 327 -49 577 243 -360 501 243 -187 609 71 -274 285 -237 142 -100 -576 -60
1416 -60 136 -541 190 370 -119 273 -339 527 965 -401 -203 586 406 284 84 -235 558 -71 -838 108
1436 108 -201 -289 31 -554 111 122 -274 159 191 -297 542 40 -379 201 136 196 482 -406 194 510 -462 -364
1458 -364 -33 -308 351 -577 -372 571 -67 -539 162 -3 831 77 -459 493 552 -158 64 88 103 477 -429
1479 -429 280 470 -342 -177 -113 -462 -70 -103 -301 152 107 -112 579 -490 338 509 -150 69 -125 -255 303
1500 303 -531 -606 446 -151 -408 -313 -410 183 47 -810 226 117 -305 409 137 239 533 -501 -80 586
1520 586 -456 51 163 -517 360 -184 -454 97 -67 -183 487 -352 -179 406 -4 311 126 -62 401 14
1540 14 -349 399 219 -185 86 -678 246 193 -795 -473 450 -313 111 -176 -174 547 -82 -105 738 11 163 102
1562 102 39 454 132 -306 58 -106 -116 181 -390 -249 18 -248 54 194 -655 -11 296 -432 266 131 -77
1583 -77 479 25 288 292 -629 -79 244 -125 27 -192 -292 587 110 -454 256 15 74 39 8 341 239 -308
1605 -308 433 335 -159 544 4 -159 215 -305 80 288 -521 -56 29 -172 77 -157 94 306 -184 24 472
1626 472 134 255 354 99 157 -81 -377 599 -24 -511 164 147 -52 54 -151 38 237 -417 28 69 -134
1647 -134 95 106 211 487 -156 -168 473 -268 -157 98 -18 200 -39 -15 129 -68 -301 116 69 -180 163
1668 163 -209 -60 214 -440 220 140 -228 -158 -56 18 -75 -324 64 464 -612 -73 -117 -220 207 -496 -413 451
1690 451 -56 -246 250 -195 250 35 -102 277 -73 -262 276 314 -288 -239 -149 60 222 -525 119 163 -452
1711 -452 18 213 -57 189 -246 279 591 -106 -110 472 -38 -94 276 -79 279 -310 -411 157 -56 -460 -164
1732 -164 -120 -118 133 -401 330 204 -201 252 30 -77 264 -259 333 480 -379 232 164 -379 0 -3 -155 163
1754 163 -319 -165 211 61 -119 109 -56 262 4 -164 401 107 -210 205 274 -378 -28 -289 47 -79
1774 -79 -718 -233 181 -403 -337 -12 -349 209 -124 -142 519 73 -10 224 -199 232 284 -387 112 -204 -212 456
1796 456 -124 -398 -27 -61 -175 -35 -208 166 209 53 223 351 -93 231 46 290 136 80 65 123 -427 19
1818 19 -151 -132 224 -326 -151 235 179 -347 236 -192 -14 118 -100 567 383 -476 159 53 -288 191 -49
1839 -49 -10 -16 -312 2 148 -247 -233 77 -113 116 -264 -155 394 95 176 188 -93 146 -63 -258 223 -185
1861 -185 -540 116 181 -30 236 -137 23 335 -212 222 139 -55 262 -57 154 346 -142 88 117 -396 -99
1882 -99 123 -274 174 126 -438 -60 -21 -512 119 123 -34 321 116 4 30 -206 121 277 -89 289 75 -12
1904 -12 198 -228 -303 -1 -222 -320 160 -241 73 67 93 551 -317 -186 352 147 171 36 -245 262 1 -288
1926 -288 282 43 -380 -113 -179 -9 350 -264 -86 31 -114 115 59 268 151 -102 97 -8 -70 73 309
1947 309 -235 -66 290 -227 0 -172 -328 374 148 -84 248 -88 16 314 -106 232 242 111 247 233 -163
1968 -163 64 -95 123 148 -44 -252 -51 -147 -61 -235 -524 -57 46 29 350 217 -51 339 -46 -206 -62
1989 -62 -223 69 102 -177 32 102 -537 -34 -308 -88 -27 -402 4 185 -259 -62 94 -129 44 -42 -21 148
2011 148 116 -121 346 -117 -330 218 -182 118 -81 -291 241 104 -208 237 -49 209 243 -146 100 194 -83
2032 -83 226 296 -287 -114 91 141 232 -123 -245 356 -247 -278 -33 -136 282 -115 -50 343 8 -29 372 -9
2054 -9 183 154 16 154 424 -219 53 -16 -56 59 -357 -62 -55 -339 -43 351 280 182 74 127 108 -259 242 237
2078 237 -107 -51 405 -176 91 140 -24 65 8 -270 175 -141 -58 8 -43 67 187 -115 167 13 143 308
2100 308 43 -99 -236 -26 -29 256 -133 109 113 -216 -309 -115 -240 49 -255 -266 -41 -285 -297 158 -152 -30
2122 -30 122 -63 207 82 41 -291 75 -290 -74 -4 -162 45 -112 23 103 -328 -277 184 221 248 -160 147
2144 147 477 127 -60 38 -238 -96 24 -18 -87 -249 75 -104 -101 -250 208 -24 -3 255 255 147 335 -48 -90
2167 -90 397 -159 171 64 312 118 -132 103 24 -190 -121 80 -163 -122 -163 41 196 53 32 171 79 255
2189 255 -21 130 93 -162 -250 2 235 -258 -163 -317 1 -33 -481 60 -40 -122 165 -26 93 156 -39 -42 410
2212 410 -46 -151 91 11 145 -38 -271 295 54 -181 -11 27 -42 -61 -86 286 -81 -156 3 -104 8 57
2234 57 -54 -76 244 18 -168 11 -190 -118 111 -178 -37 -226 83 306 -76 -38 -113 -123 13 -64 -254 316
2256 316 6 -110 115 383 105 46 -28 4 219 -298 -21 -22 -159 -239 143 -65 122 -99 155 165 -161 -185 52
2279 52 -93 40 225 -114 -19 -96 -292 99 74 -171 -85 -39 3 -95 105 123 353 -203 294 116 -72 46 312
2302 312 212 -42 -137 78 179 -143 -23 -28 -63 -2 -35 -105 195 25 -146 142 -56 -67 74 -57 106 7 -204
2325 -204 237 218 -183 104 -18 77 22 -347 92 130 -124 -5 -43 92 -126 -334 94 225 120 19 307 143
2347 143 44 -73 -8 106 136 -162 74 168 88 64 108 -74 255 -168 125 -79 -190 55 -44 -76 27 10 113
2370 113 208 -263 -224 173 -48 -216 -169 -160 177 -269 -253 227 -54 -488 -46 -148 149 120 -80 55 -10 -272 151
2393 151 433 -175 165 97 -84 279 -280 35 146 -95 -44 67 -131 -49 109 5 4 -222 99 215 -51 -282
2415 -282 249 -25 -22 110 -142 -78 -17 -250 -20 -255 57 -32 35 -208 -130 -85 43 -40 -187 555 159 39 144
2438 144 -137 39 -188 22 -177 53 -215 127 -108 -290 122 85 -210 109 -125 -315 118 -122 -247 -112
2458 -112 -154 246 163 -290 14 -89 -146 -37 -147 -68 21 -158 -63 12 -227 -51 -32 147 -23 -140 -57 58 -111
2481 -111 -32 31 -42 56 475 -29 -70 48 -109 -271 169 -90 -177 -243 121 136 86 125 -130 15 113 -102 56 20
2505 20 13 159 267 -39 -2 -45 -277 43 -50 128 63 -138 -139 183 -59 -128 24 179 -146 266 -239 249 70
2528 70 -113 2 -241 -65 -153 83 81 -199 -125 -10 64 138 124 192 5 198 24 432 106 154 14 -40 -222 41
2552 41 161 -236 -63 83 -92 69 -101 -228 142 -59 5 -62 47 -12 -331 19 151 -55 -166 -112 303 -36
2574 -36 220 -107 -156 214 -267 105 -19 -155 -128 78 -90 -342 117 39 -124 -181 -113 -161 -8 -20 102 -117 143
2597 143 -343 307 245 -300 -122 39 -348 8 -27 -156 -78 -241 157 -165 -80 -269 72 189 162 -15 -166 43
2619 43 190 42 -31 -173 -2 80 112 -46 -41 -20 99 27 226 -16 -289 -178 -93 -144 27 94 74 236 319 -58
2643 -58 -38 -150 -162 -2 83 -523 -70 102 4 -84 -153 -12 34 -36 38 -4 -173 195 -148 -130 -126 1 -115 218 -9
2668 -9 -87 166 74 -24 -190 -51 51 79 -77 25 54 -147 -50 81 131 191 -44 160 -237 -239 134 161 5 148
2692 148 -21 -107 -138 102 24 242 -100 -84 30 -49 144 65 91 -138 49 -133 -227 -232 -231 -15 26 191 -129 -235
2716 -235 -197 37 -221 -11 -117 -64 22 -127 34 17 14 -34 148 -57 11 77 156 -93 -110 -81 5 -177 348 -106
2740 -106 110 -147 -94 -6 20 -56 102 -132 -73 -140 -26 0 -139 93 -143 86 -79 -87 -209 -152 -92 39 -115 -25
2764 -25 -10 -110 -89 -238 -41 153 -304 44 -88 6 -144 -12 187 -132 -124 81 -112 -318 193 -139 -191 -78
2786 -78 110 -181 -179 -59 -282 -7 54 294 85 -187 -230 84 -121 58 -140 153 -152 -129 -72 272 133 -115
2808 -115 128 78 -271 27 -111 159 -88 -148 -70 -69 -232 218 114 -149 210 70 74 -295 -211 -196 9 -222 -199
2831 -199 51 -191 66 79 -81 91 131 313 131 64 81 79 -193 84 -113 -155 107 -226 -141 -116 15 -1 172
2854 172 -20 239 159 -290 76 246 109 172 133 164 106 83 12 -168 -71 150 -107 110 -169 -191 -108 -101 64 150
2878 150 -9 65 62 93 235 -137 -201 -75 77 -215 172 114 -183 42 5 -152 18 -64 -146 -73 -136 -291 -134 50
2902 50 -111 -37 -66 34 196 80 50 -187 99 -57 157 -35 -280 -47 -149 -23 -244 -140 339 -257 -233 -100
2924 -100 129 -1 -279 12 -81 -126 33 62 -207 -120 88 -73 -106 -29 -179 109 -28 25 225 -281 -132 -237
2946 -237 -216 134 -4 -275 -133 124 260 286 75 104 35 162 58 129 -83 -4 -168 31 73 -47 151 141 58
2969 58 -36 -99 -49 -48 117 -141 -162 3 -246 -129 -6 -213 185 52 -78 -2 72 -127 -47 43 -63 -62 10 150 32
2994 32 166 179 -67 43 -202 -252 22 67 56 -23 242 32 -32 142 -132 -130 -16 1 -53 328 4 308 -289 -36
3018 -36 33 102 -106 -4 112 182 131 228 205 16 -9 11 -33 162 330 -136 190 122 -291 137 153 122 -182 24
3042 24 -55 -43 -102 52 49 -257 -201 -128 -64 -25 -45 144 -83 69 -48 49 134 -107 122 -112 40 106 -24 -54 63
3067 63 -279 -328 62 -272 -29 115 -142 56 49 -126 -92 -126 -38 -64 186 91 -95 35 -187 -12 111 1 38
3090 38 -10 165 -172 143 -62 -228 -26 -36 -244 152 -101 104 19 119 119 -367 104 34 -108 313 -137 25
3112 25 -327 -258 108 97 -121 -54 -116 -150 325 -286 -127 30 5 160 155 -411 3 38 9 -235 36 -135 -144 156
3136 156 -136 0 96 -36 -69 -166 -118 -80 -193 -153 103 235 -35 -303 8 156 -72 -78 69 185 154 -6 5
3159 5 86 79 -176 280 -115 51 152 151 -366 125 -242 -18 200 -27 105 -211 -119 73 110 47 436 94 -91
3182 -91 -88 -97 59 -30 34 -7 -144 -120 136 123 18 40 86 38 34 -221 193 -50 230 154 145 116 279 -21 -124 152
3208 152 66 -98 32 -132 -246 3 149 3 -111 48 -82 52 -144 25 75 43 150 81 -40 -83 -107 13
3230 13 0 44 -94 -15 -84 44 -194 12 -99 9 46 -139 32 50 12 19 33 192 75 -78 128 136 135 -41 -88
3255 -88 86 -87 76 74 79 90 -93 -173 28 -37 122 -14 -45 99 -254 -232 34 18 -21 -146 169 -137 228 77
3279 77 -186 379 -103 15 17 -117 47 -113 8 -23 149 309 -146 -174 14 83 -140 -117 -10 22 -142 -8 -174
3302 -174 7 161 98 130 23 267 72 -118 -22 65 -221 -15 88 -79 157 -407 -110 148 31 278 272 -77
3324 -77 -66 363 -236 -16 28 123 -62 52 -30 104 -109 70 350 -31 104 -381 -190 -122 -15 13 -1 284 -65
3347 -65 59 141 -42 105 -70 -66 113 15 23 -220 -85 43 -209 -283 -296 -67 147 297 17 44 -111 68 -24 87
3371 87 -204 -182 127 326 98 -298 -134 272 -173 -138 -54 -35 224 123 -252 -161 85 -34 69 119 -223 -103
3393 -103 35 86 -174 166 270 117 78 -195 414 22 241 72 2 -81 103 -83 0 -292 -143 -159 195 30
3415 30 -111 -159 -206 213 -21 125 -161 256 -86 212 67 -246 -176 178 3 -56 142 -116 37 -169 -23 18
3437 18 21 -67 -98 155 -7 407 -61 94 134 -187 57 13 -113 57 -407 -212 -164 131 11 -46 -95 -20 -127 332
3461 332 -25 258 -95 64 47 -15 154 10 182 2 298 -193 -92 103 -127 -298 -125 -96 -50 9 -4 44
3483 44 -24 22 143 -1 57 41 256 20 239 215 129 274 -296 -191 -71 -202 -174 32 92 -59 96 -62 -11
3506 -11 89 71 -26 -36 -95 134 8 -182 164 231 -38 -14 72 -10 7 -325 -81 -102 -276 122 149 61 58 370 -28
3531 -28 -218 -110 -89 60 -101 87 50 244 88 -70 61 186 -8 -76 77 -123 -87 -307 -232 -5 -30 -394
3553 -394 87 -108 -32 6 153 30 -246 -70 -39 -79 -219 117 -179 -65 -9 -243 -38 21 163 -56 -56 114 13
3576 13 34 65 -109 -18 46 -198 135 -47 257 -50 -55 142 -24 32 -173 30 -16 -53 -448 59 31 132 86 5
3600 5 -87 140 -170 33 20 -171 16 -39 -183 254 -106 175 -62 41 -244 -37 88 -149 -233 12 23 205
3622 205 59 40 333 98 -36 286 -25 -321 169 93 -58 -59 -11 -67 285 313 -186 -157 -229 105 -1 99 154
3645 154 161 -142 56 133 -28 136 149 -66 -64 59 46 -177 30 123 -287 -114 -115 -99 96 51 51 -68 161 -161 226
3670 226 -71 270 150 -36 -101 222 -66 -79 -34 101 -5 -49 -153 -177 180 -114 -97 -130 -2 -60 -121 82 24
3693 24 -84 -29 9 -57 -66 40 80 40 40 -180 -95 -79 186 286 -484 -207 -84 8 101 83 0 31 -190 -63 -47 -28
3719 -28 26 129 -21 -312 244 -73 183 119 -223 122 71 110 99 30 -43 57 -133 -161 63 -79 -57 -374 156
3742 156 -30 27 -209 105 269 -102 46 -339 120 -47 39 114 150 324 -165 -243 -165 -49 94 127 -71 124
3764 124 -98 -131 -122 31 192 79 -91 171 -80 -93 48 -338 -278 101 -4 29 41 193 100 11 206 46 -11
3787 -11 -69 234 196 -18 162 247 40 39 169 25 -225 95 166 126 202 168 -275 136 47 -73 40 -2 96 -112
3811 -112 -3 -68 395 -143 76 122 25 12 -289 -4 132 101 90 183 -44 111 -118 127 233 -12 8 82 87 -49
3835 -49 178 51 41 30 -175 -162 -100 -100 -209 -83 31 19 14 -136 41 16 -146 -160 56 -131 -38 100 -202 110
3859 110 -102 -1 89 155 -92 -39 -16 152 -16 -12 -88 141 312 -16 -45 -202 131 11 -49 43 51 167 57 37
3883 37 -226 -182 -48 -228 -127 -126 168 -1 1 -162 -1 143 -102 79 30 -27 178 -220 -165 115 23 29 -374 124
3907 124 -112 19 -11 0 -136 71 -19 -36 185 -120 -30 -42 49 -98 11 -41 -88 -165 -51 134 223 289 -181 -51
3931 -51 -181 -56 34 -97 187 -55 126 119 -139 -35 48 -13 100 52 -99 85 -53 308 -128 7 -147 25
3953 25 11 -14 69 22 114 44 -102 -128 106 56 -125 -134 -63 33 -58 -101 13 -260 94 -141 29 214 -51 -110 -154 -103
3979 -103 -178 99 231 -122 -108 56 19 -70 -148 -233 -53 30 114 26 101 -73 -159 -90 -19 127 83 -73 -35 69 170
4004 170 215 304 -11 39 -256 -43 -97 3 222 -302 -277 -41 -189 3 17 -29 -82 -124 29 162 -74 -55 -56 -41
4028 -41 137 -101 83 14 -146 78 -146 49 -32 -2 -77 -154 -52 207 38 159 14 160 -63 -292 50 -26
4050 -26 195 130 -47 127 -50 -148 -149 -65 -30 68 227 -120 71 66 240 -65 -65 73 -33 121 -1 -191 -113 2
4074 2 -21 -197 -58 -28 67 -104 -123 -10 125 23 239 31 -241 1 22 43 -2 124 237 -248 83 340 177
4097 177 3 70 1 -191 109 -259 42 13 -108 113 68 148 -46 -140 127 301 -35 75 -202 -87 254 30
4119 30 -33 -28 89 216 77 -74 -4 97 108 -87 225 345 -18 -6 64 -99 -28 115 -146 -17 53 129 69 219
4143 219 198 121 30 -6 -89 -166 -103 61 -126 -223 -303 41 -208 237 85 14 -110 65 -127 -16 69 101 -75 63
4167 63 12 118 -114 -122 27 154 135 91 33 3 142 -111 242 -52 -36 -195 128 -118 -175 -204 -160 36 -77 -159
4191 -159 -172 59 -187 -175 -178 -4 -278 -75 12 -131 -184 167 31 -151 60 49 -114 -174 160 116 -42 5 -100
4214 -100 -13 -82 -2 -10 -284 -77 81 -70 70 -41 139 -31 -98 -242 346 -115 91 -39 -226 175 336 50
4236 50 -314 -68 -113 3 -37 -101 -29 -23 -106 111 45 -196 -65 -115 -101 89 178 -171 -108 311 17 87 79 188 -124
4261 -124 -412 101 65 52 -273 28 -21 -198 -2 -17 -54 -259 -52 -69 -150 209 -115 14 102 46 204 -82 14
4284 14 -63 -84 163 224 77 87 -117 -81 74 201 -130 35 37 41 -64 -245 116 203 170 -37 45 -260 -161 122 -194
4309 -194 -43 -169 -135 234 -56 -207 -63 149 -50 353 -134 -149 -140 -42 48 -32 14 -20 17 52 107 -2 47 -57
4333 -57 -197 140 -118 -107 -20 218 87 -65 21 -268 192 -60 166 249 -4 132 167 -73 37 -56 85 -197
4355 -197 -15 -91 101 39 -60 -60 16 15 83 329 -35 108 -70 104 133 -181 13 155 13 54 -22 -7 -175 -112 -183
4380 -183 58 330 281 90 -240 42 -78 18 -21 -76 46 125 -162 -60 154 -89 -35 -234 -109 119 51 -323
4402 -323 -188 -85 174 48 -67 209 -119 120 21 -41 212 -24 252 114 170 142 180 174 31 92 -262 -136 93
4425 93 -113 -233 156 -80 -19 -23 -92 35 -71 -118 90 83 -77 -83 372 -101 98 -135 198 118 267 -140 -38 186
4449 186 138 2 -180 167 -112 447 -221 152 -34 -66 20 325 139 -11 2 -18 -8 103 -114 -49 -129 -35 -201
4472 -201 -203 -7 -137 -151 -358 -7 35 -3 -17 112 10 34 -86 28 -198 -22 357 265 123 8 -291 -44 21
4495 21 -15 -82 156 37 -92 52 -338 -32 -29 109 200 138 319 -69 67 190 4 180 -102 11 26 -181 -21
4518 -21 -32 76 -37 -182 36 -64 -88 125 83 -25 92 -129 -187 -52 -156 -69 32 40 231 -250 -78 -4 -62
4541 -62 55 142 -79 -42 -63 -4 56 111 54 6 -124 -160 -61 92 -27 5 401 -124 91 -17 -75 -354 121 295
4565 295 284 -212 9 -28 89 -65 -123 317 101 -65 -33 -47 90 -12 105 -106 6 -188 -119 -25 -4 194 140
4588 140 -227 -105 -156 284 -58 -266 -75 11 34 -66 86 -109 -133 256 -9 -88 -2 -206 24 2 52 -229 -202
4611 -202 38 146 68 239 -190 -130 -76 -122 95 229 -27 -289 150 -134 -106 -124 45 -165 -33 -13 -68 18 172
4634 172 -196 -270 -84 -151 160 -137 211 0 355 105 187 266 158 357 183 -446 -84 18 119 80 -49 33
4656 33 -22 -53 101 -214 139 -112 -120 9 -47 -1 -205 139 -45 266 -38 152 122 -67 -82 -17 -157 27 123 -43
4680 -43 52 182 -23 1 205 -87 -62 311 73 145 -3 114 -292 -62 -90 -8 150 26 33 245 124 185 99 -110
4704 -110 -25 -198 206 19 144 -227 58 -13 3 -95 213 94 -4 395 -153 17 59 -68 -231 89 -118 -4
4726 -4 -181 93 -30 -23 166 165 -118 -26 129 -36 -57 -271 47 -273 94 -4 185 95 -32 46 7 144 9 -115
4750 -115 -68 241 -182 -89 -25 -253 -266 -279 124 169 -244 -4 292 -5 1 -276 -214 139 -48 79 -21 -18 -71 -130
4774 -130 427 -69 -64 109 81 -76 -86 -102 58 -123 -12 -87 53 -16 69 139 -192 -90 -99 -16 -61 -5 -69 45 156
4799 156 62 44 33 30 -115 -115 128 -127 -57 -86 57 146 120 -54 -269 -265 -13 170 192 -8 94 -141 -49 -200 175
4824 175 -20 -198 180 -70 89 -76 172 -69 -3 -118 13 -37 137 -232 -47 173 152 301 -224 141 65
4845 65 178 -271 -150 85 342 136 -188 -199 155 -57 -57 -86 67 -91 137 -156 -5 67 59 26 -206 -68 -34
4868 -34 -106 172 353 -54 -43 -299 -15 37 153 -69 169 -28 105 -224 117 -160 -284 -129 88 -100 -83 -63
4890 -63 118 195 -157 14 -150 -154 125 67 56 -60 207 67 -132 24 40 183 107 76 78 78 -44 -29 51 14 210
4915 210 -68 -297 72 -100 275 126 -311 -39 -106 -406 -131 22 -19 194 373 -38 -251 -112 -223 -107 -389
4936 -389 149 -1 -179 -199 -257 -5 327 -246 -177 -11 146 -187 -43 20 -153 -74 44 123 278 -141 -55 58
4958 58 -123 117 -10 136 225 214 -46 -15 128 2 -2 -16 -199 97 97 155 73 263 108 -18 18 -46 -24 46 -136
4983 -136 -5 -5 29 -8 211 138 -103 177 57 -87 27 56 72 -192 -224 -199 -256 -26 -49 22 -50 -28 -50 42 -75
5008 -75 -99 33 10 -27 36 75 287 233 -2 10 164 37 121 -186 93 -64 276 -79 24 51 51 -80 86 206
5032 206 -83 354 78 304 -218 -210 173 -105 -41 -63 46 19 108 -57 -176 198 12 -242 -37 -64 -193 110
5054 110 111 -33 58 -154 -63 -69 55 -166 -10 -30 171 127 -50 19 259 82 -235 254 -15 14 168 -228 -16
5077 -16 30 -123 101 49 242 123 101 10 108 30 -111 156 93 68 -106 92 -8 -180 97 129 -9 -156 -96 59
5101 59 -67 199 50 169 146 -115 58 -144 -58 -67 -82 93 8 10 195 122 70 -169 -8 207 -30 60 214 166
5125 166 37 -138 -128 76 -97 176 -21 -7 23 2 115 -181 293 -30 113 -111 -29 22 127 -12 22 -12 40
5148 40 32 12 94 -139 -129 -125 -1 -56 -28 -195 -4 -158 -173 -70 50 -276 56 -285 -218 73 35 -161 69 -178
5172 -178 -6 122 42 125 173 -328 169 53 -174 53 -116 -88 -99 230 128 -131 -31 101 238 124 146 -276
5194 -276 82 208 8 -69 -120 151 60 -149 -206 31 -55 -157 76 148 97 -50 50 -131 -37 138 202 -75 130
5217 130 -111 -4 130 169 -25 142 -350 -18 74 -209 -190 -59 -15 10 -89 -16 -63 -170 -249 -13 139 -26 48
5240 48 22 -5 -149 2 -64 -133 -78 -152 329 2 23 -3 -88 80 -317 -247 113 85 53 123 247 105 -290 342 -261
5265 -261 -28 240 -339 28 100 5 101 111 -109 -38 0 245 134 17 18 -200 83 -161 153 56 -106 3 202
5288 202 -253 134 -182 114 181 21 -58 162 -150 163 326 -28 60 -169 -168 49 -86 135 87 104 -32 264
5310 264 382 -246 112 108 211 -118 17 43 47 104 -25 226 40 -63 44 -52 -153 -48 19 -110 44 173 109
5333 109 -174 -81 -17 63 -68 -48 203 -57 -31 -202 196 -151 181 -15 230 -64 228 56 54 -36 8 -12 -198
5356 -198 -6 -179 353 11 38 -29 19 22 170 -30 43 -63 25 -360 -114 4 -158 -70 -134 -27 -4 32 18 133
5380 133 -121 49 61 36 88 -63 -6 47 168 -274 -268 10 268 131 -146 -61 -83 84 -117 228 -240 89 55
5403 55 82 -90 -246 210 -8 -197 -172 -121 -24 -69 -121 -60 -245 109 28 -179 -34 -76 -28 -105 -28 199 -150 -39
5427 -39 -109 -68 -38 181 -80 52 -16 185 -53 104 114 -31 194 -10 -120 159 -100 152 113 -56 -161 75
5449 75 75 -152 -181 54 13 -99 55 -141 -62 81 154 -76 256 -166 -450 61 143 -114 28 86 -57 98 -102
5472 -102 -32 59 -135 35 -67 58 91 171 82 -79 -158 41 -170 -27 -171 215 113 -167 184 -3 111 59
5494 59 -133 175 -95 170 96 -138 86 204 -34 101 -100 287 -140 118 -48 -115 101 -112 165 -161 247
5515 247 -159 -62 -79 -40 -19 4 105 102 42 -177 80 -211 -190 -155 102 -207 -87 -126 -103 -169 -154 -35 133 -4 -479
5540 -479 248 83 -207 -73 125 24 7 -165 189 66 -165 67 -117 -150 -59 58 323 -2 -258 121 -121
5561 -121 -416 5 163 -240 -264 5 -18 295 103 171 60 310 15 -94 34 -50 -115 93 65 -27 223 11
5583 11 276 260 -365 -99 73 -69 -162 -6 26 110 132 -76 65 -152 -24 112 16 164 121 96 -200 -146 -124 -16
5607 -16 288 147 -27 -86 80 -136 -245 -8 134 -39 -1 -344 181 171 -8 54 -13 201 -403 -36 -32 -247 -106
5630 -106 -68 -47 56 14 -44 -151 19 -38 310 93 31 -161 170 84 -99 12 -68 -91 27 -45 63 -136 -154 -105
5654 -105 35 15 -146 137 -18 -102 167 -17 -43 -248 -148 50 243 145 258 -41 285 -52 14 30 -127 -102
5676 -102 -349 118 102 -114 302 -114 238 110 -19 -184 132 114 171 -173 133 146 110 29 127 25 159 158 -23
5699 -23 -116 -187 -94 -352 62 -70 74 -190 -164 152 160 13 159 -71 -149 -1 -87 -50 -129 -19 31 -107 -167 -40
5723 -40 12 -221 -268 -22 78 -121 146 -291 165 207 -157 11 238 52 -122 -206 -99 45 -453 -14 13 -73
5745 -73 6 -140 -138 -96 108 167 -98 -288 51 -15 96 31 156 -116 -41 53 -66 48 94 135 -4 -116 67 141
5769 141 -143 -87 53 5 -37 -67 -97 -126 -99 179 -191 58 -22 80 -147 -213 119 16 103 -126 -57 -152 -155 107 -141
5794 -141 14 -150 263 178 43 259 22 17 0 -200 51 204 -305 -31 0 65 -190 -88 -194 108 57 -362
5816 -362 97 30 19 -83 25 12 -85 -64 28 197 45 134 -23 -53 153 159 -34 156 -181 -47 4 292 -53 -68
5840 -68 25 80 193 -141 -67 29 259 -85 214 -57 -51 88 -26 288 74 -81 5 127 359 -68 182 -135 28
5863 28 36 82 -89 -121 109 123 -78 76 -47 227 162 -215 61 -171 72 125 60 -208 -100 152 6 -221 -29
5886 -29 134 153 -50 106 154 68 -78 101 -177 -181 -68 -99 211 9 496 27 -143 65 -103 -29 -5 -318 -130
5909 -130 -161 -223 -84 -118 288 -7 -236 -52 361 -77 -212 -87 -36 108 125 -94 72 -183 -150 -21 -152 -249
5931 -249 -71 213 183 -112 -104 -49 -23 49 83 -16 320 99 -190 110 359 -298 -35 163 -40 64 -1 -309 9
5954 9 -144 -184 -92 -67 88 -30 -71 171 -14 -72 -67 -216 89 -7 -125 47 10 62 0 -74 108 -94 199 -29 112
5979 112 -138 106 -118 91 -95 14 -64 -157 218 464 -95 -4 -210 -47 -160 220 -170 -82 159 140 203 1
6001 1 15 28 96 80 77 -38 19 -266 -114 73 241 42 80 7 -149 -99 -232 -23 29 -80 61 -58 -222 208
6025 208 58 -265 118 121 54 -17 -20 -55 134 417 93 131 -202 116 53 24 -169 274 293 -100 117 -77 -75 161
6049 161 -144 -85 -157 -9 272 356 -98 146 155 -56 35 -96 -46 138 85 101 -132 317 90 114 23 188 83 78
6073 78 -19 199 -2 -93 188 166 -203 -40 29 -158 148 -96 -31 -168 -228 -16 -113 242 155 -45 107 223 -3
6096 -3 -202 -164 -45 16 -14 -41 -379 -115 74 -171 -121 -239 -30 110 80 185 -177 274 108 -70 -125 -240 165
6119 165 78 -137 160 -100 -36 107 226 80 174 15 -102 20 84 47 -139 -24 154 -475 -1 111 -56 124
6141 124 -173 161 67 20 102 281 252 13 -348 125 -57 -2 142 11 -133 -74 110 235 175 -2 -4 128 -116
6164 -116 374 41 -133 61 52 63 -106 30 -8 171 77 -153 106 -67 332 -223 -212 -179 16 167 38 -96
6186 -96 -241 -274 -190 46 -83 84 86 22 -13 47 -175 -117 -70 177 -50 210 -30 -3 167 -17 28 -218 134 -98
6210 -98 173 -183 -106 27 57 37 236 130 -76 203 53 115 57 -46 -230 94 -33 380 -12 -183 -188 -136 198
6233 198 195 98 14 66 157 -135 -77 19 -94 179 -37 -227 45 177 -124 200 132 61 73 210 18 43 191 47
6257 47 -70 24 -218 -131 80 459 -117 -213 8 -76 -148 -66 4 38 94 118 136 -194 42 -212 271 -72 116 277
6281 277 -164 -81 -91 23 15 32 -52 -69 -85 -19 -191 -43 40 228 97 180 136 -80 56 50 -119 37 -41 -75 -218
6306 -218 50 242 77 272 -35 49 128 -120 -34 47 -70 34 187 -84 177 103 214 82 222 235 -306 -125
6328 -125 -50 -3 -51 -166 113 42 139 -39 -11 63 -154 -203 -105 168 52 31 94 15 -174 32 121 232 -215 113
6352 113 127 -15 403 -34 -33 17 -246 6 -77 2 157 23 -8 138 13 -107 133 -6 11 207 -43 202 9
6375 9 -357 46 -93 1 -120 14 -101 -86 2 40 -57 22 61 -150 62 289 -45 -77 -87 122 15 153 40 346
6399 346 -113 12 -112 -73 -119 213 38 -97 186 -37 9 -14 -85 18 -102 -128 152 93 45 -91 137 170 -170
6422 -170 -111 232 42 3 63 97 -134 -119 -34 -221 -128 52 90 -225 50 120 -158 -67 -261 177 184 91 -17 38 -55
6447 -55 -134 -169 -16 -216 -96 -55 161 129 196 -29 -209 125 39 98 51 -55 14 200 -303 63 -138 -227 134 169
6471 169 6 -253 -124 -213 140 77 1 69 -50 -119 97 -1 -20 259 173 -127 140 -225 311 -208 29 -79 -47
6494 -47 -142 40 80 130 400 -73 -63 128 199 -37 190 -27 -81 77 -125 -235 -185 190 -11 96 -65 -79 111
6517 111 283 -34 -102 13 -44 -216 -36 -34 51 -68 20 193 -278 -63 68 -56 -178 -224 92 152 -131 -112 -62
6540 -62 52 -137 19 152 200 -82 54 34 160 259 -57 -7 -271 84 -90 -269 -85 142 -53 -103 -148 124
6562 124 -34 -108 -150 101 225 129 156 -102 60 -319 272 204 216 -100 -132 121 64 -123 145 278 121 225 60
6585 60 -186 30 45 55 -101 50 -46 -34 -118 -3 -19 -170 58 5 54 -69 -168 65 -41 -145 -11 101 -161
6608 -161 -13 -86 -230 -20 -166 -434 -156 -26 -145 139 297 79 37 144 86 -174 -357 -20 -208 -166 259
6629 259 -126 -8 60 -467 -51 70 -207 -151 240 32 1 43 -34 244 39 -105 118 160 -143 131 92 -141
6651 -141 -104 31 -37 -32 -26 -81 78 124 83 -181 9 -188 185 61 -8 -291 110 13 -121 125 -35 -135 134 193
6675 193 -152 -31 -277 -48 -202 -135 212 -138 -215 32 -353 -73 144 -104 178 137 -341 -155 -2 -49 -83 290
6697 290 59 -61 12 68 75 -12 -106 308 118 -92 -28 -173 84 40 159 126 -52 -4 115 139 47 -34 -244 -96
6721 -96 52 -57 42 -135 129 -302 -355 100 -10 -27 57 105 0 -101 280 107 289 -17 93 30 299 44
6743 44 -233 113 236 -208 65 114 -46 227 -23 70 50 -318 -238 -151 131 -16 -283 -50 34 231 36 67 37
6766 37 94 -187 86 70 -19 -228 36 248 194 -96 -46 308 99 -26 28 -121 -24 53 169 6 13 218 128 -110
6790 -110 -308 66 47 -150 49 81 160 107 -72 -89 -285 -63 268 193 -301 -29 24 -138 97 193 139 36 -2
6813 -2 -33 154 -65 -182 69 215 -52 -4 198 107 115 -246 142 -49 139 -306 247 372 34 260 10 19 12 -58
6837 -58 -46 -15 -54 -92 -6 -80 -174 29 -104 -70 -30 -286 55 -3 -155 49 158 -56 -127 -324 77 216 -60 224
6861 224 -123 18 63 61 -25 -155 -99 -98 268 -45 0 -203 -129 -163 -102 25 -48 17 230 26 -29 -49 -65 128 -282
6886 -282 -110 -118 -107 140 107 -124 -239 22 -121 153 318 112 -65 15 64 -124 -30 -48 215 -48 140 196 64
6909 64 -96 -289 -61 -26 -288 198 -78 -200 -129 34 124 -56 -7 -209 242 12 -271 11 11 -2 -25 -44 27 44
6933 44 -115 -104 21 139 -120 -125 176 -43 42 -84 -38 -125 -192 66 -79 -74 55 -79 -129 -19 -317 180 137 -114
6957 -114 -26 -138 -72 66 58 -108 132 85 55 -114 -273 -264 -17 -88 90 208 -15 275 140 82 46 -7 -83 -63 78
6982 78 58 -31 -38 -213 117 -180 26 -91 -18 75 65 -118 265 -232 -72 -16 -292 -426 74 -130 -22 -62 391
7005 391 -130 39 136 27 -60 -323 84 35 -352 -61 -160 -87 185 -79 -123 -80 -233 34 -42 93 10 230 215
7028 215 52 -110 12 -115 -43 -34 59 -47 59 80 -52 -102 -177 181 -182 -154 28 59 -22 -165 21 109 -23 272
7052 272 -35 148 -102 231 55 89 42 -2 196 260 -138 -44 -123 -194 137 -39 5 96 48 18 52 13 -81 -326 -118
7077 -118 -98 120 161 -386 -22 -5 -279 42 68 96 218 158 -132 -421 -145 16 -25 -137 -38 -8 -138 135 84
7100 84 -37 25 81 165 -140 10 274 -79 -42 -158 -119 69 -101 95 -4 -62 51 -28 69 -35 67 220 -239
7123 -239 -292 -162 100 62 161 6 -34 48 69 -13 262 -219 73 191 -233 -85 -41 -181 46 4 70 -142 -167 -209
7147 -209 -70 39 -70 41 1 -66 -135 -94 -93 -57 294 69 224 149 -265 32 -175 25 -30 186 -28 -28 30 -136
7171 -136 -31 -79 -57 -69 103 -108 -31 8 111 -108 0 316 -142 -44 107 2 -7 436 80 -130 137 103 37
7194 37 145 210 -46 -133 96 -309 105 25 -96 166 39 -228 21 304 -47 -12 176 -77 -130 54 -228 -50
7216 -50 -32 -220 257 -61 74 83 45 98 -44 4 -52 40 194 -150 -193 -49 271 103 -103 48 52 253 178 -84
7240 -84 -18 209 -61 -250 -164 106 156 155 64 -198 6 -136 -112 -120 108 -49 -116 193 337 299 -190 -105 170 67
7264 67 60 97 153 45 -222 90 42 -238 -78 37 -90 2 32 188 317 -51 130 -65 113 50 -51 101 83
7287 83 99 -203 -140 -18 96 26 -37 88 69 -75 69 197 392 154 19 54 244 -173 88 59 -67 -218 -75
7310 -75 98 -145 56 -300 -45 -86 -43 -218 -111 188 -186 124 -26 26 87 51 86 23 -106 101 130 82 178 170
7334 170 66 299 -7 -200 111 82 103 -80 93 65 108 -1 -350 -183 -18 33 -10 -74 -57 114 30 -73 -56
7357 -56 -46 -148 239 5 228 120 -53 12 85 -135 -181 -93 -6 86 -105 113 123 -347 161 -2 163 -97 -35
7380 -35 139 173 -334 -115 79 -236 -36 57 -273 114 171 -27 -119 -140 9 245 -30 -227 -108 -3 185 35
7402 35 -276 -105 -90 -99 -126 -128 -183 -50 110 248 -162 124 184 -159 137 165 9 48 162 29 -7 -54 -118 187 -89
7427 -89 -18 -184 189 63 19 -103 4 -107 -156 74 -75 74 255 112 26 145 328 33 -88 -168 -123 154
7449 154 -117 -315 -76 1 -204 377 -49 179 -17 -29 -198 -151 224 180 438 -130 156 120 76 -27 -9 145
7471 145 76 21 190 -22 96 18 -77 -112 62 -136 53 -275 -144 -43 -68 63 -247 -169 -71 114 58 145 -107
7494 -107 44 43 46 -31 141 -40 167 -16 36 134 -54 190 23 95 25 -166 -188 -46 -16 122 -130 220 118 -104
7518 -104 -123 -107 -147 -148 -162 24 -189 165 269 287 151 101 59 34 -14 -225 -39 77 54 -40 -177 -99 18 -235 21
7543 21 104 66 350 -262 -190 198 103 -5 9 -85 84 -17 -283 21 -188 -127 -27 309 345 38 -137 13 -75
7566 -75 232 35 -210 58 -196 -162 96 -141 -140 -110 125 -188 -17 -114 -140 -275 -196 -65 -54 -181 -136 -50 96 -228
7590 -228 92 -161 143 -37 -56 64 -48 -108 59 -256 111 163 -204 -156 -241 -224 5 -243 7 -244 21 208
7612 208 -192 312 -17 240 40 270 0 -218 75 21 205 202 -11 157 91 -161 -7 160 122 -235 80 -273
7634 -273 -115 141 -121 -10 92 -6 -71 98 -81 215 -42 -207 100 10 -192 272 162 112 42 -81 77 -209
7656 -209 -43 145 52 -5 138 -34 -102 132 159 84 -87 234 55 156 -258 233 28 43 -34 164 -271 39
7678 39 -97 242 -138 84 58 153 120 38 180 97 190 -119 -195 176 96 -125 -277 -216 -145 258 123 -68 -52 20
7702 20 212 140 21 51 -122 64 -119 -200 95 -26 40 4 8 134 138 51 91 -80 46 -41 -129 -114 24 78 112 -38
7728 -38 -44 145 103 -82 263 98 -78 -53 92 92 14 -17 -1 259 -198 72 223 -303 -316 -1 -61 -39 -68 -189 -83
7753 -83 -34 66 5 -196 -246 153 -133 -35 -131 -44 -1 -147 -39 -311 -88 -107 -457 -85 74 -50 -148 -321 234
7776 234 43 -140 244 -72 151 -59 189 231 -153 -257 -261 75 -100 -177 134 105 47 189 113 57 -101 -105 31
7799 31 5 -218 173 176 -3 197 -12 -262 334 -353 138 -112 127 -50 242 -313 42 -66 91 30 -16 6
7821 6 -31 -111 134 -108 53 59 82 241 -91 -20 145 -234 91 -23 182 -103 -233 -51 -159 183 20 73 7
7844 7 53 147 137 -9 26 -165 -137 -166 -186 193 -160 148 29 44 109 45 79 207 104 -46 -61 65 -3 -212 213
7869 213 -57 111 122 129 -230 187 -238 55 15 154 216 1 229 106 -70 -335 73 -68 32 -108 38 51
7891 51 -97 -176 39 -56 146 132 -192 222 -8 -96 140 -76 -65 -58 82 115 165 -86 -134 -78 -51 143 267 42
7915 42 289 -138 196 31 -28 -11 136 54 55 145 -171 328 -117 399 -4 -224 67 -104 162 24 -127 -127 173
7938 173 231 44 -85 -56 45 6 -266 110 4 -119 -440 61 -104 -170 56 146 -4 188 31 49 -324 55
7960 55 -128 -3 -202 223 102 258 -64 -96 222 126 122 -101 -5 -30 -131 -48 42 -32 -15 9 138 -82 20 -132
7984 -132 -18 -40 -179 58 39 -59 232 -156 32 -166 -45 225 -193 -91 -165 -45 24 16 -39 -318 33 4 163
8007 163 -81 -64 -148 70 47 -182 -9 0 -236 -87 94 310 229 52 2 -82 -43 -116 -61 153 175 147 13 115
8031 115 -262 64 -68 -58 -128 -62 20 -152 -124 62 -176 -26 39 -107 -1 -3 -76 206 193 -150 239 -123 119
8054 119 -36 -194 -226 -19 43 -70 84 -24 19 155 62 265 -104 51 -247 168 -140 -134 145 216 -292 -72
8076 -72 -111 -64 1 -25 150 215 -89 180 -39 246 -1 -114 -5 -243 150 150 147 -63 25 218 164 36 -81 -11
8100 -11 29 -1 22 246 -288 136 -77 40 168 -119 113 52 117 105 -141 18 105 -84 -85 -66 -3 -4 179 -382 -96
8125 -96 122 179 132 244 89 1 277 -175 -42 49 34 -36 -166 126 -109 -127 75 15 85 -42 20 125 26 185
8149 185 253 -68 -91 -100 -159 -48 4 37 -147 65 127 -111 -25 62 216 185 163 -75 -213 146 -29 109 -275 -136
8173 -136 -69 -100 172 147 167 245 -100 -13 -64 -57 66 -125 123 153 118 66 51 104
8191A04
##END NTUPLES=NMR FID
##END=
