##TITLE=1H_Pr NCS-TGF
 200.13MHz, CDCl3,
 8 sc
 
 28.3.2025
##JCAMPDX= 6.0         $$ Bruker NMR JCAMP-DX V2.0
##DATA TYPE= NMR FID
##DATA CLASS= NTUPLES
##ORIGIN= UXNMR, Bruker Analytische Messtechnik GmbH
##OWNER= pz
$$ XWIN-NMR		Version 3.5
$$ Fri Mar 28 14:01:44 2025 Russian Standard Time (UT+4h)  she@DPX200
##.OBSERVE FREQUENCY= 200.1313
##.OBSERVE NUCLEUS= ^1H
##.DELAY= (6, 6)
##.ACQUISITION MODE= SIMULTANEOUS
##.ACQUISITION SCHEME= undefined
##.AVERAGES= 8
##.DIGITISER RES= 18
##SPECTROMETER/DATA SYSTEM= spect
##.PULSE SEQUENCE= zg30
##.SOLVENT NAME= CDCl3
##.SHIFT REFERENCE= (INTERNAL, CDCl3, 0, 14.3821)
##AUDIT TRAIL= $$ (NUMBER, WHEN, WHO, WHERE, WHAT)
$$ ##TITLE= Audit trail, XWIN-NMR		Version 3.5
$$ ##JCAMPDX= 5.01
$$ ##ORIGIN= Bruker BioSpin GmbH
$$ ##OWNER= she
$$ F:/spectra/data/she/nmr/H-C/1/audita.txt
$$ ##AUDIT TRAIL=  $$ (NUMBER, WHEN, WHO, WHERE, WHAT)
(   1,<2025-03-28 14:00:07.81 +0400>,<she>,<DPX200>,
      <created by zg, POWCHK disabled, PULCHK disabled
       configuration hash MD5:
       00 E9 B6 7A A2 85 ED C7 34 08 36 98 17 FE 4E 26
       data hash MD5: 16K
       01 9E 37 50 77 3E 94 4B E2 2B 6B 1E 48 98 87 9C>)
$$ ##END=
$$ 
$$ hash MD5
$$ CF F6 F1 2A 3F 06 7D 31 62 19 B1 F1 BF AB E4 00
##$RELAX= 
##$RELAX= 
##$RELAX= 
##$RELAX= 
##$RELAX= 
##$RELAX= 
$$ Bruker specific parameters
$$ --------------------------
##$DU= <F:/spectra>
##$EXPNO= 1
##$NAME= <H-C>
##$PROCNO= 1
##$TYPE= <nmr>
##$USER= <she>
##$AMP= (0..31)
100 100 100 100 100 100 100 100 100 100 100 100 100 100 100 100 100 100 
100 100 100 100 100 100 100 100 100 100 100 100 100 100 
##$AQSEQ= 0
##$AQ_mod= 1
##$AUNM= <au_zg>
##$AUTOPOS= <>
##$BF1= 200.13
##$BF2= 200.13
##$BF3= 200.13
##$BF4= 200.13
##$BF5= 200.13
##$BF6= 200.13
##$BF7= 200.13
##$BF8= 200.13
##$BYTORDA= 1
##$CFDGTYP= 0
##$CFRGTYP= 5
##$CHEMSTR= <none>
##$CNST= (0..31)
1 1 145 1 1 1 1 1 1 1 1 1 1 1 1 1 1 1 1 1 1 1 1 1 1 1 1 1 1 1 1 1 
##$CPDPRG= <>
##$CPDPRG1= <>
##$CPDPRG2= <>
##$CPDPRG3= <>
##$CPDPRG4= <mlev>
##$CPDPRG5= <mlev>
##$CPDPRG6= <mlev>
##$CPDPRG7= <mlev>
##$CPDPRG8= <mlev>
##$CPDPRGB= <>
##$CPDPRGT= <>
##$D= (0..31)
0 0.7 0 0 0 0 0 0 0 0 0 0.03 0 0 0 0 0 0 0 0 0 0 0 0 0 0 0 0 0 0 0 0 
##$DATE= 1743156007
##$DBL= (0..7)
120 120 120 120 120 120 120 120 
##$DBP= (0..7)
150 150 150 150 150 150 150 150 
##$DBP07= 0
##$DBPNAM0= <>
##$DBPNAM1= <>
##$DBPNAM2= <>
##$DBPNAM3= <>
##$DBPNAM4= <>
##$DBPNAM5= <>
##$DBPNAM6= <>
##$DBPNAM7= <>
##$DBPOAL= (0..7)
0.5 0.5 0.5 0.5 0.5 0.5 0.5 0.5 
##$DBPOFFS= (0..7)
0 0 0 0 0 0 0 0 
##$DE= 6
##$DECBNUC= <off>
##$DECIM= 32
##$DECNUC= <off>
##$DECSTAT= 4
##$DIGMOD= 1
##$DIGTYP= 9
##$DL= (0..7)
0 120 120 120 120 120 120 120 
##$DP= (0..7)
150 150 150 150 150 150 150 150 
##$DP07= 0
##$DPNAME0= <>
##$DPNAME1= <>
##$DPNAME2= <>
##$DPNAME3= <>
##$DPNAME4= <>
##$DPNAME5= <>
##$DPNAME6= <>
##$DPNAME7= <>
##$DPOAL= (0..7)
0.5 0.5 0.5 0.5 0.5 0.5 0.5 0.5 
##$DPOFFS= (0..7)
0 0 0 0 0 0 0 0 
##$DQDMODE= 0
##$DR= 18
##$DS= 0
##$DSLIST= <SSSSSSSSSSSSSSS>
$$ [...]
##$SUBNAM0= <"">
##$SUBNAM1= <"">
##$SUBNAM2= <"">
##$SUBNAM3= <"">
##$SUBNAM4= <"">
##$SUBNAM5= <"">
##$SUBNAM6= <"">
##$SUBNAM7= <"">
##$SUBNAM8= <"">
##$SUBNAM9= <"">
##$SW= 18.0517328524113
##$SWIBOX= (0..15)
0 0 2 0 0 0 0 0 0 0 0 0 0 0 0 0 
##$SW_h= 3612.71676300578
##$TD= 16384
##$TD0= 1
##$TE= 0
##$TE2= 300
##$TE3= 300
##$TEG= 300
##$TL= (0..7)
0 120 120 120 120 120 120 120 
##$TP= (0..7)
150 150 150 150 150 150 150 150 
##$TP07= 0
##$TPNAME0= <>
##$TPNAME1= <>
##$TPNAME2= <>
##$TPNAME3= <>
##$TPNAME4= <>
##$TPNAME5= <>
##$TPNAME6= <>
##$TPNAME7= <>
##$TPOAL= (0..7)
0.5 0.5 0.5 0.5 0.5 0.5 0.5 0.5 
##$TPOFFS= (0..7)
0 0 0 0 0 0 0 0 
##$TUNHIN= 0
##$TUNHOUT= 0
##$TUNXOUT= 0
##$USERA1= <user>
##$USERA2= <user>
##$USERA3= <user>
##$USERA4= <user>
##$USERA5= <user>
##$V9= 5
##$VALIST= <valist>
##$VCLIST= <CCCCCCCCCCCCCCC>
##$VD= 0
##$VDLIST= <DDDDDDDDDDDDDDD>
##$VPLIST= <PPPPPPPPPPPPPPP>
##$VTLIST= <TTTTTTTTTTTTTTT>
##$WBST= 1024
##$WBSW= 4
##$XGAIN= (0..3)
0 0 0 0 
##$XL= 0
##$YL= 0
##$YMAX_a= 168431
##$YMIN_a= -126745
##$ZGOPTNS= <>
##$ZL1= 120
##$ZL2= 120
##$ZL3= 120
##$ZL4= 120
##$ABSF1= 10
##$ABSF2= 0
##$ABSG= 5
##$ABSL= 3
##$ALPHA= 0
##$AQORDER= 0
##$ASSFAC= 0
##$ASSFACI= 0
##$ASSFACX= 0
##$ASSWID= 0
##$AUNMP= <proc_1d>
##$AZFE= 0.1
##$AZFW= 0.1
##$BCFW= 1
##$BC_mod= 2
##$BYTORDP= 1
##$COROFFS= 0
##$CY= -3
##$DATMOD= 1
##$DC= 2
##$DFILT= <>
##$DTYPP= 0
##$F1P= 0
##$F2P= 0
##$FCOR= 0.5
##$FTSIZE= 0
##$FT_mod= 4
##$GAMMA= 1
##$GB= 0.15
##$INTBC= 1
##$INTSCL= 1
##$ISEN= 128
##$LB= 0.25
##$LEV0= 0
##$LPBIN= 0
##$MAXI= 10000
##$MC2= 0
##$MEAN= 0
##$ME_mod= 0
##$MI= 1.114404
##$NCOEF= 0
##$NC_proc= 0
##$NLEV= 6
##$NOISF1= 3.799351
##$NOISF2= 2.8
##$NSP= 1
##$NTH_PI= 0
##$NZP= 0
##$OFFSET= 14.38212
##$PC= 1
##$PHC0= -629.2499
##$PHC1= 12.79221
##$PH_mod= 1
##$PKNL= yes
##$PPARMOD= 0
##$PSCAL= 0
##$PSIGN= 0
##$REVERSE= no
##$SF= 200.129724274929
##$SI= 16384
##$SIGF1= 3
##$SIGF2= 2
##$SINO= 400
##$SIOLD= 16384
##$SREGLST= <1H.CDCl3>
##$SSB= 0
##$STSI= 0
##$STSR= 0
##$SW_p= 3205.1282051282
##$SYMM= 0
##$S_DEV= 0
##$TDeff= 0
##$TDoff= 0
##$TI= <>
##$TILT= no
##$TM1= 0
##$TM2= 0
##$TOPLEV= 0
##$USERP1= <user>
##$USERP2= <user>
##$USERP3= <user>
##$USERP4= <user>
##$USERP5= <user>
##$WDW= 1
##$XDIM= 8192
##$YMAX_p= 0
##$YMIN_p= 0
$$ End of Bruker specific parameters
$$ ---------------------------------
##NTUPLES= NMR FID
##VAR_NAME=  TIME,          FID/REAL,        FID/IMAG
##SYMBOL=    X,             R,               I
##VAR_TYPE=  INDEPENDENT,   DEPENDENT,       DEPENDENT
##VAR_FORM=  AFFN,          ASDF,            ASDF
##VAR_DIM=   8192,          8192,            8192
##UNITS=     SECONDS,       ARBITRARY UNITS, ARBITRARY UNITS
##FACTOR=    0.0002768,     1,               1
##FIRST=     0,             0,               0
##LAST=      2.2672688,     0,               0
##MIN=       0,             -126745,         0
##MAX=       2.2672688,     168431,          0
$$ Real data points
##PAGE= N=1
##DATA TABLE= (X++(R..R)), XYDATA
$$ plain form
0 0 0 0 0 0 0 0 0 0 0 0 0 0 0 0 0 0 0 0 0 -1 8 -8 8 -8 8 -8 13 -16 16 -19 24 -25 32 -34 40 -44 50 -56 61 -69 77
41 77 -86 97 -107 119 -133 145 -161 177 -196 215 -238 262 -287 317 -350 387 -427 474 -527 589
61 589 -661 749 -852 975 -1125 1297 -1423 1029 6319 168431 101632 -64188 -8833 36182
75 36182 -43416 -66781 47767 97704 8924 -62489 -34132 2708 7609 -8991 387 30531
87 30531 -441 -46271 2944 40371 -11067 -32045 17531 28387 -26505 -40235 28033 47415
99 47415 -9845 -11592 26902 511 -41099 -21878 25384 30137 -6034 -18211 -7405 -12113 -7598
112 -7598 8222 17449 24192 1311 -27662 -5605 8191 -17903 -7643 28007 15463 -19480 -9760
125 -9760 21414 5457 -21170 3280 19567 -5412 -14407 -5161 2204 8563 -2296 -9804 3594
$$ packed form
0@%%%%%%%%%%%%%%%%%%%jRj6J6j6J6j6K1k9L2l5M3m9N7o6P4q4R4j06J17j30J46
41G7j63J83k04K26k52K78l06L38l73M11m53N00n49O04o67P37q14R01j001J116
61E89j250J410j601J827k100K422k720K452N290J62112o6799j65820N5355M5015
75C6182p9598k3365J14548M9937q8780p1413K8357L6840M901j6600R378L0144
87C0531l0972m5830M9215L7427n1438k0978M9576J0856n4892j3730O8268J9382
99D7415n7260j747L8494k6391m1610J9221M7262M753l6171j2177J0806m708M515
112g598J5820R227O743k2881k8973K2057J3796k6094J0260L5650j2544l4943R720
125i760L1174j5957k6627K4450J6287k4979q995R246P365O359j0859p508J3398
$$ plain form
138 3594 4097 -2418 6173 8803 -1228 -8439 -7618 -6006 -8597 4597 22381 7236 -11821 -2730
152 -2730 4904 892 -2914 -842 10494 5581 -16674 -11756 7588 2461 -8849 -3386 8670 9236
166 9236 -1147 -2187 1646 -4635 -6188 -620 2252 5653 3606 -181 3559 -424 -4983 5071 6068
181 6068 -4686 -3858 539 -3037 -8248 -7222 1955 5314 436 1399 4295 3901 4000 278 -1369 723
197 723 -4570 -5541 2374 2810 1181 2308 -2068 -4194 -2174 109 5060 4015 -2923 -3972 -3368 -3334 -683
214 -683 2325 7545 7087 -2386 -3510 450 -2049 -1270 741 -418 867 -1568 -4057 1642 3342 1225
230 1225 2392 651 -1149 -1337 -2191 649 9 -3484 164 -270 -3914 1538 5116 3686 2232 -2542
246 -2542 -2571 367 -2315 354 4501 450 -1989 -3003 -2738 2620 2395 590 2602 -1297 -3825 -1458
$$ packed form
138C594N03o515Q591K630j0031p211Q21J612k591J3194J7784j5145j9057R091
152b730P634m012l806K072J1336m913k2255M918J9344n127j1310N463J2056N66
166I236j0383j040L833o281j553N568K872L401k047l787L740l983m559J0054R97
181F068j0754Q28M397l576n211J026R177L359m878R63K896l94R9l722j647K092
197G23n293r71P915M36j629J127m376k126K020K283M951j045o938j049O04L4K651
214f83L008N220m58r473j124L960k499P79K011j159J285k435k489N699J700k117
230A225J167j741j800j88q54K840o40l493L648m34l644N452L578j430j454m774
246b542k9K938k682K669M147m051k439j014K65N358k25j805K012l899k528K367
$$ plain form
262 -1458 -2141 490 2089 -1364 1203 1654 -1799 2336 3523 127 792 -953 -1758 -341 -2662 12
278 12 2139 -2313 -831 754 -1235 1955 1215 -1201 1361 -1383 -3026 734 -228 848 2864 299
294 299 1773 1420 -1532 1595 195 -2723 641 -1610 -3803 -93 -530 104 1511 -497 1938 1704
310 1704 -1597 2169 1500 -2180 414 -573 -1419 1228 -738 329 2170 -1576 -436 997 -1436 207
326 207 -622 -1554 1546 -1387 -1989 3021 797 -444 1687 45 322 -284 -1747 1730 284 -2618 756
343 756 -182 -1412 1126 -223 555 2059 -1475 -437 882 -1267 239 26 -817 1513 -893 -1398 2462
360 2462 587 -308 1505 -464 -540 -438 -1505 927 -115 -1982 1101 -18 -1419 1379 486 736 1744
377 1744 -1212 -360 1242 -1125 -271 622 -66 499 -1243 -536 1875 -785 -1043 905 -1562 -1168 960
$$ packed form
262a458o83K631J599l453K567M51l453M135J187l396O65j745q05J417k321K674
278A2K127m452J482J585j989L190p40k416K562k744j643L760r62J076K016k565
294B99J474l53k952L127j400k918L364k251k193L710m37O34J407k008K435k34
310A704l301L766o69l680K594r87q46K647j966J067J841l746J140J433k433J643
326B07q29r32L100k933o02N010k224j241K131j642K77o06j463L477j446k902L374
343G56r38j230K538j349P78J504l534J038J319k149J506k13q43K330k406n05L860
360B462j875q95J813j969p6J02j067K432j042j867L083j119j401K798q93K50J008
377A744k956Q52J602k367Q54Q93o88N65j742P07K411k660k58J948k467L94K128
$$ plain form
394 960 -215 440 678 -125 1478 379 -699 1430 543 -897 -425 -1034 -196 -349 -1782 503 1147 -524
412 -524 483 126 -627 1137 -14 -685 949 -290 -444 1190 -258 -586 745 415 -277 -767 533
429 533 1407 -1295 -1582 663 -727 -684 989 -582 37 1582 -625 -847 890 735 432 130 -328 170
447 170 -39 77 -127 -1120 472 854 -1546 -457 1417 100 -329 -952 -1313 1071 909 -649 837 1075
465 1075 -138 -383 -813 143 1234 59 -246 -197 -609 -137 -804 -646 975 281 615 1177 -1873 -1000 2058
484 2058 -720 -1426 1603 777 -800 -231 330 632 -216 -316 -149 -920 719 1434 -976 13 317 -2060
502 -2060 394 1515 -949 977 1746 -1360 -1624 -500 209 669 65 653 566 -720 -169 -926 -728 2394
520 2394 741 -1632 579 -47 -525 1071 -937 -1050 1190 -267 -632 719 342 37 -678 -906 128
$$ packed form
394I60j175O55K38q03J603j099j078K129q87j440M72o09Q38j53j433K285O44j671
412e24J007l57p53J764j151o71J634j239j54J634j448l28J331l30o92m90J300
429E33Q74k702k87K245j390M3J673j571O19J545k207k22J737j55l03l02m58M98
447A70k09J16k04r93J592L82k400J089J874j317m29o23l61K384j62j558J486K38
465A075j213k45m30R56J091j175l05M9m12M72o67J58J621o94L34N62l050Q73L058
484B058k778p06L029q26j577N69N61L02q48j00J67p71J639P15k410R89L04k377
502b060K454J121k464J926P69l106k64J124P09M60o04N88q7j286N51p57J98L122
520B394j653k373K211o26m78J596k008j13K240j457l65J351l77l05p15k28J034
$$ plain form
537 128 30 1111 803 -1806 879 2009 -2632 -1500 1864 390 499 912 -471 -451 -1311 -901 1002 309
555 309 619 1145 -1015 -862 -139 -250 795 -468 -245 2225 -322 -1787 684 -592 -670 1429 -85
572 -85 42 893 -794 -541 115 -275 -70 -290 650 687 -1008 734 540 -2615 71 1854 -900 404
590 404 1066 -1229 43 953 -665 -706 471 1207 -154 -806 1434 155 -2338 -201 380 -222 1524
607 1524 69 -1268 370 -708 -877 714 258 763 1089 -573 -645 61 237 227 -571 574 1231 -1169
625 -1169 -700 660 -992 -303 429 -776 349 697 -444 153 -23 -491 721 465 -123 428 562 580
643 580 -537 -1037 490 -198 -1103 795 505 -364 183 -1214 -1177 816 442 138 797 210 -328 -469 -198
662 -198 757 370 97 382 -557 -389 218 -480 167 258 -924 126 678 -543 111 694 -465 -563 -91 206
$$ packed form
537A28r8J081l08k609K685J130m641J132L364j474J09M13j383K0q60M10J903o93
555C09L10N26k160J53P23j11J045j263K23K470k547j465K471j276p8K099j514
572h5J27Q51j687K53O56l90K05k20R40L7j695J742j94l155K686J783k754J304
590D04O62k295J272R10j618m1J177P36j361o52K240j279k493K137N81o02J746
607A524j455j337J638j078j69J591m56N05L26j662p2P06J76j0p98J145O57k400
625a169M69J360j652O89P32j205J125L48j141N97j76m68J212k56n88N51J34J8
643E80j117n00J527o88r05J898k90q69N47j397L7J993l74l04O59n87n38j41K71
662a98R55l87k73K85r39J68O07o98O47R1j182J050N52j221O54N83j159r8M72K97
$$ plain form
682 206 591 204 -22 -11 -274 -48 -196 -199 912 246 -604 406 -58 -916 250 131 -382 548 347 -458
702 -458 -409 -167 89 -91 -48 604 98 -189 600 -190 -583 529 132 -251 378 72 15 8 -616 17 205 -346
724 -346 190 155 -239 168 -286 -410 291 78 121 304 -158 244 144 -350 455 153 -488 500 66 -495 343
745 343 -112 -607 -213 -316 213 239 -383 220 78 -389 562 237 -118 618 -5 -92 474 -347 -251 292 -480
766 -480 85 141 -482 73 -392 -614 550 11 -312 456 -28 144 421 -218 315 293 -566 321 188 -309 310
787 310 -441 -574 351 -320 -79 400 -400 -10 65 -389 507 62 -353 720 -42 -363 509 -81 -66 274 -434
808 -434 245 300 -601 256 101 -425 333 -350 -264 640 -274 -268 405 -414 19 166 -294 427 113 -324 502 -110
830 -110 -303 554 -233 -215 233 -460 54 190 -610 223 25 -226 417 -239 -212 586 -191 -94 520 -294 36
$$ packed form
682B06L85l87k26J1k63K26j48lJ111o66q50J010m64q58J166j19n13R30k01q05
702d58M9K42K56j80M3O52n06k87P89p90l93J112l97l83O29l06n7po24O33J88n51
724c46N36l5l94M07m54j24P01k13M3J83m62M02j00m94Q05l02o41R88m34n61Q38
745C43m55m95L94j03N29K6o22O03j42m67R51l25l55P36o23q7N66q21R6N43p72
766d80N65N6o23N55m65k22J164n39l23P68m84J72K77o39N33k2q59Q87j33m97O19
787C10p51j33R25o71K41M79q00L90P5m54Q96m45m15J073p62l21Q72n90J5L40p08
808d34O79N5r01Q57j55n26P58o83Q6R04r14OO73q19M33J47m60P21l14m37Q26o12
830a10j93Q57p87J8M48o93N14J36q00Q33j98k51O43o56K7P98p77R7O14q14L30
$$ plain form
851 36 228 -366 233 174 -303 225 -234 -165 448 -251 -128 372 -479 9 227 -364 403 203 -361 217 -105
872 -105 -232 442 -133 -72 236 -276 66 204 -358 281 119 -379 96 -115 -132 354 -287 -174 451 -323 -91
893 -91 336 -6 248 151 -246 110 -184 -121 204 -264 -80 129 -391 70 216 -366 283 305 -374 193 243 -137
915 -137 185 -17 -36 246 -105 -128 103 -71 55 -142 -327 237 0 -259 308 19 -135 260 -64 -98 374
936 374 -90 -58 209 -140 -87 89 -25 -56 -91 71 200 -299 -93 259 -305 -89 240 -276 70 316 -303 29
958 29 359 -144 -101 162 149 40 -109 -40 -109 -364 70 200 -181 172 67 -215 226 -92 -238 484 123 -315
980 -315 229 -29 -100 84 -22 45 62 -194 34 -30 -128 111 -255 -150 216 -219 64 397 -259 17 328 -353
1002 -353 -74 315 -101 38 38 -197 -5 -43 16 12 -122 343 128 -535 192 145 -514 231 272 -193 277 52 -178
$$ packed form
851C6J92n94N99n9m77N28m59O9O13o99J23N00q51M88K18n91P67k00n64N78l22
872a05j27O74n75O1L08n12L42J38n62O39j62m98M75k11j7M86o41J13O25p74K32
893i1M27l42K54r7l97L56k94O3L25m68J84K09n20M61J46n82O49K2o79N67N0l80
915a37L22k02j9K82l51k3K31j74J26j97j85N64k37k59N67k89j54L95l24l4M72
936C74m64L2K67l49N3J76j14l1l5J62J29m99K06L52n64K16L29n16L46K46o19L32
958B9L30n03M3K63j3j09j49O9o9k55M34J30l81L53j05k82M41l18j46P22l61m38
980c15N44k58p1J84j06O7J7k56K28o4r8K39l66J05L66m35K83L33o56K76L11o81
1002c53K79L89m16J39%k35J92l8N9mj34M65k15o63P27m7o59P45M1m65M70k25k30
$$ plain form
1025 -178 227 -38 -61 164 -101 39 25 -55 119 -324 -166 363 -367 -171 665 -187 -283 297 -277 -7 382
1046 382 -77 149 147 -47 2 -116 65 130 -242 167 46 -490 246 153 -533 252 336 -299 212 96 -207 157
1068 157 -29 15 27 -125 197 -11 -296 244 -45 -396 230 -55 -69 283 -253 -64 198 -418 72 321 -288
1089 -288 131 304 -148 -60 -13 99 176 -245 134 244 -349 207 163 -375 281 -43 -457 363 158 -263 123
1110 123 -103 -236 163 119 138 -31 -113 177 -248 -159 329 -301 -251 385 -197 -210 257 -239 -219 144 21 151
1132 151 95 -165 63 -48 41 211 -104 55 82 -328 209 185 -302 34 57 -252 172 141 -116 62 -131 -95
1154 -95 119 -40 16 108 -60 89 -109 -56 192 -125 -129 240 -162 -150 153 -151 -115 102 -161 -76 74 -15 57 10
1178 10 -58 45 -34 139 179 -110 59 180 -211 -39 61 -127 -2 -55 -44 212 -35 -238 -18 4 29 137 78
$$ packed form
1025a78M05k65k3K25k65J40j4q0J74m43J58N29p30J96Q36q52r6N80n74K70L89
1046C82m59K26kj94M9j18J81O5l72M09j21n36P36r3o86P85Q4o35N11j16l03L64
1068A57j86M4J2j52L22k08k85N40k89l51O26k85j4L52n36J89K62o16M90K49o09
1089b88M19J73m52Q8M7J12P7m21L79J10n93N56m4n38O56l24m14Q20k05m21L86
1110A23k26j33L99m4J9j69q2K90m25Q9M88o30N0O36n82j3M67m96K0L63j23J30
1132A51n6k60K28j11Q9J70l15J59K7m10N37k4m87L36K3l09M24l1k57J78j93L6
1154i5K14j59N6R2j68J49j98N3K48l17mL69m02J2L03l04L6K17k63Q5J50q9P2m7
1178A0o8J03p9J73M0k89J69J21l91J72J00j88J25n3J1K56k47k03K20K2K5J08n9
$$ plain form
1201 78 -18 -54 -116 97 144 -9 139 -12 -204 120 -24 -108 92 -139 -153 150 70 -35 54 -9 60 -31 -69 139
1225 139 -6 -114 161 -47 -39 168 -123 -72 161 -71 -4 33 -141 -23 -63 -143 96 7 -25 148 -154 -109 123
1248 123 -33 53 93 -149 51 -12 -121 152 21 -73 28 -71 -99 211 -44 -31 7 -147 116 127 -100 129 1
1271 1 -102 81 10 18 210 -194 -124 90 -160 50 60 -140 88 17 -113 138 -15 -141 138 -101 -5 217 -83
1294 -83 97 61 -204 108 51 -157 147 -102 -128 97 -129 -95 139 -128 91 61 -139 149 -33 -147 166 -1
1316 -1 -54 212 -107 14 163 -104 -9 27 -143 76 3 -177 56 -37 -76 108 -147 18 170 -83 79 101 -114
1339 -114 161 -32 -99 127 -36 -115 91 -52 -28 87 -111 62 123 -79 142 41 -125 180 -34 5 194 -34
1361 -34 46 132 -163 0 78 -129 41 -46 -167 56 -45 -97 105 -103 1 13 -107 18 28 -151 124 25 -101
$$ packed form
1201G8r6l6o2K13M7j53J48j51j92L24j44q4K00k31j4L03q0j05Q9o3O9r1l8K08
1225A39j45j08K75k08QK07k91N1K33k32O7L7j74J18m0q0K39q9l2J73l02M5K32
1248A23j56Q6M0k42K00o3j09K73j31r4J01r9k8L10k55J3L8j54K63J1k27K29j28
1271Aj03J83p1QJ92m04P0K14k50K10J0k00K28p1j30K51j53j26K79k39R6K22l00
1294h3J80l6k65L12n7k08L04k49k6K25k26L4K34k67K19l0k00K88j82j14L13j67
1316an3K66l19J21J49k67R5L6j70K19p3j80K33r3l9J84k55J65J52k53J62K2k15
1339a14K75j93o7K26j63p9K06j43K4J15j98J73O1k02K21j01j66L05k14L9J89k28
1361c4Q0Q6k95J63P8k07J70q7j21K23j01n2K02k08J04J2j20J25J0j79K75r9j26
$$ plain form
1384 -101 48 -11 -3 101 -31 -25 85 -52 -84 56 -63 65 38 -46 192 -59 -28 191 11 28 101 -54 -10 63
1408 63 -76 32 54 -39 -2 -26 -37 -2 -46 59 32 -84 4 66 -51 53 51 -66 89 24 -55 109 26 -27 32 17
1434 17 -22 26 4 77 4 8 41 -67 -27 56 -37 -23 154 -32 -4 109 -19 27 131 -51 -54 35 -24 -53 11 -75 -31 -45
1462 -45 -28 -13 -92 52 29 -90 174 112 -55 81 116 -60 82 53 -87 -20 34 -91 -71 -55 40 -6 -51 105 -42
1487 -42 -99 128 -19 -107 157 -17 -59 125 45 -46 95 49 -96 5 -59 -68 8 49 50 -97 -20 49 -155 39 144
1512 144 -145 17 186 -77 95 88 -81 31 38 -21 37 5 -33 11 -81 54 -5 -102 45 3 -119 166 -38 -140
1536 -140 171 -62 -107 128 -52 -121 90 -86 32 14 -19 84 -29 -73 29 -44 -24 123 -71 -26 148 -157 80
1559 80 150 -48 56 105 -81 7 49 30 6 -92 25 25 -111 65 -4 -124 119 -14 -170 92 30 -112 135 -11
$$ packed form
1384a01J49n9QJ04j32OJ10j37l2J40j19J28k7q4K38k51L1K19j80J7P3j55M4P3
1408F3j39J08K2r3L7k4j1L5m4J05k7j16Q8O2j17J04kj17J55o5p9J64q3n3N9j5
1434A7l9M8k2P3p3ML3j08M0Q3r3J4J77j86K8J13j28M6J04j82lQ9n9k9O4q6M4j4
1462d5J7J5p9J44k3j19K64o2j67J36L5j76J42k9j40O7N4j25K0J6R5m6m5J56j47
1487d2n7K27j47q8K64j74m2J84q0r1J41m6j45J01o4rP6M1Jj47P7O9k04J94J05
1512A44k89J62J69k63J72pj69J12Pn9N8l2l8M4r2J35n9r7J47m2j22K85k04j02
1536a40L11k33m5K35j80o9K11j76J18j8l3J03j13m4J02p3K0J47j94M5J74l05K37
1559H0P0j98J04M9j86Q8M2j9k4r8J17%j36J76o9j20K43j33j56K62o2j42K47j46
$$ plain form
1583 -11 5 84 -30 -22 30 16 71 -8 -49 31 -122 -79 105 -56 -4 93 -88 44 54 -95 87 -14 -60 81 21 -35
1609 -35 26 -62 -9 11 -23 65 -63 -95 102 -54 -62 152 2 -173 87 -12 -70 107 -19 25 35 -37 -7 -29 -13 58
1635 58 -131 73 145 -104 4 101 -92 20 70 -7 35 79 -81 84 68 -33 31 -57 34 53 -67 70 6 -76 82
1660 82 -2 -65 41 -48 -47 54 -45 -65 64 -27 22 -17 -69 -8 -37 -17 32 -65 -53 72 10 -17 29 14 -79 -4 -20 -15 109
1689 109 -17 54 18 -61 1 -18 3 55 3 56 8 -65 47 69 -75 -8 10 -78 31 -15 -71 32 -4 -77 11 -43 5
1716 5 60 56 43 95 -50 -1 -40 -18 54 20 7 22 0 -2 44 -28 -52 90 0 44 -13 -19 -28 33 -30 19 19 -35 61 -55 -3 20
1748 20 -2 -43 46 -53 -13 6 -12 87 -43 -28 -11 -54 19 22 -81 89 64 -17 22 18 -69 43 15 -57 59 -14 -11 76 -25
1777 -25 -37 46 -41 9 44 4 -25 -9 -27 133 -83 -54 57 -96 -10 57 -76 -28 -39 -70 13 -23 -7 67 -81 -47 40
$$ packed form
1583a1J6P9j14QN2j4N5p9m1Q0j53M3J84j61N2R7j81J32J0j49J82j01m6J41o0n6
1609c5O1q8N3K0l4Q8j28l2J97j56qK14j50j75K60r9n8J77j26M4J0p2L0k2J6P1
1635E8j89K04P2k49J08R7j93J12N0p7M2M4j60J65j6j01O4q8R1J9j20J37o4q2J58
1660H2q4o3J06q9JJ01r9k0J29r1M9l9n2O1k9K0M9r7J2J25o2k7M6j5r3P5j6NJ24
1689A09j26P1l6p9O2j9K1N2n2N3m8p3J12K2j44O7J8q8J09m6n6J03l6p3Q8n4M8
1716EN5mj3N2j45M9l9K2P2l4j3J5k2kM6p2k4J42r0M4n7orO1o3M9%n4R6j16N2K3
1748B0k2m1Q9r9M0J9j8R9j30J5J7m3P3Lj03J70k5q1L9mq7J12k8p2J16p3LQ7j01
1777b5j2Q3q7N0L5m0k9J6j8J60k16K9J11j53Q6O7j33M8j1l1Q3l6J6P4j48L4Q7
$$ plain form
1804 40 -56 -30 30 -31 31 -29 -29 28 -15 -40 80 -68 -30 82 -30 13 93 -45 65 52 -68 -12 -17 -13 68 -64 -20 45
1832 45 -94 92 21 -30 45 12 -93 38 30 -40 84 -22 -13 61 -67 1 38 -40 12 80 -34 91 -1 -68 10 14 -25
1859 -25 37 -22 -20 -36 -78 94 11 -57 59 -8 -64 65 7 44 57 -49 41 56 -82 27 -18 -73 57 -54 -55 -13 10
1886 10 -46 -4 -18 -15 -10 -43 32 -41 -31 46 54 -7 86 -37 26 65 -80 -28 37 -34 -49 7 -5 -11 -5 -16 50 10 -5 32 9 71
1918 71 21 -89 4 27 -41 5 -21 -51 -36 21 -80 22 0 -2 -56 -5 -1 1 -42 -17 -20 -15 75 1 33 53 62 -29 4 86 -5 -9
1950 -9 -29 -13 17 12 33 -43 14 -24 -121 -2 9 13 29 10 -55 42 6 -71 38 68 -37 -47 -10 -41 25 4 14 -2 -7 27 14
1981 14 -1 33 13 -16 36 -4 8 79 61 -25 72 22 -60 53 34 -32 11 -8 32 5 4 51 32 -69 56 -23 -9 65 -28
2010 -28 -40 -20 -33 -57 24 -35 22 -32 -5 -12 28 11 98 -20 14 3 -48 44 -1 -77 71 -5 -17 58 -60 -40 79 -66
$$ packed form
1804D0r6K6O0o1O2o0%N7m3k5J20j48L8J12j12M3Q0j38J10j3j20N6nMQ1j32M4O5
1832D5j39J86p1n1P5l3j05J31qp0J24j06RP4j28O8L7p8N2O8j14J25r2o7P8Ml9
1859b5O2n9Kj6m2J72q3o8J16o7n6J29n8L7J3j06R0J5j38J09m5n5J30j11jM2K3
1886A0n6M2j4LNl3P5p3J0P7Qo1R3j23O3L9j45N2O5p1j5N6j2oOj1O6m0j5L7k3O2
1918G1n0j10R3K3o8M6k6l0J5N7j01J02k2kn4N1MKm3K5lNR0p4L2K0Rr1L3Q2r1m
1950ik0J6L0nK1p6N7l8r7J19J1MJ6j9o5R7l6p7J09L0j05j0L7l1O6k1J0j6nL4j3
1981A4j5L4k0k9N2m0J2P1j8q6R7n0q2J13j9o6M3j9M0k7jM7j9j01J25p9J4P4r3
2010b8j2K0j3k4Q1n9N7n4K7pM0j7Q7j18L4j1n1R2m5p6J48p6j2P5j18K0J19j45
$$ plain form
2038 -66 -20 65 6 -10 29 -14 57 -23 -59 24 -38 1 43 -53 -8 38 -115 33 17 -2 1 -21 -8 39 17 4 18 -27 26 9
2068 9 -32 67 -12 -97 33 26 -44 43 32 -10 79 20 -14 15 -53 -21 -27 -83 77 -14 -51 21 8 -92 99 -93 -73 36 21
2097 21 22 70 -40 -6 26 -29 18 -12 -29 8 10 -6 39 2 38 28 -28 6 12 -47 33 -24 -14 61 -31 13 2 16 32 -16 -36
2128 -36 1 30 -33 2 -33 -46 82 -92 6 4 -55 11 8 -22 -11 13 -19 -39 4 -32 30 -34 6 47 -85 46 67 -71 42
2157 42 -20 -38 67 -14 -45 14 6 -11 34 13 29 -25 74 -2 19 -37 29 19 -22 18 -4 -31 -23 -44 -60 -8 -11 41 59 28 -36
2188 -36 62 -9 25 24 28 57 -31 11 1 -83 3 38 -21 31 28 23 1 24 -10 36 6 11 -13 -26 11 55 -56 33 24 -2 -5 32 -8
2221 -8 15 9 -62 32 21 12 -31 49 -6 -3 3 19 56 55 42 23 -59 -44 -35 32 58 42 24 50 5 20 34 10 -9 72 -15 -11 -14 18 -20
2256 -20 4 -46 29 13 -35 12 -22 -3 108 -55 -2 14 19 32 -14 6 -4 19 25 60 -16 80 -66 -19 28 20 7 63 -14 -23 20
$$ packed form
2038f6M6Q5n9j6L9m3P1q0l6Q3o2L9M2r6M5M6j53J48j6j9Lk2J3M7k2j3J4m5N3j7
2068Im1R9p9q5J30pp0Q7j1m2Q9n9l4K9o8L2on6J60r1l7P2j3j00J91j92K0J09j5
2097B1JM8j10L4L2n5M7l0j7L7Kj6M5l7L6j0n6L4On9Q0n7J0P5r2M4j1J4J6m8k0
2128c6L7K9o3L5l5j3J28j74R8kn9O6ll0J1K4l2k0M3l6O2o4M0M1j32J31K1j38J13
2157D2o2j8J05q1l1N9qj7M5k1J6n4R9p6K1n6O6j0m1M0k2k7Qk1j6N2lN2J8l1o4
2188c6R8p1L4jMK9q8M2j0q4Q6L5n9N2lnk2K3l4M6l0Nk4j3L7M4j11Q9rk6lL7m0
2221hK3op1R4j1rm3Q0n5LOJ6L7jj3j9q2J5RO7K6j6j8K6m5J5J4k4j9Q1q7MlL2l8
2256b0K4n0P5j6m8M7l4J9J11j63N3J6NJ3m6K0j0K3OL5p6R6j46M7M7qj3N6p7rM3
$$ plain form
2287 20 -50 3 13 -13 10 27 -40 39 -27 -55 -16 27 -14 50 13 -56 14 -28 -22 64 -28 -11 6 -3 2 -2 16 -7 -31 -17 -20 75 -33
2320 -33 51 -47 20 5 -33 16 -44 42 70 3 -15 31 -55 -10 78 -66 -7 -34 -32 36 0 85 19 -71 -9 42 -19 42 20 -27
2350 -27 16 -23 -10 12 -16 -7 -9 -8 3 3 -20 49 23 -38 12 -2 21 28 -3 25 48 -35 15 37 -72 -12 47 4 -30 -82 47 5
2382 5 4 -4 -65 4 -6 -17 5 -11 -33 6 51 22 16 12 20 -50 -17 -27 3 14 -19 78 17 44 10 -30 -25 14 -55 -8 4 -40 44 -27
2416 -27 -3 -38 0 -43 19 49 51 -22 0 13 15 -19 21 53 -71 33 -46 9 31 -24 41 44 -8 -19 32 4 -13 -16 20 35 -19
2447 -19 26 22 6 26 -4 -4 -48 57 3 0 37 -4 44 76 -59 41 21 -39 -7 14 15 -83 -7 -17 -51 41 -34 -43 -72 -14 7
2478 7 -17 -32 8 -26 -13 4 -14 86 4 -16 5 -35 -15 7 44 -13 -26 43 30 -27 26 12 -9 -32 68 28 3 54 -27 -5
2508 -5 22 0 -18 10 -10 -8 27 -34 -9 -5 11 45 -5 47 -18 -3 -3 21 -25 102 -6 -28 21 -13 -18 58 -1 55 -39 40 68 0
$$ packed form
2287B0p0N3J0k6K3J7o7P9o6k8L9M3m1O4l7o9P0m2OQ6r2J7J7rNmJ8k3k4J4lR5j08
2320c3Q4r8O7j5l8M9o0Q6K8o7j8M6q6M5Q8j44N9k7KO8l6Q5o6r0O2N1o1O1k2m7
2350b7M3l9J3K2k8RkJJ1%k3O9k6o1N0j4K3Pl1K8K3q3N0K2j09O0N9m3l4n2J29m2
2382Ejqo1O9j0j1K2j6k2L9M5k9omQp0L3j0L0J1l3R7o1K7l4m0NL9o9M7J2m4Q4p1
2416b7K4l5L8m3O2L0Kp3K2J3Kl4M0L2j24J04p9N5K2n5O5Ln2j1N1k8j7lL6J5n4
2447a9M5mj6K0l0%m4J05n4lL7m1M8L2j35J00k0o0L2K1Jr8P6j0l4R2p5rk9N8K1
2478Gk4j5M0l4J3J7j8J00q2k0K1m0K0K2L7n7j3O9j3n7N3j4k1k3J00m0k5N1q1K2
2508eK7k2j8K8k0KL5o1K5MJ6L4n0N2o5J5%K4m6J27j08k2M9l4nP6n9N6r4P9K8o8
$$ plain form
2540 0 37 -1 -50 -10 82 -34 14 20 -15 -29 -54 -39 33 15 -56 -16 30 -8 -27 -18 16 -3 -42 9 18 -20 8 31 -40 41 7 -44
2572 -44 21 42 5 -23 24 -30 4 5 62 -30 -10 43 2 -16 38 -29 -25 57 -52 34 48 -10 38 -38 -38 48 9 -7 56 -6 -17
2603 -17 40 -27 -3 -5 -26 -31 -1 -40 24 5 48 78 21 40 -19 48 29 -40 14 38 12 -46 47 12 9 27 -34 -43 -7 -24 -20 -15 -61
2636 -61 30 -12 14 6 -65 -5 41 20 13 -7 19 -23 45 16 -20 13 10 -23 5 14 29 26 44 26 -6 6 35 -7 -19 -27 34 20 3
2669 3 5 50 -21 -19 10 -47 -61 9 -23 -70 -16 -38 37 -72 -46 -22 30 -53 -32 -30 0 8 34 42 -5 -64 -12 1 2 -21 17 7 19
2702 19 2 -59 38 -28 -30 -11 -21 -8 0 33 70 1 -15 27 -20 17 -52 -34 41 -22 -53 -2 -19 -50 -34 10 21 -45 -1 23 -19
2733 -19 6 49 8 10 3 52 -16 -41 24 37 76 49 -9 -12 38 15 58 16 -42 56 0 -11 23 12 85 -8 -51 21 27 34 34 8 4 -7
2767 -7 17 52 -24 20 45 0 -90 -13 14 42 -4 -7 -5 -19 -18 -29 64 16 37 35 -17 29 39 1 3 -2 -17 14 -12 43 7 -19 40 -4
$$ packed form
2540@L7l8m9M0R2j16M8Ol5j4k5J5P2j8p1M0M6l8j9RL4j9l9N1Rl8K8K3p1Q1l4n1
2572d4O5K1l7k8M7n4L4JN7r2K0N3m1j8N4o7MQ2j09Q6J4n8M8p6%Q6l9j6O3o2j1
2603a7N7o7K4kk1nL0l9O4j9M3L0n7J9n9O7j9o9N4K4k6n8R3l5lJ8o1rL6j7MNm6
2636f1R1m2K6qp1O0M6k1pk0K6m2O8k9l6L3ll3K8RJ5lJ8j8l2J2K9m2j2qO1j4j7
2669CKM5p1KK9n7j4P0l2m7N4k2P5j09K6K4N2q3K1KL0QK6Qm7n9N2J3Jk3L8j0J2
2702A9j7o1R7o6kJ9j0J3QL3L7o9j6M2m7L7o9J8P5o3l1N1j7l1J6M4J1o6M4K4m2
2733a9K5M3m1KpM9o8k5O5J3L9k7n8lN0k3M3m2n8R8n6j1L4j1P3r3m3P2OP%k6mj1
2767gK4L5p6M4K5m5r0P7K7K8m6lKj4Jj1R3m8K1kn2M6J0l8Knj5L1k6N5l6k6N9m4
$$ plain form
2801 -4 27 -16 -15 -20 -37 -44 -64 31 4 -19 -1 68 48 -4 -32 23 21 34 142 -40 8 29 -26 21 36 -20 4 38 8 -34 21 60
2833 60 14 42 8 30 8 45 -15 -73 -11 -2 -22 7 -28 -21 21 -83 97 13 -100 9 29 -30 78 -36 3 25 -19 -29
2861 -29 -4 54 -13 22 -31 -5 36 39 82 43 -44 -14 19 -22 62 -2 -18 37 23 24 -42 -47 40 14 -84 -73 -5 -60 -21 -21 21 -3
2893 -3 -58 -9 1 -44 11 38 22 19 -16 -24 -83 -26 -29 -21 -26 -22 77 46 54 -10 0 51 3 57 21 8 14 35 8 -24 35 37 -26 31 53
2928 53 98 35 -45 -37 -37 -20 -30 -9 -3 0 -62 45 31 -15 36 28 -18 15 13 50 16 -4 -11 -36 -51 15 -9 21 -21 54 45 31 -6 17
2962 17 28 45 -8 -18 -40 46 26 39 10 -26 9 0 -29 -65 -15 -27 -30 31 -13 -41 -39 -17 -28 27 15 37 19 96 22 11 -4 -25
2994 -25 7 -32 10 18 -16 -31 -30 -14 8 -57 40 -38 1 22 29 -16 69 -27 39 3 11 6 -7 10 -22 16 -20 15 -36 31 16 15 -40
3027 -40 -17 -16 19 13 -16 19 20 -4 33 94 11 68 28 -4 -35 -5 -14 32 -26 -15 38 1 -12 1 -56 -26 11 -40 -34 -20 83 4
$$ packed form
2801dL1m3Jnj7pk0R5k7k3J8O9k0n2k8N5kJ3J08j82M8K1n5M7J5n6K4L4l0m2N5L9
2833F0m6K8l4K2k2L7o0n8O2Rk0K9l5PM2j04J80q4j13J09K0n9J08j14L9K2m4j0
2861b9K5N8o7L5n3K6M1LM3l9q7L0L3m1Q4o4j6N5j4Jo6nQ7k6r8J1O8n5L9%M2k4
2893cn5M9J0m5N5K7j6ll5qn9N7lQnMR9l1Qo4J0N1m8N4l6j3OK1k7l2N9Ko3N7K2
2928E3M5o3q0Q%J7j0K1OLo2J07j4m6N1qm6L3kL7l4k0pk5j5O6k4L0m2P5rj4l7K3
2962A7J1J7n3j0k2Q6k0J3k9l6L5rk9l6N0j2lO1m4k8KK2j1N5j2K2j8P7p4j1j5k1
2994b5L2l9M2Ql4j5JJ6K2o5R7p8L9K1Pm5Q5r6O6l6Qnj3J7l2L8l6L5n1O7j5jn5
3027d0K3JL5ok9L5Jk4L7O1q3N7m0l2l1L0rM6n8J1N3l7j3J3n7L0L7n1OJ4J03p9
$$ plain form
3059 4 14 31 3 34 27 -8 -40 13 -33 -19 36 -49 21 25 -47 9 -16 18 -26 -9 -41 70 -56 9 25 -44 23 71 6 -1 -40
3090 -40 -26 23 -9 25 28 23 46 -5 -48 18 -47 -30 -50 -18 -57 -25 -49 -4 82 11 2 27 -19 40 44 -16 -8 -20 -12 46 32 26 24 36
3124 36 34 83 -28 30 37 -44 2 -14 3 -1 69 -5 17 -9 -30 44 -3 18 23 -6 -48 5 -2 34 -29 33 14 -11 -24 4 -5 -19 52
3157 52 -39 33 -10 6 77 -28 57 -26 26 -2 32 -5 41 37 12 53 -5 -24 0 33 27 -20 2 11 -17 -14 -23 -14 -4 7 30 -87
3189 -87 43 11 5 -24 3 -27 -50 -22 33 -17 -38 45 -12 -35 -8 -7 43 24 60 20 -25 -21 18 -21 -8 52 -45 -21 1 50 -43
3220 -43 -4 25 -32 -16 24 25 -31 -17 -1 -14 -8 5 -41 36 23 -23 -3 -38 -9 30 -6 -14 0 24 -8 21 47 -30 -9 4 21 -10
3252 -10 2 -19 40 -13 11 20 48 -20 -7 13 -34 -9 11 4 -18 6 71 70 -49 -5 -59 -54 -53 -33 -20 18 -38 -16 59 43 6 -33
3284 -33 -23 2 58 32 43 63 -38 23 -11 -42 26 16 34 4 44 3 8 50 10 -31 -6 -6 15 -18 7 -80 -1 -3 48 11 -32
$$ packed form
3059DJ0J7k8L1pl5l2N3m6J4N5q5P0Mp2N6k5L4m4J7l2J11j26O5J6o9O7M8o5pl9
3090d0J4M9l2L4LnK3n1m3O6o5J7k0L2l9L2k4M5Q6p1rK5m6N9Mo0Qj2QN8j4okJ2
3124C6kM9j11N8Pq1M6j6J7mP0p4K2k6k1P4m7K1Nk9m2N3pL6o3O2j9k5j3K8rj4P1
3157E2r1P2m3J6P1j05Q5q3N2k8L4l7M6mk5M1n8j9K4L3om7K2Rk8LrRJ0J1K3j17
3189h7J30l2ok9K7l0k3K8N5n0k1Q3n7k3K7JN0j9L6m0m5ML9l9J3O0r7K4K2M9r3
3220d3L9K9n7J6M0Jn6J4J6j3OJ3m6P7j3m6K0l5K9L9l6qJ4K4l2K9K6p7K1J3J7l1
3252a0J2k1N9n3K4RK8o8J3K0m7K5K0pk2K4O5jj19M4n4NJK0J3L8n6K2P5j6l7l9
3284c3J0K5N6k6J1K0j01O1l4l1O8j0J8l0M0m1NM2m0m1K5%K1l3K5q7P9kN1l7m3
$$ plain form
3315 -32 16 40 37 -62 5 15 20 6 -10 -46 16 -33 32 21 21 -32 6 21 48 50 46 20 -7 5 68 -19 25 54 8 -29 -23 9 62
3348 62 -7 -27 48 -26 0 -6 52 -33 7 38 -24 -37 -30 -3 -8 -6 13 15 0 -12 -24 12 2 14 -23 30 -25 -81 21 36 -5 46
3380 46 70 9 22 -48 15 -44 27 26 42 10 17 -42 11 -32 1 -4 -39 26 9 30 7 22 -36 -60 -7 9 -21 21 -19 34 -18 -19
3412 -19 42 -11 -4 -41 38 78 50 38 31 -4 -12 7 33 30 -40 -7 39 49 65 -42 34 67 22 44 -25 -33 12 -70 10 106 -5 35
3444 35 -23 15 -49 -16 0 -33 54 47 5 44 13 23 37 24 25 13 33 21 -39 -10 -51 -30 22 26 41 -6 18 35 -45 -34 -14 -48
3476 -48 44 21 -16 26 51 -12 -39 23 57 -28 -1 -11 24 -7 13 -29 34 46 -10 9 -11 -19 53 39 8 29 -21 40 -8 35 -19
3507 -19 11 -56 38 -24 -19 18 -21 -22 -30 -5 -42 8 -49 34 13 -7 22 -16 -16 -21 13 4 16 14 -54 -28 -29 -26 18 35 -53 7 -21 -5 1
3542 1 9 57 -17 40 75 7 10 9 -1 -51 -1 -17 -6 36 36 82 -15 -50 18 30 -43 22 -12 37 -32 23 -41 13 28 -27 19 -40 -8
$$ packed form
3315c2M8K4lr9O7J0Nj4j6l6O2m9O5j1%n3L8J5K7Kmk6k7J2O3q7M4K9m6l7OL2N3
3348F2o9k0P5p4K6oN8q5M0L1o2j3PK7nKJ9Kj5j2j2L6j0J2l7N3n5n6J02J5m1N1
3380D6K4o1J3p0O3n9P1jJ6l2Pn9N3m3L3nl5O5j7K1k3J5n8k4N3J6l0M2m0N3n2j
3412a9O1n3Pl7P9M0k8j2pl5qJ9K6lp0L3M6J0J6j07P6L3m5K2o9qM5q2Q0R6j11M0
3444C5n8L8o4L3J6l3Q7pm2L9l1J0J4j3Jj2K0j2o0K9m1K1N2MJ5m7K4J7q0J1K0l4
3476d8R2k3l7M2K5o3k7O2L4q5K7j0L5l1K0m2O3J2n6J9k0qP2j4l1K1n0O1m8M3n4
3507a9L0o7R4o2NL7l9jqK5l7N0n7Q3k1k0K9l8%nL4rJ2ko8K6jLM4J7q8O0k8J6O
3542AQM8p4N7L5o8Ljj0n0N0j6J1M2%M6r7l5O8J2p3O5l4M9o9N5o4N4J5n5M6n9L2
$$ plain form
3575 -8 -7 31 17 32 -48 8 -21 -29 31 56 39 29 27 48 -5 57 -11 -31 75 6 -11 16 24 -39 61 34 -20 5 -11 36 22 19
3607 19 -24 -10 -47 -7 35 -3 29 -13 -12 10 19 -7 28 -15 5 61 -44 7 -19 -2 10 93 7 33 42 27 38 -63 -20 61 -63
3638 -63 -20 31 -31 38 15 -39 -25 -63 6 29 14 27 6 41 -79 10 -5 -15 33 3 41 31 -17 14 -16 -18 -58 27 46 -21
3668 -21 -40 -20 -40 33 -28 21 0 2 -33 28 62 -30 55 -6 6 -21 -91 -50 -44 28 -2 -4 4 9 -37 8 -14 -47 47 16 49 14 -52
3701 -52 -19 17 8 -25 57 -10 43 -33 10 -13 -17 16 28 -4 45 16 51 -1 10 9 58 -9 -13 6 65 -5 16 -12 1 45 3 -13
3733 -13 -18 -37 5 22 -13 -26 -54 5 -21 38 33 44 -9 -27 -44 43 42 -63 -23 10 12 -6 36 5 16 48 95 36 -18 54 -18 -4
3765 -4 10 53 22 12 -5 26 77 29 51 -2 -10 -7 20 -22 -6 7 -34 47 20 -22 -22 27 -14 -39 48 3 0 -81 -25 -25 31 -3 62
3798 62 25 81 45 31 1 -13 71 26 -27 -6 49 -70 32 -16 1 -8 -50 57 -24 -32 -27 4 21 80 27 -26 6 16 -25 13
$$ packed form
3575hJL8j4J5q0N6k9qO0K5j7j0kK1n3O2o8k0J06o9j7K7Qo3J00k7n4K5j6M7j4l
3607A9m3J4l7M0M2l8L2m2JK2Rk6L5m3K0N6j05N1k6J7J2Q3q6K6Rj5J1j01M3Q1j24
3638f3M3N1o2O9k3n4J4l8O9K3j5J3k1L5j20Q9j5j0M8l0L8j0m8L1l0km0Q5J9o7
3668b1j9K0k0P3o1M9k1Kl5O1L4r2Q5o1J2k7p0M1OP2l0kQNm6M5k2l3R4l1L3l5o6
3701e2L3L6rl3Q2o7N3p6M3k3mL3J2l2M9k9L5n2J1jM9o7mJ9N9p0K1k8J3M4m2j6
3733a3nj9M2J7l5j3k8N9k6N9nJ1n3j8j7Q7jj05M0L3Kj8M2l1J1L2M7n9n4P2p2J4
3765dJ4M3l1j0j7L1N1m8K2n3qLK7m2J6J3m1Q1k7m2%M9m1k5Q7m5lq1N6%N6l4O5
3798F2l7N6l6j4l0j4Q4m5n3K1N5j19J02m8J7rm2J07q1qNL1J7N9n3n3L2J0m1L8
$$ plain form
3828 13 -51 -4 52 9 -26 10 -30 8 14 17 42 27 29 -5 21 -37 17 13 -21 19 -57 1 5 10 -1 14 44 16 -4 14 -62 2 48
3861 48 40 -27 66 -4 23 -42 24 12 -28 -9 -37 44 -4 23 38 56 15 -55 -33 38 10 9 57 23 27 63 -41 18 -6 -34 -66
3892 -66 15 -32 -2 -25 4 -30 5 -4 41 21 -6 1 -47 -37 21 -32 -65 1 2 73 -17 -32 81 7 -40 32 65 7 40 -48 28
3923 28 -19 24 26 20 18 -20 32 53 8 20 53 6 28 -57 -7 54 -9 4 56 25 -56 -36 13 -40 -31 -19 2 8 23 -7 12 58 35
3956 35 -52 16 78 24 25 -45 33 -11 -6 58 -34 27 -13 -18 9 9 8 -11 -3 31 46 2 62 23 -19 17 41 -8 -54 -35 32 -41 36
3989 36 -61 22 -24 39 -30 -59 -43 -5 -20 -8 15 -48 -14 39 -6 32 -9 27 66 35 -16 10 13 -25 -2 -45 -17 22 -3 8 -14
4020 -14 0 -33 56 11 26 2 13 1 -1 -2 -26 -2 14 27 -37 33 -21 84 -8 -76 -14 29 5 9 11 118 35 0 -15 49 -6
4051 -6 -31 28 -4 -20 -42 8 28 -59 -12 0 43 -3 9 -5 -11 22 -57 -8 -24 -38 -49 -4 -52 37 -14 -25 -5 -6 -22 -11 -55 -1
$$ packed form
3828A3o4M7N6m3l5L6m0L8OLK5j5Kl4K6n8N4ml4M0p6N8MNj1J5L0k8k0J8p6O4M6
3861D8qo7R3p0K7o5O6j2m0J9k8Q1m8K7J5J8m1p0K2P1k8jM8l4ML6j04N9k4k8l2
3892f6Q1m7L0k3K9l4L5rM5k0k7Pm8J0N8n3l3O6JP1r0j5J13p4m7P2L3n8L3q8P6
3923B8m7M3Kokl8N2K1m5J2L3m7K2q5N0O1o3J3N2l1q1K0M9n3RJ2K1OJ5l0J9M6k3
3956C5q7O8O2n4Jp0P8m4NO4r2O1m0nK7%jj9QL4J5m4O0l9m2L6K4m9m6J9O7p3P7
3989C6r7Q3m6O3o9k9J6L8j5J2K3o3L4N3m5L8m1L6L9l1n1K6Ll8K3m3K8L9k5J1k2
4020a4J4l3Q9m5J5k4J1j2kjk4K4J6J3o4P0n4J05r2o8O2M3k4MKJ07q3l5j5O4n5
4051fk5N9l2j6k2N0K0q7M7J2M3m6J2j4oL3p9M9j6j4j1M5m8Q9n1j1K0jj6J1m4N4
$$ plain form
4083 -1 29 -20 6 42 80 -16 57 49 -43 46 10 4 28 5 27 -10 21 -5 20 -29 5 13 -45 -1 60 61 68 27 13 -29 -43 -6 -35
4116 -35 -63 21 2 -13 -77 -4 -9 1 -1 -55 11 -19 -17 -19 18 -36 -36 11 24 7 -4 17 16 -6 -11 35 4 -6 -1 -20 24 -17 33 32 -22
4151 -22 -43 19 -33 -15 36 21 7 -36 25 -12 28 3 -39 32 -10 -43 -46 6 8 2 4 -24 5 24 32 12 31 -12 -25 -22 7 -22 0
4184 0 -40 -27 32 3 9 -8 -9 -47 -8 -44 7 11 -50 16 -40 30 -46 -10 3 -26 3 -22 40 23 -1 -24 -34 -20 18 -13 -17 62 36
4217 36 -10 40 53 14 -39 25 25 3 -8 -11 13 -43 11 28 12 39 16 -16 -26 -45 44 -61 3 -15 6 13 15 -12 -31 -103 19
4248 19 -30 -1 37 34 16 7 -20 5 -11 17 -6 60 49 -61 11 -23 -35 20 23 27 21 -61 7 -40 9 52 -20 -45 -7 -49 -35 9
4280 9 -5 12 16 -25 4 -23 -44 -16 -2 -6 23 6 -2 14 10 -5 30 21 3 -45 -17 14 -20 11 17 -45 3 5 78 24 -43 -27 81 45
4314 45 35 -35 -14 12 -9 15 36 39 1 -48 -13 -46 -3 -47 -34 4 25 -7 -5 -15 -33 -25 -11 -15 8 11 3 -58 -5 22 -4 9 65
$$ packed form
4083aL0m9K6L6L8r6P3qr2Q9l6oK4k3K2l7L1k6K5m9L4Qn8M4O1JPm1j4m2j4L7k9
4116c5k8Q4j9j5o4P3nJ0kn4O6l0KkL7n4%M7J3j7j1K1jk2nM6l1j0Nj9M4m1N0jn4
4151b2k1O2n2J8N1j5j4m3O1l7M0k5m2P1m2l3lN2KoKk8K9J9Qk0J9m3j3LK9k9K2
4184@m0J3N9k9Oj7jl8L9l6N1Mo1O6n6P0p6L6J3k9K9k5O2j7k4k3j0J4L8l1mP9k6
4217C6m6N0J3l9n3O4%k2j1lK4n6N4J7j6K7k3l2j0j9Q9j05O4j8K1PKk7j9p2J22
4248A9m9K9L8lj8rk7K5j6K8k3O6j1j10P2l4j2N5LMoq2O8m7M9M3p2k5L8m2J4M4
4280Ij4J7Mm1K9k7k1K8J4mK9j7qJ6mj5L5rj8m8K8L1l4L1Oo2M8KP3n4o7J6J08l6
4314D5j0p0K1K6k1K4K1Ll8m9L5l3M3m4J3L8K1l2Kj0j8QJ4mK3Lqo1N3K7k6J3N6
$$ plain form
4347 65 -25 47 -34 15 53 30 22 -45 57 3 18 -43 -36 -49 23 0 -28 -14 32 -26 -40 -69 -4 10 8 -16 -18 -16 -17 -9 10 16 -57 -66
4381 -66 -18 23 12 4 20 -6 27 -18 -38 9 3 -19 0 36 37 -3 -2 -9 -18 29 -10 23 15 -11 -24 68 -21 19 -7 -52 -82 -20 -47 -40
4415 -40 -6 1 -45 26 23 -19 -17 -13 23 69 21 -74 32 -25 27 33 5 62 31 24 34 -10 15 -6 -3 9 13 25 -23 8 12 27 -6 12
4449 12 29 -14 31 -22 11 15 -1 -13 -41 -13 -6 13 -40 15 -39 -27 -40 -53 23 -9 -1 32 33 10 48 8 -11 3 -13 -10 -21 8 24
4482 24 19 12 37 5 -5 -20 -5 -2 -38 -28 -10 -10 -66 27 -27 -11 20 20 -21 15 2 -8 -1 -15 8 -31 25 14 41 58 7 -2 9 65
4516 65 -5 44 66 -5 68 28 47 21 -34 -34 -10 -30 -12 33 7 -17 51 28 -19 28 -29 -18 7 -9 12 -34 44 -12 12 33 14
4547 14 13 -11 -16 3 2 32 -32 51 20 1 69 53 34 10 14 -32 6 15 -7 22 -13 19 5 8 -49 31 -31 22 -12 -8 29 -40 19 46
4581 46 7 13 4 -35 -2 -53 -38 5 10 -34 -67 25 37 -38 0 14 -19 -1 11 -20 25 35 -21 5 22 -56 11 10 6 8 46 -23 -15 -5
$$ packed form
4347F5r0P2q1M9L8k3qo7J02n4J5o1Pj3P2k3k8J4M6n8j4k9O5J4kk4kKjQJ9Op3r
4381f6M8M1j1qJ6k6L3m5k0M7ok2J9L6Jm0JprM7l9L3qk6j3R2q9M0k6m5l0O2k7P
4415d0L4Pm6P1lm2KML6M6m8r5J06n7N2Ok8N7l1pJ0m4K5k1LJ2MJ2m8L1MJ5l3J8
4449A2J7m3M5n3L3Mj6j2k8K8PJ9n3N5n4J2j3j3P6l2QL3Jk3L8m0j9J4j6Lj1K9J6
4482B4npK5l2j0j5J5Ll6J0J8%n6R3n4J6L1%m1L6j3j0Pj4K3l9N6j1K7J7n1rJ1N6
4516F5p0M9K2p1P3m0J9k6n5%K4k0J8M5k6k4O8k3m7M7n7J1K5j6K1m6P8n6K4K1j9
4547A4jk4nJ9jL0o4Q3l1j9O8j6j9k4Mm6L8Rk2K9l5L2j4Ln7Q0o2N3l4ML7o9N9K7
4581D6l9Orl9L3n1J5M3Nm4l3R2J2p5L8J4l3J8J2l1M5J0n6K6J7p8O7jmKL8o9QJ0
$$ plain form
4615 -5 3 -5 16 -18 6 67 -20 -6 -25 -33 -23 -33 51 -16 -45 -4 -23 17 -16 -68 -1 -3 33 24 32 30 17 -19 -26 -8 -14 -24 9 -19 21
4650 21 -14 -52 -22 -46 1 53 46 9 -18 -24 3 21 -29 -13 66 14 -21 -11 4 -31 -35 -10 31 41 21 -4 35 13 -20 -26 21 18 25
4683 25 34 23 22 4 5 -8 27 0 -22 1 40 -78 14 -7 22 0 -10 21 -15 -40 -65 42 -20 -27 4 -14 23 9 -3 -2 -13 -4
4715 -4 -43 9 18 -29 27 32 15 -2 -7 -34 32 25 -7 13 -7 54 -58 -33 -1 15 -20 -32 17 -44 23 7 -11 9 10 -6 -17 -48 -25
4748 -25 28 27 72 -39 -8 -14 -37 58 10 -43 40 -8 23 -22 42 1 33 8 9 13 12 -1 -23 -11 -60 -22 45 -8 4 -30 35 -5
4780 -5 -23 61 -17 41 -23 44 -10 -21 18 -17 31 6 18 32 -43 21 18 -32 -25 -53 -43 33 33 -15 40 12 -9 -4 -24 -30 1 16 -2
4813 -2 56 35 19 53 8 52 28 -7 -23 -7 54 20 11 -20 28 -40 66 -28 -96 1 -58 -21 24 -21 -1 -65 1 21 -22 -28 -23 -12
4845 -12 -1 55 -40 -47 20 29 15 52 48 -17 52 -2 91 -22 -6 62 20 -3 12 -30 19 -56 -97 15 40 2 -24 -6 34 4 -24
$$ packed form
4615eQqK1l4K4O1q7J4j9qJ0j0Q4o7k9M1j9M0l3n2O7kL6rQkj3l6pJ8oj0L3k8M0
4650B1l5l8L0k4M7N2pl7k7oK7J8n0J6P9n2l5J0J5l5mK5M1J0k0k5L9k2l3oM7lP
4683B5Rj1jj8Jj3L5k7k2K3L9j18R2k1K9k2j0L1l6k5k5J07o2pL1j8L7j4j2Jj1R
4715dl9N2Rm7N6Nj7j7nk7O6pl2K0k0O1j12K5L2J6l5j2M9o1O7j6j8K0Jj6j1l1K3
4748b5N3jM5j11L1ok3R5m8n3Q3m8L1m5O4m1L2k5JMjj3k2J2m9L8O7n3J2l4O5m0
4780ej8Q4p8N8o4O7n4j1L9l5M8k5J2J4p5O4ln0Pk8J0P6%m8N5k8k1Nk0oL1J5j8
4813bN8k1j6L4m5M4k4l5j6J6O1l4rl1M8o8J06r4o8R7n9L7M5m5K0o4O6K0m3oNJ1
4845a2J1N6r5pO7Rj4L7mo5O9n4R3j13J6O8m2k3J5m2M9p5m1J12K5l8k6J8M0l0k8
$$ plain form
4876 -24 32 58 -26 -5 39 -60 -10 4 37 -19 23 -62 -10 2 25 68 1 26 27 10 -28 10 -13 -46 -20 20 11 22 31 -46 18 -5
4908 -5 16 37 21 -13 44 -48 5 42 19 16 -4 -24 4 35 -23 -11 -11 13 -78 -24 -15 0 -57 -25 -6 -6 -37 -51 -6 -19 42 4 48
4941 48 -14 2 5 22 -8 54 20 -26 -54 42 -18 27 -32 -14 -17 -66 -28 0 34 -15 -13 -8 13 7 -47 -8 3 49 15 15 53 15 -95
4974 -95 57 -37 -15 13 -7 18 38 44 28 37 -24 48 16 -38 4 5 37 -11 -15 15 5 22 -7 -32 40 13 48 -2 9 -35 -30 -32 -9
5007 -9 50 -6 7 -4 -53 24 6 -61 41 -36 8 -2 13 -9 -4 28 -37 -1 30 4 45 15 -25 38 30 52 26 18 5 31 32 -9
5039 -9 43 -46 -14 -11 23 -27 -6 39 29 -5 93 -21 24 -23 19 8 6 -17 12 13 29 97 -42 56 -44 -4 -4 -13 -19 -20 -48 51 2
5072 2 -3 7 -2 21 44 -24 5 15 27 -18 6 -8 -29 13 -59 28 5 8 -9 19 -23 -20 -21 -62 -21 14 -7 -27 -10 16 -2 41 -7
5105 -7 -17 24 -34 -17 -2 -7 4 -53 -33 2 -42 -44 -5 -10 -42 49 0 -41 32 8 -40 -10 -38 14 5 10 43 -40 61 -14 4 32 -40
$$ packed form
4876b4N6K6q4K1M4r9N0J4L3n6M2q5N2J2K3M3o7K5Jj7l8L8k3l3K6M0rJ1Rp7O4k3
4908eK1K1j6l4N7r2N3L7k3lk0k0K8L1n8J2%K4r1N4RJ5n7L2J9%l1j4M5j3O1l8M4
4941D8o2J6LJ7l0O2l4m6k8R6o0M5n9J8lm9L8K8L4m9KNK1on4L9J1M6l4%L8l8j10
4974i5J52r4K2K8k0K5K0Oj6Ro1P2l2n4M2JL2m8mL0j0J7k9k5P2k7L5n0J1m4NkK3
5007iN9n6J3j1m9P7j8o7J02p7M4j0J5k2NL2o5L6L1k6M1l0m0O3qK2k6qj3K6Jm1
5039iN2q9L2LL4n0K1M5j0l4R8j14M5m7M2j1kk3K9JJ6O8j39R8j00M0%rojk8R9m9
5072BnJ0rK3K3o8K9J0J2m5K4j4k1M2p2Q7k3Lj7K8m2Ljm1M1L5k1k0J7K6j8M3m8
5105gj0M1n8J7J5nJ1n7K0L5m4kL9nl2R1m9m1P3k4m8L0k8N2rNL3q3J01p5J8K8p2
$$ plain form
5138 -40 -28 43 -2 19 -5 0 -18 -3 43 -39 -49 0 34 -1 -1 21 -10 4 7 -4 -29 -35 2 -15 54 1 -35 -12 23 -39 -25 66
5170 66 30 43 -35 52 -16 -31 17 -19 -26 -11 33 -27 -1 -2 -1 -22 -7 -2 -15 -42 27 18 5 13 56 -4 30 -17 3 13 23 4 -26
5203 -26 -17 12 10 5 2 -6 19 -39 -9 -30 -39 -4 -18 24 4 -31 42 0 7 30 10 -14 -59 43 20 -4 22 21 4 -27 -36 -34 29 -23 -5
5238 -5 -14 13 0 19 50 35 -14 -14 45 37 45 18 -33 8 0 -15 -7 -30 -36 -23 37 -27 3 1 -15 -21 -27 2 17 -27 22 18 26 13 23 27 39
5275 39 15 44 -70 -72 -3 84 -13 55 1 20 -13 26 -34 30 33 -43 13 -56 27 -7 42 -35 -7 -55 -12 -4 24 36 2 1 -17 19
5307 19 31 -5 -2 -14 38 24 0 28 -10 -42 -27 21 -54 2 39 45 21 -8 -47 -32 4 34 22 5 -18 4 -48 26 -19 -50 -2
5338 -2 16 -89 -5 18 0 -36 35 -46 13 -10 -19 -21 -28 39 -30 -32 -18 23 39 -8 -9 13 48 1 -17 10 8 -4 -18 32 11 -23 19
5371 19 -51 35 19 44 -6 -12 -1 31 1 2 7 -24 -21 -20 11 8 0 -27 9 53 16 59 -24 40 12 17 -10 20 58 48 48 12 -74 17 15
$$ packed form
5138d0J2P1m5K1k4Nj8J5M6q2j0M9L4l5%K2l1J4Lj1k5oL7j7O9n3l6K3L5o2J4R1
5170F6l6J3p8Q7o8j5M8l6pJ5M4o0K6jJk1J5Nj3k7O9rj3QM3o0L4m7K0J0J0j9l0
5203b6RK9knlqK5n8L0k1rL5j4M2k0l5P3m2PK3k0k4m5J02k3k4K6jj7l1rKO3n2J8
5238erK7j3J9L1j5m9%N9qQk7n1M1qj5Qk3oJ3O0o4L0kj6ooK9J5m4M9mQj3J0MJ2
5275C9k4K9j14kO9Q7r7O8n4J9l3L9o0O4Lp6N6o9Q3l4M9p7K8m8M3QK8J2l4jj8L6
5307A9J2l6Lj2N2j4k4K8l8l2J5M8p5N6L7Ok4k9l9J5L6L0j2j7k3K2n2P4m5l1M8
5338bJ8j05Q4K3j8l6P1q1N9k3rkpO7o9kJ4M1J6m7jK2L5m7j8K7kj2j4N0k1l4M2
5371A9p0Q6j6K5n0oJ1L2l0JNl1LJL1lqk7L6M4l7M3q3O4k8Nk7L0L8j0%l6q6R1k
$$ plain form
5406 15 -3 13 -22 -54 9 -38 -33 14 -10 -67 -6 -17 19 -6 -16 20 -9 -10 -19 7 -21 39 30 -6 -2 57 16 -14 25 2 -37 31 14
5439 14 -13 -5 -64 55 15 25 44 -21 -8 9 14 -35 12 -55 0 -26 1 -10 -8 8 -26 40 -14 -3 -40 -29 -13 6 -50 40 -32
5470 -32 -86 5 -46 7 -72 44 -6 -12 -31 -25 -40 -9 20 21 16 2 -41 2 43 11 26 28 4 21 2 -24 39 -8 12 -47 -5 0 -2
5503 -2 22 17 8 -2 -44 40 -13 -16 -15 -87 -21 10 -34 -45 56 3 -17 -30 -19 -11 26 -46 -16 33 -2 41 49 38 -22 2 6 47 8 -6
5537 -6 -2 55 -14 -30 11 48 -12 7 -26 42 48 -14 27 -14 -18 -13 -39 15 21 -35 -3 18 -23 21 5 -51 -24 2 0 -56 -79 53 -6
5570 -6 -2 27 9 54 -22 51 8 3 -14 19 5 49 19 -24 4 -63 -15 28 -10 -2 17 -12 9 -14 -14 -44 -10 30 35 21 -51 -6 -47
5603 -47 -39 43 16 -29 52 -9 18 -3 -25 40 -47 12 1 17 8 28 10 -79 -26 -31 -49 1 -16 43 -3 -15 -37 -22 -102 -39 6 -18
5635 -18 -73 2 24 -21 18 -9 67 19 6 5 15 -15 29 -40 13 -8 -8 22 21 -52 -25 32 6 37 -12 -9 35 -12 -9 -27 -31 40 11
$$ packed form
5406A5j8J6l5l2O3m7NM7k4n7O1j1L6k5j0L6k9jrK6k8O0rl6MN9m1l0L9k3l9O8j7
5439A4k7Qn9J19m0J0J9o5J3J7Nm9M7o7N5k6K7j1KJ6l4O6n4J1l7J1J6J9n6R0p2
5470c2n4R1n1N3p9J16n0oj9Oj5L1K9Jnj4m3M3M1l2J5Kk4J7j9k6O3m7K0n9M2Nk
5503bK4nrj0m2Q4n3lJp2O6L1m4j1J01n3k0j3J1QL7p2L0M9l5M3Qj1o0K4MM1l9j4
5537fMN7o9j6M1L7o0J9l3O8Oo2M1m1mNk6N4On6L2K1m1M4j6n6K7K6kn6k3J32n9
5570fMK9j8M5p6P3m3nj7L3j4M4l0m3K8o7M8M3l8QJ9k9K1k3%l0L4M0Nj4p2M5m1
5603d7QQ2k7m5Q1o1K7k1k2O5q7N9j1J6rK0j8q9N3nj8N0j7N9m6j2k2J5q0O3M5k4
5635a8n5P5K2m5L9k7P6m8j3jJ0l0M4o9N3k1%L0jp3K7N7k6L1m9LM4m7Lj8mP1k9
$$ plain form
5668 11 -21 -23 -26 -48 -22 -39 -27 6 -2 -56 0 37 -48 -45 44 -10 4 -49 16 -33 -7 11 -14 9 -10 19 50 -2 7 29 -39 -15 3
5701 3 -10 -37 38 3 27 12 28 24 -20 -37 -2 -25 -54 21 -9 -13 54 -25 13 -20 10 25 8 -56 9 14 23 -31 -17 46 23 -14 -25
5734 -25 34 28 -29 1 3 19 17 -7 14 -11 -37 41 49 -32 32 -15 -2 0 -24 53 -2 49 17 32 -10 -31 28 2 -32 2 -21 -28 5
5767 5 21 42 13 -32 -27 39 43 33 33 -6 2 31 -6 29 18 21 8 24 -3 7 -25 42 -8 -34 -27 0 24 -56 -3 -41 -8 1 -32 40
5801 40 13 -12 -79 37 -32 20 24 56 -15 -41 -23 -13 -18 2 -33 2 -13 0 49 37 10 -22 43 -30 20 -31 -29 64 40 12 -27
5832 -27 42 -20 -29 40 -76 46 -42 -21 12 -13 -80 -48 -17 22 44 71 -34 18 21 21 36 7 -10 -70 55 -36 -33 -25 -24 20 -100
5863 -100 37 -16 -10 -17 25 21 -21 36 5 -11 -55 35 -39 12 -27 -5 12 -7 25 -29 20 22 41 33 0 -22 0 -33 -29 12 -21 -33
5895 -33 3 11 22 -14 31 -50 18 26 -25 42 -32 10 -1 45 38 38 12 -12 -21 -22 -6 42 32 11 0 6 -2 -45 -8 33 -29 11 -20 -2
$$ packed form
5668A1l2klk2K6j7J2L3qn4N6L7q5LQ9n4J4n3O5m9K6J8k5K3j9K9L1n2RK2o8K4J8
5701Cj3k7P5l5K4j5J6mm4j7L5k3k9P5l0mO7p9L8l3L0J5j7o4O5NRn4J4O3k3l7j1
5734b5N9on7L0KJ6kk4K1k5k6P8Qq1O4m7J3Kk4P7n5N1l2J5m2k1N9k6l4L4k3pL3
5767EJ6K1k9m5NO6Mj0%l9QK9l7L5j1Lj3J6k7J0l2O7n0k6PK7K4q0N3l8L3Rl3P2
5801D0k7k5o7J16o9N2ML2p1k6J8J0nK0l5L5j5J3M9j2k7l2O5p3N0n1KR3k4k8l9
5832b7O9o2rO9j16J22q8K1L3k5o7L2L1L9K2K7j05N2L%J5k9j7o0J25r1LQJM4j20
5863a00J37n3OpM2mm2N7l1j6m4R0p4N1l9K2J7j9L2n4M9KJ9ql3k2K2l3MM1l3j2
5895c3L6QJ1l6M5q1O8Qn1O7p4M2j1M6p%k6k4rjJ6M8j0k1j1Oqm3L7M1o2M0l1J8
$$ plain form
5929 -2 6 32 9 2 13 -22 32 25 -3 19 27 -57 14 32 -16 -56 -12 -14 -6 -1 26 30 -12 78 11 9 3 -29 -33 26 -17 2 32 32 -28 18 -26
5966 -26 3 28 3 -15 -9 1 -38 36 -30 -27 -28 -3 -27 -42 -2 -73 -22 -28 30 0 21 -24 108 -5 52 19 0 16 -13 -3 -8 -81
5998 -81 -48 39 16 -2 -18 -49 -11 26 -42 5 2 -36 57 65 -61 33 0 -14 -109 18 -50 -3 -8 -13 21 -43 32 45 77 -4 58
6029 58 -49 27 -17 4 76 -33 -4 22 42 -27 -5 28 18 11 1 39 15 3 -16 7 7 35 -61 -27 -16 41 29 -45 11 16 19
6060 19 10 -40 24 -16 -40 -29 -11 -55 61 -32 -12 15 -39 9 -9 -4 5 -4 -2 44 -12 -13 17 -23 12 19 3 2 0 -9 4 -46 -15 -68 14
6095 14 -57 -25 -43 -27 -19 41 -21 35 4 -14 7 -18 12 1 1 -12 9 -15 38 -34 24 13 1 44 -33 51 16 27 -27 17 -6
6126 -6 -23 -19 -41 19 -46 8 -18 21 1 -9 59 35 -47 26 -51 17 -18 66 11 48 -26 -24 -29 2 -61 -4 -10 -25 -23 -3 36 27 13 9
6160 9 53 5 34 16 17 -4 50 -30 21 -2 18 -39 -15 -15 -8 -16 -30 -26 31 28 -36 33 -25 -7 27 -25 -20 -34 0 29 7 -8 27 6
$$ packed form
5929bQK6k3pJ1l5N4pk8K2Qq4P1J8m8m0M4kQNK7Mm2R0o7kol2mN9m3J9L0%o0M6m4
5966b6K9K5k5j8OJ0l9P4o6LjK5k4j5M0p1N1oN8l0K1m5J32j13N7l3j9J6k9J0np3
5998h1L3Q7k3j8j6l1L8L7o8M7ll8R3Qj26R4l3j4r5J27o8M7nnL4o4P5J3L2q1O2
6029E8j07P6m4K1P2j09K9K6K0o9K2L3j0pj0L8k4j2j9K3%K8r6L4J1N7j2p4N6NL
6060A9rn0O4m0k4J1J8m4J16r3K0K7n4M8j8NRrKM6n6jL0m0L5Pj6jkrJ3n0L1n3Q2
6095A4p1L2j8J6QO0o2N6l1j8K1k5L0j1%j3K1k4N3p2N8j1j2M3p7Q4l5J1n4M4k3
6126fj7Mk2O0o5N4k6L9k0j0O8k4q2P3p7O8l5Q4n5L7p4KnL1o3N7oj5KK0L9rj4m
6160IM4m8K9j8Jk1N4q0N1k3K0n7K4%Pqj4MN7lo4O9n8J8L4n2Nj4L4K9k2j5L5k1
$$ plain form
6194 6 -4 69 -21 0 5 2 -11 5 30 -25 16 -5 44 21 -17 -67 46 17 4 30 -35 -59 43 15 32 3 -10 26 5 18 -22
6225 -22 -58 -13 69 -37 -62 25 -14 -2 -31 16 33 -85 -10 -65 -64 18 -24 24 -6 33 4 -2 -25 29 23 -31 54 17 30 20 2
6256 2 -11 -14 -14 8 -1 6 4 -29 4 34 -77 -33 -12 -71 -30 8 -17 16 30 -4 20 47 87 20 26 1 29 -2 36 -11 16 45 -9
6289 -9 -10 -2 2 -1 35 -13 15 -12 30 -48 -39 -32 -9 44 -19 8 0 27 7 1 0 -13 -55 -35 -68 -3 -2 42 6 13 59 2 -11 -5 2 -28 -6
6326 -6 0 11 38 8 7 53 47 8 16 -26 33 -17 -1 -22 18 -30 29 106 -2 16 9 -12 33 39 -59 -36 30 -5 15 28 -20 -34 -8
6359 -8 41 -30 -31 40 -20 0 -5 19 -17 -28 35 -46 -23 48 14 18 -53 -28 98 -4 -10 1 -3 -26 -3 37 -11 -13 4 -41 -11 -3 -41
6392 -41 -9 -20 -29 -5 -31 44 7 -66 -22 -33 31 -9 8 17 38 38 -6 -16 -7 30 -12 -32 44 -58 -28 31 36 48 4 9 10 -14 17
6425 17 -13 -26 -22 9 2 -26 73 -2 -1 -41 -55 -14 -8 -9 -11 -59 44 -7 18 18 45 3 -13 3 -29 -9 50 20 8 28 36 1 -27 9
$$ packed form
6194Fj0P3r0K1Nlj3J6K5n5M1k1M9k3l8n0J13k9j3K6o5k4J02k8J7k9j3L6k1J3m0
6225b2l6M5Q2j06k5Q7l9J2k9M7J7j18P5n5JQ2m2M8l0L9k9ok3N4on4Q5l7J3j0j8
6256Bj3l%K2rPkl3L3L0j11M4K1n9M1L8k5L3J4l4K4K7M0o7Ok5K8l1L8m7K7K9n4
6289ijQMlL6m8K8k7M2p8RPK3N3o3K7qK7k0ojj3m2K0l3O5JM4l6PM6n7j3OPl0K2
6326fOJ1K7l0jM6ol9Qm2N9n0J6k1M0m8N9P7j08J8pk1M5Or8K3O6l5K0J3m8j4K6
6359hM9p1jP1o0K0nK4l6j1O3q1K3P1l4Mp1K5J26j02oJ1mk3K3M0m8kJ7m5L0Ql8
6392d1L2j1rK4k6P5l7p3M4j1O4m0J7RK1%m4j0RL7m2k0P6j02L0N9NJ2m4NJk4L1
6425A7l0j3ML1pk8R9p5Jm0j4M1Ojkm8J03n1K5%K7m2j6J6l2K0N9l0j2K0Ql5k8L6
$$ plain form
6459 9 6 25 23 -38 -14 -30 -6 -25 -37 54 38 5 -44 42 -16 -22 -66 -10 33 -25 -30 -23 3 15 -38 -30 -12 5 -7 38 -21 -29 30 -82
6493 -82 -29 -44 11 23 18 -14 42 39 4 5 -58 16 -48 58 81 41 -7 -24 -21 0 -12 -57 48 -56 -3 -36 -104 9 -27 6
6523 6 -28 -31 -13 13 15 -3 56 12 25 39 -16 -41 -6 23 -34 -5 2 4 -19 -64 7 -2 -3 64 -12 -17 34 15 -36 38 -29 5 -77 -17
6557 -17 16 -38 -8 -3 7 20 -18 51 -8 -43 31 35 0 9 0 -38 11 -32 12 25 -5 -28 -13 6 37 2 11 27 43 -12 40 43 -49
6590 -49 -25 -4 -4 -3 24 -17 -22 57 -28 39 2 3 -11 -1 -4 -35 -33 -71 -57 12 5 3 27 26 -42 7 54 -23 4 -24 21 5 40 3 -8
6625 -8 -5 20 -15 5 -33 -52 -23 -48 44 6 17 -56 -30 -5 49 9 2 -7 -21 9 -37 -33 4 16 -53 19 -12 -15 44 -14 7 49 -86
6658 -86 -14 -65 -28 4 3 -7 35 5 -22 44 -9 27 17 -13 18 58 -7 4 9 12 -14 64 4 -22 -17 -43 -17 -39 -11 -17 -4 -26 -20
6691 -20 -7 3 8 -20 14 -5 18 11 -50 -19 -7 20 31 -19 -39 39 20 -43 11 24 -19 44 -26 -47 -16 -22 6 1 12 43 -54 5
$$ packed form
6459IlJ9ko1K4j6K4j9j2R1j6l3m9Q6n8om4N6M3n8nPK6J2n3QJ8J7j2M5n9qN9j12
6493h2N3j5N5J2nl2N6ll5Jo3P4o4J06K3m0m8j7LK1j2m5J05j04N3l3o8J13l6L3
6523Fl4lJ8K6Kj8N9m4J3J4n5k5L5K9n7K9PKk3m5P1rjO7p6nN1j9n1P4o7L4q2O0
6557a7L3n4L0NJ0J3l8O9n9l5P4Ml5Rrl8M9m3M4J3l0k3J5J9L1l5RJ6J6n5N2Lr2
6590d9K4K1%JK7m1nP9q5O7l7Jj4J0ll1Kl8J4O9pkK4jo8M9M7p7K7k8M5j6L5l7j1
6625hLK5l5K0l8j9K9k5R2l8J1p3K6K5N4m0prj4L0m6ML7J2o9P2l1lN9n8K1M2j35
6658h6P2n1L7L2jj0M2l0k7O6n3L6j0l0L1M0o5J1NLk6P8o0k6Nk6K6k2K8oJ3k2O
6691b0J3J0Nk8L4j9K3po1L1J2K7J1n0k0P8j9o3N4J3m3O3p0k1L1oK8nJ1L1r7N9
$$ plain form
6723 5 -17 -60 2 9 -12 36 -15 -2 52 -3 -86 -4 2 22 -29 3 1 -16 -9 -48 14 3 7 -32 1 -18 17 71 -20 -31 -36 -1 -31 4
6757 4 12 52 10 -31 -4 40 -41 24 59 -35 -12 4 -46 -15 -12 -32 12 41 -17 -77 -28 -32 30 -21 64 79 -9 3 -11 55 14 34
6789 34 17 -5 10 -35 -19 -40 22 -5 29 -27 50 -27 28 37 -30 8 8 -23 -55 -24 -34 -12 -27 -24 27 6 11 -39 -5 39 -14 14
6821 14 -14 34 -2 35 0 35 -7 -20 -19 -11 -45 -8 -19 3 32 -19 -1 2 -14 15 -44 -27 -8 -2 33 45 1 40 28 -15 2 27
6853 27 -1 -33 -43 -77 -2 -12 -40 -10 -2 -45 -42 -17 -38 31 32 -56 60 -23 -9 73 45 -57 15 35 -21 47 -27 41 1 3 30
6884 30 38 -15 -27 -21 65 11 13 -58 55 -50 31 -1 -98 4 32 1 -18 -20 -8 15 1 6 54 28 9 -39 4 65 23 -2 -17
6915 -17 32 -41 -37 -2 16 -44 30 -11 -2 -8 5 -8 60 -37 -15 2 14 19 -9 13 -28 15 21 11 -58 36 1 -61 -4 -19 -1 -4 7
6948 7 2 8 -52 -57 -12 26 24 -50 -4 76 -11 2 27 31 -25 -24 60 0 -12 -25 -43 -10 14 -37 -16 2 -54 38 -5 -15 -36 -15 -1 -38
$$ packed form
6723Ek2m3O2Pk1M8n1J3N4n5q3Q2OK0n1L2kj7Pl9O2j1Ml9L3j9L5N4r1j1nL5l0L5
6757DQM0m2m1K7M4q1O5L5r4K3J6n0L1Lk0M4K9n8o0M9mO2n1Q5J5q8J2j4O6m1K0
6789C4j7k2J5m5J6k1O2k7L4n6P7p7N5Ro7L8%l1l2L1j0K2j5LN1k1Nn0L4M4n3K8
6821A4k8M8l6L7l5L5m2j3JQl4L7j1K2K9n1J8Lj6K9n9J7J9OL5J2m4L9j2m3J7K5
6853B7k8l2j0l4P5j0k8L0Qm3LK5k1O9Jq8J16q3J4Q2k8j02P2K0n6O8p4O8m0KK7
6884C0Qn3j2OQ6n4Kp1J13j05Q1l2r7J02K8l1j9kJ2K3j4NM8k6j9m8M3O1m2k5j5
6915a7M9p3ML5J8o0P4m1RoJ3j3O8r7K2J7J2Nk8K2m1M3Oj0o9R4l5o2N7j5J8lJ1
6948GnOo0nM5L8kp4M6Q0q7J3K5Mn6JQ4o0j2j3j8L3K4n1K1J8n6R2m3j0k1K1J4l7
$$ plain form
6982 -38 -30 -26 -43 41 45 -10 -47 -28 -14 -24 10 11 -5 -45 -24 19 28 1 -18 36 2 36 27 -14 -4 -16 36 10 36 2 34 7 1 11
7016 11 38 16 -66 8 -40 37 -6 15 10 -48 -31 0 -19 20 -31 -9 -89 -5 -15 12 23 10 35 -21 12 13 42 12 32 6 -2 0
7048 0 53 7 13 0 -24 -20 5 -10 28 27 46 -22 39 -8 6 -28 31 15 -33 42 32 -40 -1 13 -30 -43 -3 0 -34 -18 57 20 12
7081 12 18 -37 -7 -22 55 13 -27 0 26 20 2 -7 34 -48 -35 65 -19 -5 -25 -26 -59 -15 30 -24 3 59 41 12 -10 -39 44 56
7113 56 10 1 8 -11 -1 44 -30 -3 -20 -20 56 -7 -34 9 16 -13 13 -1 19 -23 -52 -8 -3 -57 -14 29 24 2 14 30 26 3 -29 20
7147 20 27 -25 9 -2 -22 -24 10 -65 20 -84 2 15 -17 -42 13 14 22 -28 8 -49 -25 -5 -44 -59 26 29 -17 28 24 48 -16 -3 -60
7180 -60 -13 -12 22 -29 17 -13 -12 24 -22 -60 20 1 -8 23 -35 12 20 13 13 -25 -54 -12 59 25 -17 -12 9 22 33 -12 -25 8 -7 -32
7214 -32 1 43 -61 9 -34 13 41 4 -8 -19 -8 25 -23 34 -25 4 25 2 -11 18 65 -7 12 11 -34 4 29 -11 -6 -29 -75
$$ packed form
6982c8QMj7Q4Mn5l7J9J4j0L4Jj6m0K1M3Rk7j9N4l4L4rm1J0j2N2k6K6l4L2k7oJ0
7016A1K7k2q2P4m8P7m3K1nn8J7L1j9L9n1K2q0Q4j0K7J1j3K5n6L3JK9l0K0k6qK
7048@N3m6Oj3k4MK5j5L8jJ9o8O1m7J4l4N9j6m8P5j0p2L9J4m3j3M0Ll4J6P5l7q
7081A2On5L0j5P7m2m0K7K6oj8rM1q2J3J00q4J4k0jl3M4M5n4K7N6j8k9k2k9Q3J2
7113E6m6rPj9J0M5p4K7j7%P6o3k7M3Pk9K6j4K0m2k9M4Nn4M3M3nk2J2J6mk3l2M9
7147B0Pn2L4j1k0kL4p5Q5j04Q6J3l2k5N5JQn0L6n7K4K0l9j5Q5Lm6M5mK4o4J3n7
7180f0M7JL4n1M6l0JL6m6l8Q0j9rL1n8M7Qp%l8k9M2P1l4m2NK1J3J1m5j3L3j5k5
7214c2L3M2j04P0m3M7K8l7j2j1J1L3m8N7n9K9K1k3j3K9M7p2J9jm5L8K5m0Nk3m6
$$ plain form
7245 -75 12 -94 -41 -17 12 -40 -9 26 -3 0 -48 -33 -50 23 40 -10 -44 25 9 14 51 -47 23 -1 -11 31 -31 31 3 -28 -29
7276 -29 -25 22 7 -33 21 4 6 -29 -12 16 19 -13 4 44 -25 -6 49 16 24 -8 -4 -44 28 42 51 44 32 32 35 -20 -1 44 -3 29 12
7311 12 -12 84 -26 34 25 -3 -12 10 -25 -11 -50 -13 -44 14 35 -4 -25 -5 -51 13 16 -42 -47 -13 37 4 -28 25 -12 3 41 -12
7343 -12 -23 -2 14 47 -26 -34 -1 18 -15 41 -18 -14 -26 5 -19 8 5 23 -18 16 -29 -57 -30 -20 -39 -60 20 40 9 -45 -13 26
7375 26 -10 -17 -54 -11 5 -19 -13 28 -14 -29 -24 4 -21 5 44 18 16 -8 -43 20 33 -8 -3 -9 21 31 2 -23 15 -7 -55 21 -27
7408 -27 -7 -48 -13 -28 -2 -11 1 -3 29 -62 -16 11 7 30 -12 6 43 -12 30 22 -1 42 11 -28 7 -32 1 -49 -3 14 -13 -61
7440 -61 -2 17 17 55 -4 -10 14 -58 10 30 21 -5 21 36 -38 9 -23 59 32 -40 34 21 -49 -55 -8 15 15 30 -15 -50 -26 -41 -26
7473 -26 8 21 31 -20 43 11 27 20 14 -18 6 -16 20 -48 37 -35 -34 -54 21 -29 -13 -4 12 -64 -22 -4 2 -20 52 30 -26 -12 4
$$ packed form
7245g5Q7j06N3K4K9n2L1L5k9Lm8J5j7P3J7n0l4O9j6NL7r8P0k4j0M2o2O2k8l1j
7276b9MM7j5m0N4j7Kl5J7K8Ll2J7M0o9J9N5l3Ql2Mm0P2J4Rpj2%Ln5J9M5m7L2j7
7311A2k4R6j10O0rk8rK2l5J4l9L7l1N8K1l9k1K0m6O4Ln8nL4N0l3l2N3l7J5L8n3
7343a2j1K1J6L3p3qL3J9l3N6n9Mj2L1k4K7lJ8m1L4m5k8K7J0j9k1Q0K0l1n4L2L9
7375B6l6pl7M3J6k4OM1m2j5NK8k5K6L9k6kk4l5O3J3m1NoL0J0k9k5L8k2m8P6m8
7408b7K0m1L5j5K6rJ2mL2r1M6K7mK3m2J8L7n5M2qk3M3l1l9L5l9L3n0M6J7k7m8
7440f1N9J9%L8n9oK4p2O8K0rk6K6J5p4M7l2Q2k7p2P4j3p0oM7K3%J5m5l5K4j5J5
7473b6L4J3J0n1O3l2J6pol2K4k2L6o8Q5p2Jk0P5n0J6RJ6p6M2J8Ok2P2k2n6J4J6
$$ plain form
7506 4 -21 -6 -50 -35 -9 -3 38 39 10 -15 -43 25 20 9 -51 -9 36 -55 13 -1 17 27 23 -14 7 -84 23 17 -48 -9 30 -11 -88
7539 -88 -25 -35 -18 -27 -64 -14 19 23 -65 21 -85 -53 46 -16 -5 28 -10 17 73 -17 11 -3 -3 48 -42 31 5 -21 30 -3 37
7570 37 24 47 -16 -45 -7 -12 -8 -38 -45 -11 21 -67 -17 -31 4 22 -33 7 -43 21 -11 -10 -24 27 57 -12 -12 -4 52 28 -39 -24 13
7603 13 -17 0 5 24 -20 82 -2 -25 23 36 -23 3 46 -2 -23 0 -22 -4 -1 42 56 -15 -29 60 63 2 -11 -36 28 -14 -21 17
7635 17 20 8 22 35 -64 1 -13 9 0 10 -6 17 39 0 8 1 15 -35 -8 -4 -42 31 -13 -35 9 -40 -15 -49 -18 -96 -3 47 22
7668 22 8 5 -16 1 -28 25 29 -4 45 32 46 37 41 38 -45 -23 39 1 -39 -59 -46 25 -31 -25 1 3 -29 -20 47 -52 7 -49 4 28
7702 28 43 -50 -15 43 -33 11 25 22 8 33 -34 6 -8 19 -25 15 9 11 12 14 -9 3 -4 17 -10 15 -44 1 26 14 18 -36 5 19
7736 19 18 -23 -22 -15 16 -11 -11 23 1 5 -43 -45 -9 8 -36 -22 22 -20 17 23 -15 29 3 -32 17 49 37 -15 47 3 17 -10 6 10
$$ packed form
7506Dk5J5m4J5K6OM1Jk9k5k8O8nj1o0M2M5r1O8j4J8J0ml7K1r1J07oo5L9L9m1p7
7539h8O3j0J7rl7N0L3Mq8Q6j06L2R9o2J1L3l8K7N6r0K8j4%N1r0P3k6k6N1l3M0
7570C7j3K3o3k9L8nMl0pL4L2q8N0j4L5J8n5M0n0O4l2Jj4N1L0o9%QN6k4o7J5L7
7603A3l0J7NJ9m4J02q4k3M8J3n9K6M3m8k1K3k2J8LM3J4p1j4Q9Lo1j3k5O4m2pL8
7635A7Lj2J4J3r9O5j4K2rJ0j6K3K2l9QpJ4n0K7Ml8P3m4k2M4m9K5l4L1p8R3N0k5
7668B2j4lk1J7k9N3Ml3M9j3J4rMlq3K2O2l8m0k0J3P1n6OK6Kl2RO7r9N9n6N3K4
7702B8J5r3L5N8p6M4J4lj4K5o7M0j4K7m4M0oKJKk3J2pK1k7K5n9M5K5j2Mn4M1J4
7736A9jm1JPL1k7%L4k2Mm8kL6J7m4J4M4m2L7Ol8M4k6l5M9L2j2n2O2m4J4k7J6M
$$ plain form
7770 10 41 -33 -76 -18 69 1 41 -14 -63 -12 -51 -25 -3 -38 2 -65 6 0 24 -30 -18 5 -19 22 -77 -23 -66 34 6 40
7800 40 8 -35 -70 5 -15 18 10 4 -13 3 1 47 18 10 26 -8 27 -14 0 -68 34 0 24 -11 18 -34 -35 26 43 -29 16 27
7832 27 -13 -43 20 -48 0 -15 -33 1 -36 -14 45 -2 4 8 40 42 47 24 -26 21 13 -43 3 23 28 -16 -5 -13 -23 25 18 41 -67 15
7866 15 28 -4 -10 -78 28 -36 -18 -28 39 37 -13 5 1 -5 2 35 -40 -7 3 33 -40 -15 -30 -4 -35 55 9 12 32 29 28 -17 -2 -40
7900 -40 -18 -52 -15 -28 -30 -27 -9 5 5 -3 -13 -57 -6 -27 -43 4 -60 6 0 -1 -31 -34 -19 70 6 -3 3 13 -16 -23 27 56 10 28 31 -16
7936 -16 -32 53 -11 13 -21 15 -25 38 37 -13 -1 -21 -10 -29 46 20 -30 -47 7 -10 -13 5 -54 40 -26 -17 16 -42 -16 -17 28 -34
7968 -34 52 -43 -21 -25 1 -114 36 -13 -29 -10 9 -28 -8 40 -22 25 1 7 -40 21 -24 69 -18 -36 -2 -41 8 -43 25 30 19
7999 19 -18 -51 -54 13 -23 -49 11 -14 -51 -35 1 -15 40 27 -19 -12 62 -1 -42 20 32 25 45 -21 -23 39 41 2 5 -17 28 28 60 -45
$$ packed form
7770A0L1p4m3N8Q7o8M0n5m9N1l9K6K2l5M0o7P1oK4n4J2K3k4M1r9N4m3J00k8L4
7800D0l2m3l5P5k0L3qoj7J6kM6k9qJ6l4L5m1J4o8J02l4K4l5K9n2jO1J7p2M5J1
7832B7m0l0O3o8M8j5j8L4l7K2N9m7OML2KNk3n0M7qn6M6K0Nm4J1qj0M8pK3j08Q2
7866A5J3l2oo8J06o4J8j0O7kn0J8moPL3p5L3J0L0p3K5j5K6l1R0m6LK0ljm5J5l8
7900d0K2l4L7j3kLJ8J4%qj0m4N1k1j6M7o4O6ojl0lJ5Q9o4rOJ0k9pN0K9m6J8Lm7
7936a6j6Q5o4K4l4L6m0O3jn0J2k0J1j9P5k6n0j7N4j7lJ8n9R4o6RL3n8K6jM5o2
7968c4Q6r5K2mK6j15J50m9j6J9J9l7K0M8o2M7k4Om7O1m5R3q7j8L4l9M9n1O8Nj1
7999A9l7l3lO7l6k6O0k5l7J6L6j6N5j3m6PP4o3m1O2J2pK0o6kO2Kl9Lk2M5%L2j05
$$ plain form
8033 -45 -45 -15 -43 -60 -22 -43 31 2 18 -8 17 -16 28 24 42 50 18 -5 -14 17 31 16 -20 2 -40 14 42 -1 9 4 11 43 38 2
8067 2 5 37 -23 17 -31 -70 -9 11 -19 -12 -5 -15 -24 28 -38 -30 -3 9 -11 -49 34 13 8 -45 -18 -63 -11 23 6 -62 -13 -6 29 48
8101 48 33 1 -6 -60 -32 -21 -37 13 11 -75 -4 31 23 -34 -56 5 -11 -41 7 -14 36 -1 -10 -15 55 53 -27 -9 23 10 25 -65 6
8134 6 -6 3 -4 -49 36 1 52 75 -8 -2 28 -8 27 4 -10 -10 -29 -15 -1 42 -24 37 31 -38 -21 61 70 15 61 -6 -3 2 -54 -8 35
8169 35 -42 -28 37 -38 9 -2 55 -25 -25 -1 32 23 33 -30 14 -32 53 -27 -45 -6 -69 3
$$ packed form
8033d5%L0k8j7L8k1P4k9J6k6K5l3M4mJ8Ql2k3rL1J4j5l6K2m2N4K8m3J0nPL2nl6
8067BLL2o0M0m8l9O1K0l0PPj0rN2o6QK7J2k0l8Q3k1nn3K7m5N2L4j7o8M9PL5J9
8101D8j5l2pn4K8J1j6N0kq6P1L5qn7k2O1j6l0M8k1N0l7rnP0kq0J8L2j3J5r0P1
8134Fj2Rpm5Q5l5N1K3q3OL0l6L5k3j4%j9J4J4M3o6O1oo9J7Q2Rn5M6o7LNn6M6M3
8169C5p7J4O5p5M7j1N7q0%K4L3rJ0o3M4m6Q5q0j8L9o3P2
8191C
$$ Imaginary data points
##PAGE= N=2
##DATA TABLE= (X++(I..I)), XYDATA
$$ plain form
0 0 0 0 0 0 0 0 0 0 0 0 0 0 -8 8 -8 8 -8 16 -16 24 -24 32 -32 40 -48 56 -64 77 -88 103 -112 128 -151 168
34 168 -192 216 -240 271 -301 336 -373 415 -459 509 -562 621 -685 755 -833 917 -1011 1114
52 1114 -1227 1354 -1498 1658 -1843 2051 -2297 2586 -2936 3363 -3905 4613 -5586 7008 -9291
67 -9291 13565 -24274 109318 124528 -126745 -52443 29815 -18356 -52439 55127 78605 -24437
79 -24437 -94701 -28432 25088 22723 -3448 -733 18724 2260 -40463 2786 45277 -3634 -33040
92 -33040 18760 30741 -19654 -32433 31017 47698 -18463 -34142 12451 -2213 -38722 -11470
104 -11470 34623 27277 -16518 -28240 -3449 2242 3095 17462 18315 10656 -7443 -29559 -6862
117 -6862 18159 -4684 -5214 25545 11234 -25161 -14444 18858 6869 -22822 -2330 19626 -6776
$$ packed form
0@%%%%%%%%%%%%qJ6j6J6j6K4l2M0m8N6o4P2q8J04j20J41j65J91k15K40k79L19
34A68l60M08m56N11n72O37p09P88q74R68j071J183j306J440j588J750j928K125
52A114k341K581k852L156l501L894m348M883n522O299p268Q518j0199J2594j6299
67i291K2856l7839J33592J5210k51273P4302Q2258m8171l4083J07566K3478j03042
79b4437p0264O6269N3520k365k6171K715J9457j6464m2723M3249M2491m8911k9406
92c3040N1800J1981n0395j2779O3450J6681o6161j5679M6593j4664l6509K7252
104a1470M6093p346m3795j1722K4791N691Q53J4367Q53p659j8099k2116K2697
117f862K5021k2843n30L0759j4311l6395J0717L3302j1989k9691K0492K1956k6402
$$ plain form
130 -6776 -18731 -172 7481 8048 293 -7543 5635 9938 -1238 2750 5401 -6266 -11930 -6845
144 -6845 -204 1219 7893 18192 2122 -18994 -6413 7266 781 -3618 -1370 5207 2425 -14543
158 -14543 -8944 13621 8943 -5668 103 10527 6894 -6088 -8559 -1228 -3295 -4848 2828 5398
172 5398 4666 2484 -2728 -686 -801 -5656 2099 5396 -5877 -5912 1851 -148 -3619 -421 7070 8489
188 8489 621 -1037 2515 540 -1332 -3400 -4926 -1240 -2478 -3755 3927 4848 -256 324 -1523 -3321
204 -3321 1006 3552 5003 2997 -4678 -5403 -1432 -399 2058 3892 4486 2171 -6213 -6955 782 112
220 112 -1237 1874 513 475 358 -1824 2834 5335 918 422 -436 -3146 -2324 -2075 -478 227 -3236
237 -3236 -669 1964 -1441 2534 6298 1507 -1387 -3606 -3159 1662 452 348 4341 261 -3255 -1286
$$ packed form
130f776j1955J8559P653N67p755p836J3178M303j1176L988K651j1667n664N085
144f845O641J423O674J0299j6070k1116J2581J3679o485m399K248O577k782j6968
158a4543N599K2565m678j4611N771J0424l633j2982k471P331k067j553P676K570
172E398p32k182n212K042j15m855P755L297j1273l5P763j999l471L198P491J419
188H489p868j658L552j975j872k068j526L686j238j277P682R21n104N80j847j798
204c321M327K546J451k006p675p25L971J033K457J834N94k315q384p42P737o70
220A12j349L111j361l8j17k182M658K501m417m96q58k710Q22K49J597P05l463
237c236K567K633l405L975L764m791k894k219M47M821j210j04L993m080l516J969
$$ plain form
253 -1286 -541 2920 2846 -1778 -979 -2583 -5311 -914 792 1531 3620 -36 353 2776 -903 1141 3368
270 3368 -1661 -1779 -833 -1897 504 -461 -191 2504 -1680 -2011 1324 -1179 -33 1203 -2135 93
286 93 121 -2265 2087 2696 1086 2978 221 -598 866 -2098 -302 450 -3399 -612 -61 -3277 611
303 611 1442 -252 1619 47 492 1876 -1729 501 2138 -2414 -347 1022 -1245 1498 839 -334
319 -334 1991 -1225 -1775 1208 -1207 -1040 -146 -1954 684 139 -1870 2919 2003 -1444 1341 592 -655
336 -655 131 -1378 954 1392 -2325 487 1453 -1301 991 715 -745 747 -2008 -2278 834 -990 -480
353 -480 979 -408 1404 919 -915 2527 1451 -1390 806 -264 -1443 -125 -1013 566 785 -1919
369 -1919 384 714 -1724 799 988 -619 735 -1092 -1054 1742 -75 -374 1260 100 216 -364 -753
$$ packed form
253a286P45L461p4m624P99j604k728M397J706P39K089l656L89K423l679K044K227
270C368n029j18R46j064K401r65K70K695m184l31L335k503J146J236l338K228
286I3K8k386M352O09j610J892k757q19J464k964J796P52l849K787N51l216L888
303F11Q31j694J871j572M45J384l605K230J637m552K067J369k267K743o59j173
319c34K325l216n50K983k415J67Q94j808K638n45k009M789r16l447K785p49j247
336f55P86j509K332M38l717K812R66k754K292k76j460J492k755k70L112j824N10
353d80J459j387J812m85j834L442j076k841K196j070j179J318q88J579K19k704
369a919K303L30k438K523J89j607J354j827L8K796j817k99J634j160J16n80l89
$$ plain form
386 -753 1597 -305 -1875 884 -509 -1382 1285 140 -356 564 -512 310 351 -1110 835 854 -1269
403 -1269 -398 -126 188 639 -667 563 1811 -410 -177 444 -933 228 -86 -1602 218 -81 -1084
420 -1084 780 224 -600 997 790 -176 -184 560 1279 -890 -1837 870 356 -712 1075 -8 -772 927
438 927 -566 -1495 686 493 -463 -274 -338 254 412 66 306 -229 486 1299 -1034 -831 1512 33 -1177
457 -1177 -567 -820 849 1300 -970 -115 635 -956 -934 -345 480 1509 235 -620 144 -79 210 116 -234
476 -234 1135 607 -394 220 -1698 -1613 1892 -2 -1995 1132 923 -1382 -355 654 714 76 -227 545
494 545 71 750 1559 -993 -1060 575 -1378 -119 1924 -964 -547 1226 -1829 -2173 266 841 971 380
512 380 224 535 -636 -80 465 38 2056 969 -2289 -219 480 -1112 349 -494 -1528 1008 251
$$ packed form
386g53K350j902j570K759j393q73K667j145m96R20j076Q22M1j461J945J9k123
403a269Q71K72L14M51j306J230J248k221K33O21j377J161l14j516J820k99j003
420a084J864n56q24J597k07r66qP44P19k169r47K707n14j068J787j083p64J699
438I27j493r29K181j93r56J89o4N92J58l46K40n35P15Q13k333K03K343j479j210
457a177O10k53J669M51k270Q55P50j591K2N89Q25J029j274q55P64k23K89r4l50
476b34J369n28j001O14j918Q5L505j894j993L127k09k305J027J009O0o38l03P72
494E45m74O79Q09k552o7J635j953J259K043k888M17J773l055l44K439N75J30n91
512C80j56L11j171N56N45m27K018j087l258K070O99j592J461q43j034K536p57
$$ plain form
529 251 -1128 571 261 -428 -418 -435 758 894 783 1075 -1113 -102 2046 -1989 -1931 2487 775 -978
547 -978 -50 -1232 -1164 -709 -525 1360 788 -118 660 -891 -1112 709 532 1004 480 -320 1679 -48 -2357
566 -2357 474 406 -1010 1003 90 -1031 386 -785 -999 368 7 132 252 483 874 -621 105 1152
584 1152 -1601 -7 2697 -522 -739 1061 -1268 -824 947 -731 -941 515 756 -357 -1213 625
600 625 473 -2141 -71 1815 290 1069 513 -1479 297 386 -594 996 730 -35 351 -1099 -1269 98
618 98 113 -9 -395 -38 941 -954 -1217 1130 3 -327 1199 71 251 1064 -393 -210 216 -595 326
637 326 360 -568 -173 16 -249 -784 -1081 449 537 -693 760 1070 -480 36 -280 -563 1421 1237 -138
656 -138 289 -220 -880 -552 -184 415 172 -595 -232 -552 -477 534 -18 51 614 -364 88 1177 -247 -97
$$ packed form
529B51j379J699l10o89J0j7J193J36j11K92k188J011K148m035N8M418j712j753
547i78R28j182O8M55J84J885n72r06P78j551k21J821j77M72n24q00J999j727k309
566b357K831o8j416K013r13j121J417j171k14J367l61J25J20K31L91j495P26J047
584A152k753J594K704l219k17J800k329M44J771j678k10J456K41j113q56J838
600F25j52k614K070J886j525P79n56j992J776Q9r80J590k66p65L86j450j70J367
618I8J5j22l86L57R79j895k63K347j127l30J526j128J80Q13j457J83M26q11R21
637C26L4r28L95J89k65n35k97J530Q8j230J453L10j550N16l16k83J984j84j375
656a38M27n09o60L28L68N99k43p67L63l20P5J011n52O9N63r78M52J089j424J50
$$ plain form
676 -97 803 -380 -641 202 271 312 -91 -629 -422 -413 -117 72 -66 653 355 -775 136 406 -608 393 777
697 777 -248 402 489 -555 -491 -42 70 2 -100 246 -86 -655 233 -22 -672 482 504 -312 273 265 -61
718 -61 63 -357 34 479 -201 -4 207 -372 -90 -134 -546 262 292 -127 234 -111 -11 308 -227 237 413
739 413 -382 241 293 -642 99 117 -685 -44 94 132 268 -366 -79 275 -442 269 445 -270 369 234 -419
760 -419 360 -74 -465 373 -165 -126 310 -377 -155 38 -467 531 382 -505 359 92 -211 286 -285 -56 450
781 450 -497 134 508 -320 80 -31 -584 524 154 -372 435 -294 -367 183 -351 174 284 -572 354 215
801 215 -568 430 169 -294 350 -111 29 462 -453 -77 344 -475 72 -16 -486 414 -95 -590 352 -212 -213
822 -213 481 -166 214 480 -328 319 230 -479 486 18 -437 300 -208 -226 299 -451 -112 370 -372 169 73
$$ packed form
676i7R00j183k61Q43O9M1m03n38K07RK96J89j38P19k98j130R11K70j014J001L84
697G77j025O50Q7j044O4M49J12o8j02L46l32n69Q88k55o50J154K2q16N85ql26
718f1J24m20L91M45o80J97K11n79K82m4m12Q08L0m19L61l45J00L19n35M64J76
739D13p95O23N2r35P41J8q02O41J38L8J36o34K87L54p17P11J76p15O39j35o53
760d19P79m34l91Q38n38L9M36o87K22J93n05R98j49q87Q64k67l03M97n71K29N06
781D50r47O31L74q28M00j11n53J108l70n26Q07p29p3N50n34N25J10q56R26j39
801B15p83R98k61m63O44m61J40M33r15L76M21q19N47q8m70R00n09m95R42n64j
822b13O94o47L80K66q08O47q9p09R65m68m55P37n08j8N25p50L39M82p42N41r6
$$ plain form
843 73 -436 479 59 -373 574 -59 -212 486 -117 55 403 -375 34 6 -322 381 -125 -473 256 -389 -296
864 -296 449 -242 138 374 -408 73 243 -173 371 225 -160 327 -86 -66 312 -313 -19 216 -575 -127 48
885 48 -331 215 -158 -355 464 -12 -169 580 99 43 285 -264 -6 125 -166 153 -41 -265 132 -242 -145
906 -145 292 -279 -41 409 -353 -165 339 -152 49 106 -45 242 29 -158 218 -12 -59 -50 -322 90 139 -317
928 -317 138 64 -288 108 14 -233 274 70 -243 195 -19 -41 168 54 48 15 91 204 -217 -235 248 -160 -262
951 -262 254 -145 -111 264 -202 -118 387 -76 -116 239 106 11 -68 -45 63 -142 46 288 -153 -44 136 -262
973 -262 33 135 -304 253 246 -431 29 201 -278 92 102 17 134 -108 32 172 -55 173 -110 -211 241 -9
995 -9 -158 368 -251 -272 342 -302 -275 408 -2 -100 143 -112 23 140 21 92 -80 171 77 -527 -18 312 -451
$$ packed form
843G3n09R15m20m32R47o33j53O98o03J72L48p78M09k8l28P03n06l48P29o45R3
864b96P45o91L80K36p82M81J70m16N44j46l85M87m13K0L78o25K94K35p91M48J75
885D8l79N46l73j97Q19m76j57P49m81n6K42n49K58J31k91L19j94k24L97l74R7
906a45M37n71K38M50p62J88N04m91K01N7j51K87k13j87L76k30m7Rk72M12M9m56
928c17M55p4l52L96r4k47N07k04l13M38k14k2K09j14ol3P6J13m21j8M83m08j02
951b62N16l99L4L75m66Q4N05m63m0L55j33r5p9K3J08k05J88K42m41J09J80l98
973b62K95J02m39N57po77M60J72m79L70J0q5J17k42J40J40k27K28k83j01M52k50
995ij49N26o19k1O14o44K7O83m10r8K43k55J35J17j19P1j72K51r4o04N09L30p63
$$ plain form
1018 -451 -22 424 -323 46 136 -314 163 63 -136 196 -7 -76 154 -13 92 -82 -231 450 -30 -383 556
1039 556 -79 -609 252 -116 -164 459 -18 -113 206 -171 -5 102 -12 196 -90 14 203 -433 74 390 -544
1060 -544 114 526 -404 -48 246 -332 31 65 -79 65 -44 158 217 -277 236 252 -296 131 185 -183 199
1081 199 -95 -253 248 -281 -102 411 -188 -107 277 -150 -160 108 22 204 -101 -14 282 -280 -5 259 -325
1102 -325 56 212 -518 201 351 -421 -41 78 -282 176 197 23 10 -210 101 -55 -209 373 -5 -382 381
1123 381 38 -297 283 -35 -282 218 70 41 7 -274 -56 85 -11 204 -53 -145 146 -95 109 322 -266
1144 -266 -123 187 -201 47 251 -202 -108 -76 -116 131 -113 -127 86 -86 11 32 -42 189 109 -109 256 65 -202
1167 -202 127 11 -145 95 -79 -87 126 -39 -86 9 -109 18 -10 30 136 -84 -96 177 -15 -142 163 -81
$$ packed form
1018d51M29M46p47L69R0m50M77j00j99L32k03o9K30j67J05j74j49O81m80l53R39
1039E56o35n30Q61l68m8O23m77r5L19l77J66J07j14K08k86J04J89o36N07L16r34
1060e44O58M12r30L56K94n78L63L4j44J44j09K02N9m94N13J6n48M27N4l68L82
1081A99k94j58N01n29J79N13n99Q1L84m27j0K68q6J82l05Q7K96n62K75K64n84
1102c25L81J56p30P19J50p72L80J19l60M58K1j74j3k20L11j56j54N82l78l77P63
1123C81l43l35N80l18k47N00j48k9l4k81K18J41r6K15k57r2K91k41K04K13n88
1144b66J43L10l88K48K04m53R4L2m0K47k44j4K13j72R7K1p4K31q0k18L65j91k67
1167b02L29j16j56K40j74qK13j65m7R5j18J27k8M0J06k20j2K73j92j27L05k44
$$ plain form
1189 -81 -35 80 -82 114 14 -335 -32 96 22 98 23 -148 -111 -70 108 214 26 13 -16 -146 155 168 -130
1212 -130 88 -26 -158 200 82 -165 -60 -92 -105 -8 -56 -4 41 -122 94 41 -70 166 -43 -135 180 47 -89
1235 -89 99 -126 -68 83 -130 73 48 -129 84 -108 -212 126 23 -6 119 -120 -30 141 -71 141 124 -201
1257 -201 -10 52 -102 74 -93 -152 -3 -133 61 197 -131 -34 14 -186 74 87 -113 217 -52 -164 168 -27
1279 -27 -15 162 -94 31 113 -207 40 10 -239 71 12 -108 196 -82 -38 135 -112 46 133 -112 91 102 -136
1302 -136 148 -81 -165 201 -55 43 98 -200 -7 28 -200 89 100 -130 134 -26 -92 158 -49 -36 190 -79
1324 -79 -7 116 -140 68 86 -102 181 -1 -133 204 -122 -107 107 -123 -31 76 -151 126 62 -154 116 32
1346 32 -74 173 -87 8 59 -84 74 64 -186 23 32 -142 150 -48 -86 105 -157 -88 192 -93 -10 58 -117
$$ packed form
1189h1M6J15j62J96j00l49L03J28p4P6p5j71L7M1J78J06j88j3k9j30L01J3k98
1212a30K18j14j32L58j18k47J05l2j3R7m8N2M5j63K16n3j11K36k09r2L15j33j36
1235h9J88k25N8J51k13K03k5j77K13j92j04L38j03k9J25k39R0J71k12K12j7l25
1257b01J91O2j54J76j67n9J49j30J94J36l28R7M8k00K60J3k00L30k69j12L32j95
1279b7J2J77k56J25Q2l20K47l0k49L10n9j20L04k78M4J73k47J58Q7k45K03J1k38
1302a36K84k29q4L66k56R8N5k98J93L5k28K89J1k30K64j60o6K50k07J3K26k69
1324g9P2J23k56K08J8j88K83j82j32L37l26J5K14k30R2J07k27K77o4k16K70q4
1346C2j06K47k60R5N1j43J58j0k50K09Rj74K92j98l8J91k62O9K80k85Q3O8j75
$$ plain form
1369 -117 80 159 -118 71 -3 -65 105 -171 -83 161 -101 32 141 -176 49 77 -130 95 68 -77 23 -35
1391 -35 -83 66 -56 -14 39 -64 66 39 -114 121 1 -84 87 -74 -58 74 -53 -74 115 -67 -3 25 -102
1414 -102 1 37 5 -18 -74 -20 86 -86 10 140 -112 -19 48 -128 -2 73 -43 25 47 -56 41 30 -35 -32 -43 -9
1440 -9 -44 -74 -32 20 -48 33 -8 -117 113 -68 -74 108 55 -90 72 -37 7 51 -15 17 13 2 15 -77 39 79 -110
1467 -110 9 70 -168 -42 93 -111 -5 80 -61 -22 64 5 40 17 15 21 -75 46 -37 -45 27 63 -122 40 87 -142
1493 -142 126 53 -54 117 -3 -107 53 62 59 67 60 29 -34 -8 72 -69 -85 123 -64 -130 123 -136 -83 117 -104
1518 -104 -27 92 -95 -39 -9 -89 4 -40 48 25 -30 86 32 -111 56 40 -188 71 70 -80 106 92 -121 16 31
1543 31 38 72 48 16 -10 -147 69 22 -53 136 -19 -55 134 -119 -25 119 -124 -17 172 -105 -26 72 -73 22 7
$$ packed form
1369a17J97P9k77J89p4o2J70k76Q8K44k62J33J09l17K25K8k07K25k7j45J00n8
1391c5m8J49j22M2N3j03J30k7j53K35j20q5J71j61J6J32j27k1J89j82O4K8j27
1414a02J03L6l2k3n6N4J06j72R6J30k52R3O7j76J26P5j16O8K2j03R7j1o5Lj1L4
1440il5l0M2N2o8Q1m1j09K30j81oJ82n3j45J62j09M4M4o6L2mj1J3r2J16M0j89
1467a10J19O1k38J26J35k04J06Q5j41L9Q6n9L5k3kOr6J21q3qP2L6j85J62M7k29
1493a42K68p3j07J71j20j04J60RlQpl1o3K6Q0j41j6K08j87o6K53k59N3K00k21
1518a04P7J19j87N6L0q0R3m4Q8k3n5J16n4j43J67j6k28K59jj50J86j4k13J37J5
1543C1PL4k4l2k6j37K16m7p5J89j55l6J89k53R4J44k43J07J89k77P9R8j45R5j5
$$ plain form
1568 7 85 103 -105 25 118 -188 2 46 -210 49 40 -127 91 87 -66 113 20 -74 34 -38 49 6 -96 110 -76
1593 -76 -122 159 11 -65 48 -96 -96 109 -70 -5 -11 -78 62 5 -85 14 -4 -18 4 46 2 -43 -123 50 26 -50 84
1620 84 3 -118 50 61 -79 -3 -38 -65 116 24 37 139 16 24 -52 -6 145 -56 15 106 -49 7 81 -75 -20 39
1646 39 7 -2 -5 -55 -3 -19 -18 104 -31 -32 74 -85 53 113 -38 20 17 -53 27 63 -98 97 -19 -101 -13 33 9 50
1674 50 -56 12 -62 0 -36 -46 -15 58 23 -11 65 -3 29 49 -46 -37 -13 -51 16 -22 -29 38 -38 -30 91 -39 -33 -26 -19 13 72 -38
1706 -38 18 39 -19 -12 55 -73 9 -30 -5 50 44 -41 46 17 -53 7 8 26 65 -53 1 -17 -83 40 -55 -9 20 -45 -94 26
1736 26 2 -8 -79 -71 27 -7 -20 37 -35 -52 85 15 14 51 -21 -13 38 -50 49 -6 -66 26 13 -24 22 -33 40 -1 -32 65 95
1767 95 29 6 26 -22 20 -42 -32 34 -59 -50 101 -99 -60 16 -5 -11 18 18 31 10 -35 117 -10 -16 41 -44 -2 112 -7
$$ packed form
1568GP8J8k08J30R3l06J90M4k56K59rj67K18mj53J79r3r4J08p2Q7m3j02K06j86
1593g6m6K81j48p6J13j44%K05j79O5oo7J40n7r0R9j8j4K2M2m4m5q0J73k4p6J34
1620H4q1j21J68J1j40P6l5k7J81r2J3J02j23Qp6M6J51k01P1R1j55N6P4j56N5N9
1646C9l2rln0N2j6JJ22j35jJ06j59J38O0j51N8lp0Q0L6j61J95j16q2Q8M6k4M1
1674E0j06O8p4O2l6j0L1P3l5l4P6o8L2K0r5RK4l8O7l8pO7p6QJ21j30OPPL2N9j10
1706c8N6K1n8PO7j28Q2l9K5N5oq5Q7k9p0O0JJ8L9j18N4j8o6J23r5M6K9o5m9J20
1736B6k4j0p1QR8l4j3N7p2j7J37p0jL7p2QN1q8R9n5o0R2j3l7M6n5P3m1l1R7L0
1767I5o6k3K0m8M2o2J0O6r3RJ51k00L9P6k1oK9%J3k1m5J52j27oN7q5M2J14j19
$$ plain form
1796 -7 -38 -6 -72 39 53 -26 57 -15 -17 26 -53 -8 102 -5 21 -6 -58 63 79 -62 46 10 -43 34 -30 -30 0 -91 -28
1825 -28 14 -28 29 -40 -57 85 -46 23 44 -41 -33 100 13 61 58 -39 50 4 -52 115 17 -44 100 7 -9 46 -65 -1
1853 -1 45 -147 102 37 -60 2 6 -31 61 -63 14 93 -30 21 0 -58 80 7 -30 54 -34 -45 106 -38 -6 63 -78
1880 -78 15 -2 -30 9 27 7 40 9 8 6 2 16 40 -42 35 -49 -63 -28 57 -72 43 -23 -39 39 -36 -37 16 -38 -74 -1 -31
1911 -31 29 2 -23 -17 -21 -38 72 -29 -25 -13 -48 14 65 -62 41 38 -58 24 40 -8 48 -38 -21 28 3 11 38 -41 37 24 -94
1942 -94 -9 11 -33 5 -13 -65 25 -2 -4 -60 -28 -55 11 -48 42 14 -16 -3 -35 -24 93 -93 -107 78 20 1 39 -13 -42
1971 -42 54 25 33 20 -17 -20 48 22 22 -64 0 0 -75 50 72 -40 -21 26 -71 51 4 -11 -14 -11 -27 -51 -41 -58 -24 -21 0 -21
2003 -21 -41 23 -48 -124 74 -55 -22 59 22 -57 38 -23 16 86 7 -20 -66 -11 -31 -39 15 31 7 12 15 -37 53 10 -29 49 -4
$$ packed form
1796gl1L2o6J11J4p9Q3p2kM3p9M5J10j07K6k7n2J21J6j41J08l6n3P7o4%L0r1O3
1825b8M2m2N7o9j7J42j31O9K1q5QJ33q7M8lr7Q9m6n6J67r8o1J44r3j6N5j11O4
1853aM6j92K49o5r7O2Ml7R2j24P7P9j23N1k1n8J38p3l7Q4q8j1J51j44L2O9j41
1880g8R3j7k8L9J8k0L3l1jkmJ4K4q2P7q4j4L5Q5j29J15o6j6P8p5jN3n4l6P3l0
1911c1O0k7k5Omj7J10j01MJ2l5O2N1j27J03lr6Q2J6m8N6q6J7M9k5QK7p9P8j3j18
1942i4Q5K0m4L8j8n2R0k7kn6L2k7O6n9R0k8l0J3l2J1J17j86j4J85n8j9L8n2k9
1971d2R6k9Qj3l7lO8k6%q6O4%p5J25K2j12J9M7r7J22m7j5lLj6k4J0j7L4LK1k1
2003b1k0O4p1p6J98j29L3Q1l7p9R5o1L9P0p9k7m6N5k0qN4J6k4NLn2R0m3l9P8n3
$$ plain form
2034 -4 -40 -10 -13 -21 54 3 -58 -11 -29 -13 -9 -18 69 35 -40 -25 43 -23 49 -28 -14 90 10 -29 85 27 31 3 7 8 10 27 0 -67
2068 -67 -60 64 -47 29 28 -38 47 36 -49 56 5 -56 -10 -9 1 33 -5 53 2 -20 65 -12 -100 45 25 -118 9 -30 -18
2097 -18 35 -2 -19 -7 -23 15 73 -39 2 -38 25 33 -65 -11 43 -61 -1 3 -38 -21 38 2 11 -51 -67 -17 12 35 62 -16 28
2128 28 -26 -39 48 51 -29 45 3 -33 93 -10 20 -16 13 -12 -40 -2 40 33 14 85 10 15 17 -74 25 -16 -44 -45 59 -65 -17
2159 -17 37 -29 4 26 31 30 4 -24 29 -5 45 10 -4 8 11 -30 28 -7 -9 27 23 4 -26 -16 -7 37 20 5 -8 30 51 -7 -64
2192 -64 13 48 -23 12 7 -23 1 2 -38 -19 -4 17 -40 4 -2 46 -34 -4 -15 -42 4 50 6 18 -13 -16 14 -31 -26 43 -28 65 18
2225 18 -17 -27 -10 40 17 19 -31 8 32 1 7 -6 -41 27 -10 42 38 -65 63 12 -20 -37 -29 -12 -21 83 26 78 1 -14 -37
2256 -37 -23 65 25 -22 26 -10 -7 9 -1 57 70 -64 -12 12 -12 16 -46 -15 15 2 4 29 17 -2 -31 -53 7 -4 27 30 -17
$$ packed form
2034dl6L0lqP5n1o1M7j8J6MrQ7l4p5J5O8o6P2p7J4J04q0l9J14n8Mk8MJKJ7k7o7
2068f7PJ24j11P6jo6Q5j1q5J05n1o1M6JJ0L2l8N8n1k2Q5p7q8J45k0j43J27l9J2
2097a8N3l7j7J2j6L8N8j12M1m0O3Qr8N4N4j04O0Mm1J7N9l6Ro2j6N0K9K3K7p8M4
2128B8n4j3Q7Lq0P4m2l6J26j03L0l6K9k5k8L8M2pj9P1p5NKr1R9m1k8jJ04j24M8
2159a7N4o6L3K2Njk6k8N3l4N0l5j4J2Lm1N8l5kL6mj9l0J0RM4j7j5j3L8K1n8n7
2192f4P7L5p1L5nl0K4Jm0J9J5K1n7M4oM8q0L0j1k7M6M6m4J2l1lL0m5NO9p1R3m7
2225A8l5j0J7N0k3Kn0L9K4l1Oj3l5O8l7N2mj03J28n1l2j7QJ7rJ04n7N2p7j5k3
2256c7J4Q8m0m7M8l6LJ6j0N8J3j34N2K4k4K8o2L1L0j3KK5j2j9k9k2O0j1L1Lm7
$$ plain form
2287 -17 1 21 -36 -32 -15 -93 -24 7 -26 15 11 -50 33 21 -9 54 -41 -8 89 66 36 42 -34 -8 -22 -10 -28 -30 3 -24 -1 27
2319 27 -5 -32 -36 69 -44 2 -41 -35 7 -21 -18 22 -27 8 28 0 -15 18 -17 -49 -9 -80 61 22 -38 45 -2 -5 36 -25 13
2350 13 -13 -48 19 31 -31 35 13 -52 -11 -54 56 -31 -25 6 -17 3 23 -23 -5 -4 -5 -12 1 -3 -34 1 -56 -9 7 -7 3 -16
2382 -16 -47 -8 -25 21 23 3 10 -5 9 -44 74 -33 -26 -59 -5 -53 -81 -6 64 -11 -80 20 24 11 -18 -19 13 -38 -11 25 -27
2413 -27 -11 5 -41 -17 -6 21 3 25 -14 -5 -42 -33 59 -29 13 12 -9 24 5 -28 -13 8 -5 2 50 -15 -46 12 -29 24 -23 -10
2445 -10 -1 -8 17 -28 -25 8 -43 -50 34 -38 -38 -32 -1 0 23 -3 30 -8 34 -5 23 32 -15 -13 7 -1 40 26 15 -15 21 36 -32 15 -43
2480 -43 -62 32 -33 -12 13 53 18 14 2 25 -34 15 4 5 -35 -3 -1 -39 -42 -10 68 -50 -56 -19 20 32 5 54 1 -4 76 -8 -28
2513 -28 -25 17 -31 19 -54 -51 -46 -26 47 -20 -20 86 -34 -25 44 -50 36 13 14 60 -12 -38 -53 -31 25 -14 -63 -14 29 -50 -9 -34
$$ packed form
2287a7J8K0n7MJ7p8O9L1l3M1mo1Q3j2l0O3r5L3R7k3l0Op6K6j4J2j8kL3k7K3K8
2319B7l2k7mJ05j13M6m3OM2k8LM0m9L5K0k8j5L3l5l2M0p1J41l9o0Q3m7lM1o1L8
2350A3k6l5O7J2o2O6k2o5M1m3J10q7OL1k3K0K0m6J8JjpJ3ml1L5n7M7J6j4J0j9
2382a6l1L9j7M6Kk0Pj5J4n3J18j07Pl3N4m8k8P5P0p5o9J00Mj3k9jL2n1K7L6n2
2413b7J6J6m6K4J1K7j8K2l9Rl7RR2q8M2jk1L3j9l3J5K1j3PM8o5l1N8m1N3m7J3
2445a0RpK5m5LL3n1pQ4p2%OL1JK3k6L3l8M2l9K8Rm7KK0qM1j4j1l0L6J5o8M7n8
2480d3j9R4o5K1K5M0l5mj2K3n9M9j1Jm0L2Kl8lL2P8j18oL7L9J2k7M9n3nQ0q4k0
2513b8LM2m8N0p3LNK0P3o7%J06j20RO9r4Q6k3JM6p2k6j5K2N6l9m9M9M3p9M1k5
$$ plain form
2545 -34 34 18 -21 22 -3 -30 -25 -30 -18 52 26 -36 55 50 -23 32 -3 -24 12 -54 -45 39 -43 19 15 -20 -15 -23 72 0 0 -7 17 5 -17
2580 -17 -11 -5 -1 -31 -23 13 -12 -53 36 7 -3 56 -27 -35 3 -15 -20 -43 27 20 -22 8 -41 21 -38 4 -65 -25 -55 -34 31 -5 2 19
2614 19 27 73 -68 -52 -48 -62 2 -32 -17 -23 51 -40 -11 14 -78 -17 29 50 5 29 -36 -4 34 -6 54 58 -24 39 20 4 0 31
2646 31 33 40 -35 -5 29 -37 2 -50 -13 51 4 -14 -16 -14 8 -10 -19 -40 -40 35 -6 14 -31 2 13 4 37 0 -31 15 51 -22 13 -52
2680 -52 -53 -33 -13 36 19 -56 -3 25 -12 -9 13 34 7 -8 17 3 -34 -24 6 -47 -16 -6 -25 -12 40 -67 -6 32 -50 -15 0
2711 0 23 -14 -10 62 -3 -65 -91 22 -12 54 -30 -25 -48 -8 -20 -9 -15 19 32 -6 -59 -5 -40 10 0 3 25 -35 -31 -11 15 -18 64
2744 64 -17 23 35 38 9 -35 -30 -10 -24 -48 -51 -46 -14 11 9 1 2 20 25 5 13 -10 -42 -27 24 18 -2 59 19 18 11 -28 -16 -73 11 37
2780 37 -26 -16 7 32 12 42 -44 -3 16 -27 36 1 0 19 -72 32 9 -27 -25 35 -48 -36 16 -35 8 24 -5 -3 7 28 -20
$$ packed form
2545c4O8j6l9M3k5k7NnJ2P0k6o2R1np3N5l5k1L6o6RQ4q2O2ml5NqR5p2%pK4j2k2
2580a7OOMl0QL6k5m1Q9k9j0N9q3qL8j8nk3P0pm2L0m9O2n9M2o9M0l0K1O5l6PJ7
2614A9QM6j41J6Mj4O4l4J5oP4r1K9K5r2O1M6K1m5K4o5L2L8m0O0Mq2O3j9j6mL1
2646C1KPp5L0L4o6L9n2L7O4m7j8kKK2j8rk1%P5m1K0m5L3J1rL3l7l1M6L6p3L5o5
2680e2jK0K0M9j7p5N3K8l7LK2K1k7j5K5j4l7J0L0n3L1J0j9J3N2j07O1L8q2L5J5
2711@K3l7MP2o5o2k6J13l4O6q4Nk3M0j2J1oL4J3l8n3N4l5N0j0LK2o0MK0K6l3Q2
2744F4q1M0J2Lk9m4NK0j4k4lNL2K5kqJJ8Nk0Qk3l2J5N1ok0O1m0jpl9J2n7Q4K6
2780C7o3J0K3K5k0L0q6M1J9m3O3l5jJ9r1J04k3l6KO0q3J2N2n1M3J6k9KJ0K1m8
$$ plain form
2811 -20 3 31 13 17 -32 -7 3 -1 -18 15 15 -28 -1 55 0 20 -18 24 -52 18 22 11 -12 -9 39 56 45 39 -4 23 40 -37 -39 -1
2845 -1 -38 -4 8 4 17 33 36 28 -58 -3 68 -28 7 34 -27 71 -16 -9 -6 -17 6 35 -24 42 59 -38 21 30 2 -14 31 -66 10 -23
2879 -23 -33 24 -43 26 7 -62 16 -48 -9 15 28 20 30 1 -9 87 -13 25 10 41 7 38 34 -30 74 -16 26 4 39 58
2909 58 -43 10 -47 25 19 -9 6 -21 26 -6 20 -38 -9 3 -41 -23 43 -17 70 6 60 4 25 -11 -1 -8 -78 6 -17 -10 11
2940 11 33 9 11 31 -23 20 15 25 -12 13 38 -11 39 -4 -55 -57 -12 -13 -41 -50 -20 -62 51 14 -36 31 -9 12 -3 -38 4 1 -6
2973 -6 2 29 2 12 -39 -32 36 -24 38 0 -1 41 34 5 -12 -13 37 -38 14 36 -21 -3 -22 -34 2 -4 -11 -64 43 15 -17 -44 -10 37
3007 37 16 21 34 19 20 -21 -28 22 11 52 7 20 -13 -18 -20 10 -7 28 1 -15 -18 -27 -3 -36 -23 12 15 -16 5 -19 -21 6 -40 46 -17
3042 -17 -19 -62 -54 43 -27 -20 -15 101 20 22 0 -56 21 -2 39 31 27 -20 14 11 13 9 -35 -30 14 16 61 48 -9 24 3 31 31 1 -34 30
$$ packed form
2811b0K3K8j8Mm9K5J0mj7L3%m3K7N6n5K0l8M2p6P0Mj1k3LM8J7j1om3K7J7p7kL8
2845al7L4J2mJ3J6Lqq6N5P1r6L5K7o1R8q7PLj1K3K9n9O6J7r7N9Rk8j6M5r7P6l3
2879b3j0N7o7O9j9o9P8o4L9K4J3qJ0k9j0R6j00L8j5L1l4L1mo4J04r0M2k2L5J9
2909E8j01N3n7P2ok8J5k7M7l2K6n8K9J2m4J8O6o0Q7o4N4n6K1l6J0pp0Q4k3PK1
2940A1K2k4KK0n4M3nJ0l7K5K5m9N0m3n1kM5jk8rL0m2J13l7n0O7m0K1j5l5M2lp
2973fQK7k7J0n1PO8o0O2l8jM2pk9j7jN0p5N2K2n7J8j9j2L6opn3J07k8l2k7L4M7
3007C7k1NJ3j5Jm1pN0j1M1m5J3l3nkL0j7L5k7j6lrK4l3J3L5Ll1K1k4kK7m6Q6o3
3042a7km3QR7p0PNJ16q1Kk2n6P7k3M1qmm7L4lKmm4NM4KM5j3n7L3k1K8%l0l5O4
$$ plain form
3078 30 -4 5 -13 -30 27 -33 -60 23 9 4 -4 -71 39 11 -19 24 15 6 4 -21 6 45 -23 52 39 -32 30 28 -7 -12 1 18 41 -11
3112 -11 -13 22 30 -10 1 0 6 4 -17 -25 1 -68 37 -40 -70 18 -42 24 33 -100 -16 -29 4 32 27 0 23 14 -4 -8 -81 16 11 -53 -18
3147 -18 24 -15 7 13 -11 -23 60 -12 45 18 24 28 -35 -40 -65 -16 28 -48 -66 -68 -44 1 4 -28 4 9 -30 70 -53 -35 -29 -26 -61 78
3181 78 -24 48 34 -2 2 -4 -42 -7 -24 -8 1 -2 28 37 41 11 -6 5 42 -21 33 -22 61 -33 21 45 35 25 0 -1 24 -24 -34
3214 -34 15 -17 0 -46 1 -45 15 -18 -22 1 4 39 -12 46 34 10 34 58 0 -24 26 -69 12 -5 -23 -19 -2 0 21 -51 -24 36
3246 36 -62 -30 46 -15 -58 -12 39 8 -20 -32 -60 -34 -19 92 -9 -1 1 -41 5 -20 11 11 -3 5 -31 -27 -50 -26 -67 -7 3 -22
3278 -22 -23 30 -2 -28 3 -15 48 -10 3 -21 -10 -40 -28 32 -20 43 14 7 18 17 0 -12 11 43 5 -23 65 -14 -4 -7 -54 36
3310 36 13 -48 19 50 39 20 19 23 32 -73 44 -19 -24 -54 -9 -13 5 37 9 -35 15 22 -12 1 -37 -18 -8 22 -10 -27 11 -24
$$ packed form
3078C0l4Rj8j7N7o0k7Q3j4nqo7J10k8l0M3rrkk5K7L9o8P5j3p1O2kl5nJ3J7K3n2
3112a1kL5Qm0J1jOkk1qK6o9J05p7l0Q8o0O6Rj33Q4j3L3K8nk7K3rj8mp3R7no4L5
3147a8M2l9K2Ok4j2Q3p2N7k7OMo3nk5M9M4p6j8kK4M5Ll2L2Nl9J00j23J8OLl5J39
3181G8j02P2j4l6Mol8L5j7J6RlL0RMl0j7J1L7o3N4n5Q3r4N4K4j0j0k5jK5m8j0
3214c4M9l2J7m6M7m6O0l3mK3LL5n1N8j2k4K4K4n8k4N0r5Q1j7j8MJ7KK1p2K7O0
3246C6r8L2P6o1m3M6N1l1k8j2k8K6J5J11j01QKm2M6k5L1%j4Ql6Mk3K4m1O0J0k5
3278b2jN3l2k6L1j8O3n8J3k4J1l0J2O0n2O3k9pJ1jj7j2K3L2l8k8Q8p9J0lm7R0
3310C6k3o1O7L1j1j9jMRj05J17o3nl0M5mJ8L2k8m4N0Pl4J3l8J9J0L0l2j7L8l5
$$ plain form
3342 -24 4 14 56 -40 50 -46 -13 47 -8 34 38 -89 5 7 25 94 -8 -2 5 -31 -47 67 -26 -18 -7 -23 6 -22 -82 -24 31
3373 31 -34 3 7 -28 -29 -31 -1 16 -67 40 -41 -34 -7 -11 -49 -5 11 -2 3 -51 -19 45 6 -12 -15 -34 68 -24 -48 -6 -17 31 17
3406 17 15 -47 20 8 -35 3 30 30 -28 16 31 -37 -30 -45 21 1 -35 -3 10 -49 -39 -11 25 -46 15 2 24 9 -23 -16 2 3 -18
3439 -18 -33 46 -12 24 5 6 -2 -20 56 41 1 -58 -18 6 61 -8 5 19 45 32 -26 0 20 5 -56 10 -23 63 -30 23 2
3470 2 23 31 -69 27 -30 26 12 28 -7 29 -22 6 -25 21 -29 -11 -4 39 -26 8 -23 -66 58 -14 -30 22 3 -10 23 -57 46
3501 46 53 12 4 44 -6 -5 28 -10 23 -44 36 24 17 6 -12 -6 3 14 9 -46 -14 -2 13 -6 -35 30 -18 15 53 -12 -15 43 30 -103
3535 -103 -31 71 17 0 29 -13 -32 -16 6 -6 0 3 -31 -40 -3 -27 -12 -33 -36 -25 -7 9 27 -15 19 13 -13 17 -27 9 -12 39
3567 39 47 26 -1 23 -6 -44 -3 -27 -9 -20 -2 21 17 4 -62 15 -19 -42 6 -52 18 -83 -84 15 25 -19 -14 -20 -47 53 6 4
$$ packed form
3342b4K8J0M2r6R0r6L3O0n5M2Mj27R4KJ8O9j02OPl6j6J14r3QJ1j6K9k8o0N8N5
3373C1o5L7Ml5jkL0J7q3J07q1PK7ml8M4J6j3Nn4L2O4l9j8lj9J02r2k4M2j1M8j4
3406A7ko2O7j2m3L8K7%n8M4J5o8Pj5O6k0l6L2J3n9J0K8L6p1O1j3K2j5l2PJ8Jk1
3439a8j5P9n8L6j9Jqj8P6j5m0n9M0K4N5o9J3J4K6j3n8K6K0j5o1O6l3Q6r3N3k1
3470BK1Qj00R6n7N6j4J6l5L6n1K8l1M6n0J8PM3o5L4l1m3J24p2j6N2j9j3L3q0J03
3501D6Pm1qM0n0JL3l8L3o7Q0j2pj1j8ORJ1nn5L2J2J5j9k9O5m8L3L8o5lN8j3j33
3535a03P2J02n4j7K9m2j9J6K2j2OLl4rL7k4J5k1lJ1J8J6J8m2L4ok6L0m4L6k1N1
3567C9Qk1k7K4k9l8M1k4J8j1J8K3mj3o6P7l4k3M8n8P0j01jR9J0m4Nok7J00m7k
$$ plain form
3599 4 58 12 21 -3 -66 -11 -22 29 -42 -43 52 13 61 43 83 -21 16 83 -38 -31 -31 4 73 -54 -45 6 -22 25 -33 -13 -29 -19
3631 -19 -34 -43 26 -58 -9 38 -69 53 -32 -13 -6 31 -1 -5 -50 -40 35 4 -36 -38 22 59 1 -3 16 7 9 5 25 32 -28 -11 3 -78
3665 -78 -44 -20 -99 21 50 -53 5 -5 -38 -19 -48 -52 0 -32 -21 0 -24 15 -29 -20 3 -6 -45 -30 -36 -16 -14 -30 9 -32 -4 26
3697 26 -3 -43 5 70 -41 40 -8 -26 -61 -7 2 28 -13 33 9 -5 -19 -47 -56 -17 28 -8 -54 -33 -11 9 -34 -14 17 11 -22
3728 -22 -27 -61 -13 55 -46 -17 18 -15 34 -16 38 -27 -40 -3 42 -30 -16 11 -37 10 -38 -51 52 -28 15 -46 -1 35 10 15
3758 15 -51 -48 -14 2 40 47 -8 -18 0 -3 -6 -3 22 38 5 43 17 44 11 -6 -4 55 -12 6 16 7 21 6 25 -9 -4 28 13 -10
3792 -10 16 9 -64 -2 -35 -48 -6 2 48 -31 -56 -27 26 6 -24 14 33 15 7 19 -10 4 -52 -27 -83 -58 -10 -34 2 16 9 -3
3824 -3 -27 -7 34 -5 -4 -9 -15 -35 -1 -10 30 -61 -21 -18 -13 -43 -21 -40 -20 -22 3 -29 26 -2 -41 -1 -54 -47 -8 -24 -17 -27 -34 -10 18 16
$$ packed form
3599DN4m6Rk4o3N5j1N1p1jR5l9M8j8M0j04L7O7j21P%L5O9j27RN1k8M7n8K0j6J0
3631a9j5rO9q4M9M7j07J22q5J9PL7l2mm5J0P5l1m0kO0L7n8mJ9rKmK0Po0J7J4q1
3665g8L4K4p9J20K9j03N8j0l3J9k9mN2l2J1K1k4L9m4RK3rl9J5oK0Kj6L9m1K8L0
3697B6k9m0M8O5j11Q1m8j8l5N4RK6m1M6k4j4j4k8rL9M5l6m6K1K2K0m3K0L1ol3
3728b2nl4M8O8j01K9L5l3M9n0N4o5j3L7M5p2J4K7m8M7m8j3J03q0M3o1M5L6k5N
3758A5o6LL4J6L8Pn5j0J8llLK5J6l3L8k6K7l3j7KN9o7J8J0rJ4j5J9l4NL2j5k3
3792a0K6pp3O2l3j3M2QM6p9k5K9N3k0l0L8J9j8qJ2k9J4n6K5n6K5M8k4L6J4pj2
3824ck4K0M1l9Jnok0L4rM0r1M0LNl0K2j9K0kK5l2N5k8l9M0n3PL9j6Pj0pK4K8k
$$ plain form
3860 16 42 33 8 -8 7 -2 -1 44 -2 -17 -69 40 40 -38 25 19 -13 -55 16 -22 -8 48 16 2 -12 27 13 -11 -65 -52 -37 -1
3892 -1 -5 -11 -1 1 -10 9 63 39 -57 -32 -2 48 -3 30 -4 26 17 2 19 -20 18 5 -40 16 -7 35 23 0 -21 -14 -73 18 -30
3925 -30 -61 -8 -9 -38 -82 -28 -39 38 9 11 -30 -34 59 44 17 18 28 22 2 29 -11 8 1 21 16 13 23 26 -32 15 25 -12 3 11 -45
3960 -45 -1 -60 5 31 -22 -34 11 -14 -21 -30 -43 -44 -18 -68 -11 33 -39 3 -17 26 -6 5 47 22 -88 -6 30 55 -27 -3 82
3991 82 1 6 -11 32 36 -31 -6 -40 -30 0 13 -19 23 21 10 10 -42 -66 15 -47 -47 -43 13 -4 -35 -37 -48 22 -27 -7 -15 -38 -22 -13 -6
4026 -6 21 1 -18 42 -14 24 -14 53 3 -43 8 -5 34 38 -31 22 -3 5 6 16 -20 -10 17 -39 -17 -36 10 -12 -40 -35 -21 3 -35
4059 -35 -3 67 3 -26 -27 -10 -4 24 -22 -35 -45 8 -11 27 15 -9 -41 -46 -47 -11 69 -56 53 -18 33 -12 7 12 -13 -7 -39 46
4091 46 -39 -29 84 -55 14 38 18 62 -8 -28 -19 30 15 -34 47 -31 9 20 -10 0 39 -3 36 -30 5 -27 2 -9 -49 34
$$ packed form
3860A6K6rk5j6J5rJM5m6j5n2J09%p8O3ol2m2P1l8J4N6l2j4j4L9j4k4n4J3J5L6
3892amoJ0Kj1J9N4k4r6K5L0N0n1L3l4L0rj5J7l9L8j3m5N6k3M2j2k3k1Pn9R1m8
3925c0l1N3jk9m4N4j1P7k9Km1mR3j5k7JJ0ok0K7m0J9pK0nlJ0Ln8M7J0l7J5Qn6
3960d5M4n9O5K6n3j2M5k5prj3jK6n0N7M4p2M2k0M3l2J1M2k5j10Q2L6K5q2K4Q5
3991H2q1Nj7M3Mo7K5l4J0L0J3l2M2kj1%n2k4Q1o2%MN6j7l1kj1P0m9K0qk3J6RP
4026fK7k0j9O0n6L8l8O7n0m6N1j3L9Mo9N3k5QJJ0l6J0K7n6K2j9M6k2k8NJ4K4l8
4059c5L2P0o4k9jJ7OK8m6j3j0N3j9L8j2k4l2njL6Q0j25J09p1N1m5J9Nk5Ol2Q5
4091D6q5J0J13j39O9K4k0M4p0k0RM9j5m9Q1p8M0J1l0J0L9m2L9o6L5l2K9j1m0Q3
$$ plain form
4121 34 -57 46 -70 -18 9 -69 -41 25 95 -3 -30 34 41 16 31 -26 65 -27 -24 38 0 -65 -11 -59 -22 34 -1 -16 39 1
4151 1 -3 1 52 -12 -59 61 -5 -3 19 -10 -1 -21 21 21 -34 25 -19 36 31 -44 -9 15 -58 9 2 32 87 -21 -6 -43 25 -52 -14
4184 -14 77 -21 -4 6 37 -2 23 -38 -43 -52 19 42 12 49 29 34 -16 -31 6 -25 -16 -23 14 -1 -16 8 3 -42 1 29 -28 -31 -13 -4
4218 -4 -26 -1 -64 -23 -55 8 1 -26 -4 -38 -10 -29 -77 -4 48 -21 3 -4 -25 5 -32 51 -22 9 17 -29 -23 -13 -33 -33 51 9 42
4251 42 27 -20 17 3 20 -25 25 -48 29 26 -53 -8 -35 0 -31 -37 22 -41 -4 -44 -7 -34 -98 -32 -34 -24 25 -31 -24 -21 18 -13 -52
4284 -52 12 2 13 -24 -30 24 63 -20 -5 -5 19 -12 1 -37 -22 18 -31 34 7 32 -56 3 5 -22 -23 -28 -20 16 9 -24 -37 33 -17 -10
4318 -10 -28 3 -26 60 -16 22 22 -21 66 2 -21 29 -17 35 -3 -13 18 13 13 3 31 -9 2 37 18 -62 18 -3 -18 35 -23 -11
4350 -11 12 -16 -2 -49 -26 -24 -33 5 -13 -5 -50 71 15 -12 -47 12 28 2 -25 48 -13 -65 -7 10 -40 -22 -42 46 -64 -6 -10
$$ packed form
4121C4r1J03j16N2K7p8K8O6P0r8k7O4Pk5J5n7R1r2LO2l8o5N4m8L7N6l5j5N5l8
4151AmMN1o4m7J20o6KK2k9Rk0M2%n5N9m4N5np5L5K4p3O7pL0N5j08J5l7O8p7L8
4184a4R1r8J7J0L1l9K5o1nrP1K3l0L7k0Nn0j5L7l1RpL7j5j5K4nm5M3K8n7lJ8R
4218dk2K5o3M1l2O3pk7K2l4K8j9m8P3N2o9K4pk1L0l7Q3p3L1Qm6OJ0k0%Q4m2L3
4251D2j5m7L7j4J7m5N0p3P7lp9M5k7L5l1oN9o3L7m0L7k7o4O6kJ0M9n6PLL9l1l9
4284e2O4j0J1l7oN4L9q3J5%K4l1J3l8J5M0m9O5k7K5q8N9Kk7jnQL6pl3j3P0n0P
4318a0j8L1k9Q6p6L8%m3Q7o4k3N0m6N2l8j0L1n%j0K8m0J1L5j9q0Q0k1j5N3n8J2
4350a1K3k8J4m7K3KrL8j8Qm5J21n6k7l5N9J6k6k7P3o1n2N8J7n0J8k0Q8j10N8m
$$ plain form
4381 -10 1 -5 -19 -39 10 -9 -14 43 -33 -4 16 1 -11 27 13 -38 -33 -20 35 -2 -54 0 -48 -9 24 23 15 -28 33 66 19 -53 14
4414 14 1 -11 14 -9 20 6 -28 -8 11 13 29 20 56 -3 20 40 -38 -14 -16 -112 -42 -35 23 -33 58 -24 -69 -6 0 31 -60 -23 -29
4447 -29 -50 -55 31 -9 -5 -14 -54 72 31 -17 -10 12 -26 -30 27 4 -19 57 20 20 16 -2 -16 -8 -7 -21 22 4 -26 -20 -7 6 -53 -80 -45
4482 -45 16 1 25 -9 -61 -41 -24 -43 -10 10 -28 -37 -60 3 37 -26 -5 67 1 8 -29 -19 -18 -7 52 -31 21 -4 41 -34 -33 -25 22
4515 22 58 -46 -20 -16 -19 -6 1 -63 24 -21 -8 1 -15 46 1 -10 23 -48 3 33 48 15 -12 -17 -5 9 10 4 -8 32 -10 -3 -39 17
4549 17 -16 -20 3 -48 5 36 0 42 29 7 -43 -8 -15 -61 -2 -20 -53 -24 -19 -40 -80 -20 -7 -21 31 16 -34 11 21 30 -4 23
4581 23 -19 -6 25 -11 -23 -24 18 20 0 -43 52 31 -55 -9 -34 3 -27 39 -1 -3 -45 -9 -1 26 58 -73 16 -6 -13 -36 29 -10
4613 -10 58 12 14 8 -50 18 -18 -35 20 23 -17 -6 -19 6 14 58 5 -24 19 9 -67 71 -31 -30 -4 -40 -60 20 -28 -43 -79 -19
$$ packed form
4381a0J1oj4k0M9j9nN7p6K9K0j5j2L8j4n1NJ3N5l7n2N4m8L9L3jqm3O1L3m7p2O7
4414A4j3j2K5k3K9j4l4K0J9KJ6rL6n9K3K0p8K4kr6P0PN8n6R1q2m5O3OL1r1L7o
4447b9k1nQ6m0Mrm0J26m1m8PK2l8mN7k3k3P6l7%mj8j4QJj4M3j8l0OJ3J3n9k7L5
4482d5O1j5K4l4n2K0J7j9L3K0l8rk3O3L4o3K1P2o6Pl7J0JJ1N9q3N2k5M5p5JQM7
4515B2L6j04K6MlJ3Po4Q7m5J3Rj6O1m5j1L3p1N1L0J5l3k7nJ2J4Joj2M0m2Pl6N6
4549A7l3mK3n1N3L1l6M2j3k2n0L5pm6N9j8l3K9Nk1m0O0J3j4N2j5n0M5J0Rl4K7
4581B3m2J3L1l6j2jM2Kk0m3R5k1q6M6k5L7l0O6m0km2L6QK7L2j31Q9k2pk3O5l9
4613a0O8m6Kon8O8l6j7N5Lm0J1j3K5QM4n3k9M3j0p6J38j02JK6l6k0Q0m8j5l6O0
$$ plain form
4645 -19 -47 -32 -16 -41 -5 -58 -16 -53 -57 45 -5 43 6 -22 74 -52 -32 38 3 -30 -5 3 -20 5 7 -71 9 -17 -57 -9 -21
4676 -21 -20 -35 -4 12 5 -23 59 -17 29 -16 -38 -38 -15 -18 -36 16 -52 -49 -54 2 4 -11 -28 22 7 -11 -2 -71 -38 -23 45 -4 -17 52
4710 52 -16 5 -13 -5 -27 17 19 20 10 7 3 -28 -27 -54 -51 -58 -18 -64 -5 36 -42 23 -6 24 -37 -18 5 6 4 18 50 -37 -14 -10 -21 -10
4746 -10 -29 -19 -3 -44 28 10 4 -42 30 -67 -18 -10 0 23 41 13 -15 -11 -40 11 34 -11 -17 -5 -66 -4 -26 -47 -20 44 -80 14
4778 14 -48 -5 12 -61 18 -30 -12 -5 28 -20 -39 41 8 41 62 50 0 34 19 -5 47 -33 47 5 -12 5 -3 19 9 -18 -28
4809 -28 19 -18 2 10 -44 -14 -9 -75 -11 -7 11 -18 2 -22 21 -15 2 -14 -13 -13 -26 37 9 -27 -4 -4 41 68 22 -13 46 18 -18
4842 -18 -1 -6 -1 0 8 16 93 -2 54 -41 6 -24 -51 -8 26 -38 52 -43 9 0 32 -33 -19 -31 -92 5 27 -25 -9 28 -39 -38 -5 4
4876 4 -5 -1 58 72 -5 -13 -51 23 6 -25 19 -11 8 -29 -52 -11 -5 19 -33 12 -25 -45 24 -36 -43 24 63 -26 -8 -14 -17 -8 47 -4 -3
$$ packed form
4645a9k8J5J6k5L6n3M2l7mJ02n0M8l7k8R6j26K0P0l5l3K5Qk3K5Kp8Q0k6m0M8j2
4676b1Jj5L1J6pk8Q2p6M6m5k2%K3lj8N2o8LnN6Kj5j7N0j5j8Ro9L3J5O8m9j3O9
4710E2o8K1j8Qk2M4KJj0lml1Jk7LpM0m6N9M1p8O5k9L0o1J9K3JkJ4L2q7K3Mj1J1
4746a0j9J0J6m1P2j8om6P2r7M9QJ0K3J8k8k8Mk9N1K3m5oJ2o1O2k2k1K7O4j24R4
4778A4o2M3J7p3P9m8J8PL3m8j9Q0l3L3K1j2n0L4j5k4N2q0Q0m2j7J7qK2j0k7j0
4809b8M7l7K0Qn4L0No6O4MJ8k9K0k4M3l6J7j6J%j3O3k8l6K3%M5K7m6l5N9k8l6
4842a8J7nNJQQP7r5N6r5M7l0k7M3L4o4R0r5N2rL2o5J4j2o1R7K2n2J6L7o7JL3R
4876DrMN9J4p7ql8P4j7l1M4l0J9l7k3M1OK4n2M5l7k0O9o0pO7L9q9J8olRN5n1J
$$ plain form
4911 -3 -78 6 -13 -25 73 -4 38 -18 -20 -27 25 -24 -15 35 -44 4 39 -28 -18 1 -21 -8 16 47 -3 -21 17 4 -5 12 -7 13 -8
4944 -8 23 -17 -46 -20 -28 40 -55 9 -25 24 -30 -8 -12 -62 -33 42 5 22 -28 -34 17 -50 22 -8 26 27 25 -23 19 42 26 -2 11
4977 11 10 24 13 4 -53 -5 32 -40 -12 -13 -32 -6 -49 10 32 14 33 54 26 -5 37 -25 51 -21 -26 24 19 -40 14 -18 27 13 -29
5010 -29 -4 30 7 5 6 -12 -18 -30 0 -7 -13 -11 46 6 10 16 -5 -11 -28 -27 32 -64 -8 55 -16 -21 22 -13 -50 15 4 -15 1 -14 -36 22
5046 22 -35 33 -30 -36 -17 39 -15 44 -8 28 9 -45 -1 -24 -26 -1 -36 -56 -47 -59 -26 -55 45 -21 -19 -29 0 -24 -72 7 -47 9
5078 9 -34 29 -6 -15 -64 17 -27 -89 -20 -13 1 4 -12 52 13 -74 -60 -13 10 67 33 18 26 1 2 13 56 -15 -13 -55 -8 -70 -40 -43
5112 -43 -28 29 -2 -56 -18 -17 -82 -30 -25 -6 -17 28 19 -10 2 -64 -49 22 27 19 9 65 44 -13 -30 -5 -15 -17 38 -18 1 46 32
5145 32 14 -7 13 15 -18 15 46 13 3 -30 -42 -31 58 23 2 -29 18 0 -24 -15 -45 6 -19 -32 27 29 14 -44 -15 -20 9 56
$$ packed form
4911cp5Q4j9j2R8p7M2n6kpN2m9RN0p9M8L5o7J0J9k2J3K4L1n0j8L8j3rJ7j9K0k1
4944hL1m0k9K6qO8r5O4l4M9n4K2mn0K9P5l7J7n0oN1o7P2l0L4Jkm8M2K3j6k8J3
4977A1jJ4j1rn7M8L7p2K8jj9K6m3N9K2j8J9K1k8l1M2o2P6p2nN0nn9N4l2M5j4m2
5010b9K5L4k3kJj8oj2L0poKN7m0MOk1oj7JN9r6N6O3p1nM3l5l7O5j1j9J6j5k2N8
5046B2n7O8o3oJ9N6n4N9n2L6j9n4M4k3kK5l5k0Rj2L3k9J00o6Kj0K9k4m8P9n4N6
5078Im3O3l5rm9Q1m4o2O9PJ4Lj6O4l9q7J4M7K3N7l4j5Qk5JJ1M3p1Km2M7o2L0l
5112d3J5N7l1n4L8Jo5N2NJ9j1M5rk9J2o6J5P1Nqj0N6k1n7j7K5j0kN5n6J9M5j4
5145C2j8k1K0Kl3L3L1l3j0l3j2J1Q9l5k1l1M7j8k4Rl0N1k5j3N9Kj5n8K9nK9M7
$$ plain form
5177 56 2 -31 17 58 -42 56 -43 -36 28 6 -14 -41 -14 -6 -3 -20 -29 -5 20 27 4 -7 34 -35 -70 10 -61 35 -87 -11 47 -23
5209 -23 9 -28 50 -6 70 31 -33 11 18 12 57 24 -26 -41 28 -6 -75 15 12 -23 -52 -4 36 -23 -65 30 -35 25 -18 1 34 -48
5241 -48 10 -1 -14 -44 27 -40 -4 -23 1 33 26 41 -15 -19 1 8 -13 -8 8 -15 8 -19 35 8 15 26 -26 19 21 -28 16 0 -36
5274 -36 31 -30 1 -14 -22 -19 -50 -3 -14 -40 -6 -66 -18 -29 -43 -7 -4 -20 -26 -34 -47 17 -17 -44 17 -45 -37 14 5 -31 21 82 70 43
5308 43 -14 35 7 12 -11 -17 -27 23 -45 8 -38 -28 24 -14 -3 -78 -1 -19 -70 47 37 -45 -20 -61 6 5 14 -23 -11 39 0 -10
5340 -10 57 -17 16 -54 11 40 19 -34 -3 10 -38 36 29 -27 -42 -46 22 13 -12 26 -39 -70 -24 9 -45 47 -11 -22 -40 70 47
5371 47 16 -87 9 -21 -16 25 40 14 -4 50 10 22 7 -16 51 -63 29 3 -69 -20 5 -79 -17 -20 -25 -16 10 2 -9 10 -28 13
5403 13 -35 -17 16 -17 28 10 -9 -11 -37 -26 -16 28 -24 -14 24 -12 -53 -23 4 22 -42 44 24 68 34 -22 -10 -15 3 -30 -55
$$ packed form
5177E6n4l3M8M1j00R8r9PO4k2k0k7K7QLj7rK4K5Pk3j1M1o9l5Q0p1R6j22P6N8p0
5209b3L2l7P8n6P6l9o4M4PoM5l3n0j5O9l4o9R0ll5k9M8M0n9m2R5o5O0m3J9L3q2
5241d8N8j1j3l0P1o7L6j9K4L2pJ5n6mK0Pk1NJ6k3K3k7N4k7PJ1n2M5Km9M4j6l6
5274c6O7o1L1j5qLl1M7j1k6L4o0M8j1j4L6Lj6oqj3O4l4k7O1o2QN1rl6N2O1j2k7
5308D3n7M9k8Nk3oj0N0o8N3m6J0N2l8J1p5P7j8n1J17j0q2K5m1O7jRl7J2N0l9j0
5340a0O7p4L3p0O5K9k1n3L1J3m8P4pn6j5mO8rk5L8o5l1M6L3n4R2n8j1j8J10k3
5371D7l1j03R6l0NM1J5k6j8N4m0J2j5k3O7j14R2k6p2M9K5q4O2lnRK6qj1J9l8M1
5403A3m8J8L3l3M5j8j9kk6J1J0M4n2J0L8l6m1L0K7J8o4Q6k0M4l4n6J2nJ8l3k5
$$ plain form
5434 -55 -13 45 -5 49 3 -45 4 -30 -19 -30 30 8 -16 -10 -5 11 -33 -34 -3 2 12 17 -75 -48 14 -13 12 -25 -21 -15 -19 -24 61 -40
5468 -40 36 -39 -73 -26 -9 -6 -17 -7 -4 -46 -7 -40 -23 39 -31 -56 -16 -20 -80 -30 -21 -41 32 -41 -12 6 -50 3 26 44 48 -31 -6
5501 -6 -4 -75 37 3 -8 17 -51 10 33 -7 0 36 -29 62 -20 -28 30 9 23 -13 -4 -22 -30 -48 -31 41 9 13 12 8 -53 -47 33 1 -40
5536 -40 29 13 14 27 -25 -19 -15 -56 -7 36 -68 -17 6 -44 -11 -40 40 -7 6 -20 15 5 43 45 38 78 14 -30 -35 -15 18 13 13 -36
5570 -36 -9 30 16 34 -12 21 -1 22 14 16 20 11 -6 32 -57 -76 26 -9 38 -29 39 22 -9 13 6 -34 43 10 -22 28 10 -23
5602 -23 -23 6 47 21 84 -13 20 -23 23 15 9 -26 12 5 -1 13 -39 -18 -15 25 -18 -17 1 8 4 28 12 4 -35 -13 -45 28 -12 4 -12
5637 -12 32 -42 15 35 38 37 21 -14 -25 12 0 -21 11 -37 -22 23 -7 -20 4 -38 -33 -17 -15 43 -5 -81 -14 -15 -5 -13 -76 8 -3
5670 -3 13 -37 13 -15 -70 23 27 43 1 12 40 39 -24 -15 -10 -10 4 55 -42 47 -18 41 -3 -29 55 24 12 -6 -9 -9 -35 -14 -5 -67 23
$$ packed form
5434e5M2N8n0N4m6m8M9l4J1j1O0k2k4ONJ6m4jL1NJ0Nr2K7O2k7K5l7MOmnQ5j01
5468d0P6p5l4M7J7Lj1J0Lm2L9l3J7O2p0k5M0mo0N0Rk0P3p3K9J8n6N3K3J8Mp9K5
5501fKp1J12l4j1K5o8O1K3m0PL6o5R1q2qN8k1J4l6Rj8qj8J7P2l2Mjmo1OQ0l2m1
5536d0O9j6JJ3n2OMm1M9M3j04N1K3n0L3k9Q0m7J3k6L5j0L8KpM0o4m4nK0L3n%m9
5570c6K7L9j4J8m6L3k2K3qKMrj7L8q9j9J02l5M7o7O8j7l1K2pm0P7l3l2N0j8l3
5602b3%K9M1k6O3r7L3m3M6qol5L8poJ4n2K1LM0m3JJ8PmK4j6ql9K2l2P3m0J6j6
5637a2M4p4N7K0Ljj6l5j1L7j2k1L2m8J5M5l0j3K4m2NJ6KN8m8p6O7jJ0qo3Q4j1
5670cJ6n0N0k8n5R3MJ6m2J1K8jo3RN%J4N1r7Q9o5N9m4k6Q4l1j2j8l%k6K1Ro2R0
$$ plain form
5705 23 -17 -62 27 -8 -18 -30 14 49 2 -12 37 -13 24 32 -17 -28 -1 0 -17 -40 -40 -22 -26 59 11 4 -47 -23 63 9 64 -21 -29
5738 -29 -30 -5 14 33 22 -36 8 44 -3 -12 -15 -13 -7 -3 10 25 30 27 -15 -48 49 35 1 -4 60 94 -17 43 -18 0 58 -12 -52 -15
5772 -15 -13 20 57 -3 -30 2 39 -19 -67 -23 -2 -11 -76 -1 -49 3 12 -15 -14 -20 7 -15 26 23 4 -45 -25 -11 -22 -38 16 -33 -1
5805 -1 2 -28 6 46 19 42 30 -13 -13 25 42 -24 25 -10 -28 52 25 -26 -7 0 1 -9 -27 3 -15 26 -49 -2 7 4 -20 -41 2 49
5839 49 20 -29 -17 32 14 4 17 -35 11 -19 18 17 14 27 34 13 73 3 32 51 -27 -13 5 -14 6 10 -2 -40 9 40 4 -43
5871 -43 -14 54 11 11 4 12 27 -54 -28 34 -66 -20 4 63 -37 -37 -4 56 16 -22 23 -25 59 -7 13 -40 -14 -14 -27 -11 -27 -23
5903 -23 -11 60 12 6 2 23 -10 3 27 3 53 -61 -29 -21 12 9 37 -14 -71 -13 -10 -4 3 0 5 -3 15 -3 17 -42 57 -6 42 29 27
5938 27 40 19 -11 -43 8 21 1 4 9 14 -21 19 22 -8 14 -9 -35 -27 -21 -15 37 -21 36 -1 -34 -55 -55 -32 18 -20 36 -33 -6 -21
$$ packed form
5705B3m0m5Q9l5j0j2M4L5m7j4M9n0L7Qm9j1K7Jj7k3%J8mQ5m8pn1K4Q6n4N5q5q
5738b9jK5J9J9j1n8M4L6m7rlKOMJ3J5Nlm2l3R7j4l4nO4L4j11O0o1J8N8p0m0L7
5772a5KL3L7o0k7L2L7n8m8M4K1ro5P5m8N2Rk7JoK7k2M1lj9m9K0J4j1j6N4m9L2
5805aLl0L4M0k7K3j2m3%L8J7o6M9l5j8Q0k7n1J9PJj0j8L0j8M1p5M7Rlk4k1M3M7
5839D9k9m9J2M9j8j0J3n2M6l0L7jlJ3Pk1O0p0K9J9p8J4J8j9K0Mj2l8M9L1l6m7
5871d3K9O8m3%pQJ5q1K6O2j00M6K4N9j00%L3O0m0l8M5m8Q4o6K0n3K6%j3J6j6M
5903b3J2P1m8omK1l3J3K4k4N0j14L2QL3lK8n1n7N8LOPlNqJ8j8K0n9R9o3M8j3k
5938B7J3k1l0l2N1J3k0LNNl5M0Ll0K2k3k6QOON2n8N7l7l3k1%K3N0l8N6o9K7j5
$$ plain form
5972 -21 48 38 -47 -1 38 11 23 -12 -14 -22 -20 15 20 -39 55 -6 22 -47 -12 -13 3 16 -10 6 -20 -34 -57 -5 -40 -24 3 -32 12
6005 12 -71 -8 -32 14 -7 -38 -23 41 -11 15 18 -1 41 -12 43 25 -35 26 1 25 -1 -11 -16 4 60 13 38 32 19 -23 3 -23
6037 -23 3 3 -23 -13 -8 -63 13 7 -12 -27 -44 11 22 -19 -12 -20 -1 -7 24 20 -26 28 -11 -22 0 -41 18 26 -46 36 -7 -16 -27 -42 14
6072 14 -73 28 -70 13 35 -71 18 -42 -29 -5 -14 -35 -17 43 -21 -2 60 40 5 -16 -33 9 26 -23 28 -21 17 16 -19 43
6102 43 2 40 -32 34 58 34 29 3 -18 1 75 -1 6 8 -43 -21 -26 -25 -25 -14 -26 -13 -14 22 25 38 -9 29 8 26 -66 -40 31 30 32
6137 32 45 34 20 7 -1 -7 92 -40 50 -1 27 -49 -38 -39 53 -31 44 -32 10 -25 -4 3 31 -2 -24 -36 6 -8 -45 14 -6 -48
6169 -48 -41 30 39 -3 1 -61 -7 38 17 -16 -24 16 -40 30 4 7 -9 -10 17 30 -13 -26 -43 1 -28 30 32 19 -15 16 8 -3 2 29 18
6204 18 -5 19 0 -16 -51 -14 -2 -36 -18 2 -24 -58 -12 -4 -46 -29 -3 25 33 -15 61 -1 22 -16 27 59 34 -13 34 12 12 -14
$$ packed form
5972b1O9j0q5M6L9k7J2l5kqKL5Nn9R4o1K8o9L5jJ6J3k6J6k6j4k3N2l5J6K7l5M4
6005A2q3O3k4M6k1l1J5O4n2K6Lj9M2n3N5j8o0O1k5K4k6j0nK0N6m7K5oj3m2K6k6
6037b3K6%k6J0Nn5P6oj9j5j7N5J1m1PqJ9oL1mm6N4l9j1K2m1N9Qp2Q2m3rj1j5N6
6072A4q7J01r8Q3K2j06Q9o0J3K4rk1J8O0o4J9O2k0l5k1j7M2J7m9N1m9L8jl5O2
6102D3m1L8p2O6K4k4nk6k1J9P4p6PKn1K2nJ%J1j2J3jL6LJ3m7L8k1J8r2K6P1jK
6137C2J3j1j4j3qoR9j32R0n1K8p6J1jR2q4P5p6M2l5K1PK8l3k2j2M2j4l7N9k0m2
6169d8PP1Rm2Mo2N4M5k1l3qM0n6P0k6Lj6jK7J3m3j3j7M4k9N8Kj3l4L1qj1NK7j1
6204A8k3K4j9j6l5L7J2l4J8K0k6l4M6Qm2J7K6K8Qm8P6o2K3l8M3L2k5m7M7k2%k6
$$ plain form
6236 -14 25 20 27 17 -20 -8 5 2 24 -7 6 -50 -18 6 28 -10 40 -47 -26 5 1 -43 -21 0 32 13 51 51 -4 9 4 0 29 40
6270 40 41 -53 -7 -17 -12 -9 -2 -20 18 24 -13 12 19 -58 -42 4 -50 -9 -1 -12 20 -4 -7 -34 -9 2 -13 -9 29 -37 -15 4 27 58 4
6305 4 15 -7 17 -2 -6 -12 -16 -38 47 13 -14 32 3 41 2 -34 18 5 -18 -1 -19 45 46 17 8 -7 -9 0 -17 5 31 -10 -39 -54
6339 -54 24 54 7 -8 -8 -6 30 16 31 -12 -13 59 2 11 55 4 1 -71 -32 26 49 69 37 17 36 33 26 66 43 -11 -33 -10 -8 -3 45
6374 45 -12 1 -49 44 35 -5 -46 22 2 -17 27 -43 68 -3 -9 2 -45 -40 63 16 -15 -19 -33 10 17 19 -62 50 7 -29 13 -45
6406 -45 -26 23 39 12 -17 -45 64 -18 3 -32 -9 -6 25 29 60 -21 -34 -3 32 14 -19 -43 75 34 -7 -10 -45 20 11 -1 11
6437 11 30 42 -9 36 21 -17 -59 -1 -16 -2 21 -48 39 -16 84 -21 10 39 -38 44 -30 -34 1 4 26 22 -14 -24 -17 33 -9
6468 -9 -29 6 25 -41 -53 -7 18 25 26 20 -13 15 -7 33 -13 37 29 -33 30 9 24 34 -14 39 -5 5 18 -28 25 -17 35 1 -13
$$ packed form
6236a4L9nPj0l7J2J3lK2l1J3n6L2K4K2l8N0q7K1L1mm4K2K1L2j9L8%n5J3nmK9J1
6270D0Jr4M6j0NLPj8L8Ol7K5Pp7J6M6n4M1Qj1L2k4lk7K5J1j5ML8o6K2J9K3L1n4
6305DJ1k2K4j9momk2Q5l4k7M6k9L8l9l6N2j3k3J7j8O4Jk9rj5kRj7K2K6m1k9j5
6339e4P8L0m7j5%KL6j4J5m3jP2n7RM4n1lp2L9N8K3K0l2k0J9lpM0k3n4k2K3KNM8
6374D5n7J3n0R3rm0m1O8k0j9M4p0J11p1oJ1m7NJ03m7l1mj4M3PKq1J12m3l6M2n8
6406d5J9M9J6k7k9k8J09q2K1l5K3LL1ML1q1j3L1L5j8l3k4J18m1m1ll5O5rj2J2
6437A1J9J2n1M5j5l8m2N8j5J4K3o9Q7n5J00j05L1K9p7Q2p4mL5LK2ml6j0PN0m2
6468ik0L5J9o6j2M6K5PJol3K8k2M0m6N0qo2O3k1J5J0m8N3m4J0J3m6N3m2N2l4j4
$$ plain form
6501 -13 16 -6 -53 0 14 -31 -17 -3 16 -12 -10 18 -17 13 7 1 15 -11 -47 -8 35 2 34 10 -1 62 5 -15 -15 29 -6 -14 -28
6534 -28 -39 1 31 35 1 22 -4 -23 34 -34 -11 12 0 33 -4 -6 16 -1 -33 63 27 61 -41 19 -22 26 46 -9 1 83 -26
6565 -26 -9 -4 29 9 52 2 40 -1 68 9 -21 -9 -1 10 7 -4 0 22 -9 -70 -49 -11 17 0 0 34 2 25 -23 -41 -34 -24 23
6598 23 -71 24 -22 18 -8 8 -39 17 -18 25 82 -32 26 40 6 -11 10 85 8 -7 -4 -25 43 -7 39 5 0 -13 -12 -3 8 17
6630 17 22 37 17 -14 -39 15 -41 -16 12 -13 -16 -25 -35 27 -7 -5 3 38 48 39 34 16 -15 -2 -12 27 -9 -1 10 31 -7 14 24 50
6664 50 17 18 -3 14 -8 53 -1 -25 -20 32 -27 -5 -27 -33 33 24 -71 -58 18 15 21 26 27 -8 2 1 60 -45 -9 1 19 0 -4 -40 10
6699 10 -26 41 -31 2 21 10 43 -9 -34 13 -32 35 -3 -77 -69 -24 10 -26 -9 -51 -14 -67 -20 0 12 -16 36 -89 8 26
6729 26 12 -18 -12 67 -11 12 -19 -46 -24 -14 50 79 -41 47 21 27 -38 -9 -31 -9 0 39 26 -37 -12 -34 -25 -8 -49 33 19 12
$$ packed form
6501a3K9k2m7N3J4m5J4J4J9k8KK8l5L0ooJ4k6l6L9M3l3L2k4j1O3n7k0%M4l5qj4
6534b8j1M0L0Ml4K1k6j9N7o8K3K3j2L3l7kK2j7l2R6l6L4j02O0m1M8K0n5J0Q2j09
6565b6J7NL3k0M3n0L8m1O9n9l0J2QJ1lj1MK2l1o1K1L8K8j7%L4l2K3m8j8PJ0M7
6598B3r4R5m6M0k6J6m7N6l5M3N7j14N8J4l4j7K1P5p7j5Lk1O8n0M6l4nj3JRJ1R
6630A7NJ5k0l1k5N4n6K5K8k5lrj0O2l4KQL5J0rnj8l1J3j0L9l6QJ1K1l8K1J0K6
6664E0l3Jk1J7k2O1n4k4NN2n9K2k2oO6rr5J3P6lONJl5J0jN9j05L6J0J8j9ml6N0
6699A0l6O7p2L3J9j1L3n2k5M7m5O7l8p4QM5L4l6J7m2L7n3M7K0J2k8N2j25R7J8
6729B6j4l0OP9p8K3l1k7K2J0O4K9j20Q8k6Oo5K9k2K2RL9j3o3K5k2RJ7m1Q2j4p
$$ plain form
6761 12 17 9 -45 -35 -50 16 21 8 -25 5 0 20 -8 23 53 22 0 42 4 11 -1 -42 6 27 -11 -13 3 54 -24 -17 -41 9 -35 -35
6795 -35 -2 -36 -16 24 -22 -19 12 -6 -69 2 -2 -4 -4 23 19 -6 -25 -8 17 5 18 43 13 -16 -10 12 -58 -21 -6 9 -11 5 43
6828 43 3 38 -9 22 27 -31 -18 -5 -15 25 8 -62 -74 36 -21 -9 -9 -1 -13 -5 36 -49 -2 0 50 57 -27 -15 -14 -1 -18 -17 29 73
6862 73 3 25 10 2 22 30 15 -6 -51 -23 -37 12 -6 -34 -25 -28 25 -63 27 -57 22 -4 0 -24 10 -45 -48 -21 9 31 -45 5 19
6895 19 -28 1 39 -12 -5 -17 9 8 32 -13 -23 42 7 -11 36 11 73 -23 -2 53 11 34 -23 -15 11 39 -1 18 -22 -2 -21 -24
6927 -24 17 -2 -34 0 -18 -42 29 -40 -25 3 -37 -25 -25 -5 -47 8 -51 49 -4 32 47 40 -4 -46 38 43 -30 8 -25 11 21
6958 21 -32 23 -23 8 16 -36 25 1 -14 -40 10 -43 -26 -33 -9 -42 -31 -4 -19 -3 34 -32 -1 0 7 11 -26 57 46 52 -22 14 -50
6991 -50 -10 40 -40 -12 18 33 -26 24 37 19 30 12 -17 19 -38 -7 20 -46 -25 25 26 -29 19 3 -35 28 -38 -25 -13 -30 5
$$ packed form
6761A2Nqn4J0j5O6Nj3l3L0nK0k8L1L0l1k2M2l8Pj2m1M8K1l8kJ6N1p8Pk4N0m4%
6795c5L3l4K0M0m6LL1j8o3P1mk%K7mk5j9J7K5j2J3K5l0k9OK2p0L7J5J5k0J6L8
6828D3m0L5m7L1Nn8J3J3j0M0j7p0j2J10n7J2%Qj2QM1q5M7KN0Pq4J2JJ3j7JM6M4
6862G3p0K2j5qK0Qj5k1m5K8j4M9j8k8RlN3q8R0q4P9k6Mk4L4n5lK7L0K2p6N0J4
6895A9m7K9L8n1Pj2K6jK4m5j0O5l5j8M7k5O2r6K1N5m2K3n7QK6K8m0J9m0K0j9l
6927b4M1j9l2L4j8k4P1o9J5K8m0J2%K0m2N5n9J00n3L6J5pm4m2Q4Np3L8l3L6J0
6958B1n3N5m6L1Qn2O1k4j5k6N0n3J7pK4l3J1K7j5J6L7o6L1JPMl7Q3j1Op4L6o4
6991e0M0N0q0K8L0J5n9N0J3j8J1j8k9L6n7L1K7o6K1N0Jn5M8j6l8O3o6J3J2j7L5
$$ [...]
8191d
##END NTUPLES=NMR FID
##END=
