##TITLE=1H_Pr NOS-TG
 200.13MHz, CDCl3,
 8 sc
 
 28.5.2025
##JCAMPDX= 6.0         $$ Bruker NMR JCAMP-DX V2.0
##DATA TYPE= NMR FID
##DATA CLASS= NTUPLES
##ORIGIN= UXNMR, Bruker Analytische Messtechnik GmbH
##OWNER= pz
$$ XWIN-NMR		Version 3.5
$$ Wed May 28 15:36:55 2025 Russian Standard Time (UT+4h)  she@DPX200
##.OBSERVE FREQUENCY= 200.1313
##.OBSERVE NUCLEUS= ^1H
##.DELAY= (6, 6)
##.ACQUISITION MODE= SIMULTANEOUS
##.ACQUISITION SCHEME= undefined
##.AVERAGES= 8
##.DIGITISER RES= 18
##SPECTROMETER/DATA SYSTEM= spect
##.PULSE SEQUENCE= zg30
##.SOLVENT NAME= CDCl3
##.SHIFT REFERENCE= (INTERNAL, CDCl3, 0, 14.3821)
##AUDIT TRAIL= $$ (NUMBER, WHEN, WHO, WHERE, WHAT)
$$ ##TITLE= Audit trail, XWIN-NMR		Version 3.5
$$ ##JCAMPDX= 5.01
$$ ##ORIGIN= Bruker BioSpin GmbH
$$ ##OWNER= she
$$ F:/spectra/data/she/nmr/H-C/1/audita.txt
$$ ##AUDIT TRAIL=  $$ (NUMBER, WHEN, WHO, WHERE, WHAT)
(   1,<2025-05-28 15:35:21.67 +0400>,<she>,<DPX200>,
      <created by zg, POWCHK disabled, PULCHK disabled
       configuration hash MD5:
       00 E9 B6 7A A2 85 ED C7 34 08 36 98 17 FE 4E 26
       data hash MD5: 16K
       D7 30 59 26 E6 19 48 58 B8 48 52 D3 A7 C6 8D 97>)
$$ ##END=
$$ 
$$ hash MD5
$$ E6 05 7C 9D CF 6C D9 88 7C 5C DF DA 71 F7 54 E2
##$RELAX= 
##$RELAX= 
##$RELAX= 
##$RELAX= 
##$RELAX= 
##$RELAX= 
$$ Bruker specific parameters
$$ --------------------------
##$DU= <F:/spectra>
##$EXPNO= 1
##$NAME= <H-C>
##$PROCNO= 1
##$TYPE= <nmr>
##$USER= <she>
##$AMP= (0..31)
100 100 100 100 100 100 100 100 100 100 100 100 100 100 100 100 100 100 
100 100 100 100 100 100 100 100 100 100 100 100 100 100 
##$AQSEQ= 0
##$AQ_mod= 1
##$AUNM= <au_zg>
##$AUTOPOS= <>
##$BF1= 200.13
##$BF2= 200.13
##$BF3= 200.13
##$BF4= 200.13
##$BF5= 200.13
##$BF6= 200.13
##$BF7= 200.13
##$BF8= 200.13
##$BYTORDA= 1
##$CFDGTYP= 0
##$CFRGTYP= 5
##$CHEMSTR= <none>
##$CNST= (0..31)
1 1 145 1 1 1 1 1 1 1 1 1 1 1 1 1 1 1 1 1 1 1 1 1 1 1 1 1 1 1 1 1 
##$CPDPRG= <>
##$CPDPRG1= <>
##$CPDPRG2= <>
##$CPDPRG3= <>
##$CPDPRG4= <mlev>
##$CPDPRG5= <mlev>
##$CPDPRG6= <mlev>
##$CPDPRG7= <mlev>
##$CPDPRG8= <mlev>
##$CPDPRGB= <>
##$CPDPRGT= <>
##$D= (0..31)
0 0.7 0 0 0 0 0 0 0 0 0 0.03 0 0 0 0 0 0 0 0 0 0 0 0 0 0 0 0 0 0 0 0 
##$DATE= 1748432121
##$DBL= (0..7)
120 120 120 120 120 120 120 120 
##$DBP= (0..7)
150 150 150 150 150 150 150 150 
##$DBP07= 0
##$DBPNAM0= <>
##$DBPNAM1= <>
##$DBPNAM2= <>
##$DBPNAM3= <>
##$DBPNAM4= <>
##$DBPNAM5= <>
##$DBPNAM6= <>
##$DBPNAM7= <>
##$DBPOAL= (0..7)
0.5 0.5 0.5 0.5 0.5 0.5 0.5 0.5 
##$DBPOFFS= (0..7)
0 0 0 0 0 0 0 0 
##$DE= 6
##$DECBNUC= <off>
##$DECIM= 32
##$DECNUC= <off>
##$DECSTAT= 4
##$DIGMOD= 1
##$DIGTYP= 9
##$DL= (0..7)
0 120 120 120 120 120 120 120 
##$DP= (0..7)
150 150 150 150 150 150 150 150 
##$DP07= 0
##$DPNAME0= <>
##$DPNAME1= <>
##$DPNAME2= <>
##$DPNAME3= <>
##$DPNAME4= <>
##$DPNAME5= <>
##$DPNAME6= <>
##$DPNAME7= <>
##$DPOAL= (0..7)
0.5 0.5 0.5 0.5 0.5 0.5 0.5 0.5 
##$DPOFFS= (0..7)
0 0 0 0 0 0 0 0 
##$DQDMODE= 0
##$DR= 18
##$DS= 0
##$DSLIST= <SSSSSSSSSSSSSSS>
$$ [...]
##$SUBNAM0= <"">
##$SUBNAM1= <"">
##$SUBNAM2= <"">
##$SUBNAM3= <"">
##$SUBNAM4= <"">
##$SUBNAM5= <"">
##$SUBNAM6= <"">
##$SUBNAM7= <"">
##$SUBNAM8= <"">
##$SUBNAM9= <"">
##$SW= 18.0517328524113
##$SWIBOX= (0..15)
0 0 2 0 0 0 0 0 0 0 0 0 0 0 0 0 
##$SW_h= 3612.71676300578
##$TD= 16384
##$TD0= 1
##$TE= 0
##$TE2= 300
##$TE3= 300
##$TEG= 300
##$TL= (0..7)
0 120 120 120 120 120 120 120 
##$TP= (0..7)
150 150 150 150 150 150 150 150 
##$TP07= 0
##$TPNAME0= <>
##$TPNAME1= <>
##$TPNAME2= <>
##$TPNAME3= <>
##$TPNAME4= <>
##$TPNAME5= <>
##$TPNAME6= <>
##$TPNAME7= <>
##$TPOAL= (0..7)
0.5 0.5 0.5 0.5 0.5 0.5 0.5 0.5 
##$TPOFFS= (0..7)
0 0 0 0 0 0 0 0 
##$TUNHIN= 0
##$TUNHOUT= 0
##$TUNXOUT= 0
##$USERA1= <user>
##$USERA2= <user>
##$USERA3= <user>
##$USERA4= <user>
##$USERA5= <user>
##$V9= 5
##$VALIST= <valist>
##$VCLIST= <CCCCCCCCCCCCCCC>
##$VD= 0
##$VDLIST= <DDDDDDDDDDDDDDD>
##$VPLIST= <PPPPPPPPPPPPPPP>
##$VTLIST= <TTTTTTTTTTTTTTT>
##$WBST= 1024
##$WBSW= 4
##$XGAIN= (0..3)
0 0 0 0 
##$XL= 0
##$YL= 0
##$YMAX_a= 260070
##$YMIN_a= -294834
##$ZGOPTNS= <>
##$ZL1= 120
##$ZL2= 120
##$ZL3= 120
##$ZL4= 120
##$ABSF1= 10
##$ABSF2= 0
##$ABSG= 5
##$ABSL= 3
##$ALPHA= 0
##$AQORDER= 0
##$ASSFAC= 0
##$ASSFACI= 0
##$ASSFACX= 0
##$ASSWID= 0
##$AUNMP= <proc_1d>
##$AZFE= 0.1
##$AZFW= 0.1
##$BCFW= 1
##$BC_mod= 2
##$BYTORDP= 1
##$COROFFS= 0
##$CY= -3
##$DATMOD= 1
##$DC= 2
##$DFILT= <>
##$DTYPP= 0
##$F1P= 0
##$F2P= 0
##$FCOR= 0.5
##$FTSIZE= 0
##$FT_mod= 4
##$GAMMA= 1
##$GB= 0.15
##$INTBC= 1
##$INTSCL= 1
##$ISEN= 128
##$LB= 0.25
##$LEV0= 0
##$LPBIN= 0
##$MAXI= 10000
##$MC2= 0
##$MEAN= 0
##$ME_mod= 0
##$MI= 1.114404
##$NCOEF= 0
##$NC_proc= 0
##$NLEV= 6
##$NOISF1= 3.799351
##$NOISF2= 2.8
##$NSP= 1
##$NTH_PI= 0
##$NZP= 0
##$OFFSET= 14.38212
##$PC= 1
##$PHC0= -1552.021
##$PHC1= 8.992201
##$PH_mod= 1
##$PKNL= yes
##$PPARMOD= 0
##$PSCAL= 0
##$PSIGN= 0
##$REVERSE= no
##$SF= 200.129724274929
##$SI= 16384
##$SIGF1= 3
##$SIGF2= 2
##$SINO= 400
##$SIOLD= 16384
##$SREGLST= <1H.CDCl3>
##$SSB= 0
##$STSI= 0
##$STSR= 0
##$SW_p= 3205.1282051282
##$SYMM= 0
##$S_DEV= 0
##$TDeff= 0
##$TDoff= 0
##$TI= <>
##$TILT= no
##$TM1= 0
##$TM2= 0
##$TOPLEV= 0
##$USERP1= <user>
##$USERP2= <user>
##$USERP3= <user>
##$USERP4= <user>
##$USERP5= <user>
##$WDW= 1
##$XDIM= 8192
##$YMAX_p= 0
##$YMIN_p= 0
$$ End of Bruker specific parameters
$$ ---------------------------------
##NTUPLES= NMR FID
##VAR_NAME=  TIME,          FID/REAL,        FID/IMAG
##SYMBOL=    X,             R,               I
##VAR_TYPE=  INDEPENDENT,   DEPENDENT,       DEPENDENT
##VAR_FORM=  AFFN,          ASDF,            ASDF
##VAR_DIM=   8192,          8192,            8192
##UNITS=     SECONDS,       ARBITRARY UNITS, ARBITRARY UNITS
##FACTOR=    0.0002768,     1,               1
##FIRST=     0,             0,               0
##LAST=      2.2672688,     0,               0
##MIN=       0,             -294834,         0
##MAX=       2.2672688,     260070,          0
$$ Real data points
##PAGE= N=1
##DATA TABLE= (X++(R..R)), XYDATA
0@%%%%%%%%%%%%%%%lJ1j6J6j6J6j9K7l2L2m0M8n6O4p2Q6r4J04j20J36j52J71j93
38a02K12k36K67k95L25l59L96m36M80n30N83o42P08p82Q64r51J051j168J300j452
58g67J632j848K109k434K852l410M195n376P338j1146K1070r4119k14930K60082
72c4752K21530j18516j66413M6116J13538k8728o8008M2040n490n2353N6787Q7186
84I2937m6342j38995j1489J77636M0360j71752m4924J10891M5009k9614l5887
95a2170m424M491r142M1566K7917p2671k6244P5339L8958n3036o9972K8780P0774
108D0166k9947k6838L7880l1519m0835M9425M1005k8710n4746J3366Q2567l518
120D8296p9546n20M8942N667l2959m318M5713k0545o5741N4393O2491p2224n7657
$$ y = [0, 0, 0, 0, 0, 0, 0, 0, 0, 0, 0, 0, 0, 0, 0, 0, -3, 8, -8, 8, -8, 8, -11, 16, -16, 16, -24, 24, -32, 32, -40, 46, -48, 56, -64, 72, -80, 91, -102, 110, -126, 141, -154, 171, -188, 208, -228, 252, -278, 305, -337, 371, -411, 453, -498, 553, -615, 685, -767, 865, -983, 1126, -1308, 1544, -1866, 2329, -3047, 4291, -6855, 14215, -79904, -294834, -34752, 186778, 68262, -98151, -52035, 61503, 32775, -35233, 6807, 1317, -51036, 5751, 92937, 46595, -92400, -103889, 73747, 114107, -57645, -102569, 8322, 53331, 23717, -12170, -16594, -12103, -21245, 20321, 48238, -24433, -50677, 24662, 63620, 10584, -59388, -30608, 40166, 10219, -16619, 21261, -10258, -51093, -1668, 39337, 10627, -44119, -30753, 51814, 48296, -31250, -31770, 17172, 22839, -10120, -14438, 31275, 10730, -55011, -618, 61873, -10351, -68008]
133f8008N3594O5892k0294p2071R414N8528j7010k7854K1703J2509j1576j1362
145f535K0078J5912n2599k0238O5763J5670m9184j8481J8999K4807j0665k3073
157a9546K0791R461j8317J1493J2619j3636j3872L463K6685m640l3586J6768K0022
170A7705k4886k67J8258p662j6924n903K4356J7528k9186j0641K2934K544q828
183i72m907R539J2339j9470j548K9230k1506l4858K2127L3164l395l5985j2735
196b8977L7330J0265k4990L53M502j351P614J845q39j3914j0123L2408J2933l7680
210a0624j2000K2405J9215l667k8778l585K0505j212J712K864j6881m56J5107
223D605Q705p476k7277Q853L8725j2647l0770O034J3743P304p443j0490J1356
$$ y = [-68008, -14414, 51478, 31184, -40887, -31473, 27055, 10045, -17809, 3894, 16403, 4827, -6535, 13543, 29455, -23144, -43382, 22381, 38051, -11133, -29614, -10615, 14192, 3527, -19546, 1245, 10706, -7611, 3882, 16501, 2865, -11007, -7544, 19141, 14501, -19085, -2317, 17705, -7181, -7448, 10810, 3148, -13776, -19679, 4677, 22205, -6981, -17622, 5312, 7856, -972, -5879, 3660, 15999, -3471, -5019, 24211, 2705, -32153, -10026, 23138, 19743, -16242, -28977, 8353, 18618, -6372, -6019, -1517, -2868, 4746, 6591, 5752, -8162, -18285, 14123, 27056, -10624, -22624, -219, 18996, 15329, -13449, -17034, 3471, 2259, 3971, 6835, -10046, -10502, 4605, 13310, 5834, -21443, -12590, 26135, 13488, -17282, -11248, 2495, 9799, 2356, -8134, 3222]
236C222k079p335J5466l434j4161M815M820O215o990j8027J7469J3072j9326p07
250f980Q755K31L14p366Q116R230k0808J118J8870r270o219L183J998N791j2414
265e451l068J7852j0008r941J3102j681k795o38l529J4033j857j4631J2673L567
279G628r249L728j782K293J235j2754J0160O514j8685N410J1009o887m88l268
293e136M416J0105j4313o68J4138q242j13N187p024N510j854n565J0952q274q115
308h996J3012k726n085J053n289J0779J432j3839J0922N343r175O988q25m212
322f18M563o330O136M216j6066N241Q948r547J726o49k567R674p076m115R937
337C473n121M45O154o800L865J330n138R267m564r053J0484j706o865L615l803
$$ y = [3222, 1143, -6192, 9274, 5840, -8321, -3506, 1314, 7529, 539, -17488, -19, 13053, -6273, -6980, 1775, 2006, 2320, -5046, 3070, 12300, -8508, -7390, 11480, 2210, -4009, -826, 1172, 6963, -5451, -8519, 9333, -675, -10616, 2486, 805, -1990, -2628, -6157, 7876, 6019, -8612, 4061, 7628, -1621, 2107, 325, 2618, 3853, -8901, 1259, 7773, -10912, -5502, 5507, -1380, -1868, -5136, -720, 9385, -4928, -5596, 8542, 300, 187, 5374, -1650, 3860, 2006, -3559, 7393, -881, -8996, 4016, 1290, -3795, -2742, -8031, 2748, 4180, -9659, 1263, 6606, -2569, 4419, 3594, -618, 3945, -2385, 3751, 7967, -8099, -2858, 6090, -3457, -1731, -2380, -4947, 4727, -2349, -6464, 3473, -1648, -1203, 4951, -1849, 2016, 3346, -1792, 7475, 2911, -6142, 4342, 2636, -4229, -614, -4417]
352d417M857K593j0570O398L853p852P517O20n728N809l559Q12N542r090K063
367a152O727o643K195j372n533Q891j835n783O510m657j290P484m476l19N95k781
383c439Q988j797q722P385p35l150O156o155k042O256l399K355l55o982M813J674
399H51j314M502o696k954P877j853K02N89p373O744O798n891j660l511J583R901
415G795n265p331L215k02M658J269q634P64J325J924P084p058o923Q498J492P6
431B687o68p921M048Q546k935k073m062j708O280j081J32J220r550L280J0087
446F282n296m682k975J770J3749n46j2908j641N472Q543p88j2860J550Q057n54
461C173J078n048n510O052k84l86M573o844k323P168P78L95n404n928J1206O476
$$ y = [-4417, 440, 3033, -7537, -1139, 2714, -5138, 2379, 2999, -2729, 3080, -479, 333, 5875, -3215, -1152, 5575, -1068, 1127, -245, -5778, 3113, 1278, -4505, 2005, -2652, -3942, 3542, -934, -1253, -658, -3439, 5549, 3752, -4970, 2415, 1680, -1470, 4686, -1469, -3511, 2745, -654, 1701, 1346, -5636, -823, 851, -463, 4039, -2657, -5611, 2266, 413, 615, 1204, -6169, 575, 7373, 1482, -178, -3689, -2106, 7795, 2530, -4801, -1586, -1788, 2870, 4139, -4495, -3731, -2406, -482, 6602, -456, -7379, 1119, 2611, 2687, 2019, -5902, -1854, 6692, 3757, 1684, -2378, -4086, 2194, 1113, 1245, 2465, -7085, -3805, 6282, 986, -3696, -6671, -4901, 8848, 8302, -4606, -6247, -775, 7768, 6980, -5880, -4330, 3727, 3173, 4251, -797, -6307, -255, -539, -925, 3648, -3196, -5519, 1649, 2427, 2822, -2582, -8510, 2696, 9172]
477I172n890l517l604M731M897p544N26K295o286O487N203q604l042j799M672
492b303J1569o816r953L607P326O848p665j3998Q839Q712k585J490o294l106O471
507B142l781j45L501p989K056R695J07l915j1173j485J7515L257r025l804j849
522d893J0416M667j4415k098N398R07P449l985j0245K966K267L663L414j1966
536f455k709J2013N345j886j2711m022J6444P40r662M488j423j376M860l254M30
551H22k002q206R582R371p855o789l166P847J0574j1105p660P172K892N959j610
566E826j2715L599N285j866M836l745o772N951K021N45k965j0822N921J2386j787
581E698n136q362J239J4947m271r547M768J434K937K849r247q71L806k309N315
$$ y = [9172, 3282, -235, -3839, 892, 5789, -1755, -1229, 1066, -5220, 1267, 6470, -2134, -5176, -6975, -2303, 9266, 2450, -7503, -3896, 3430, 10278, 2613, -11385, -2546, 6166, 3581, 5071, -1223, -4329, 2142, -1639, -1784, 1717, -6272, -4216, 5479, 5586, 1671, -9502, -10987, 6528, 9785, 760, -3044, -4893, 5523, 10190, -4225, -6323, -925, -18, 7431, 3446, -6799, -3833, -1566, 2097, 5511, -6455, -9164, 2849, 8194, 6308, -6403, -10425, 6019, 6759, -2903, 1585, 162, -1214, 3646, 392, 822, -1180, -9386, 196, 9567, 1712, -5077, -8243, -396, 10178, -927, -8587, -1415, 1477, 7436, 5826, -6889, -3290, 1995, 129, 4965, 1220, -5552, 399, 2420, 2965, 0, -10822, -4901, 7485, 5698, 562, -7800, -6561, 8386, 4115, -5432, -664, 770, 3707, 6556, -2691, -3562, 244, -2065, 3250]
596C250J216o537k129k46Q201M155j5756k336J4041J961l004n227l410J0283O44
611E106q405K728J374J1L032k976p05j442m931P089K725n631K099j120j428N600
627C126l989k914M646j396K707L360o687q36K055J71K615l162j701L463k191J523
643G90J473p834J901N954k248J413j614l709N611O92l851N06M7K976J680l534
659B53J458k420m360O950J776n456Q86n29J785K613o049j081N087m57J477p51
675A182k982K489L9L70J261n545J044O356k295j280j154l438L985P17l109L236
691H76m13j840K520k144p58J199n79M359k72m380K934q56k185L561k255j393K915
708A289k082Q75J455m010J090N36o03K565k130j97M635l002j542K268k647J909
$$ y = [3250, 4466, -2071, -4200, -4446, 3755, 7910, -7846, -10182, 3859, 5820, 2816, -2411, -5821, 4462, 5106, -3299, -571, 803, 814, 3846, 870, 165, -1277, -6208, 881, 3606, -2025, 74, -1046, -2474, 3126, -863, -3777, 869, -527, 2180, 5540, -1147, -1983, 72, 243, 2858, -304, -2005, 1458, -733, 790, 2263, -5571, -3670, 2284, 36, 1449, -165, -3874, 1737, 2429, -1422, -916, -869, 2107, 3787, 253, 1711, -709, -5069, 1881, 3657, -1799, -913, -1442, 343, 2956, -3093, -4174, 913, 456, 1933, 1182, -1800, 689, 728, 1098, 2359, -3186, -2142, 4214, 1919, 639, -515, -3953, 32, 749, -2360, 876, 463, -1377, 1143, -1001, -1759, -560, -1139, 3220, 2948, -1432, 1502, 646, -1539, 2022, -233, -1626, 1289, -793, 82, 1537, -2473, -1383, -847, -1450, 1115, -1015, -1212, 3423, 421, -1121, 1147, -1500, 409]
724D09J836k387K252j146l425L601j277j771K174k136K002K452m785Q46J218j834
740a971L741j382j786L957j986n61K299m063J021L629l262P39k85k121L639k023
756d15k684L689j676M34K447m026J670K468l408K509L66k710L646r82j700K201
772A829l451J047L341m609P06J852k966K783j44l266L650j027j119L641l136Q25
788d4L000l845J615R42l796M146r7l713K772j722o66K954l815R87K945l848J930
805b55J306l667L825L5k615L711k505p74L190k879R04J724l881K456N90m001L264
822D28k48k330L350k082q69K996k739J772J760l985K717J403l228K615j249j455
838a144L838k883j234K615k720J459J178l430K725j62k868M019j245k313L539
$$ y = [409, 2245, -142, 2110, 964, -2461, 1140, -137, -1908, 266, -1870, 132, 2584, -2201, -1355, -137, -1971, 1770, 388, -1398, 2559, 573, 12, 2311, -1752, -731, 2898, -364, 375, 90, -2031, 1608, -415, -3099, 590, -1086, -652, 1795, -2231, -561, 1907, -1501, 1008, 1374, -1336, 2310, 1328, -372, 1829, -1622, -575, 2766, -1843, -1137, 715, -2251, 532, 388, -2878, 772, -255, -1374, 2267, -869, -44, 2956, -889, 726, 1668, -2128, 2018, 1921, -1792, 980, -742, -1408, 1546, -2269, -1282, 1663, -2185, -255, 1051, -2616, 1209, 1244, -1371, 2340, -165, -939, 2251, -628, 276, 2000, -1881, 575, 1165, -2836, 428, 180, -2150, 1200, -882, -1751, 1245, -1494, 278, 2038, -1947, 770, 2173, -1055, 1560, 311, -1144, 2694, -189, -1423, 1192, -1528, -69, 1109, -2321, 404, 242, -2626, 1393, 148, -2165, 1374]
853A374j520J37J987l214J814J298l462L141k30l065K531r01r83K425l758M28
869a998M230l040J46M22j757L516m97k598L109j700m76L360l033q11K098j402
885d31K256j347l517L340L26k125K125j321o81J639j883K202J244l588J741J990
901A970j648P99k229L46L972k615k141K171k117O29J787j627O26j149k48L772
917B298k788k077L009J89J026q6l695K385J909k718J207j53j385J645r71M1Q22
934F58l023R07K313j433J230j083j883L764K21j818J06j830K431L364m110j219
950a405J911l00J049j980j219K532j268J45K381l238r40J951k93K748j511l715
966c152M603K028l689o66k31J961J041k654J666J034m187J390J163q91J209l092
$$ y = [1374, -146, -9, 1978, -1236, 578, 1876, -1586, 1555, 1325, -1740, 791, -110, -1093, 1332, -2426, -1998, 2232, -808, -662, -240, -1997, 1519, 1022, -1576, 1533, -167, -643, 2717, -316, -1127, 971, -431, 1825, 478, -3039, 301, 627, -1498, 627, -694, -1375, 264, -1619, 583, 1827, -1761, -20, 1970, 322, 1121, -1108, -762, 3210, 595, -1546, 625, -1492, -863, 924, -703, -77, -1226, -1474, 2298, -490, -2567, 442, 631, 1657, 1571, -2124, 261, 2170, -548, 659, 506, -879, 766, -205, -164, 658, -2365, -1458, 855, -578, 652, -431, -2314, 1450, 1671, -147, -41, -1871, 560, 3924, -186, -1405, 506, 206, 1255, -725, -1944, 588, -680, -535, 1846, -1392, -2332, -381, -674, 2074, 563, -3152, 1451, 3479, -210, -876, -1107, 854, 1895, -759, 907, 1941, -2246, -856, 307, -584, 625, -2467]
982b467P98N677l259m092J993J064K733p96l804K726J284j588R68k734P04K600
998A807k791K01K157k896O63O53j306L181k306k977N743R91k776j551q31L828
1014A790Q44n013L151J633l402J803j263r88J825l023J958N021n134k948K984
1029g62J511J395l445j404N791r28l065J833j603O74J422k966K520J021m737K818
1045G5J474l035O00j115J315L526l011p51J542k474K607J142l091K351K0j029
1061A46K434l704j526M123j977K1K525l253O8J210p42J720l012o88N729j568k780
1078a274K172j333Q97P21k932L640M20m878K985J686k920o36j426L083K854m637
1094a578K52K599j764L85q72r98M272o82k141K603k425j102K438j331Q28O31k476
$$ y = [-2467, -1669, 4008, 749, -3343, -1350, -286, 2447, 1651, -2153, 573, 1857, 269, 1237, -1497, -793, 1807, -984, -783, 1374, -1522, -859, -206, -1512, 1669, -637, -3614, 2129, 3120, 344, -1207, -2038, 1790, 2634, -2379, 772, 2405, -997, 806, -457, -1445, 380, -2643, -685, 4336, -798, -3746, -762, 749, 2144, -1301, -2705, 3086, 2158, -907, 926, -677, -3, 1419, -1547, 973, 1994, -2743, 75, 1549, -1486, -886, -2001, -686, 2840, -171, -922, 620, -1854, 753, 1895, -1196, 1155, 1175, 146, 2580, -1124, -2650, 1473, -504, -483, 2042, -1211, -1143, 67, -675, 1045, -1967, -2655, 3074, 1506, -1274, 898, -435, 462, 1183, -1749, 1891, 2311, -2567, 418, 2104, -816, -1452, -2878, 205, 3059, -1578, -1326, 1273, -491, -106, -978, -1976, 2296, 1614, -527, 2076, -349, -1451, 987, -344, 484, 1115, -1361]
1111a361K388m2k812J532j332O2L148j281j02R78k916K021J102l265K034J676
1127A830j519J404j523q18R80k492J649K252k757O91J045j583Q85j556k8L698
1143B158k015r99K864j757o16J113j566J270l84r87L148j101k388J410j230jP56
1160c25j187K383L09k582K076K71k811J234R62Q24J208k701K54J441k374N97N58
1177A37r35J559p59r09K142k535p36K401j076M45J490j295J135r36r39J934r96
1194A27r22K291r50l92J57j433J739o35k799K893J042j920Q64n23j75J082j809
1211a363J637J669k284Q42P21j221M89j204K82K424k803l13K650k303n01J111
1227a67o51J334q47r39L034j376j840K422q71N9R78j659J871l1k917J899O24k346
$$ y = [-1361, 1027, 985, -1827, -295, -1627, -1565, 1583, 302, 200, 1178, -1738, 283, 1385, -1880, 154, 1830, 311, 1715, 192, -626, 354, -2138, -489, 1763, -994, -303, 742, -841, 44, -1512, -1540, 2158, 143, -856, 2008, 251, -365, 748, -818, 452, 68, -919, 2229, 1128, -1260, 150, -1080, -1081, -325, -1512, 871, 1180, -1402, 674, 945, -1866, -632, 330, 1154, 2362, -339, -85, 1356, -1018, -421, 137, -798, 761, 2, -907, 1235, -1300, -2036, 365, -711, -266, 1224, -71, 1064, 128, -811, 1123, 127, -795, 1496, 546, 154, 311, -1122, 617, -18, -2817, 76, 1118, -802, 62, -461, -636, 446, -1363, 274, 1943, -341, 501, 1222, 1, 490, -714, -432, 1992, -811, -1124, 1526, -777, -1278, -167, -818, 516, -331, -1270, 1764, 388, -1452, 970, 99, 158, 1136, -523, 1348, 1317, -1600, 299, 923, -1423]
1245a423J432l80J65J047k313J031J404k877J711J510j790J334o20n21J755k105
1261f40p6K787k456k44J315j588J422n27j637K692j285j540K787j214m33R82j820
1278a475K082P76k859K601M63k699J635l07o10J481k028P25J811l433Q36J876
1294H75k106J795o52j087K394j548j046K956j751l35J919j981J458M9k127K283
1310A096n75k331K421n29q49J513j896Q10Q84k145K024Q79k512J831q8j007J833
1327A359j760j09K033j852M28Q58j945J276K41k082J938r05q33K469j559o92K182
1344A047j561N76J123j879J581m1j473J954j101r93J820j559K7J509k240Q65P97
1361D52j957J793j92j401K122p39n83J441j367L65J543j743P85O48j664J417o37
$$ y = [-1423, 9, -371, -206, 841, -1472, -441, 963, -1914, -203, 1307, -483, 851, 231, -290, 1465, -640, -716, 2071, -385, -629, 686, -902, 520, -7, -1644, 1048, -237, -1777, 1010, -204, -637, 345, -1475, 607, 1383, -1476, 1125, 1588, -1111, 524, 217, -393, 1088, -940, -215, 1596, -1837, -1001, 875, -1231, 564, -88, -1175, 1219, -329, -1375, 1581, -170, -505, 1414, -567, 891, 940, -1187, 1096, 521, -1810, 611, 82, -767, 746, -1150, -340, 544, -1601, 423, 1302, -1210, 621, 533, -474, 1359, -401, -510, 1523, -329, 99, 957, -988, 288, 529, -1553, 385, -520, -1353, 1116, -443, -1135, 1047, -514, 62, 1185, -694, 887, 846, -627, 1327, 226, -767, 1053, -506, -479, 1030, -1210, -345, 452, -1505, 288, 96, -1305, 817, 78, -505, 936, -431, -66, 1477, -266, 519, 1167, -497, 920, 283]
1378B83j365J801j152n34J948j781k26J398j415J096N49j360J625m41p56J562
1394A232j442MJ563j660L71O03k025J511M82j674J307r47m45J535j207K48J260
1411G16j560J544K3j686J336N95p88J075j174o21J555j839K26J344j291M31j55
1428b69o92J339q45q08K024k13o00M89j177J368P26j915J097J52j358J172k21
1445B69q66R37j035J38R54j544Q41N61o50J293r90j031K087q20m68J313r66L01
1463C24O37j710J065J32j378R34l7j95Q86j959K88J707j173K53J71m31K088r05
1481F97k311K081K95q76R45q51L30P82k066O82O67j380J139m59m95J996k140p03
1499a667K776r84m73P95j070J336L12j808J494j32j271J156o13O74P52l081J318
$$ y = [283, -1082, 719, -433, -967, 981, -800, -1026, 372, -1043, 53, 602, -758, 867, 426, -330, 1232, -210, -206, 1357, -303, 68, 671, -1354, 157, 639, -1035, 272, -675, -1120, 415, -792, -544, 716, -844, 700, 723, -963, 373, 968, 180, 1255, 81, -540, 1015, -824, -598, 746, -545, -114, -269, -961, 378, -467, -1275, 749, 536, -64, 425, -752, 616, 1342, -573, 524, 676, -682, 490, 269, -597, 340, -695, -557, 397, -1147, -306, 255, -395, 898, -92, -1123, 964, 144, -324, 989, 23, 324, 961, -749, 316, 448, -930, 4, -33, -228, 658, -1301, -1013, 694, -479, -226, -55, -486, 1602, 697, -1614, 467, 762, -114, 831, -20, 310, 1092, -974, -292, 375, -1005, 134, -325, -820, 1176, -964, -1667, 1109, 125, -348, 447, -623, 713, 1025, -783, 711, 579, -692, 464, -149, 525, 1277, -1804, -486]
1516d86J626k228K11P22j61J945j841j634K740m28j050J230o26R87j37j803J584
1533F51m40j656J949o53k62J690k483r7K013j695M17R11r17J356j75o42Q42j286
1551d77P7J882j806J43J273j496P94k66k279K140L53j151J732o71q01R84j442
1568a011R10Q79j579J603N25j813J489m31j555J400p06J35J470k180L75J556k312
1585a245k16J250j23J165q78k30J747j893m54J863j365M03R97q61J117r46k375
1602b044J953J10q57J115m16K86M00j869Q16J005j577J416J88p30K107j666q16
1619e79J522j209k67J162j125R96J79j845P71k20n36J598n63j80J488j592O0O59
1637C19j145J395M65j476J608m15j371R99m98k77M50r64J314J80j411O96J01j087
$$ y = [-486, 1140, -1088, -877, -155, -316, 1629, -212, -1846, 894, 466, -584, 646, 20, 1007, 870, -933, 651, 211, -1445, 504, -149, -411, 1279, -1204, -1301, 712, -983, -566, 345, -572, 784, 609, -33, 809, -477, -400, 1482, -324, -181, 1092, -404, 390, 124, -2155, -15, 338, -813, 919, 248, -553, 431, -1011, -101, 778, -801, 802, 1327, -486, 1003, 572, -983, 417, -289, -154, 1316, -864, -489, 1067, -1245, -1461, -211, -334, 831, -47, -277, 1470, -423, -877, 986, -379, 24, 1021, 160, 1277, 331, -2044, -91, 19, -838, 277, -139, 147, 547, -1322, -506, 499, -1078, 338, 526, -204, 1903, 237, -579, 943, -266, -533, 629, -496, 500, 679, -1166, -395, -615, -1151, 447, -116, -296, 1192, -400, -340, 319, -826, 569, 1034, -442, 1166, 751, -620, 379, -119, -396, 54, -910, 404, 584, -827, -131, -30, -1117]
1655a117J154L7r5J127j223m5J012j524M28Q98p28P65o03m24Q12j158l74J484
1673D26r89N12O26j034O23p0j162J413l64k02J021m59k15N44r61J36M97j004J154
1692D92K56j472Q48l48n71R47p59L09J432j457M48K91p63K74M8J73J000j055m42
1711c49J438j518o6Q35j142R22P8q73J144p27r01J029l8j35Q91q83R87k9j703
1730a040J501L33j114R52k88m55P31j322L49J015j877P20Q31q50N34%q27J373
1748E66r59q2J702r94K8O52j221N02O9j287J930o31j367J295n19m50J024q28O55
1767H5M23j623J609M68j503J055o20j03J235j290M32J075j870j33J153j137P10
1784c4j54n01J524j285p66J915o93m98J207q70J125k52j582J528k62j223J579
$$ y = [-1117, 37, 74, -21, 1106, -117, -162, 850, -674, -246, 652, -76, 689, 86, -338, 474, -684, -1058, 426, -563, -51, 575, -459, 164, 94, -1068, 345, -19, -221, 800, 341, 126, 670, -291, -155, 342, -662, 492, 748, -724, 124, -224, -795, 152, -607, -298, 1134, -323, 125, 416, -347, -73, -25, 148, 1148, 93, -349, 1089, -429, -495, 340, -802, 120, 198, -675, 469, -258, -1159, -130, -168, -303, 588, -295, 692, 663, -1040, 461, 794, -320, 632, 344, -111, 620, -702, -353, 662, -1215, -495, 336, -514, 20, 20, -807, 566, -393, -475, 1227, 233, 261, 913, -308, 194, 263, -1024, 906, 275, -1092, 203, -316, -766, 258, -570, 85, 508, -1115, 494, 962, -541, 514, -106, -209, 1026, -264, 168, 1243, -627, -760, 393, -744, -34, -188, -689, 835, -450, -1216, 699, 6, -492, 715, -155, 970, 718, -864, 664, 402, -821, 758]
1801G58j61j141Q31j045N40Q04j644P95O97j079P58L18q55J267j154k45J641j266
1819a81J09J159j115J56K73j459J555n17q12J323q07o63J319r31O74M25j361J230
1837C77K94j544J498k08p52R44o88l56Q65j043O17P73j712Q45J90p15R49q21j16
1856f03J565j280l47J356r76M09O91r83P36k93r55J373n67n57J017j077K93M85
1874B87j328R94M13j240J381l34j063J398n99n6R73q71J13Q63j581R00L80j158
1892e28R49m30o44J122j103l19J608j180P3O47l78N19j66p28J223l99m37R05p58
1911b4J85L58j005O70K68j025O70rr55Q91l29MM90n73L82M19j131J041M31o64
1931I4N06o83l25J155j069j50J343j249L7N04o94K66p4k23Q71m25m93J138n54
$$ y = [758, 597, -544, 287, -758, -218, 586, -1058, -263, 434, -645, 113, 431, -424, 843, -311, -556, 1085, -181, -72, 1087, -28, 128, 401, -1058, 497, -20, -832, 491, -316, -979, 340, -591, 83, 508, -853, 377, 671, -873, 625, 417, -335, 609, -79, -435, 430, -613, 4, 777, -935, -90, 100, -615, 334, -487, -603, 962, -318, -665, 691, -285, 124, 815, -168, 568, 275, -680, 693, 126, -431, 586, -491, -198, 287, -1041, -47, 366, -874, 507, 173, -890, 508, -91, -147, 826, -45, 68, 931, -650, 250, 630, -528, 421, -9, -653, 469, -634, -953, 655, -525, -452, 195, -183, 336, 170, -558, 665, 266, -171, 734, -24, 161, 519, -486, 184, 452, -573, 97, 88, -867, 24, -305, -301, 189, -384, -2, 417, -714, 327, 758, 94, 600, -83, -408, 747, -322, -472, 871, -378, -341, 163, -531, -265, -339, -562, 309, -116, -609, 529, -25]
1950b5J55K54n83R45Oj504J261O1j208Q26l98Q4L86j006M01P79o18M81m08j32
1970b43R36p38l13J392j086k47J164j190J85M57r96J077J14j244N60k73k44R07
1988B18p78L12J001j090L10N97q38O99k66o31J487o18r33J214p77j18L66j401
2006a246J241N66j132J040q01n26J512j026l16J501p75K63K84j090J040j52r19
2023e36J236m81m14Q56j000J85P50j918P75J408j530O15M45q84J032q90m08J478
2041G19o22k70J051o35O8m9j424J717J6j259J070l25m95P36j434L63J645j376
2059e04O00O58j135N69Q1n81Q13q47J96J386j191l78Q43j253O40J93p30J113k59
2078B14q37R21n54m56J165o82M58P51r67L92Q2j274J373k33q87J123o48j64O55
$$ y = [-25, 130, 384, -199, 746, 752, -752, 509, 570, -638, 188, -210, -126, 260, -746, -345, 434, -184, 297, -111, -243, 693, -45, -358, 1034, -52, -299, 865, -325, -140, 317, -679, 398, 512, -732, -172, -445, -689, 218, -560, -248, 753, -337, -27, 570, -268, 431, 165, -466, 1021, 403, -530, 684, -93, -211, 155, -1246, -5, 561, -571, 469, -332, -858, 654, -372, -688, 813, 38, 301, 585, -505, 535, 383, -536, 700, 219, -195, 661, -339, -154, 596, -1322, -547, 861, -669, -54, 391, -493, 539, -351, -759, 719, 97, -173, 878, 243, 311, 262, -1162, 555, 571, -688, 382, 57, -438, 298, -1136, -773, 872, -504, 96, 754, -381, 188, 269, -312, 501, -346, -150, 1236, 45, -333, 510, -743, -103, 90, -640, 473, 214, -623, 298, -256, -712, 453, -229, 229, 980, 13, 405, 487, -787, 586, 353, -534, 589, -59, -223, 432]
2097D32j301K30R69j136P63N19j032Q47l31m67J243j085K59J257j398L62L84j017
2115e02R24m24j131J563j70r47R87p79n7N54p75R15M63r27J126l43r37R34n30
2134e6k25J043q53J47N06j304M24O82r88L74L02j81Q46j186j05J059q13K94P12
2153F78m98N18k14o49O30q66m88J389l31k39K48q19M80J06r65J400J28r53R86
2172E41l29l48P20r30L13Q38j094O10L15r53K80j07m02P35o40J54J011j237K66
2191b57P29j173Q15J46m64R83n81o11J058r49j12N70n39P20K96j246R39l31j216
2210a223J108L6k26M96n89N23L26j286R31O26p65O05k46n28J050j310j23J052
2228D57j030K50Q83j045N82r6q04J040l11m82J180n20l28M89o38N23K75j011J060
$$ y = [432, -869, -639, 330, -806, -43, 476, -556, 291, -40, -507, 736, -349, -90, 1167, -231, 131, 515, -502, 422, -2, -1133, 430, 260, -687, 300, -479, -536, 18, -757, 158, 621, -306, 820, 477, -460, 474, -56, -281, 762, -91, 56, 562, -742, -318, 364, -624, -250, 52, -129, 717, -469, -574, 485, -328, -34, 678, 180, 698, 484, -165, 465, -401, -889, 500, 169, -70, 178, -641, -161, -55, -1020, 380, 508, -445, 541, 212, -136, 584, -346, -33, 805, -289, 321, 636, -317, -37, -144, -546, 189, -451, -297, 714, -523, -257, 472, -701, 114, 260, -204, 779, 198, -413, 645, -304, -416, 154, -385, 335, 631, -615, 324, -7, -1223, -115, -79, -305, 191, -398, 125, 451, -835, 96, 722, -43, 562, 316, -212, 838, -472, -595, 457, -573, -323, 560, -485, 97, 1, -803, 237, -74, -556, 624, 104, -224, 265, -373, 150, 425, -586, 474]
2247D74P5r67J093n72l92M29r30L29J087r58N20L12j190O90j95j25J161r59j19
2266b37J459j394n4O47j045O88j0p20J185m34j094J262n58k77R61o77K82M30j040
2285f26J053P2j065J128k05p32J261j080n9Q64j370M58N09r49O19N72j078J047
2303D19q74j40J116p33R0Q23j058N41K54r44J107j52j144J231l36q39J001p78
2321d16lP15r82P86K27r65O38J01m50J057p17j92J004j157L03Q75j226N42K84
2340D24j010Q43n30n02J299r75k97J295q56k0M67p79J222J26j178R38j25p71J141
2359G12q88Q5M16q69M69M03j090Q45P0q54R86n76L3Q02q59QJ019q22K08K96q21
2380d27Q96K93r97N62n42k14Q18p30j35R88j033O48Q3r35J195l20o87J288n51
$$ y = [474, 549, -418, 675, 103, -289, 140, -790, -461, 626, -332, 188, 500, -690, 0, -195, -320, 841, -118, -237, 1222, -172, -226, 421, -624, 64, 54, -666, 519, 85, -1009, 253, -305, -582, 379, -298, -16, 414, -626, 427, 499, -566, 562, 357, -375, 886, -194, -253, 611, -759, -301, 208, -741, -122, 450, -628, 419, -455, -595, 521, -212, -122, 701, -357, 184, 438, -506, 601, 449, -695, 536, 200, -639, 362, -416, -419, 296, -686, 100, 327, -638, 0, 101, -349, 708, -9, -201, 803, -354, -51, 824, -402, 140, 424, -586, 257, -273, -775, 524, -451, -748, 547, -309, -329, 138, -641, 581, 707, -471, 467, 342, -429, 712, -176, -91, 325, -544, -75, 328, -762, 83, 153, -701, 285, -291, -258, 544, -315, -307, 712, -110, 98, 394, -427, 469, 762, -235, 327, -215, -429, 389, -341, -476, 512, -521, 127, 210, -725, 470, 150, -537, 751, 200]
2399B00k72K95l32K58K81q07L46J66o21O36k42j30O28j136M75O09o20N2M65n26
2419b75O78l55l50R74m05m57N81o64K68M09r08L24K02o57O18p1l49Q64o45k86
2439e04O49m22L38N72r60P79j22r88J139l60l71N24m97j30O13j084N26M78n60
2458c80L03j44m8N54n29Q8Q58q32P3M94n50P31l00q80R36o6r95R07m71q2P90p31
2480b74J12K93o28N49j40l12J001p15o4Q63p13k09O92o32J89M84q83M40N7q16
2500g06R57k97k60P09p88K99N43r20M25M87o20O84k94m35R49n61o13O48o10K67
2520a36N99j267N44L84p45N75m29j66J131o48l44J344j042K31M42p82P48j80o47
2539c88M74O0n72P30o31R7M86q60O44N01j124O68L06p08N31j98j72J006r46p8
$$ y = [200, -72, 223, -109, 149, 430, -377, -31, 135, -486, 150, -92, -222, 406, -730, -255, 354, -266, -214, 251, -275, 403, 48, -302, 672, 267, -190, 391, -273, -5, 404, -504, -180, 22, -635, -17, -88, -437, 427, -218, -504, 145, -277, 61, 633, -327, 452, 330, -658, 481, 121, -250, 274, -223, -353, 260, -824, -298, 180, -380, -77, -221, -269, 285, -244, -156, 702, -130, -57, 437, -113, 618, 318, -562, 374, 308, -687, 220, -251, -333, 457, -274, -162, 131, -497, 52, -88, -400, 601, -114, -178, 685, -28, -237, 455, -177, 12, 496, -387, 53, 110, -706, 251, -46, -306, 403, -385, -86, 457, -463, -38, 449, -171, 513, 219, -216, 733, 172, -441, 207, -403, -136, 463, -804, -260, 124, -621, -46, -475, -641, 490, -158, -502, 842, -200, 31, 473, -309, 439, 259, -388, 86, 146, -426, 304, -327, -230, 256, -604, 40, 541, -583, 85, 391, -317, 214, 16, -156, 850, -96, -174]
2559a74P38p86K24J75o65R09j12r91Q09m23k22Q99p26J64Q50r30L74K12o80P64
2579D09on37P70m30k27N81j188L32Q80j365O61O37p91N12l24n34J134n84r9J026
2599H57o50j64J38l90M66L3r23J272l87q24Q11n93K2M53q48O90O26j013K91J82
2619D9j88M23n51l6J111o87o3N88j084L63L04p32P55J99o16M62m81l63N21m02
2639d28Q4P42m63N11k23n72O34k59m91P52j05k63M85o98J72L23j093Q56N29p79
2659b86N25k95k70N79q10K93P96m78J74L83q02L21j37o04J038l65j84N04m77q2
2679a77J08l77M69K5m29Q00l29m98P95l64k80M30l06L94L95q74K13P9o59M18J53
2700a4l6N50o61N5L64q80J81P92n45L28L6l71P57n12l50P45n05k43O91m75K69
$$ y = [-174, 564, -222, 2, 177, -488, 421, 309, -682, 127, -296, -518, 381, -345, -181, 669, -261, 113, 325, -355, 409, 403, -134, 636, 206, -21, 560, -628, -296, 584, -781, -120, 517, -274, 238, -86, -620, 514, -70, -169, 857, 207, 43, 181, -209, 257, 290, -633, 639, 252, -572, 239, -354, -332, 121, -727, -37, 589, -424, -133, 49, -139, 284, -267, -303, 808, 121, 58, 646, -438, -75, 229, -503, 252, 451, -165, 297, -184, -547, -26, -428, -344, 398, -65, 446, 223, -349, 285, 26, -465, 287, 182, -81, 404, -294, -122, 201, -892, -36, 493, -286, 239, -56, -326, 253, -557, -264, 532, 54, 228, 611, -191, 130, -7, -611, 427, 62, -122, 382, -95, -177, -69, -446, 23, 48, -381, 419, 90, -408, 387, 23, -257, 173, -133, 261, 656, -218, -5, 74, -585, -167, -14, -50, 500, -161, -106, 258, -622, -441, 351, -194, 134, 170, -201, 556, 44, -306, 439, -66, -309, 382, -93, 176]
2721A76j72n37M92ql66O41k98k17N46n60K33N51j096O61M79p83O29l52j48N29
2741D00o03j1L36n40M15J71q63N93M6l28P35l10k15O70m53m54Q64n51M29J11o21
2762a79O81l04q80J074l76n51R31q25M82N45j296M52N11n79N14J58k74L16o54
2781b54J97Q10r38Q7N02q52O24j60n37N97k68m13R39l18k51M69l60J85K75p30
2801c96P40J0l28P54n41q55R23o41J28M72q83N69N84r97L08M15n29M10j27K1N90
2822F27p80Q5N62p29K60L15l86K97n7n93O31l57l20P06m68J39L11p55O75J46r69
2843f60R08n6m04N23j65pL06r25L39O23r74K19L61n09N75k65m35R88o77j08P19
2864C76o15J42N20n30L15m9k72M70l20k66M38l58P4J30m48J52N33n37J09o1m92
$$ y = [176, 4, -533, -41, -49, -415, 226, -72, -289, 257, -303, -70, 481, -615, 46, 525, -258, 371, 19, -129, 400, -203, -214, 122, -418, -3, 168, -695, -102, -56, -384, 351, 41, -174, 496, 43, -411, 453, -98, 331, 442, -179, 502, 198, -682, 392, 16, -535, 396, -429, 53, 598, -698, -246, 265, -314, 200, 358, 84, 400, -254, -57, 753, -185, -98, 404, -448, 176, 16, -521, 76, -192, -605, 334, 16, -235, 234, -126, 59, 334, -396, 344, 354, 26, 780, 239, -616, 307, -334, -206, 266, -617, -48, 536, -461, -153, 262, -267, 143, 16, 37, 627, -153, -68, 494, -235, 25, 340, -46, 251, 194, -399, 232, -125, -445, 261, -207, -68, 243, -512, 163, 309, -660, 248, 192, -212, 311, 146, 139, 445, -480, -141, 482, -492, -273, 88, -421, 154, -111, -546, 442, -235, -343, 376, -239, -97, 423, -107, 208, 159, -113, 357, 37, -229, 209, -149, -75, 55, -393, -241, 292, -245, -136, -197, -689]
2885f89J013j67l28O53n00j16J29k39K12N31o64L13ol07K97l60N8N20o67J5M18
2906A16n32L33j6j85P22j70o32R18l06l04L21n04M92l8l85M14k15n06M08K64l80
2927a85L49n97N76J57l89jK82l37M47k65j24N19m65m7M36o13J5M14o10L20P7l51
2949c92N36k76l06Q31l19j84M39k93J64p8l91N47m4n08L52o3j57M00p19K45O29
2970D13n43j40L31m11O42k87k46M56j10k38N13m53L21j08l68M78j02p32Q30l8
2990B08p26O33k85O8L57p11K49N94p02O32r4j93M19k16l15O03l80j26K81p03L94
3011a3M52r92L83J77l08M49m46j87Q67m09o5K29l38K67L02p32O64N3q74P39j55
3032F3l64M51l51P3K95o78N19J7k76N01p6l90Q09o56k64Q46n30O1M74q24P72j50
$$ y = [-689, 324, 157, -171, 482, -18, -134, -5, -244, -32, 499, -165, 148, 142, -165, 132, -228, -170, 350, -317, -302, 116, -416, -83, -99, -284, 438, 268, -364, 554, 248, -56, 265, -239, 253, 215, -170, 244, 29, -477, -69, 195, -185, 164, -433, 143, 300, -89, -90, 192, -145, 302, 37, -87, 432, -33, -80, 356, -257, -242, 172, -438, -118, -41, -392, 144, -132, -438, 393, 74, -110, 329, 36, 200, 122, -269, 278, 234, -274, 78, 15, -142, 258, -461, -216, 413, -130, -270, 61, -350, 292, 5, -241, 215, 105, -133, 380, -73, 248, 140, -228, 250, 148, -584, 246, 208, -518, 115, -170, -102, 255, -456, -207, 387, -315, 317, 223, 30, 449, 233, -82, 521, 141, 15, 296, -407, -13, 439, -553, -170, 7, -301, 148, -298, -485, 382, -27, -92, 137, -201, 66, 368, -364, 300, 353, -521, 218, 63, -301, 150, -201, -128, 167, -511, 8, 25, -251, 250, 174, -216, 593, -63, -327, 519, -11, 50, 524, -300, 472, 322]
3054C22q25L73K8m40N72l73O6O90p76J12M23n17L04K31l27O24l83l36N76m33j94
3075b83O44p33M23J39o03M97k86l34N34l1l59Q36o60J98M31p41L53L87m90J51
3095G3K97n71O92n77l12P83n94J20O88j102M95K50p63N30J20m12Q66m53k96O82
3115E16n70Q6R1m63O43r8m81M21j89j93K44l60j7P33o57K47J14m06M85l59L0O84
3137E01l64k63O74n09k7K94o99N59Q2m52K70k07j19M06l36n2O17n16MO96n09K6
3159G6J40n40Q04l67m46R41l52l21L4m76J63N56n65M25K09m70L08j72p3K02j22
3180d6K2N72m60J53q9n08M17R0l43M73l62k52M36m58J19K03p9M3K96m75N11k31
3202C2m29O39k55P5M06o69J98K18q21O61K00o13M20L2k43L52p24K43L32l51L31
$$ y = [322, -503, -130, -102, -542, 30, -343, -277, 413, -363, -251, 172, -345, -41, 190, -137, 487, 104, -232, 344, -89, -283, 361, -372, 51, 190, -413, 84, -202, -536, -2, -33, -392, 444, -216, -18, 413, -328, 25, 412, -78, 73, 370, -201, 491, -86, -398, 385, -209, -89, 599, -503, -8, 242, -521, 9, 129, -283, 583, 130, -166, 516, -54, 32, 123, -340, 303, 205, -276, 145, -44, -237, 7, -353, -370, 363, -294, -47, 67, -339, 146, -213, -183, 501, 137, -126, 548, 39, 12, 306, -393, 166, 248, -204, 66, -141, -260, 146, -190, -242, 375, -141, -137, 559, 50, 76, 216, -324, 480, 113, -333, 608, 256, -65, -31, -507, -344, 212, -353, 72, 281, -189, 119, -53, -126, 76, -46, -24, 548, 88, 241, 152, -356, 61, 151, -192, 281, -81, -333, 103, -355, -236, -33, -112, -69, 227, -248, 263, 32, -397, 242, -13, 62, 468, -201, -3, 215, -606, 55, 255, -358, 62, 94, -149, 203, -521, -278, 54, -297, 34]
3223C4K71n69L16L06o60N79k23k83O87m14j5K38o89N44l8n84O69j2l13M75j97
3244A22j88L03m89J40M49k75K95j82n31M05j12k76O50m39K6K05n44J37M11n85
3264d78N86l0m29O41k25j96P39n43l0K75l03K27M9q10O38k33m10R51l44l79N66
3285B62m77J64K34n34O28j7m80N54j9n83M87l31Q1K92l89o5N56o66J60k3k36L63
3307c9J49m87O13j98j27L31m10n7O88n01L39j7m96M61o5o06P25m56J35M07q09
3328d20M69j24m08M96K78l65K22p6k74O80n04R7L06n47J58M10n83M49o9p20O48
3349A23p7m17M14j27L0L00m98L57L8j88K54q1l74N98k64j69M95o42J23L67p04
3370d42M60Q6n33M86k02j26O50p28J80O31m06J00n8j01L39k2p32O85j96n53P30
$$ y = [34, 305, -264, 52, 358, -302, 277, 54, -229, 458, 44, 29, 267, -422, 122, 84, -500, 169, 157, -156, 319, 122, -66, 237, -252, -112, 337, 62, 357, 175, -356, 49, -63, -339, 311, -128, -102, 103, -441, -304, 107, -478, 108, 78, -351, 290, 65, -131, 608, 65, 35, 310, 7, 234, 283, -527, 111, -122, -532, 419, 75, -304, 262, -215, -51, 183, -351, 277, 260, -220, 334, 315, -268, 219, -112, -31, 261, -128, -193, 363, -303, -143, -166, -402, -39, 110, -377, 236, 38, -89, 242, -168, -225, 463, -38, 301, 284, -212, 249, 184, -422, 303, -153, -18, 389, -420, 49, -75, -483, 13, 291, -74, 148, 72, -202, 478, -26, 71, 377, -170, -12, 398, -185, 264, 195, -525, 123, 46, -371, 43, -84, -54, 246, -252, 105, 143, -45, 209, 128, -246, 352, 88, -81, 414, -228, -105, 262, -442, 18, 104, -429, 57, -145, -271, 379, -349, -169, 462, 56, 156, 98, -3, 336, 314, -418, 267, 71, -482, 248]
3391B48m24l7N76o17N4L39m82O45p9n78O58k80k67O27m19o4M38m30%O2k85N18
3413B03k15j32J36k26j63N00l72Q3M50l31N5K81l76M27m7o70O15l07J56m9l02
3434b84K25J92o68M05K9l44N10l18j96O53l14o1J12k70O20j93m47N33j35m0K53
3455B62n17J29L91n81J13L50l20M00l15j08M24k13m12O68n23NN33l50Q6n0r0L84
3477B66k67k99M71k83k17L15k99K71L48p27N89k7k73L49k14j07M60r5l48K01j08
3498Fm3N24r43M75J15m46M76l40j64Q88q08P5N71m76N2L37n31M14m8k79L64p0
3520A49j66L59m52k9L18n20L83K41p17O22p8l81L13r4j59N73m62O9L93n63L62
3541A61J98o57N83L8n57Q1K8Q6J94k00k77N88p14L47L66m51N28k36l76O64l97
$$ y = [248, -176, -213, 363, -254, -200, 139, -343, 302, 223, -355, 303, 23, -244, 383, -36, -100, 338, -92, -92, -30, -315, 203, -12, -144, -8, -234, -397, 103, -269, -186, 264, -67, -12, 269, -107, 320, 273, -397, 218, -89, 67, 18, -284, -59, 133, -535, -130, -101, -445, 65, -253, -449, 204, -110, -171, -59, -329, 291, 98, -349, 184, 49, 9, 262, -255, -126, 265, -316, -203, 147, -173, 227, -88, -196, 228, 15, -397, 271, -252, -247, 286, -64, 22, -28, -118, 266, -1, -300, 171, -112, -329, -14, -313, -42, 306, -421, 168, 141, -132, 217, 3, -104, 356, 261, -87, 114, 6, -37, 487, -456, 19, 134, -312, 164, -176, -340, 548, -260, -185, 386, -90, -38, 299, -232, 182, 134, -145, 219, 149, -17, 342, -110, -139, 179, -341, 42, 283, -434, 188, 110, -271, 42, -52, -211, 362, -100, -31, 362, -201, 161, 359, -298, 285, 323, -234, -153, -125, -39, 155, -45, -322, 266, -448, -101, 265, -186, 342, 106, -270, 394, -3]
3562cj58L89j51K22k3m13K07K12n08K75L9l38M47l07n1L62m95L48M66q43M69J15
3584B61n54M39k73j13O12m77Q8K11m19J42M1j94L52j95l21O84j55m37O60n81P3
3605a56N20m58L05L18o22P7j48k3L63l01k5M00o08K31K08n10L19J32k92N07q7
3626A50l23O25m99o1K52m86L07K23m26L60l14K7K15l57lM57l65K46R7m04L47J59
3648B27k72J98k6m7K30m20j14L67k05J42J16k41J34jo43O74j11k63M71l40M0M27
3670C43m81j38K91k44M09J17m47O9o3j18M79m60J8M30k04r3K03l90K78J9m68O06
3692A56j50L7J41j91o1K65n14M90P5k38J22n1m52O41m19o4J42j60K88j4j28k05
3714b90J62o7K79j30n8M67l15j47J12Qq8J00k61J66J58n53O37l00j01K72j45K58
$$ y = [-3, -161, 228, 77, 299, 276, -137, 70, 282, -226, 49, 88, -250, 197, -110, -161, 201, -294, 54, 520, -323, 146, 261, -293, 146, -127, -240, 372, -105, -17, 194, -225, -83, -42, -236, 116, -79, -400, 284, 129, -308, 352, -229, -156, 364, -94, 211, 529, -93, -16, -164, -187, 176, -125, -150, 250, -358, -127, 81, -429, -110, 22, -270, 237, 150, -173, 452, -47, -108, 144, -342, -35, 188, -238, 122, -192, -165, 50, -307, -310, 147, -218, 28, 125, -279, 68, 227, -45, 153, 127, 80, 310, -110, -224, 143, -62, 80, 196, -45, 89, 88, -555, 119, 8, -255, 216, -124, -84, 343, -138, -276, 15, -229, 180, 297, -150, -81, -144, -262, 217, -243, -225, 205, 1, -92, 111, -279, -1, 18, -450, 156, 6, 43, 184, -7, -68, 197, -317, 173, 248, 10, 132, 81, -371, 270, -149, -213, -71, -231, 57, 43, -85, -290, -128, -195, 84, -46, -104, 363, 48, -99, 13, 21, -67, 33, -228, -62, 96, -457, 180, -120, -221, 51, -94, 164]
3736A64K17m21J18j8o0K77j27j36L01n12P3M55n75J31J38l86L51K33n05L71j43
3757e4k92N34j93jM71l96q8L04n76L66K6k19K96k54JQ3r4j78N52l08K0J06m09
3780c03L40k1j98L37m0l52M51l34O1K12k62K93j79k58N07n54q8M34j82O9N3k72
3802b86K81j0p2L34m3m12K46K20m37K82o6K6K02o48K05K50k01R1O9l25M91j50
3824D7l78L52j28J62L41o18L57K23m86K36j33k27K62j5k21M65m86O4J77l3p3O9
3846d3k37M51R3l23L05m05L7M46l13J02K10n69N54j7m20J05O1k48J53m7j5K50
3868A30k58K06J21m08K76O3j92K84k47m7K35j38k23M89l94QJ5j17K51Ll06K57
3890Hkk16M66l93L36P4k83RK06n03L65n7j45N03l94j20L50k41j0K24o02M94J27
$$ y = [164, 381, -40, 78, 60, 0, 277, 150, 14, 315, -197, -124, 331, -244, -113, 25, -361, -10, 223, -282, 89, -54, -346, 188, -5, -6, 465, 69, -19, 285, -291, 75, 101, -118, 178, -76, -75, 8, -86, -264, 288, -20, 0, 106, -303, 37, 16, -182, 155, 115, -237, 214, -120, -59, 153, -109, 184, 5, -253, 254, -300, -388, 46, -136, -67, -14, -286, -5, -15, -87, 247, 204, -208, 38, 258, -179, 103, 37, 63, 265, -383, -178, 72, -129, -38, 31, -294, 197, 47, -331, 21, -107, 55, 396, -222, 135, 358, -128, 108, -25, -252, 10, -5, -226, 239, -247, -183, -6, -39, -112, -43, -280, 171, 264, -59, 246, -159, -122, 324, 11, 113, 323, -246, 308, 291, -129, -24, 37, -211, -58, -105, -120, 130, -128, 78, 199, -209, 67, 130, -62, 222, -25, -72, 163, 25, -198, 291, -103, -95, -80, -197, 54, 57, -249, 8, 6, -210, 256, -137, 199, 273, -10, -1, 205, -298, 67, 10, -135, 368, -26, -146, 204, -37, -47, 177, -425, 69, 196]
3913A96k34J41j22J33P4j42j07L96m17R6J09k97K20n3m40N10j07j36M23n63K57
3934f3J84l13K59j24k00O08l79q5L01k09k07M03k28j00K79m37J09L39k96L64k03
3955Bn08N92o5j55M01m18L71q5l17M57j67j36J90k68k73N06l02O7K29m64K87J27
3977G1l31j0M52l69K38k44M5M04k43j32L75m52L65R9l46K50k16j34M01k58m8M70
3999C87l13j77Q7q6K77j48l91K59J25k71N46k95J9K8j82K16j6l89N08k93k55J64
4021b00J38N2J72k62j5L98p32M95R3j83J36M8n36N47Jj09L72n45QK03j17L4N9
4044E7j72J14K03m60O45l51r5L11k91J80J45m72M70k45k71L97k5m10O58m80k31
4065c23L78k31J27L40n96M52p2m00N02L2l12L64k42J9J40k54J70M6l53L32N6m52
$$ y = [196, -38, 103, -19, 114, 188, 46, -61, 335, -82, 14, 123, -174, 46, -7, -447, 63, -44, -180, 243, -320, -63, 121, -192, 67, -57, -257, 351, -28, -113, 188, -21, -228, 175, -53, -153, 126, -311, -202, 137, -159, 205, 2, -506, 86, 21, -134, 267, -151, 220, 135, -182, 275, 108, -28, 162, -106, -379, 127, -175, -108, 121, -343, -56, 71, -260, -270, 182, -187, 51, -193, -148, 256, 13, -119, 256, -196, 169, 268, -78, 172, -44, -178, 223, -35, -83, 387, 74, -103, -16, -102, 175, 27, -364, -105, 20, -251, 295, 0, 19, 47, -135, 81, 65, -324, 184, -109, -364, -200, -62, -10, 162, -100, -115, 283, -449, 46, 139, -44, 92, 140, -396, 151, 152, 43, 415, -130, -122, 81, -36, -2, 57, -115, -1, 202, -258, 387, 36, -59, 252, -39, 141, 286, -186, 284, 39, -232, 165, 140, -270, 388, -92, -323, 55, -176, -49, 291, -305, 147, 75, -325, 177, 209, -103, 261, 19, 38, 178, -76, 94, 140, -213, 119, 175, -277]
4087b77L33j02k83N21m21J52Q8r7K39j32j13L56k85j21K37jj48M04m89O6J70l80
4109b83L24P7l70M34l8l18L20k31l1M78m57K43R5k76K71r8k90K88j15k42M66k18
4131B9l9J93m93J61J79r6N1Q8k37K95k35j0J64k58L95R0l28R2M9l17K73j51K4
4154h1K49k08J59J24m81M7L60k49O6K63k94K00O6k47J94j04k14M00l98K26J95
4175B73o41K93K45l45N03m18l8K75j46K2p8j42K48J77j81K78l89R4J49n52J49
4196b24L57k30l2K15k59J61P4k45L05l02Q1L42l16m7J93l3Q9%l19L23k4l10L13
4219A12j95k3J33l34L35M3l57L47Jj99j1J60n7L66k61m1K11m53J77K83k51J68
4241A54q2l36L77j69k07L99j58p1K56k65L09j39j92o5K58l48P33m36L3N8m3n46
$$ y = [-277, 56, -46, -329, 192, -229, -77, 11, -86, 153, 21, -92, 264, -21, -142, 95, 94, -54, 350, -139, -73, 97, -283, 41, 118, -252, 182, 144, -174, 146, -85, -116, 362, -95, 148, 243, -33, 238, 140, -150, 138, 23, -219, 247, 29, -10, 183, -310, -149, 30, -66, -15, 73, -164, 131, -104, -114, 50, -208, 187, 277, -51, 41, 90, -227, 46, -105, -81, 168, -40, 119, 243, -238, -191, 169, -80, -14, 249, -45, 155, 221, -26, 168, 64, -150, 250, -148, 78, 273, -368, -75, 170, -175, 328, -90, -128, 147, 1, 23, -55, -197, 51, 228, 47, 325, -64, 30, 179, -373, -224, 133, -97, -129, 86, -173, -12, 62, -183, 122, -180, -99, 243, -73, -120, 73, 40, 129, 129, -190, 133, 109, -201, 112, -83, -106, 27, -307, 28, 71, -286, 61, 62, -137, -148, 12, -45, 321, 60, 19, 230, -223, -46, 237, -14, 154, 72, -264, 113, -56, -263, 136, -22, -93, 163, -102, 207, 68, -124, -189, 69, -279, 454, 18, 51, 109, 66, -480]
4263d80Q67n25M9L68o93O10k4j84r8K7lJ78p2k0O1k65J98K90l05K88j55l66N30
4286B76m07k69M46r1R8j7j92R0J35l59M34j41j72N62l80K52J33n25O9K81n10L27
4308D0lj8J13j37j57J52j66P7L19k91n1K76j28L02n5k69J07J61l27K20m03J21
4330a17K78l60L7L11l21L93r4l46L80M7l78L69k98j4M27m66j3L70l22L33p7l48
4352b09L87p5k63K87k29j02K45J5j51J47n6K29j00j80Q3n9K13J36m36K95j42k49
4374b14L18j3l67K66J85n18L95j77J47L01n24PK70l40K18J69l35K67j20r7J26
4395c6J64l5P3k13m5Q1l21L37J2k04L66k33q9M30k38P5r7r9K41K3k58L27l98K32
4419I5r3j43j28N47o66L15K33l63L81K3p2J7l55J00M16n24Q5J69j48M0K07m68
$$ y = [-480, 387, -138, -89, 279, -414, 196, 172, -12, -110, -83, -86, 92, 20, 0, 61, -204, -6, 284, -21, 267, 112, -254, 276, -131, -400, 46, -45, 53, 36, -156, -66, 69, -290, 144, 3, -169, 393, 13, 265, 398, -127, -58, 223, -287, 40, 37, 19, 132, -5, -162, -10, -176, -99, 220, -71, -122, 154, 26, 328, 273, 4, 111, 272, -55, 165, -238, -117, 161, -199, -162, 149, -172, 221, 127, -219, 161, 208, -170, 199, -99, -113, 314, -152, -165, 205, -117, 216, 139, -209, 178, 103, -160, 127, -102, -204, 41, 56, -95, 52, -4, 225, 125, -55, 28, -31, 182, 318, -118, 177, 35, -214, 104, 91, -276, -10, 175, -343, 52, -125, 22, 323, -201, -194, 76, -264, -46, 123, -212, 55, -65, -162, -36, 128, 93, 166, -47, -92, -11, -332, 5, 17, -187, 179, -54, -143, 287, 49, 124, 27, -72, 169, 192, -66, 261, -137, 95, 2, -141, -269, 278, -388, -73, 160, -203, 178, 201, 129, 146, -209, -109, 307, -217, -132, 37, -111, -71, 136, -332]
4441c32N18j20k93L80k56j41K14j49J76M07n39J24J63l66L55l0l14L65j71j25
4461a34J43j87K19Q2k55N3L5k25N26m91o0L70j82m2K64k28L29j48j16J11rK4K7
4484A06k56P7Q6p7J17K55n72J37K92k08J85n6k94M31j79j23K52l57K70Q6l86K2
4506a92K23k24J26P6k76M69k11j02K91m49J73L66m75K87J63l34K44k16j1L81l44
4527c5j7K74l12Q9K24n29K15J74k80R4j72J18M39n23J66K99k93L8K51k96K67j33
4549E8j64K34o1j16Q0j56N4J66n38M44N7j71J81j99o8K96k12Q0J80k54J65J97
4571B53k08O8j87n5O0J25m02L29p5MK70o38N03J04k25K19j83r5K49l8j89L08j88
4594IJ56Lm89M44%l6J41l23j42J56J15j65K24j06j11J91Ml9J5l19L33L6k30L62
$$ y = [-332, 186, 66, -227, 153, -103, -244, -30, -179, -3, 404, -135, -11, 152, -214, 141, 111, -203, 162, -9, -134, 9, -178, 41, 123, -132, -79, -44, -269, 257, -234, -294, 76, -106, -148, 116, -112, 217, 69, -47, 64, 55, 79, 106, -150, -73, 13, -64, 53, 308, -264, -127, 165, -43, 142, 86, -208, 223, 44, -79, 173, -184, 86, 172, -214, -192, 31, -193, -67, 9, -267, 202, -9, -111, 180, -269, -96, 270, -205, 82, 245, -89, 155, -61, -72, 309, -35, -52, 222, -90, -1, 223, -306, -91, 83, -197, -103, -275, -157, 282, -241, -75, 224, -69, -31, 220, -76, 191, 58, -106, 128, 67, -49, 31, -125, -71, 95, -443, 1, 58, -113, 68, -131, -199, 97, -115, -35, 145, -109, 56, 253, 45, 113, -74, -129, -69, 56, -346, -17, -92, -88, 182, -456, 47, 151, -74, 145, -38, -133, 116, 78, -111, 197, 9, 165, 168, -321, 123, 123, 87, 228, -95, -237, -81, 34, -131, 93, -13, -124, 67, 71, 32, 47, -272, 61, 97, -133, 229]
4618B29k35l24M27j54n1J89m48L28j14N7K44Mk89L73l21K78q1j44p4J34l05K99
4640B2L6m51M64j62k99M39l58J63K72k31P1J98j68L01l56k80L93J23j68K59k70
4661bJ83o6j41L0J46l12J93j17J61Lk51k8K16l11L70j61q7R1K92j43r8Q4k35M76
4685B93k18j30J96l77K81K07o15L52K17r8Mk38J19M50n97q0L28L1P0j48Km6M1
4708D4O0k34K2K41J12l12J75m4k24J46j4p5R1p1O2K6j15K79L03o32J83J93m12
4731a96K28q2j82L92k37k13M44k73K12nl46M48j11k54J82K22n48M91j60j38L14
4752A88j74q7K46l18J93j05k51K91m0k7J7P3j24R4j28J56Q2j47J75j10j00J93
4774I7k69q1K74j01l6J60j99J00Q6j75J88j46O9N9j08j8K87k90L5K36k97K61L0
$$ y = [229, -6, -330, 97, -57, -108, 81, -367, -39, -153, -96, 148, 152, -137, 236, -85, 193, 112, -32, -106, 28, -277, 22, 58, -393, 71, -91, -390, 49, -309, -146, 126, -105, -34, 164, -4, 297, -59, -339, 54, 177, 9, 268, -2, 181, 115, -26, 4, 150, -162, 31, -86, 75, 78, -173, -201, 15, -296, 74, -87, -174, -83, 209, 66, -32, 52, -183, 293, 75, -55, 141, -236, 45, 252, -363, -11, 206, 108, 112, -126, -7, 443, -154, -234, 94, 125, 195, 47, 49, 3, 44, 104, -130, -108, 133, 245, -67, 108, 64, -160, -14, -28, -103, -12, -83, -21, 5, -110, 169, 472, -160, 23, 216, -196, 32, -50, -232, 160, -77, -290, 154, -119, 93, 88, -258, 190, 79, -175, 7, 229, -319, 172, 12, -126, 188, 14, -73, 173, -145, 48, -57, -308, -17, -57, -84, -67, 6, -118, -24, -152, 4, 86, -61, 114, 4, -96, 97, -172, -253, 21, -80, -116, 44, -155, -55, 31, -144, 44, -102, -33, 26, -82, -100, 187, -103, -68, 168, -129, 132, 162]
4797A62j15M3j11k4M5o3k11M64L0l38K71k51K05m5j42K20J5n7j48O2k51M79m23
4820a83P1J33k02J26j06J22P5l1q5J27j39K82l17l0K08j7j09K18L1k64L15l15
4842i0K1J96k12J78K0k71MJ68J10o8j40j4J75j19L8Q9OK5K15m58L3L9R6j36J75
4867H0j28K05j08l52M81l95Q2K21q2J86j89j37K73j2p0J75j83k13L24j75R1j3
4889F1j95N31j15m10K83j30q1K19l06P0O2Q5j04J82l40K95j50p5J83J58l19L38
4911B42l40j69K05kJ5j19p3L31R0m12L39m2l18M46o3%J0j34O8K5k64M40l34j8
4935g7J84k74O8J39j15J36r2j42L29N7m5j21nk61J73j88K93j44n4L29k04j70J36
4958d8kn2L68l63J41j12lq1J20K6J36k44J4K64m8k20J21j15K28j04j67M7J23j74
$$ y = [162, 47, 90, -21, -45, 0, -63, -274, 190, 220, -118, 153, -98, 107, 62, -80, 140, 155, 98, -50, 12, -239, 240, -183, -112, 21, -181, -55, -161, -39, 36, 5, -80, 47, -92, 190, -127, -157, 51, 34, -75, 143, 174, -90, 225, -90, -69, 127, -85, 93, 113, -158, -154, 14, 124, 56, -84, -98, 77, -42, -4, 85, 91, 116, 331, -127, -94, -55, 41, -95, 80, -48, 157, 49, -303, 178, -217, -135, 86, 4, 190, 1, -136, 137, 125, 55, 230, 47, -166, 158, -17, 74, 61, -134, 397, 282, -128, 155, 25, -56, 163, -143, -73, -11, 74, -30, 152, -188, 107, -43, -118, 65, 223, -96, 242, -98, -267, -62, -64, -49, -168, -241, 90, 180, -232, 107, 65, -253, 193, 130, 130, 140, 6, 74, 99, -165, 275, -59, -77, 107, -167, -99, 40, -75, 61, -31, -173, 156, 213, 168, 47, 42, -219, -46, -234, 59, -85, -139, 190, -14, -184, -48, -50, -102, 266, -97, 44, -68, -71, -152, -32, -6, 130, -114, -100, 164, 116, -104, 17, -98, 130, 26, -141, -94, 29, -145]
4982a45K58j19j72K70k59J72L14m61j02M17j56n3J17j6K08l40L0J36k18N1K96
5003B28o34L16K63l16J08L03n03L00J7l47K62M8k36N37l95N2J13k1q0N9j89K64
5025A49j75k7K91k72k6K17k34M8J92n1n3p0k55N45l54K46j46Q8k46R1l8q9O3p3
5049a79M83k01l78M03m2mK19n22J40K37o8m0j22J2L00k34p8K21j8l49K96j52J81
5072A05L1m05K65j08Q9J33l7l06N40l25K66J66n00L63j96k02rK50k69L21k88q2
5094a98K15k23K78k0k18J2L58l51J94J8j80J07l22J23L00l29J17K12l17L82M6
5115B04m74M65l74P9J36p8NJ51j50J60L0j99l0Q3p3K96k83L3K40l49J7L93m52
5138a70R8J58k60K59q1o9M81m09j92K90L0r1J82j23j64K34l43L40r5M0j27J12
$$ y = [-145, 113, -6, -178, 92, -167, 5, 319, -142, -244, 173, 17, -36, 81, 65, 273, -67, -37, 99, -119, -68, 228, -406, -90, 173, -143, -35, 268, -235, 65, 82, -265, -3, 45, -191, 346, -49, 3, 116, 95, 15, 74, -115, 149, -26, -53, 238, -34, -60, 157, -77, -29, 163, 112, 59, -11, -266, 279, -75, 171, 25, 113, -133, -42, -80, -169, -106, -179, 304, 103, -275, 128, 86, 82, 301, -221, -81, 156, 88, 48, -74, -62, 238, 4, -74, 147, 129, -220, 76, -76, 105, 136, -269, -4, -112, -23, 110, 73, -233, 307, -18, 248, 414, -86, 277, 81, -121, -130, 120, -149, 172, -116, -198, 17, -206, 72, 52, -166, -154, 204, -147, 47, 65, -115, -8, -330, -207, 93, -236, -119, 93, -224, 158, 204, -270, 195, -179, -100, 36, -42, -37, 114, -36, 124, 154, -45, -75, 8, -65, 231, -52, -19, 221, -128, -111, 282, -170, -72, 86, -174, 85, 4, -65, 416, 7, -185, 105, 135, 44, 226, 103, -61, 173, -170, 170, 75, 115, -12, 100]
5160A00l92L73j44Q8R5q0Q1P9k86l0K0K91J31k66m3K11k55j66K97m20M69p7j02
5183b6r5K31l06K82k6q1Q8O5j41J36k36L50o8k70L39k03M8J08k47l7O6J18P3k28
5207f0j54L65k28r0J91L0p6jn2M42j60k09k7J11l23J85L35l24J97r2k06K50n6
5230D8j9J34m54L65O7j97j32K50k72K43p6n1K93j76J0m1j58J86j72J01M50l02
5252I7j42N5M3j38L8M2J7J06j46Q8l2j05J91j24o2K30j29J68j37l19L71j27n6
5275g1J99m6k38K07o9j01K34m46K26K01j62K4qq4J2K20k30K53l69L6J92k10J92
5298c8J42m05J97R7m7L25k57L2J52m04K37J09J0j79O6j62K48j19q6P4j29k7K90
5321A26j16J3j07r8N3L35l67L74j92L4J30k69J78k52qJ45J29l9k7L0k09r1R4J46
$$ y = [100, -292, 81, -63, 25, 120, 40, 121, 200, -86, -116, -96, 195, 326, 60, 17, 228, -27, -193, 104, -316, 153, 76, -26, -121, 110, -196, 86, 60, -21, 67, 132, -9, 127, -109, 241, 173, -97, 242, 39, 87, 195, -52, -89, -23, 95, 168, -60, -214, 151, -77, -167, 24, 54, -22, -23, -75, 367, 207, -2, -29, 82, -241, -56, 279, -45, 152, 60, -146, 104, 48, 29, 163, -291, 74, 141, -56, -188, 62, -210, 33, -43, -94, 199, 23, 33, -8, -166, 20, -152, -51, 399, 97, -45, 10, 53, -85, -47, -5, 12, 118, -28, 60, 28, -77, 114, -10, -72, 158, 29, 197, 60, -259, 112, -15, -71, 128, 82, -156, 51, -18, -119, 115, -331, -105, 96, -66, -42, -50, -134, -122, 98, -132, 121, -248, -212, -20, -230, -38, 104, -301, -104, -7, -54, 271, 14, 46, 198, -206, 31, 140, 150, -29, 37, -125, 123, 4, -82, -8, -137, -164, 126, 10, 23, -84, -182, -129, 206, -161, 213, 21, 55, 185, -84, 94, -158, -166, -21, 108, 69, 42, 72, -137, -228, -134, 12]
5345A2J12k64j16L31j43N8K2o6J79p1J6J0j04J0J16j27j28N79o27K30J36k61p
5368a03J41k07J03J48j65M30m63K73k80q5J30K00k44J58o3k50L92l27K15J44j52
5389ek2j0J97j44J34m22N78l65K17l0j04k03K49j11K6K85j11k04k6K21j68L0K5
5412C7R4k05K10N6l31r9M65n66N31k26j07K26j72O1oK3j87K40l38L12K47l20J18
5435F3l12M08J06j35j57K17k53j2L15m57K71J09j34J20j94o1K65k76K5O1q2J93
5457H0k68N8K86q6j71J72j11p6J63j61q5L05j98L63l31j22J65J2k09L48l65R7
5479a34M81j64o1j66j31J19K38k22K3J17j04J81k56p1M61m40rJ95k88K91M2j93
5501i1K25j37P2J92n13J85J12J1J05%l08K98k21j6J76l1j8o2j79J08J32k41J48
$$ y = [12, 124, -140, -256, 75, -68, -10, 12, -54, 125, 54, 70, 80, -24, -14, 102, -25, -153, 426, -201, 29, 165, -96, -103, 38, -169, -66, 82, -83, 347, -116, 157, -123, -208, -78, 122, -122, 36, -27, -277, 115, -212, 3, 147, -5, -27, -37, 160, 16, 150, -272, 306, -59, 158, 128, 24, -179, 70, -41, -15, 270, 159, -45, -71, 150, -18, 12, 37, 131, -74, 136, 192, -139, -238, 227, -339, 192, -34, -141, 85, -87, -26, -32, -9, -196, 44, -294, 18, 265, -55, 63, -249, 159, 265, 130, -27, 190, -63, -75, 240, -217, 54, 163, 29, 149, -45, -106, 159, -117, -92, -31, -113, 80, -188, -130, 156, 70, -101, 71, -40, -116, 47, -114, -199, 106, -92, 271, -60, -182, -17, -5, -214, 134, -231, -134, 347, 183, 122, -44, -175, -56, 182, -40, -17, 100, -4, 177, -79, -150, 311, -129, -138, 57, -231, 60, 102, -91, 134, -3, 69, 261, -252, -67, 45, 56, 161, 161, -147, 151, -70, -86, 90, 59, 41, -21, -200, -92, 40, -201, -53]
5524e3r1n5K88l4j42k3J38J64M9k64r8O9q0K84j24k63L49p3k43K39j57J34M4k62
5548b04K56m7j37N1P4J99m7j94J34O6j15k3l5NJ25l19p5K61k9j02J95R5m3j05
5572a4j22j8K54j21J85K0j78R2j27j49K42k70K2J33q7r2K20J12q2j84J83O9K10
5595B98m19K91k62J39p7q0L51k64k57M14r1n7J70j37j74n7L15k40J08MM6J64j12
5618G3Q7k75K13l6o7j8R4p2k3O1j13N9Kj59K02j39M3j3k8J34K1l27K37J31MN6
5644A47nk45K73m32J82J03N7ok76jJ49K66l34K52j26j51L78k88J68n7k61L03J30
5667B26j09o7r6p7J31J95j96k7k87K04J68j08k3J57M0%j57j62K42Qq3R6n6j36
5691a17K83l11K09L6j84J15J36l10J17o1J0J79o4k2J28j27l2J6J38j54k21J53
$$ y = [-53, -144, -199, 89, 55, -87, -110, 28, 192, 241, -23, -121, -52, -132, 152, 28, -235, 114, 41, -202, 37, -120, 14, 58, -204, 52, 5, -132, -81, -7, 192, 145, -49, 85, 151, 36, 13, -22, -17, 108, -211, -286, -25, -54, -156, 39, 134, 91, -14, -136, -154, 100, -21, 164, 184, 6, 98, -29, -178, 64, -206, -184, -51, -138, -230, -10, 102, 20, -164, 19, 88, 298, -121, 170, -92, 47, -30, -110, 241, -23, -280, 134, 43, -14, 156, 19, -155, -212, 103, -137, -29, -25, 21, 185, 73, 160, -115, 98, 62, -5, -23, 71, -1, -24, 37, -76, -17, -15, -174, 28, -111, -68, -81, -109, 25, 46, -281, -44, 87, 91, 147, 142, -103, 170, -262, -80, 23, 80, 74, -202, -203, -54, 212, -122, 130, 4, -147, 231, -57, 111, 54, -207, 96, 226, 117, 50, -46, -123, 8, 203, 7, -20, -307, -103, 65, -43, -66, 91, 131, 131, -26, -188, 54, 62, -21, 75, 19, -117, 166, -145, 64, 100, -84, 31, 167, -143, -26, -87, -77, 102, 38, 16, 144, 17, -15, 1, 139, -15, -236, -83]
5713h3M1R1lL2k57J07J3o2J44O6l36K27n6J3J83j12K01j67k90K53M3l7Jp8J0L
5739e3J17p3J70q0k03K00j02p2lj22K78j16j4J61n7M4J54k26mL00m88L08k81m6
5763b08M62l35P6pk52J96j76K09K10j47j20K21O8l53J81j28L07k18L5j05K91k25
5785a8J13o2l49L67Pj97K29o2p3J13j19k4J11j19J2K90l56J88j76J44n1k85L78
5808F1m0j30O8J06l75L13O6p2J17j09J5J24r9j59M3J0J33j55J7on4J98RJj60J34
5834E6l47L47j11oJ67q6R5j54J10l50O47m30Q4j08O6L8J46k48P4o9N0J74k61q4
5858b00J90j5L2p6p0K78J0o4j2J91m50J83m5M7M2O5q2K6j05l7R5k03L23j6k05
5883i8K19j81o0R4j41J86K46m42K43j5q0J89n8k05J41j72k2K82q9j70J33j29J49
$$ y = [-83, -42, 49, 46, 78, -179, -72, -59, -121, 23, 89, -247, -20, -76, -63, 120, 8, 209, 42, -248, 5, 48, 11, 12, -66, -56, -53, 64, -9, 161, 81, -122, 78, -24, -96, -99, -221, 57, -59, -73, 88, 31, 75, 229, 3, -1, 299, -189, 119, -162, -208, 254, -81, -5, -12, -264, -68, -244, -35, 175, 28, -92, 129, 197, -156, 25, -103, 204, -14, 21, -84, 207, -18, 95, 33, -316, 51, 58, -139, 90, 28, -45, 68, -51, -75, 36, -83, -71, 219, -137, 51, -125, 19, -32, -317, 61, 21, -109, -41, 65, -310, 3, 69, -3, 114, 5, 20, 144, 45, -114, -71, -61, 72, -83, -66, -72, -126, 72, 81, 82, -78, 56, -291, 56, -55, -61, 106, 20, 115, -39, 71, -279, 368, -62, 22, -86, -20, 18, 164, -84, -10, -79, -29, 145, -116, -200, -10, -25, 7, -69, -139, 139, 149, 85, 73, 264, -186, -3, -48, -1, 41, 106, 24, 50, -55, -92, 3, -200, 123, 107, -98, 121, -60, -120, -26, -167, 19, 265, -177, 66, 51, -29, 160, 102, -103, 38, -134, -156, 126, 37, -133, 0, -129, 20]
5906B0K1J10j1J49j89L5j14j34J80q8q3J91k16J3J8j28J29PK23l6j34m8p1J51
5930eR6l3n9N1j56r3L00j02m4N2k30NrN7R6R4l7K1M9o1o3J03l0Q9o6PJ45k40N2
5959a1J54l95J76K3j33J80kk55L15k8Q8j48J15l9L2j0l1j52M0J31k33J58O1j84
5983a48J88P5j57Q0j2j56K36k68K48j3k15n3K82k45PJ65r5L0K11p2j01M9l08M08
6007A36j11lq6L6J32Mj25O8l4k25K19p6K02nj68K06p2l11K90k53J31L08l69j16
6031b22J01J40j09L29l06P3Jm2K9J94k35J48j83j41L19k6k21J74L3j4Q8j78J02
6054E4N0r6o2lj55K38j01K60j33k33L38r5k49K43K07m25L95k82P9J95j68O8j25
6077@l6J87j49j68K69K9j90K38j29k82J99j13J8M01l66J86j3j77J83j65j31K56
$$ y = [20, 41, 151, 140, 289, 100, 135, 21, -113, 67, -21, -104, 87, -129, -116, -98, -226, -97, -90, 133, 97, -37, -85, -156, -5, 91, 58, -1, 50, -106, -199, 101, -1, -45, 7, -223, -218, -227, -170, -74, 20, -17, 4, 53, -8, -71, 32, 2, 91, 25, 32, 177, -63, -11, 143, -252, -76, -53, -186, -6, -8, -263, 52, 24, 112, -36, 79, 40, 72, 62, 31, -121, -81, 50, -183, -25, 36, -148, 40, 115, -42, 38, 26, -130, 106, -162, 86, 73, -142, -195, 87, -158, -151, 14, -81, -51, 160, 88, -13, 36, -272, 136, 25, 22, -64, -28, 104, 108, -17, 51, 17, -208, 11, -65, 137, 132, -36, 170, 98, -213, 77, -176, -45, 263, -106, -222, -121, 19, -90, 239, -67, 6, 7, -35, -6, 188, -47, 101, -82, -223, 96, 70, -151, 23, 56, 42, 130, -48, 54, 104, 8, -54, -57, -212, 26, -75, 185, 52, -181, 157, 62, -187, 56, 263, -162, 233, -49, 30, 225, 57, 125, 0, -36, 151, 2, -166, 103, 132, -58, 180, 51, -231, -32, -145, -127, 274, -92, 94, 81, -96, 87, -78, -209, 47]
6099D7k2k0J8j36P3QP2j80k3K80q3j06J85o1J9j94L40j07k38P0N5Ol0j41J44l7
6125f1p7L33l20J94J2j05O4k55K05J34j92K1L5m2m9K80l10J2J42r8l2J60O2P3
6149A86j83m6J84j84q2L58l18J84K30m50L22r0j00R9l25J52K33no0l9k45QK9M6
6173i6J27J39j59J39j68N1Km9o1Q5q2J9M9j45R8K6j3K3J0j67K11LKM2k90K05J96
6200A97k03J99l52O9L11k70J21p2p7J44j3l67K26j39Q6J91J36j54J28j85N1J45
6222A72j39N5j2j44K24j32p7k0n1J51J19k95M33j67j92J12Oj22J93r2k65J73R1
6245B1j81J77J08L7J1j97M3M6j56J02j77m7K73m10L02K5J21l2j37J89K14k15j99
6268h2J3P4n2J46q0R8j9j27K40l30j79K63rk01K89j15J64k81J3L55j31k06J51
$$ y = [47, 25, 5, 23, -113, -40, -32, 40, -140, -163, 117, 34, -72, 113, 52, 71, -123, 217, 110, -128, -58, -3, 3, -27, -168, -24, -61, -138, 195, -125, 69, 81, -24, 40, -215, -10, 124, -68, -47, -12, -54, -103, 177, -133, -121, 21, -77, -109, 51, 113, 186, 3, -43, 141, -43, -125, 233, -85, 99, 329, -121, 201, 111, 11, 110, -215, -63, 170, 165, 105, 66, -179, -171, -142, -96, 31, 170, 11, 150, -18, 33, 35, -14, -75, 10, -72, -53, -4, -149, -51, -25, -38, -15, -5, -172, 39, 42, 44, 86, -204, 1, 197, -6, 193, -159, -90, 221, -49, 72, 0, -77, 67, 54, -313, -87, -226, -140, 51, 187, 33, 161, -24, 27, 172, 33, 88, 76, -68, 156, 24, -53, -73, -124, 27, 146, -149, 284, 117, -75, 37, 43, -79, 114, 22, -243, -70, 21, -160, 17, 125, 162, 173, -24, 19, 65, -91, 11, -166, -213, 60, -350, -48, -23, 98, 66, -71, 118, 332, 117, -82, -69, 5, -47, 99, 19, 117, 98, -29, 211, -119, -298, -35, -44, -245, 44, -71, 93, -188, -175, 180, 49, -157, -6]
6291fLl1l5J08M8m3k90J09J24k10K80k4k0J21j93N2k6N4p5N6R5j62K42k07j23
6316a53J97o9Kj16J73N3K4k44J58p4j92J37n7J15p5m4L34k34j62L18k59K66p9
6339A9k02K33r5l0M6M3J1p8M1Q1l9j71j91N14l66L8K52j88L80k38k07J84O1j31
6363c3n6j62Q2K13o9J08P1j46jo5n3L1J21j74L27j36k2r2j30K28j38K2J75j20
6387a9k73K26q9N0K73k61J55j85J53P6j57J45r9L1m2pJ58j8J26m74K3L58m48N37
6411B39j77l7K46l90J27J27l30L66j94J1o8J43k14L25q8p6l0j53L49k46J78l41
6433b33L14j06J47k22J23j6%R1P7l85k3L08J5r2N4K6N7p2K1J3p6k47K24q6m8J19
6459a7q0o1J25K1J5P0j07P5j99J39J51j68Q2P0p4J0%p1Q7k54J27K0J66k48K84
$$ y = [-6, -3, -34, -69, 39, 87, 44, -246, -137, -13, -223, 57, 33, 13, 134, -59, -7, -33, 21, -54, 2, 97, -65, 177, -30, -153, 44, -25, -23, -139, 34, 87, 111, -133, 25, -49, -241, -104, -161, -46, -121, -165, 169, -65, -227, 91, -168, 98, 19, -183, 50, -45, -75, -29, 14, 25, -53, -12, 69, 30, -141, -332, 182, -184, -146, 106, -82, 298, 60, -147, 37, 98, -33, -89, -251, -169, 44, -25, 83, 154, 8, 7, -58, -111, -80, 41, -133, 194, 58, 36, -56, -186, 42, -96, -74, 101, -19, -292, -66, -155, -105, 168, -93, 62, -123, 30, 106, -51, 94, -5, 26, -16, -23, 135, 117, 243, -231, -208, 150, -298, 239, 62, 25, 271, -119, 8, 135, -195, 171, -23, -12, -80, 63, -151, 174, 86, 10, -20, -173, 176, -70, 108, -233, 81, -25, 122, -100, 23, 7, 7, 98, 175, -210, -233, 75, 90, -2, 52, 78, 135, 63, 84, 97, 21, -226, -2, -88, -136, -17, -97, -158, -33, -12, 3, 73, -34, 41, -158, -19, 132, -36, 46, 116, 42, 52, 52, -19, 68, -186, -59, -39, 127, -121, 163]
6484A63k88K76j53j46K96m0j60K47l46J66K17k90q3L05j00j83J25l91M78j55p7
6505a39J19k87Q2K17%Q3n9j20J98l2k22K95J5r5K44k72p8J43j90O2J55l92R1K23
6529D1q0K79l67j7J09n0j13J49j31K08j08J31o1L1J09l3l3n3J47k84M3K05o4j59
6553a01J99j93l3K35k64K18o1oj18J16J58q8k68K22K8j61K61k24J13J34k33L2
6575c4J25j61r9L22k64J76ol0J9j70J53kj20L8J55j53r7K87l20J99j69R6K46k62
6599g1MJ30j79J49Q0j49L4K07k58Q5m3j96M33j33j67M6Qk1J34j02K79k17j11J22
6623F4L1l27L24j46N3J54j99O1j65k19L89J78j59j1j98K51j64M2p9K04j86K51
6645A49o0l99K98K54j03r1p9j67j21K88M4j1j43K32P4q9j45Q3k12J96j36K27n9
$$ y = [163, -125, 151, -2, -148, 148, 108, -52, 195, -151, 15, 232, -58, -141, 164, 64, -119, 6, -385, 93, -62, -139, -20, -307, -225, -8, -8, 75, 16, -104, 94, 62, -160, 135, 150, 55, 299, 27, -51, 92, -98, -36, 119, -273, -182, 41, -39, 240, -127, -144, -35, -85, -198, -49, -180, 28, -80, 51, -10, 21, 130, 97, 64, 11, 158, -126, -83, 122, 58, -101, 98, -95, -128, 107, -157, 61, 0, -6, -124, -8, 150, 62, -206, 16, 44, -117, 144, -80, 33, 167, -66, -34, 91, -70, -169, 153, -111, 65, 59, 29, 48, -122, 31, 29, -91, -53, 102, -51, -148, 139, -181, 18, -151, -55, 191, -71, -67, 63, -116, 33, 113, -36, -2, 205, -53, 32, -11, -207, 226, 93, -74, -28, -20, -41, 93, -9, 270, 53, -58, 64, 95, -232, 92, -54, -1, 153, -46, 15, -150, -369, 20, 198, 39, 28, -170, 81, -83, -41, -120, 84, -102, 149, 89, -310, -12, 242, 139, 48, -31, -198, -319, -31, 13, 2, -141, 91, 165, 76, -69, 14, -198, -2, -138, 89, 30]
6668C0j12K6r7k8L89l16L0J55q8n3m1J88j10K5K4M0J03l64K69j03M7J7o1o0K53
6693A63o1j49R1j08J89n0j45J40P5N2k60K79j54K7k01J06K09k33K20j86q3J05
6715B6N1N4L8k19J61n2n5M6n7o7J21k42O7J30m8J87m4k97R6RJ80l2nj57J29M2
6741F2j80K38l6K05k02p2K3k66n0K03j3j38K82k0q8L6n7j7J48q2m0J00m4J23j10
6766Ep9J68L4k41o2m9K61R5j58K87j87Nq6K41k49L1J04k69J05o6K1K38l82J84
6790d9r4n6K64J35j72M4j13j47J71j32K42N7n1j35K34m30L12M5j64J02p1%O5J
6814E8j87K25k01L00j03l25L21O1k21J38j19M8N5j18P9j7q9L04k12nm3R2k12J08
6838f3j27P5J27k11K69r1O5n9m7J44j25J3pN2J08Rj84j55J36N5P3N1J4j35J72
$$ y = [30, -82, -56, -153, -181, 208, -108, -78, 77, -11, -64, -105, 83, -27, -2, 22, 62, 165, -199, 70, -33, 14, 31, -30, -90, 163, 102, -47, 44, -64, 125, 75, -70, 70, 145, 197, -63, 216, 62, 89, -112, -6, 203, -30, 190, 4, -79, 26, 77, 131, 169, -50, 111, 59, 4, 50, -7, -74, 47, -195, -128, 2, -46, 141, 97, -200, -104, -95, 85, 53, 48, -109, 20, 62, -118, 120, 84, 289, 87, 15, 38, -228, -278, -75, -88, -226, 56, 36, -52, -16, -73, -90, 58, -24, -64, 36, -8, 115, 5, -74, 94, 128, -113, -175, -224, 37, 132, -26, 261, 74, 79, -7, 234, -15, 16, 120, -149, -44, -110, -89, 149, -233, -49, -143, -199, 65, 200, 28, 72, -41, -188, -17, -149, 93, 150, 99, -36, 198, -232, 80, 125, -39, 63, -8, -8, 57, 58, -129, 96, -105, 195, 92, -233, 88, 149, -72, 66, -53, -5, 50, -68, 11, -6, -95, 209, -3, -8, -51, 41, -171, -63, -190, -115, 12, -199, 70, -21, 44, -15, -62, 82, -43, -30, -37, 15, 123, 132, -52, -207, -71, -16, 57, 108, 122, -13, 159]
6863A59k21j01J76p9l3K68k34j9P0N7j34R3N0k4q2RJ71l2R8l88J72O2j60J03p3
6888i2J74l35L62m5l6q9K8J75q9m1J80k47m9J77j27L7J03k49K51P5j66J22j29
6911a0j14L07j08k8k1O1J00m78K81J62j25l9N2j65N3J51j33p3R0k43L15l1j40
6934a36K75j56j36K05k68J44K39l25j27K35j56O0J47K0K7j15l6K19k90J98k2j27
6956a25J99J2Q0k32O1j30J84Jj21P6j1K2R4j36Rqr4R7J29k01M4mr0K46j59K7p8
6983a08J70j5p1j16K47j77O4L7l1N5j3j37j0J29l39L57J97l04K40j39k31J35M05
7006C45k89O0j02K79j75k20K77j46k38J44N4N6n6K2P5j91l0K56R3k38o8K73j80
7029Am9J63M2l06J28Q0%p4J01k64K4P4Q6J08N0k52K11K1j15j26J35j52K3J2m9
$$ y = [159, -62, -163, 13, -66, -99, 169, -65, -84, -14, 43, -91, 2, 52, 28, -54, -45, 126, 94, 192, -196, -24, 38, -122, -19, -92, 82, -253, 109, 64, 28, -61, -33, 142, 53, 12, 192, -55, -104, 73, -54, -17, 86, -163, 88, 163, -3, 119, -10, -124, 183, 75, 47, 26, 87, 187, -291, -10, 152, 27, -12, 40, -125, -72, 79, -54, -127, -37, -280, 35, 4, -136, 139, -17, -153, 52, -216, -72, 167, -158, -285, -50, -206, -146, 1, 21, 48, -67, -103, 116, -174, 24, 2, -125, 74, 86, 166, -66, -5, -135, 49, 50, -71, 5, -6, 16, 110, -26, -17, -25, -119, -22, 107, -94, -50, -54, -144, 102, -57, -30, -108, 62, 47, -24, -140, 107, -70, -6, 31, 0, 55, 42, -95, -105, 24, -315, 42, 239, -65, 175, 36, -195, -60, 345, 56, 116, 14, 293, 118, -102, 175, 29, -209, -65, -11, 45, -11, 11, 86, -105, -135, 121, 214, -24, -92, 181, 1, -48, 115, 157, -149, -21, 59, 59, -15, 86, -178, -154, -80, 6, 114, 164, -88, 123, 144, 29, -97, 38, -114, -91, -79, -128]
7054a28J21j07R1P6j97o2O7K11K7j04j37o7M18j39r1J20R9j41L1j36R2j5qO8j94
7079a05J34l2Q9j7n9j11N9J28k14K93k32J02J13l05K39k91J93J98q3j81J66m2
7101D2r9J07j04J7K24k47j95L31L2k77J04r3J40m8R1p0P1l2N0J34k23L5R6N4m1
7126I9o3M0j29j6M9j13J94O5q9N5j59Q1p4R3m8k10J06J50n7R9k73L03j89j2J43
7151D5r5j30J11J31k16J73Q7J41l65J85r0J16Q1J1j08O6j86pJ43N5k08J79k88
7174a69L52l95J67J33j43j99K54K35k97p7K53n2j74J8oK26k02R0j29K21P7j99
7196a6NK3j3K7n6J11mk7j55k4O1J1J73k62J49k36L13m5j45q6M08j73l6R5q4O7
7222H1jj70J97j30n0J20J54o9j31K5j52J95j16k59L27j31l2J81l6Pj81J65J0j42
$$ y = [-128, -7, -114, -23, 53, -144, -206, -139, 72, 99, -5, -142, -209, 209, 70, -21, 99, 198, 57, 88, -48, 44, 29, 21, 89, -105, 29, -3, 86, 69, 10, -101, -42, 86, -128, 165, -67, 35, 148, -157, 82, -209, -16, 182, 99, -82, 84, 42, -57, 50, -54, -37, 187, -60, -255, 76, 108, -169, -65, -158, -18, -66, 25, -45, 26, -6, 44, 178, -45, -10, 86, 140, 99, 36, 76, -53, -69, -20, -133, 61, 126, 37, 92, -67, 14, -60, 33, -15, -225, -119, 31, -26, 73, -200, 103, -86, -98, 45, -50, -180, -69, 62, -154, 19, 106, 247, -118, 67, -23, 93, 174, 185, 77, 143, -43, -50, 93, 148, -60, 119, -169, 183, -212, -45, 88, -55, -254, 0, 235, -62, -139, 114, 62, -112, -94, -100, 126, -76, 14, -115, 106, 183, -16, -11, 12, -1, 26, -30, 81, 77, 50, -105, -129, -68, -57, 116, -146, 3, -233, 80, 35, -110, -196, 212, 39, 3, 98, 14, 81, 80, -90, 107, -23, -73, 47, 201, 132, 1, 26, -126, 69, -47, -306, 21, -110, -142, 39, 3, 10, -171, -6, 4, -138]
7246a38J02J75k97J9J6J81J9J75j31j94J53j95M8K7L1J84m88M42j07k23J18Q3
7268@j41L52k45oJ06k12J53O8j5l2K6j7R2l45R5K83l69K6n5J90L4j72J30j1J01
7293C6M6j3P9l12O9K10j47K14k78Q8L59l83J18J1m8K0M4j98J70O4jL11n83K7J47
7318E0J7O3q3J25j57K6L3j13m3R8O5Rj21j7no8K2J19q7j13Q5L71l82K91P2k53
7344DK08r0j17ln6P1J49j40k24J64m6K18qj49j61Q2l2n6R8K12m1q9j15L71m00
7369a50J37K6M4N8j18Mn4K15j98K41j26k1Q7k18K1L55r8k29K07k08K22k5j77k40
7393b45J26J72MM0j94J64J41j39j42ok4J05k09K44p2P8J21k20J29ql07L32j29
7416c9J5q3L6J28Qj47j12P5K09J3J0k09J2J11k37L14r0R0r3J6p8J08k22J32M8
$$ y = [-138, -36, 139, -158, -139, -123, 58, 77, 252, 121, -73, 80, -115, -67, -40, -9, 175, -313, 129, 22, -201, -83, 0, -141, 211, -34, -40, 66, -146, 7, 75, 60, 28, 54, 37, 129, -216, -121, 162, -207, -181, -236, -46, -12, -184, -54, -65, 36, 82, 69, 148, -164, -95, 115, -32, 182, -96, -8, 351, -32, 86, 97, 49, 69, 113, -85, 85, 149, 148, 459, -124, -97, 50, 67, 130, 47, 172, 15, 41, 74, -39, -82, 16, 81, 90, -31, -48, -53, -121, -99, 20, -67, -180, -95, 276, -106, 185, 257, 4, 212, 122, 5, 2, -54, 17, 166, 26, -198, -34, -80, 138, 130, -19, -180, -98, -130, -186, -88, 124, 83, -6, -121, 250, -150, -13, 13, 57, 115, -3, 1, -53, 162, -36, 205, 79, 58, 145, -73, -52, 303, 205, -24, 183, -25, 197, 172, -5, -245, -119, 53, 57, 97, -97, 67, 208, 69, -73, -79, -103, 2, -207, 37, -35, 43, 164, -56, 73, 65, -242, 90, -39, -24, -107, -71, 57, 65, -82, -194, -119, 90, 103, 113, -96, -84, 27, -210, 104, 14, 104, 11, 27, -51, 57, -165, -33, 15]
7441A5J09k06j6K27j28j0J99k48R9j6L08l56O1q8J22J49k19MJ96k73N1J18n6R2
7465A34q6p6l1K71k61j92J88k7K63k40j2K29l13J10j65J54K8n7o2K77k48N9N8
7488Aom5J22m8KP9k20J59M6j22J81M8m13J92O1M0j36l9K28k86R5l4R5J71k65N3
7514d1k3J24Ll0o2j78K98j86J59O0k72J15N3o8mJ9k39L07J32l60K12m9j45K04
7538B9J52J03k64o1Q2j33J71K0j12J47j86K58o4j08j59J58J57l00L06k73j9K50
7560A54j80n7J95l05K24M6l8O4j47QJ00o4o1N7k02J73J02r2o7M2J85k23J36M2
7584I2j18J23j25J55jj66o1l7J36J12L9pj44j98K09O4l37R4K59q6rJk3J60j89
7609e7K06j05k31J09N6n3J53j14J19Ml45M24j89j34L3K81k59k0L69k57K20l02
$$ y = [15, 124, -82, -98, 129, 1, -9, 190, -58, 41, 25, 333, -23, 38, -50, 72, 221, 2, 6, 202, -71, -20, 98, 42, 134, 48, -28, -59, 212, -49, -241, -53, -80, 183, -57, -69, 160, -153, -43, -208, -54, -26, -83, -145, 132, -116, -57, 1, -5, -50, 72, 24, 26, 105, -115, 44, 90, -32, 149, 197, -216, -24, 37, 77, -59, -98, 130, -156, -61, -95, 0, 171, -94, -41, -64, 60, 63, 33, -29, -207, 91, -95, 64, 124, -148, -33, 20, -48, -52, -33, -272, 35, 167, -193, 19, -30, -175, 29, 181, 284, 20, -41, 41, -92, 79, 99, -13, 134, -52, 206, 142, 34, -125, 33, 190, -110, 196, -77, -96, 154, -26, -83, 112, -193, 31, 77, 39, 103, -44, -36, 64, 0, -61, -4, -206, -33, 69, -23, -90, -48, 137, -86, 50, 92, -26, 97, -28, 127, 126, -40, -101, -138, -2, 110, 149, 142, -2, -200, 9, 73, -264, -170, 89, 3, -6, -5, -28, 132, -57, 149, 44, -187, -78, -22, -75, 78, -36, 83, 87, -258, 166, -23, -157, -124, 157, -102, -122, 247, -10, 210, -92]
7631i2J35k2o2O2J35k00P9m3l9J60j28k30L12j63J04lj47K00J23k19J14j19o0
7654a03P8n4RJ40J9m1m6r3P6P8K21l12P4M7j17j91J24Q8j31K17k25K45j82R1k7
7679a5j82J96n8L8Q4L6J3k08R9J15l16L19pj33j35N0J46J46k52L5RJ4j55M82l22
7704ap6N5QQ5J8k69J21L25l60J66j17J90j93p8J52j89M9K76n9j52J74p5K01k9
7728B22l23j40J01J65m6k0M5n7M7O7j22j14K22Oj48q7J88j14J44l2j07J44j51
7751a10J67Q9j67j46L06k64P8P9l0m5j86L71j45q3K7J11JJ04j26j50K4J64p4J89
7775A84qj46l7j72J16K70m01J35P6K4n7kP3R7k49J6K25j70L3k02J61K1r9j25P8
7800a59M44l79p8N2J26q1NK9J12j64J02L7j78L91k87M0K88l35M5m4%J67k06K50
$$ y = [-92, 43, 21, -41, 21, 156, -44, 35, -8, -47, 113, -15, -245, 67, -96, 8, 5, -142, 58, 181, -38, 76, -43, -103, -25, -79, -70, 70, 89, 48, 2, -91, -15, 63, 284, -28, 46, 93, -24, -215, -91, -3, -134, 83, -142, 103, -79, 12, -15, -197, -1, -59, -21, 63, 99, 112, -96, 3, 118, -198, 121, 114, -19, -154, -104, 42, 188, -64, -29, -20, -6, -161, 321, -1, -77, -22, -14, 71, 89, -180, -59, 266, -94, 72, -45, 145, -48, -126, 26, -163, -114, 162, 103, -49, 125, 50, 251, 222, -101, -241, -140, 25, -21, -41, 4, -53, -6, 61, -61, -175, 47, 53, -95, -182, 6, -108, 36, 4, -103, 41, -110, 57, 146, -21, -167, 139, -125, -47, 32, 2, -43, -229, 142, -3, -86, -59, 52, 53, 157, 31, -119, -95, 69, -5, 184, 176, 30, -7, -179, -63, 207, -194, -59, 17, 41, -16, -18, 55, 152, -97, -81, 144, -26, 7, -195, -34, -13, -112, -237, -159, 285, -94, -172, -120, 6, -75, -70, -41, 71, -93, 9, 46, -132, 259, -28, 12, 300, -35, 10, -34, -34, 133, -73, 177]
7824A77l81N4J95J71l54J37O2j88J45p4L6j03L04k26j30K9J30J08o1q7K25r1P8
7847A56L9l53L84p1j69K5l75M13N9J18j77j70K88l4j33k41K72R1j04J05n5j89
7869a21J27j10K6J61M0J8M0q5j6j20K8J31l2K84m47J12j45J46l0l5r1r7L45j13
7893A6j82L52k47N0J36j86J12r2J24N9j58k16M55k33PJ59l24L4J2J20j00k8j67
7916b97L71m7P6o0k3q7J05n6n2k32L11K30k45L7j06K48l30J28Q8J17j8j30k2J72
7940A78p0j24J07n5j6k78J82pp5R7Q5j68J09J72k49O3j15R1J13Kk83K22Mj41K34
7965G8m45K28J28n3L47j81o0j16J49j52q7q9J22O9L55l19j39J24J45m5N8k11J24
7988C0L3r9m8J79N6p6n6l1k00K39O8k32J72o4K21r1l10R7O0j5K60j47q0J21k98
$$ y = [177, -204, -150, 45, 216, -138, -1, 61, -127, 18, -56, -20, -123, 181, -45, -175, -146, -16, 92, 31, -56, 169, 78, 156, 195, -158, 226, 155, -14, 11, -364, 49, 108, 226, 49, -121, 167, 133, 0, -241, 31, 122, 18, 123, 68, -121, 6, -104, -78, 83, 123, 141, 181, 96, 80, -40, -12, 119, 87, 371, -76, 36, -109, 37, 7, -28, -119, -216, 129, 16, -166, 186, -61, -11, 125, -61, 51, -41, 83, 142, -16, -232, 223, -10, -3, 156, -168, -134, -122, -2, -102, -130, -297, 74, 27, 103, 43, 20, -67, 38, -18, -70, -302, 9, 239, -6, 31, -75, 173, -157, -29, 59, 176, 158, 28, 6, 178, 108, -16, 91, 36, 20, -258, -76, -83, -158, -61, 24, -144, -35, 137, -112, -49, -164, -73, 40, 42, -241, -19, -15, -156, 78, -367, -139, -11, -64, 283, 102, 42, -74, 75, -77, -164, -253, -131, -62, 293, -26, -165, -41, 104, 59, 117, -94, 30, 63, -36, -84, 95, 151, 75, 19, -12, -212, 27, 95, -137, 35, -29, 192, 101, -209, -112, -52, -67, 193, 46, -34, 87, -211]
8013b11J26J7R8K17k30k18L59k10K33j32P7j56L0N1m6J67l0k27J67j30kJ9Qk75
8037b98R1K51J02j73n4K73m5l05J96k10j6J97j47j24K58l0J91k27j84L03k08J51
8059hq1q9P7M1J41m6o5O8j03J4J15P6j47P2k0N9K2j30j9m9R2k61K06J11P3J33
8085B82k62K2N2j59r2J26Lp0J97k59J6J52n9j8N8L1j11Q9J72k12K11n1k08J36
8109D6P7j39N6p9l4O4k1l1Q8m3m5K64nl68J25M9j44R7J01j15M9l0K34k81J11j9
8135GK8K17l77J4K48j85J19j12K38k06J4R0k8j43lJ03R5k63%J67p9N1j18KJ53
8160C2j63J49Q0j20P2N9q2J96r5r1j11k57K66J68k3k24R0K61j70j21J01J55l36
8183a64O9k4N5P3m6j8Q5R1
$$ y = [-211, -85, -68, 30, 247, 17, -201, 158, -52, 181, 49, 126, -30, 0, 51, 5, 172, 142, -85, 82, -48, -50, -31, -23, -298, -207, 44, 146, -27, -81, 192, 147, -158, 38, -172, -188, 9, -138, -262, -4, -34, 157, -70, -254, 49, -159, -8, -89, -178, -101, -60, 81, 35, -30, 38, -65, -51, 64, 140, -7, 65, 45, 104, 126, -4, -23, -72, 20, -241, -35, 76, 149, 282, 20, 42, 94, -65, -157, -31, -28, -98, 99, -160, -144, 8, -51, -69, -11, 20, -91, -2, 170, -42, 169, 118, -90, 46, 123, -16, 40, -39, -73, -9, -30, -61, 27, -16, -61, 203, 198, -170, -45, 4, -140, -43, 58, -57, -8, -38, 196, -85, 26, 7, 35, 252, -125, -111, 137, -48, 71, -41, 197, -9, 5, 95, 67, -76, -79, 24, 119, -144, -144, 23, -56, -5, -123, -121, 32, -131, 18, 98, -22, 50, 109, 27, 223, 128, 37, -74, -331, -65, 103, 80, -144, -54, 207, 37, -84, 17, 172, -164, -95, -119, -64, 9, -37, -55, 30, 121]
8191A21
$$ Imaginary data points
##PAGE= N=2
##DATA TABLE= (X++(I..I)), XYDATA
0@%%%%%%%%%%%qJ6j6J6k4L2l2M0n5O3p2Q8j04J21j45J69j94K26k58K98l44L91
33B08m41M97n60O31p10P92q82R85j098J218j349J494j652J823k010K216k442K691
51A411k964L266l602L977m400M878n423O052o789P663q724J0047j1740J3997j7183
66i534K2048l0475M9127j66234J00282K94856k16720j70439N6484J53178m1927
77D0646q1939K6402M0068n4008M3539O1656n5742j17765K0645J57321L3380j85399
89g1196m2594J43328M6047o9773l9539M240K5776R52K0757K1406n8037k8748P8166
102C0785K8185o5229n5222L9638P5122k7757n4536L3748n567m1027M5399M0227
114D3766m0981m4203K0102P0067p323q5609K708O6187L344l6880o917L6439m739
$$ y = [0, 0, 0, 0, 0, 0, 0, 0, 0, 0, 0, 0, -8, 8, -8, 8, -16, 16, -16, 24, -31, 32, -40, 48, -56, 65, -80, 89, -105, 121, -137, 161, -183, 208, -233, 264, -296, 335, -375, 417, -465, 520, -578, 640, -709, 785, -867, 956, -1054, 1162, -1280, 1411, -1553, 1713, -1889, 2088, -2312, 2566, -2857, 3195, -3594, 4069, -4655, 5392, -6348, 7649, -9534, 12514, -17961, 31166, -135068, -34786, 260070, 43350, -127089, -70605, 82573, 40646, -41293, -14891, 25177, -28831, 14708, 76364, 20622, -97143, -76498, 80823, 114203, -71196, -113790, 29538, 75585, 5812, -33727, -29487, -3711, -2759, 17998, 39404, -18633, -47381, 30785, 58970, -6259, -61481, -21843, 53279, 25522, -29014, 4734, -833, -41860, 3539, 43766, 2785, -41418, -21316, 48751, 41428, -44181, -41473, 24714, 28058, -8822, -15739, 20700, 15961]
127A5961n7329L6830O5768o8011n9094O6398N9491l6768p1659J1233O8753j1867
139A9706m2987K2012J8312j5944r709J2290J3403l5274j8644O3746J8220o1334
151a6203j6173L2503K1590j1748k6217J4784J7218k1385J695J4592j5831j1264
163a6439R145K0415j108l1407J0983L0083k2595r567K2520o977j6368K336J9639
176A0660J3005k8817j6445K7125N066j5960k392P267R824j4045r350K5530r562
189A906l1859K5927L4973j3425l3986o415L7182J3604l3323n433J3927k710K408
202B776k17o663o663n081K4127J3092l6906j1096L2913J5444j1427k4483j873
215a6057K7445J787r949K402j1987j854J7169J906j2132j8278O325L4810j1430
$$ y = [15961, -41368, -4538, 61230, -6781, -65875, 523, 60014, 23246, -48413, -37180, 31573, 19706, -23281, -1269, 17043, 1099, -8610, 3680, 17083, -18191, -36835, 26911, 45131, -16203, -32376, 127, 21717, 9969, -16248, -1464, 15754, -5631, -3936, 10656, -5175, -16439, -7294, 13121, 12013, -19394, -8411, 21672, -923, -10490, 12030, 5053, -11315, -8979, 10660, 23665, -5152, -21597, 5528, 10594, -5366, -7758, -491, 9333, -4712, -14062, 11468, 1906, -29953, -4026, 30947, 17522, -16464, -22879, 14303, 27907, -5416, -10849, 3078, 368, 2776, 2559, -4104, -10767, -15848, 8279, 21371, -15535, -26631, 6282, 21726, 10299, -14184, -16057, 11388, 13175, 3226, 5628, -6359, -8213, 8956, 10862, -1270, -19548, -13223, 21587, 10157]
228A0157l6639J1499K2427K362p541j0015J0087N979j0841J0107K189j7340N181
241b388Q175j057m704j3986J1461J6949k0488o804J5152j097k181k886K812J0903
255I861j4512m633K2384o269j2341P570J994J692p437o775J6101m054j6154J2841
269B68K946q563K824j760Q060K661j5533Q906J0513j2615J833L485k017L547r104
284d549L285J1209j6302o42J6075q644n303K125N42Q644r911o804J6925m139o947
299d436R093n091Q42L933p294P249j340j1563J2407K045j0499L247j670M301M969
314F193j4072N188J0942j2201K330M536p037M768j113j22P704j1964K01J3947
328I300r403k981N336m151O460k832q908R941j488n724P469n116j279O012n904
$$ y = [10157, -26482, -14983, 7444, 9806, 2265, -7750, 2337, 8316, -2525, 7582, 9771, -7569, -2388, 5787, 4730, 26, -13960, -2499, 14450, -6038, -12842, 2310, 1213, -968, -3854, -1042, 9861, -4651, -9284, 13100, 6831, -5510, 2060, 4054, 5746, -1691, -8466, 7635, 3581, -12573, 268, 3214, -5349, -2525, -4285, 3775, 6436, -9097, -191, 10322, -2293, -460, 3025, 1008, 4555, -4549, -1264, 9945, -6357, -6999, 9076, 432, -4871, -2746, -2204, 6440, -3471, -10275, 6650, 2511, -4436, 4657, -434, 408, 4341, -2953, 4296, 2956, -8607, 3800, 5845, -4654, -1407, -3077, 1224, 6193, -7879, -2691, 8251, -3950, -1620, 2916, -4121, 647, -466, -588, 7116, -4848, -4647, 9300, -103, -3084, 2252, -1899, 4561, 1729, -7179, 2762, 1274, -4450, 3019, -2097, -3376, 2636, -3268]
343c268M810J447j1152R776M269j0015M215J310m7M293r180J966Q026r128K327
358c51M225q785L332R57l492O478n350j969J0304n279j995M457n372O386K556
373F102q922M609L83n342P395l143m580L139k613M279J258j0233N404M673n895
388c486N192j294m274Q020j033k247K716o245K977M868m734J801l598n164Q337
403A836P6n295K322m298L293Q652p198l469K460J377P890l521r429N532K770K81
419C279J342q496j40N662r34K861m686q470R198M013m845J56l989L059R837m445
435C402n119Pn76O273M48l922J696o125N62J0521n852p938J888K740R242j071
451F176j5172O84R745M677j517j1168J367J1899j284l496k570m764O308L173m262
$$ y = [-3268, 1542, 2989, -8163, 1613, 5882, -4133, 82, 1392, 1345, 5638, -3542, -1576, 6450, -2678, -351, 3874, -4911, -1579, -622, -4114, 2364, -2986, -4955, 5349, 70, -1925, 2532, -2840, 3546, 6102, -2820, 1789, 2172, -3170, 4225, 1082, -3498, -359, -2972, 1307, 2565, -7668, -2264, 2409, -3486, 1706, 412, -3862, 4158, 3125, 878, 3594, -2651, 326, 5194, 460, 2261, -1337, -6501, 1836, 1912, -3383, -1061, -5359, -2066, 6586, -612, -4081, -1621, -244, 7646, 4125, -5304, 228, 2998, 3279, 4621, -3875, -4015, 1647, 713, 3574, -1112, -9582, -384, 3629, -1216, -1060, -5049, -1990, 7847, 3402, -1717, -1710, -2286, 3987, 4435, 513, 2209, -3916, -3354, 7167, 1315, -6623, -4735, -1995, 7247, 6176, -8996, -8312, 1433, 6110, 4593, -6575, -5208, 6691, 5407, 1911, -659, -5423, 885, 4058, -204]
466b04L021m342m433Q042P91m191k455l522R562P042r480m566J079M020N695o315
482b56k458O201m668K278O216r427l930L645K897P749o172j2088O103Q227J270
497E587o764j1231R114J2980o037k772k187l479P591l16m050M586m492j161R786
512G155k921p466n642P04J5849K891j4933k674L405P074M261j2965k963J1442
526C217J118J670k355j0537L967O501o66J015q558l539J3171K998p715q912k389
541a1014J6221L616j3825K955M146l630M424j010l472K020m833O394R667j0481
555A178q820K411O519P689r920j0136J0338M876n72j488j1008L103J0716k923
569A963J068j014o895N869M018l524k166o159M641J2404n145r517l331K113J2502
$$ y = [-204, 2817, -1525, -5958, 2084, 2875, -1316, -3771, -7293, 2269, 9311, -169, -4735, -3656, 364, 6059, -256, -2714, 3487, -1181, 1097, 7313, -2114, -6044, -2399, 498, 8247, 2075, -10013, -3910, 4317, 5587, -1177, -12408, -3294, 9686, 3649, 877, -1310, -4789, 2802, 2486, -1564, 3022, -1470, -2631, 7155, 4234, -3232, -8874, -8170, 7679, 10570, -4363, -7037, -3632, 3442, 7703, -5262, -8225, 3217, 4335, 6005, 3650, -6887, -2920, 3581, 2915, 3930, -4628, -8167, 5004, 8002, 287, -8625, -11014, 5207, 8823, -5002, -2047, 2099, -1531, 2893, 1883, -1589, 431, -4402, 1992, 11659, 1178, -7642, -5231, 1288, 8977, -943, -11079, -741, 4135, 3563, 2075, -8933, -5830, 4886, 1963, 3031, 2017, -4878, 991, 5009, 1485, -681, -6840, -2199, 10205, 5060, -4457, -7788, -5675, 6827]
584F827j904j3225N598N503j249J931o441k649Q078p20J181K009o978j426L168
599b97M035K832j2856m073J6325J650r113l269j575Q524L121j0149J774N792j660
614A061J831j798k422J270k778M855M330p376l52K099l392M347j616n037N312
629C34Q03j290L192n685k121N567K83J243j108k936L925m32j633K350n502j28
645c138P911k923k511K73l700L859K388n010O55K160J273K008m041l68J195l040
661c009N327L695p177j16K227p17K169m474k494O399q9k050J2l055K047K191j386
678e00J454k499m50O610j390m170O61j738K810K875m696J340J766l664J282q05
694a114j659K228n5J821N76m811J957K429k894L036N4k861L389p26j434K192l040
$$ y = [6827, 4923, -8302, -2704, 2799, 1550, 3481, -2960, -5609, 2469, 1749, 2930, 4939, -2039, -3465, -297, 3738, 6570, -6286, -10359, 5966, 7616, -1497, -4766, -6341, 2183, 5304, -4845, -3071, 2721, 1061, 2892, 1094, -1328, -58, -2836, 2019, 6349, -1027, -1379, 720, -2672, 1675, 59, -4978, 334, 1137, -153, 3039, -2646, -4767, 800, 1083, 2326, 1218, -1718, 2207, 1775, 142, 2492, -3010, -3138, 4773, 1850, -661, -388, -4088, -229, 2159, -2851, -2196, -36, 1237, 3245, -796, -1164, 31, -3009, 2318, 6013, -1164, -1280, 947, 230, 2399, -2075, -4569, 1830, 1741, -309, -297, -3352, -1305, 886, -500, 954, -1545, -1995, 4615, 3225, -945, -284, -2022, 788, 3663, -1033, 307, 2073, -1591, -309, -1114, -2773, -545, -600, 1221, 1797, -3014, -1057, 1372, -1522, 1514, 1568, -1293, 2096, 1370, -64, 2128, -912]
711i12n12K278j592J570q24k318L767j757l091L282p40J67L382k730M65R86l359
728a938L031Q13l146K421l93o66K662m227j474L506j705J163Q74l605L362Pk839
745b154L208j932m58M847k624j547J979k359K399ql922L606K06k500K747l053
761a565p44L960l214M34K333k999K101J171k936K465q60j098M309l198j576L844
777B427k839O45J298l919K411R13l274L478j782j678L993k548r06L419l133K268
793G73K173m742K406R76k351K882j843j471L890l575r24L103l308J454K160m057
809b454K673m7k705L972j122j238L375l169N12K922m148J667K150l894K214j69
825E39k857L380j740j064L244l523P91L197l708J172J630k689L534l02l267L751
$$ y = [-912, -1424, 854, -738, 832, 8, -2310, 1457, -300, -3391, -109, -849, -682, 2700, -30, 435, 1421, -1938, 1093, 1906, -1240, 1181, 788, 122, 2784, -1443, -2917, 589, -1116, 47, 921, -2684, 678, 685, -2154, 1054, -878, -1336, 3511, 887, -660, 1319, -1040, 1359, 1351, -2571, 1035, 1241, -1259, 1488, -1565, -2309, 1651, -1563, -1129, 1204, -1795, 306, 1477, -1459, 1006, 146, -952, 3357, 159, -1417, 2427, -412, 233, 1531, -2388, 23, 936, -2338, 1140, -642, -2320, 1673, -875, -1781, 1638, -1495, 773, 2946, -1796, 610, 1586, -765, 2117, 274, -1197, 2693, -882, -1806, 1297, -2011, -557, 1603, -2454, 219, 172, -2533, 1439, 317, -921, 2454, -715, -203, 2719, -1429, 238, 2388, -1506, 708, 539, -2318, 1062, -678, -1742, 1502, -2021, -1230, 1967, -1741, -569, 1061, -1628, 1906, 1604, -1663, 2088]
841B088j357j224K718l213O52J862l508K159Q92m237L359K11k069K628k212J89
857a062L080l050J329K113l778J886J321k537K304j802j356M340k490k276J798
872a80j511K047R73l673K305L61j976L281j394k309L539n26k01P91l409K442K090
889B650l798J298L55k236J969j137q6K387l241J74L565k572J16K70m87L729j586
906A370l512K951k09r31K405j856p48M75r68K495j246l487L221J129j254N03k893
923b555J383L540k939J84J665j980J551N45j595J300j843l81L150k012m06J61
939b32j870K543Q92l310P71J19Q67L405l646k164L580K40j50n33j563K478j56
956A271j716K075k397j874L106l45N35n18l725L572L033m479r05J962J312J612
$$ y = [2088, 731, -493, 2225, -988, -336, 1526, -1982, 177, 1069, -3168, 191, 402, -1667, 961, -1251, -1062, 2018, -1032, 297, 2410, -1368, 518, 1839, -698, 1606, -196, -1552, 2788, 298, -1978, -180, -1691, 356, 1329, -2344, -39, 322, -1654, 1627, 233, -2076, 1463, 937, 736, 1527, -1882, 560, 2650, -1148, 150, 505, -1731, 238, -899, -985, 1402, -1839, -1665, 1900, -672, -556, -286, -773, 2956, 1370, -2142, 809, 600, -331, 2074, 218, -530, -55, -1023, 1472, 226, -3261, -40, 1089, -165, 338, -2555, -1172, 2368, -571, -387, 1278, -702, 849, 1394, -201, 1099, -744, -1125, 2025, 13, -393, -232, -2102, 441, 1333, -1977, -1206, -1087, -220, 3185, -461, -2625, 955, 1195, 1045, 512, -1051, 1427, 1271, -445, 1630, -767, -2641, 465, 120, 655, 137, -3588, -16, 3017, -1462, -2367, -405, 907, 2519]
972B519k704JK273l205K64K721j538J14j051p72M536k602n190L236K154P40o66
989H30l791J831L383k364L03n46l39L439k098j515K836k389p69K479j865J246
1005F71l07l708M145K390m993n94K98L028J892n051J316L943l720L62J285k102
1021a145K380j236l59M575m481m522M379K064r76k052j779M869M10m882K172O51
1037F8p43K372j565k3K627m247R76L354l576m67J339l42K652k442k895K772j259
1054a399N73K743l498J198J792k339K156j285k758M660k05k316K805k497j441
1069a811K670j032M21q07j974M793o78m638K622L25p23J721k021J633K450m734
1085a783J490L371l673m05N54J383K790m538j834M096j683j351J074j205L019
$$ y = [2519, -185, -184, 2089, -1116, -852, 1869, 331, 445, -606, -1378, 3158, 556, -4634, -1398, 756, 1496, 830, -2961, -1130, 2253, -111, 192, -354, -693, 2746, 648, -867, 1969, -420, -1189, 1290, -575, 671, 364, -3344, 801, 3191, -1802, -2396, -2098, 930, 2822, -2229, -913, 3030, -690, -328, 957, -1145, 1235, -1, -360, 4215, -266, -4788, -409, 1655, 679, -1373, -3152, 1717, 2127, -2755, -583, 68, -675, 1697, 132, 109, 2736, -1511, -535, 2819, -757, -1224, 115, -227, 2425, -17, -2912, -140, -1399, -826, 1917, -1581, -383, 1409, -930, 1226, -59, -2817, 1843, 1638, -678, 2127, -370, -1811, 859, -173, 248, -559, -2533, 2260, 1582, -3056, -434, -109, -832, 889, -1132, 501, 2951, -1783, -293, 3078, -595, -1000, -446, 937, 3727, -811, -2645, 1451, -232, -1583, -509, -1714, 1305]
1100A305M32l655K282n20k134L317p1o34J577k434R38J465l198O92R51j238K538
1117A613q68k145J572k064M95K778k986Q30L008j988K16j21j610J861r42L77K727
1134B753k555r94J919j886l30M94j103L289n38l125K705p42j438J691m25M25J030
1151A170j565K252k19l313J505K45o15J189p93M62J126l146O80J761l009J266
1167a004K225n78N20j711p07K596j786k66J913q16Q51m1k132J726j028j865K882
1184G79m90r71J653j427k10K27j161J908L22j888K312L9j747J246o17L84O94k508
1202a455J651K130k949J8N32j160J250p83K50K152k524j42J625j116J41N71k20
1219b9J822j245j647K718j164j892K324o93o9Pj649K093j44k544J937M11j129
$$ y = [1305, 1737, -1918, 364, -156, -2290, 1027, 956, 322, 1899, -535, 403, 1868, -1330, -638, 313, -925, 1613, 745, -1400, 172, -1892, -1397, 1381, -1605, -775, 2233, 245, 461, 340, -1270, 591, -351, 26, 2753, 198, -796, 1123, -763, -1093, -599, -1702, 1587, 1049, -2076, 629, -113, -1551, 140, -285, 140, 1170, -395, 1857, 1638, -1675, -170, 75, -540, 649, -144, 318, 1444, -1702, -1022, 739, -2270, -1004, 1221, 643, 1163, -548, -1255, 1341, -445, -711, 1202, 386, 1237, 1196, -936, 790, -238, -2103, 779, 289, -682, 971, -456, -666, -439, -1600, 308, 630, -1258, 1054, 1093, -654, 592, -25, 359, 1053, -1455, 196, 2326, -623, -605, -73, -1233, 17, -766, -516, 1636, -888, -1030, 595, -521, -380, 191, -29, 1793, 548, -1099, 1619, 455, -1437, 887, 194, 125, 132, -1517, 576, 432, -2112, -175, 236, -893]
1236h93J479j002L43J502k889J257K022k560J001P82j055J218j831k79K041k156
1252a020o7K471j954L5M81j507K315p68j352L415j356k006K459r00k7P75j998
1269a004J785K50k662K161J06k049J473j037M65J360k347J026K207l060R26J408
1285A008j103J177q25n81K523k431q79K693j907K40N75k056J794j8k289K801n06
1302B16j520K388j276k84J598j888J241R38k820J954N70j861J686j085o84J771
1318I44j920N21J691k787Q04J500k007J666j50j311K116q60r27K284j920N61J440
1335A645k328R29L73j687K136p81j854K275j103q77J839j423N44J435k153J397
1351C67M85j826K107l54j347K059j922l42J883j722L34Q03j957J355N30j849J387
$$ y = [-893, 586, -416, -73, 1429, -1460, -203, 1819, -741, 260, 1042, -13, 1205, -626, -905, 1136, -1020, -1087, 1384, -570, -535, -54, -1561, 754, -14, -1366, 2049, 693, -1313, 1146, 246, 219, 994, -1004, 781, 1031, -1631, 530, 636, -1413, 60, -977, -512, 848, -1499, -473, 1734, -1326, -400, 1008, -95, 1082, 257, -324, 2199, -232, -1111, 1582, -325, -85, 490, -1566, 228, 210, -2079, 722, 216, -1304, 1084, -192, -476, 1122, -766, 475, 1413, -1407, 547, 1117, -744, 942, -143, -827, 944, -976, -455, 1236, -1551, -747, 753, -1254, 412, 262, -1049, 1067, 207, -720, 1564, -356, 205, 1645, -683, 246, 619, -1068, 1068, 287, -1567, 708, -395, -1272, 567, -856, -312, 1123, -1030, 367, 852, -974, 1133, 779, -568, 1491, -431, -773, 1110, -612, -278, 525, -1432, -77, 453, -1396, -9]
1368ik69n66J954j304m36J481j447R99M70j591J618M6j548J646q60j268J688r63
1386c59m2O58j387Q06N00j215J230n3j021J868r59l08J280j501O37J463k009L45
1404f7M85j208J393j63j317J295j028M1Q18j664R94J449j519R33k15j089J756
1421H94o55o49K105j445p35J141j172Q12k64j367J866k10j289P84n98M88J414
1438A120k120M80J323j317Q81N83j266R52l44m59J049j209k89J311j024M90k08
1455d7j990K204J29j359J484l25n99J184q78M2J445j702M86R61r93O03j073l76
1473h04J879j019j087J400r35N20N80k444J480J318j417J036k71m12J005j338
1489e09L29J438j341J26P34j300J269j281j408K797k79j838J243o53L33J294k125
$$ y = [-9, -278, -844, 1110, -194, -630, 851, -596, 403, 873, -718, 900, 946, -602, 1044, 184, -1084, 604, -359, -401, 257, -1130, -324, 176, -1039, 191, 138, -883, 985, 26, -282, 998, -503, 134, 1597, -412, -67, 418, -790, 603, 440, -877, 418, -610, -569, 249, -1415, -421, 1028, -491, 442, 227, -862, 894, 239, -410, 1695, 250, -485, 656, -516, 296, 32, -1335, 531, 321, -968, -184, -782, -294, 1120, -1000, -520, 803, -514, 367, 950, -316, 636, 292, -167, 882, -327, -616, 695, -329, 161, -47, -2037, 167, 296, -1063, 421, 96, -503, 681, -197, -155, 1290, -412, 74, 1035, 42, 645, -428, -804, 1075, 56, -1031, 369, -566, -46, 534, -1910, -430, 888, -529, 507, 236, -176, 829, -509, -180, 1258, -83, 43, 777, -523, 746, -535, -1943, 854, 575, -1263, -20, -673, -340, 954, -1171]
1506a171J040J030j505J385N2m85R72j930q2K384k009p36J800q36O40n61k197
1523b209K243M50j854J560R2Q4L56j668J187R48j891J351N59j538J484j528j213
1540a587K347r58r55J726r24J84Q17j680Q79k7o97K206r71q62J986j520l56J201
1558H09j959J079J793k113O35J74j654J042k79k72J403j253N74J232k098O73P88
1575E74j629J324N24q78J415j232j204K288j835q95K144l37J44l87j089J783j201
1592d91r24K193p20m29J609j214Q2O48k506J685J476j626Q27N7q54N40j299r6
1610a042J655j240K05J197j378R37l33j571J900k9j066J765k58l72M88j526J98
1627d70O52p73J283J76j455J151j006j173J503p45P34J384j709M89R90j767Q45
$$ y = [-1171, -131, 899, -606, 779, 831, 346, 1318, -612, -694, 1690, -319, -1055, 745, -91, 549, -12, -2209, 34, 484, -1370, 190, 282, 366, 722, -946, 241, 1189, -702, 649, 1208, -330, 1154, -374, -1587, 760, -198, -1153, 573, -351, -167, 650, -1030, -151, -178, -875, 1331, 360, -502, 1484, -36, -392, 809, -1150, -71, 1722, -391, 244, 418, -1236, -194, -473, -745, 658, -595, -21, 1211, -887, -214, 574, -1055, 269, 793, -85, 1330, 98, -1106, 1182, -653, -1548, 596, 259, 403, 16, -1073, 710, -491, -1415, 778, 58, -371, 1238, 24, 106, 754, -1752, -67, 1409, -217, 610, 667, -187, 353, -946, -1042, 613, -627, -422, 775, -603, 334, 1, -1570, 330, 301, -765, 1000, 742, 370, 858, -668, -470, 182, -591, 692, 868, -587, 564, -442, -1615, -112, -857, -123, 1261, -448, 41, 1031, -736, 109]
1644A09J80m93J126n22j47J016j820j32R71j035Q62N07j080O66q19q59J743o49
1662c76n64J659m52J59L23r21P30j84j078J651m22q46P91q22j25L42j090R52P14
1681D41j120R84p0r11Q55m55J0J145q27M21Q34j878O12O5o54Q70j41o15J287j365
1701e12n20J021o67Q0N65j51R49o13o81J458o35r37J479n60K0M68j229O14J23
1720B72j603J238J21m84N74o52K07R07j532P44J268j211L33L99p37R37q49l75
1738d43J140j243Q1J427j390m5P79j202Q42k98n42J804m11j250J278q97J29Q27
1756E86j278J136P27j922R05P0o35P93n43k03J040j478L23J306j911O99O38q95
1774f42J137m18o45J644j422l30J514q27n5O80q83P18j94j537J615K9j542J596
$$ y = [109, 289, -204, 922, 400, 253, 1269, -551, -683, 288, -747, 115, 622, -458, 208, -611, -1470, 273, -376, -940, 719, 267, 426, 749, -172, 558, 374, -704, 947, 525, -321, 470, -352, -477, -135, -1225, -273, 441, -679, 305, 235, -676, 179, -276, -266, 879, 52, 473, 1307, -571, 41, 106, -548, 322, 181, -434, 853, -512, -1032, -11, -678, -598, -33, -184, 765, 152, -529, 929, 294, -643, 836, 276, 296, 764, -465, 149, 272, -1331, -93, 28, -456, 118, -534, -327, 580, -952, -208, 1060, -151, 182, 581, -156, 781, -68, -443, 697, -546, -465, 962, -428, -473, 306, -896, -54, -352, -894, 910, 499, -751, 527, -370, -241, 586, -692, 444, 1171, -751, 154, 224, -411, 382, -161, -364, 676, -802, -479, 827, -1084, -385, 253, -642, 495, 77, -568, 1076, -346, -676, 838, 11, -44, 636, -247, 471, 277, -1260, 355, 384, -1158, 438]
1792D38n37K4K70j199Q51P72j877J380J022j604Q82j84j84R55j609J33J488j309
1810b88k1N89r53Q45l48j059J593l26p46J447q38k80Q56q12R25M61j640J187J6
1829F08j202R66m23m55J107j454N16R26j800Q13J013j344J021J32q32J276p35
1846A33m18J547j198m63J188q92L86p9j038J702r86j195J642k88l15P60j092N15
1864i1O08j100J081J97q23J035l85q01R74r30pR75j442N35N25j446J019O73j062
1883d65N56k92k22J070o95J73O71j045L36M30o67J007l85j158J432p26j101J398
1901C17n64O8K79r72P88L42p74O11J65m94R47r52J23R74j074J49P82j402P21K24
1921B58q01P08k81k56N87o35J56R14r48O8M56r65J313l57p56J472q44l57J015
$$ y = [438, -99, -75, 195, -1004, -153, 619, -1258, 122, 1144, -460, 422, 238, 54, 1009, -600, -467, 1021, -288, -309, 280, -673, 172, -176, -1235, 358, 32, -714, 733, -105, -385, 471, -341, 584, 1045, -595, 592, 608, -594, 372, -51, -506, 601, -853, -337, 589, -1211, -398, 615, -729, 292, 424, -408, 868, 133, -285, 1262, 64, -399, 789, -103, 283, 204, -834, 868, -118, -1313, 329, 41, -274, 486, -606, -91, 517, -583, 498, 695, -128, 907, 522, -279, 695, -235, -242, 733, -709, -174, 351, -1095, -76, 597, -465, 91, -201, -423, 647, -48, 125, 796, -249, 87, 517, -150, 857, 472, -686, 746, 20, -1081, 317, -247, -179, 100, -872, -84, 258, -516, 95, 260, -234, 713, -239, -116, 858, -216, -67, 715, -687, 34, 258, -543, 165, -116, -372, 215, -420, -264, 650, -298, -230, 226, -739, 574, 217, -539, 933, 89, -268, 747]
1940G47j023P1L73l91M58k77q95J107j5q10P92o53M17O62j309P67R77j555M31
1959a26Q73q19O65q03l22J263q41k54N73p31M01K43j101J381k40j015J236k89
1977I4m78R91p20K97O59j210N48J99n54N43m01l64J231j490l35J381j064M45N81
1996C53j036R74J01j133J392l05o70Q52p46N55O50j226K92L08j168J286m86j259
2014a266J820k66j101J192j046O28O16j175Q77Q88j259N98k6n62N57j021n3J906
2032A307j686k42J063j324P73k17p57J580j11j059J051n2n94O23j030J191P70
2049A286j757Q53L30j241N61m15o14J889j146l42R28q18L4O60q32Q19L0o81J871
2068A415j233q13J240p32r9Q36q44M54O70j724P46Q9j300J326R6n98R66o67lL30
$$ y = [747, -276, -205, 168, -223, 235, -42, -937, 170, 155, -655, 137, -516, -99, 563, -746, 21, 998, -557, -126, 747, -72, 593, -210, -532, 731, -110, -364, 209, -522, -121, 122, -979, 402, 162, -853, 383, 94, -384, 607, -113, 184, 843, -367, 181, 380, -174, 369, -32, -396, 835, -655, -990, 391, -673, -228, 353, -683, 291, 392, -741, 651, 346, -324, 528, -218, 337, 987, -239, 53, 361, -807, 479, -7, -1266, 554, 288, -813, 379, -667, -39, 577, -598, 279, 1167, -92, 506, 480, -82, 475, -546, -599, 1307, -379, -621, 442, -882, -109, -326, -1083, 497, 386, -673, 378, 326, -268, 355, -675, 516, 1286, -471, 382, 712, -529, 32, -383, -997, 892, -254, -596, 332, -486, -452, 208, -624, 195, 225, -456, 1415, 182, -631, 609, -123, -222, 614, -230, 224, 894, -830, -84, 5, -1295, 31, 127, -471, 495, -172, -175, 155]
2088A55r40J053N00j410J415O3j153Q90p42k36J137j005k94J164r08k03M56o51
2106g09J153l86n75J392q36l90R68r91K63O38j000J221q9j152P05L6p49M42k91
2125c50K27P68j143K84M34j334J130L14o57J163n62k94N78p73l24J084o40j3M92
2144C84l23J69n60l56J043o44l81J254n64k23N57r78P58K8p74J497p7q63M27m12
2164c8k04O03q01O64M62j388M09K53o33O65m09o4J222p02j88R57r20j67M90n13
2184c02P43j43m03Q83p79o44O64k91j33O27n42M96k02j011J060j41l58R55k0r6
2204C63M73j354O03M24j238P67N08p17M38o76r2J004j322J69J311r07K51K40o67
2223d22R13m59n41J260n30k58Q55p02r5J06j066R80M20j156J187k48r55P06j41
$$ y = [155, -785, 268, 768, -642, 773, 836, -317, 573, -169, -405, 732, -273, -567, 597, -311, -514, -58, -709, 444, 58, -517, 875, 39, -351, 617, -374, -111, 527, -473, 748, 659, -493, 212, 248, -501, -59, -350, -123, 645, -498, -214, 220, -1114, 16, 330, -327, 836, 274, -20, 558, -215, -539, 545, -95, -108, 384, 61, 230, -330, -686, 357, -287, -668, 586, 22, -201, 356, -622, 136, 164, -610, 887, 810, -53, 374, -38, -242, 361, -440, 224, 686, -702, -293, -40, -673, -8, -417, -481, 741, 39, -149, 808, -112, -279, 211, -302, 441, 298, -105, 778, -1, -645, 19, -272, -405, 222, -320, 176, -26, -1037, 23, -118, -476, 479, 459, 363, 836, -518, 85, 509, -729, 38, 546, -171, 267, -409, -501, 503, -819, -650, 661, -246, 5, 245, -422, 491, 32, -509, 751, 221, -37, 818, 116, 21, 127, -939, 41, 461, -695, 492, 244, -711, -5, -146]
2242a46k17P94j056P93R46j329N03J25j032R50l04l43J306j080k44O66r14J94
2260c88M82o59P90j70p37J301n95q91J297n38K79O59j052M96K21j187Q73J97j009
2279f31Q49l21k35P64j192M00R85j285N97O01j032P31K6m54P38o26m05J437j066
2298a19k7P76j038M79j1j148J399j20j071J380r05q4R98r30O79L46j205Q79M85
2317G63j296Q73j54n52Q86r59L07P16j339J88P69q77Q02M9o99Q37m54k51J267
2336H76j010r7J174j185P9P84r85P22j89p81J327p33p80J094j049O46N88j197
2354g16O43O17j092O89K83n19O85p12K91O08j198K58R94r78K1K75p64P57l17l81
2374e56P36n95j67R96p95M78L02p46N91l2n59Q35o11k10J110r15j41K76o45O10
$$ y = [-146, -363, 431, -625, 168, 1114, -215, 288, 413, -619, 331, 27, -316, 990, -90, -334, 332, -582, -388, 94, -565, 225, 55, -682, 619, 24, -867, 430, -108, 171, 830, -222, 274, 495, -692, 181, 378, -631, 218, -103, -338, 426, -766, -366, 619, -666, -69, 532, -500, 231, 257, -197, 541, -85, -490, 947, -119, -146, 630, -408, 71, 60, -1088, 311, 191, -880, 500, -405, -489, 509, -421, 258, 604, -601, 278, 763, -533, 340, 186, -366, 520, -439, -132, 584, -755, -567, 202, -675, 127, 176, -523, 314, -140, -391, 876, -134, -231, 943, -242, -163, 621, -364, 358, 169, -612, 715, -18, -798, 296, -753, -107, 481, -716, -73, 544, -548, 141, 424, -95, 590, -122, 169, 777, -421, -163, 831, -147, -126, 149, -615, 142, -175, -556, 180, -415, -582, 414, -381, 97, 399, -347, 244, 212, -347, 488, -123, -333, 777, -138, -279, -3, -648, -38]
2394c8M40j128Q01J17q89Q84k78n2N60n40P1Q56j064M57J42m63M80o87l18J047
2414C98n60o17Q52l78P4N18r26Q15L51r01P61l40P2M56n34r5N89p86K23N09j022
2435e41P27l5j002R61j87l64P79n66Q6P10o60K41J62l77O30j23o52O92n70k70
2455c59J012q13R8M30q93M31l0m09R47m23m16P68n35K34M25q24M75M98q11L69
2475A74J10n68P69p33j77O84n57j06M99o16O93R6r81R84j21p02J125n46l39R23
2495F11p82J82M63q70O04P0p45P44m77m01J134j012RP41o17K51N18q01P51J68
2515E41j104Q75l4l47O79o79p3R23j304N63J04m56O98l42q02R92q4p26P13n31
2535c94J71R60q87N1P51j036M76K20p08R99o50l30Q32r07J20N45j008P76J89n60
$$ y = [-38, 402, -726, 75, 192, -697, 187, -91, -143, 417, -123, -52, 804, -260, 197, 339, -124, 356, -331, -649, 398, -162, -779, 73, -305, -231, 287, -639, 176, 527, -374, 387, 47, 119, 575, 41, -54, 535, -251, -28, 481, -541, 186, 151, -851, 110, -77, -441, 338, -228, -142, 568, -92, 149, 311, -66, 564, 441, -211, 481, -89, -359, 653, -160, -62, 368, -525, -94, -124, -533, 414, -9, -425, 343, -192, 42, 467, -357, 118, 616, -195, 174, 284, -284, 485, -248, -425, 259, -298, -404, 95, -521, 172, 268, -713, 271, 150, -552, 573, 27, -312, 611, -171, 11, 474, -396, 208, 278, -467, 277, -200, -601, 533, -479, -470, 271, -346, -95, 423, -378, 373, 541, -563, 312, 278, -69, 610, -69, -142, 781, -523, 40, 144, -312, 386, 44, -758, 234, 150, -576, 137, -394, -223, 737, -150, -99, 652, -384, 92, 312, -396, 603, -47, -377, 455, -452, -332, 213, -795, -19, 170, -390]
2555c90Q38m69o06J149j75m85M10k17M95L12j500P46L37j082P00K72q31Q52o56
2574c00m24J011p94M57P86j094P48L05j015O45l76j82J094r63KQ19j086J23P6
2593a68k36N54L9p47Q99k14p03Q06q00P22K73p53R08J59j371O62K85q04Q33k88
2613E6l6P49j108j82P13n17J79M3k33Q58o13l02Q31o06k28R53n83J99M41q33K96
2634G7l17m63P93M9l61M81n54m8M23n77M07O25r01P55N3p47P44p24j6Q24q27K46
2656e8N84n54J37p1o12O37m37j74Q66l17m56O92n69K0N59k05K25M83r19N16rp88
2678d50Q52m53k0O37p67J01L30q66L86J13m05O58Jk59Q11o15l34O70o83L58L99
2699D64l89L12m57l64M08n74J31P12l91m7L17n54N11J30o83Q21k31j85O35m11
$$ y = [-390, 448, -21, -627, 522, 347, -138, 272, 55, 550, 862, -638, 108, 445, -637, 63, 335, -496, 356, -300, -724, 287, -507, -50, 736, -358, 390, 695, -320, 325, -51, -233, 861, -102, -100, 719, -367, -244, -168, -404, 150, 189, -558, 341, 127, -576, 230, -570, 152, 425, -328, 580, 739, -632, 30, 315, -489, 344, 56, 20, 769, -339, -521, 192, -325, -146, -103, -336, 522, -91, -393, 438, -168, -396, 557, -26, 173, 614, -219, 77, -240, -703, 90, 139, -222, 259, -295, -343, 80, -497, -90, 535, -366, 389, 442, -305, 439, -285, -301, 523, -304, -58, 526, -28, 109, 38, -574, 63, -374, -548, 318, 1, -455, 237, -332, -312, 247, 42, 267, 750, -169, 347, 338, -450, 402, -51, -71, 566, -201, -100, 230, -636, -250, -137, -542, 116, 117, -142, 669, 54, -280, 390, -293, 65, 464, 75, 387, -70, -434, -26, -600, -469, 243, -148, -195, 122, -432, 79, 209, -474, 347, 116, -69, 566, 155]
2719A55k14K55o49N15N28j051N56O4p12N81l08j16Q32n92L2O12q32K34J97m14
2739c27N91K2l77Q31l61m95N01p18L4L46m94N92J39q55Q49k75n84P01j82K1M00
2760C59o73L78K49q08N08M57p85O15%l35M93j094L54N51p25N74L20p86L29K0n22
2781e21Q91k54m44R09l85m35N23n76M10K84r18Q69k94p47O22j25l68P68p54M61
2801h4L53n98N22L32q64M71K56o33R31q96J63O50j005J91N67o16L76k12j99M55
2821A60k38k57N15r6k53N67m81k6N63r16Q78J50p25O93l60n07M12m49J83K45m45
2842c87K05L23o09O69Ko69N85j05r6P76o08l14P18m59J06Qm80O17j68n20O37m70
2864b39k78P44o06J02N94o25O52n7o50N54R0m69O20l49r0M82p94O5O13r73O09
$$ y = [155, -59, 196, -453, 62, 590, -461, 95, 159, -553, 28, -280, -396, 436, -156, -124, 488, -344, -110, 87, -327, 264, 286, -91, 740, 379, -116, 385, -333, -299, 47, -447, 145, 284, -571, 278, 3, -581, 120, -62, -41, 359, -314, 64, 313, -495, 13, 470, -315, 300, 300, -35, 458, -636, -282, 269, -456, 118, 438, -348, -19, 1, -521, 370, 116, -328, 581, 196, -239, 284, -292, 118, 402, -516, 353, 59, -688, -66, -191, -559, 209, -545, -84, 269, -329, 193, 525, -339, 132, 388, -245, 686, -210, -47, 603, -402, -211, 356, -260, 116, -96, -295, 160, -78, -335, 180, 84, -169, 398, -83, -109, 454, -462, 416, 566, -159, 534, 174, -333, 79, -370, -187, 58, -387, -182, 141, -468, 201, 203, -466, 119, 14, -82, 694, 86, -228, 490, 31, 137, 145, -335, 282, 114, -406, 231, -239, -517, 227, -379, -277, 317, -308, 344, 287, -363, 191, 281, -188, 432, 83, -7, 475, -319, -254, 359, -614, -5]
2885eM2n80N51j38nL42k41n8M54l67L5L23j75q3k05r6O70m99m67P76l70j22K87
2908F9o26O82j71m26P45l59k78N98j0l15O35m91k14N53o20N0N41o15L82k19j71
2929b60L78l10r8M56k73j10L46l11M96j72m83P66m46p3N67o07K67L69p21K73R2
2950A46o11M85J4o48O79k6k02J93k84J40P86r00L21N2j54K64k33k03O94k35o88
2971d10N56m82L05J21m99L81K75o53M93j17l85Q24k19j42L35m68K66M35p76J83
2991B3L34n68J28o1j48Q01m58j81L45n56K05K44p38R45k30l52O63l50j30N41o70
3012b13K90K58l59l9L12p64N78m26j84P98m07k0P20q77K69M55q13N02J17k99N76
3033D74j60m27L32l78m3M62o86L71J80o66O02O1p54P09J1k28L26k55J11N44q51
$$ y = [-5, 37, -543, 8, -130, -135, 207, -34, -92, 362, -5, 30, 353, 178, 95, -110, -206, 464, -35, -502, 274, -96, -218, 69, -557, 125, -46, -472, 273, -86, -364, 234, 224, -91, 544, 53, -161, 392, -228, -178, 363, -252, 130, -89, -260, 118, -192, -290, 166, -107, -217, 129, -182, 314, 142, -341, 425, -21, -94, 473, -134, 133, 502, -219, 54, 146, -465, 20, 34, -614, 65, 39, -163, 30, -254, -114, 672, -228, 93, 145, -9, 255, 22, -181, 513, 278, -410, 146, -336, -31, 90, -409, -28, 247, -406, 87, -30, -415, 409, 190, 48, 383, -85, 181, 616, -160, 23, 357, -211, -83, -144, -292, 509, 51, -130, 215, -341, -136, 108, -630, 315, 85, -267, 396, 46, -84, 457, -213, 77, 335, -24, -63, 249, -515, 63, -363, -547, 251, -156, -176, 544, -333, -64, 391, -422, 80, 197, -102, 474, 314, -113, 219, -159, -202, 260, -426, -55, 125, -541, 61, 122, -632, 77, 88, -140, 186, -69, 42, 586, -265]
3054b65L21L54o38N23k94k17O04m76n25R30p09J32M21n21N75m2p31O58j37k85
$$ y = [-265, 56, 410, -228, 295, 1, -216, 388, -88, -613, 317, -392, -260, 161, -360, 215, 173, -558, 100, -37, -322]
$$ [...]
8191I7
##END NTUPLES=NMR FID
##END=
