##TITLE=1H_Pr NCS-TF
 200.13MHz,CDCl3,
 8 sc
 
 27.6.2025
##JCAMPDX= 6.0         $$ Bruker NMR JCAMP-DX V2.0
##DATA TYPE= NMR FID
##DATA CLASS= NTUPLES
##ORIGIN= UXNMR, Bruker Analytische Messtechnik GmbH
##OWNER= pz
$$ XWIN-NMR		Version 3.5
$$ Fri Jun 27 13:53:18 2025 Russian Standard Time (UT+4h)  she@DPX200
##.OBSERVE FREQUENCY= 200.1313
##.OBSERVE NUCLEUS= ^1H
##.DELAY= (6, 6)
##.ACQUISITION MODE= SIMULTANEOUS
##.ACQUISITION SCHEME= undefined
##.AVERAGES= 8
##.DIGITISER RES= 18
##SPECTROMETER/DATA SYSTEM= spect
##.PULSE SEQUENCE= zg30
##.SOLVENT NAME= CDCl3
##.SHIFT REFERENCE= (INTERNAL, CDCl3, 0, 14.3821)
##AUDIT TRAIL= $$ (NUMBER, WHEN, WHO, WHERE, WHAT)
$$ ##TITLE= Audit trail, XWIN-NMR		Version 3.5
$$ ##JCAMPDX= 5.01
$$ ##ORIGIN= Bruker BioSpin GmbH
$$ ##OWNER= she
$$ F:/spectra/data/she/nmr/H-C/1/audita.txt
$$ ##AUDIT TRAIL=  $$ (NUMBER, WHEN, WHO, WHERE, WHAT)
(   1,<2025-06-27 13:51:33.10 +0400>,<she>,<DPX200>,
      <created by zg, POWCHK disabled, PULCHK disabled
       configuration hash MD5:
       00 E9 B6 7A A2 85 ED C7 34 08 36 98 17 FE 4E 26
       data hash MD5: 16K
       38 A5 72 7C 02 D3 4F BE CB 22 14 CF 29 CD AF 56>)
$$ ##END=
$$ 
$$ hash MD5
$$ 7F 8C EE 57 C1 24 98 07 B3 10 4A 94 BC 3A 73 3A
##$RELAX= 
##$RELAX= 
##$RELAX= 
##$RELAX= 
##$RELAX= 
##$RELAX= 
$$ Bruker specific parameters
$$ --------------------------
##$DU= <F:/spectra>
##$EXPNO= 1
##$NAME= <H-C>
##$PROCNO= 1
##$TYPE= <nmr>
##$USER= <she>
##$AMP= (0..31)
100 100 100 100 100 100 100 100 100 100 100 100 100 100 100 100 100 100 
100 100 100 100 100 100 100 100 100 100 100 100 100 100 
##$AQSEQ= 0
##$AQ_mod= 1
##$AUNM= <au_zg>
##$AUTOPOS= <>
##$BF1= 200.13
##$BF2= 200.13
##$BF3= 200.13
##$BF4= 200.13
##$BF5= 200.13
##$BF6= 200.13
##$BF7= 200.13
##$BF8= 200.13
##$BYTORDA= 1
##$CFDGTYP= 0
##$CFRGTYP= 5
##$CHEMSTR= <none>
##$CNST= (0..31)
1 1 145 1 1 1 1 1 1 1 1 1 1 1 1 1 1 1 1 1 1 1 1 1 1 1 1 1 1 1 1 1 
##$CPDPRG= <>
##$CPDPRG1= <>
##$CPDPRG2= <>
##$CPDPRG3= <>
##$CPDPRG4= <mlev>
##$CPDPRG5= <mlev>
##$CPDPRG6= <mlev>
##$CPDPRG7= <mlev>
##$CPDPRG8= <mlev>
##$CPDPRGB= <>
##$CPDPRGT= <>
##$D= (0..31)
0 0.7 0 0 0 0 0 0 0 0 0 0.03 0 0 0 0 0 0 0 0 0 0 0 0 0 0 0 0 0 0 0 0 
##$DATE= 1751017892
##$DBL= (0..7)
120 120 120 120 120 120 120 120 
##$DBP= (0..7)
150 150 150 150 150 150 150 150 
##$DBP07= 0
##$DBPNAM0= <>
##$DBPNAM1= <>
##$DBPNAM2= <>
##$DBPNAM3= <>
##$DBPNAM4= <>
##$DBPNAM5= <>
##$DBPNAM6= <>
##$DBPNAM7= <>
##$DBPOAL= (0..7)
0.5 0.5 0.5 0.5 0.5 0.5 0.5 0.5 
##$DBPOFFS= (0..7)
0 0 0 0 0 0 0 0 
##$DE= 6
##$DECBNUC= <off>
##$DECIM= 32
##$DECNUC= <off>
##$DECSTAT= 4
##$DIGMOD= 1
##$DIGTYP= 9
##$DL= (0..7)
0 120 120 120 120 120 120 120 
##$DP= (0..7)
150 150 150 150 150 150 150 150 
##$DP07= 0
##$DPNAME0= <>
##$DPNAME1= <>
##$DPNAME2= <>
##$DPNAME3= <>
##$DPNAME4= <>
##$DPNAME5= <>
##$DPNAME6= <>
##$DPNAME7= <>
##$DPOAL= (0..7)
0.5 0.5 0.5 0.5 0.5 0.5 0.5 0.5 
##$DPOFFS= (0..7)
0 0 0 0 0 0 0 0 
##$DQDMODE= 0
##$DR= 18
##$DS= 0
##$DSLIST= <SSSSSSSSSSSSSSS>
$$ [...]
##$SUBNAM0= <"">
##$SUBNAM1= <"">
##$SUBNAM2= <"">
##$SUBNAM3= <"">
##$SUBNAM4= <"">
##$SUBNAM5= <"">
##$SUBNAM6= <"">
##$SUBNAM7= <"">
##$SUBNAM8= <"">
##$SUBNAM9= <"">
##$SW= 18.0517328524113
##$SWIBOX= (0..15)
0 0 2 0 0 0 0 0 0 0 0 0 0 0 0 0 
##$SW_h= 3612.71676300578
##$TD= 16384
##$TD0= 1
##$TE= 0
##$TE2= 300
##$TE3= 300
##$TEG= 300
##$TL= (0..7)
0 120 120 120 120 120 120 120 
##$TP= (0..7)
150 150 150 150 150 150 150 150 
##$TP07= 0
##$TPNAME0= <>
##$TPNAME1= <>
##$TPNAME2= <>
##$TPNAME3= <>
##$TPNAME4= <>
##$TPNAME5= <>
##$TPNAME6= <>
##$TPNAME7= <>
##$TPOAL= (0..7)
0.5 0.5 0.5 0.5 0.5 0.5 0.5 0.5 
##$TPOFFS= (0..7)
0 0 0 0 0 0 0 0 
##$TUNHIN= 0
##$TUNHOUT= 0
##$TUNXOUT= 0
##$USERA1= <user>
##$USERA2= <user>
##$USERA3= <user>
##$USERA4= <user>
##$USERA5= <user>
##$V9= 5
##$VALIST= <valist>
##$VCLIST= <CCCCCCCCCCCCCCC>
##$VD= 0
##$VDLIST= <DDDDDDDDDDDDDDD>
##$VPLIST= <PPPPPPPPPPPPPPP>
##$VTLIST= <TTTTTTTTTTTTTTT>
##$WBST= 1024
##$WBSW= 4
##$XGAIN= (0..3)
0 0 0 0 
##$XL= 0
##$YL= 0
##$YMAX_a= 419558
##$YMIN_a= -400189
##$ZGOPTNS= <>
##$ZL1= 120
##$ZL2= 120
##$ZL3= 120
##$ZL4= 120
##$ABSF1= 10
##$ABSF2= 0
##$ABSG= 5
##$ABSL= 3
##$ALPHA= 0
##$AQORDER= 0
##$ASSFAC= 0
##$ASSFACI= 0
##$ASSFACX= 0
##$ASSWID= 0
##$AUNMP= <proc_1d>
##$AZFE= 0.1
##$AZFW= 0.1
##$BCFW= 1
##$BC_mod= 2
##$BYTORDP= 1
##$COROFFS= 0
##$CY= -3
##$DATMOD= 1
##$DC= 2
##$DFILT= <>
##$DTYPP= 0
##$F1P= 0
##$F2P= 0
##$FCOR= 0.5
##$FTSIZE= 0
##$FT_mod= 4
##$GAMMA= 1
##$GB= 0.15
##$INTBC= 1
##$INTSCL= 1
##$ISEN= 128
##$LB= 0.25
##$LEV0= 0
##$LPBIN= 0
##$MAXI= 10000
##$MC2= 0
##$MEAN= 0
##$ME_mod= 0
##$MI= 1.114404
##$NCOEF= 0
##$NC_proc= 0
##$NLEV= 6
##$NOISF1= 3.799351
##$NOISF2= 2.8
##$NSP= 1
##$NTH_PI= 0
##$NZP= 0
##$OFFSET= 14.38212
##$PC= 1
##$PHC0= -1193.964
##$PHC1= 4.392216
##$PH_mod= 1
##$PKNL= yes
##$PPARMOD= 0
##$PSCAL= 0
##$PSIGN= 0
##$REVERSE= no
##$SF= 200.129724274929
##$SI= 16384
##$SIGF1= 3
##$SIGF2= 2
##$SINO= 400
##$SIOLD= 16384
##$SREGLST= <1H.CDCl3>
##$SSB= 0
##$STSI= 0
##$STSR= 0
##$SW_p= 3205.1282051282
##$SYMM= 0
##$S_DEV= 0
##$TDeff= 0
##$TDoff= 0
##$TI= <>
##$TILT= no
##$TM1= 0
##$TM2= 0
##$TOPLEV= 0
##$USERP1= <user>
##$USERP2= <user>
##$USERP3= <user>
##$USERP4= <user>
##$USERP5= <user>
##$WDW= 1
##$XDIM= 8192
##$YMAX_p= 0
##$YMIN_p= 0
$$ End of Bruker specific parameters
$$ ---------------------------------
##NTUPLES= NMR FID
##VAR_NAME=  TIME,          FID/REAL,        FID/IMAG
##SYMBOL=    X,             R,               I
##VAR_TYPE=  INDEPENDENT,   DEPENDENT,       DEPENDENT
##VAR_FORM=  AFFN,          ASDF,            ASDF
##VAR_DIM=   8192,          8192,            8192
##UNITS=     SECONDS,       ARBITRARY UNITS, ARBITRARY UNITS
##FACTOR=    0.0002768,     1,               1
##FIRST=     0,             0,               0
##LAST=      2.2672688,     0,               0
##MIN=       0,             -400189,         0
##MAX=       2.2672688,     419558,          0
$$ Real data points
##PAGE= N=1
##DATA TABLE= (X++(R..R)), XYDATA
$$ [...]
1903D09m33l4M69R8k74k66K26P36j013l66M98l6j18k90j49O20K18j083Q99K68
1923C79k79l49R5L62L90q89M56M83q59K75j80k65M03J1k41Q6k25L37k99k04L41
1944a72M00l31L1M6K48N23r26k33J007l39P3l51L66M7q57M6N12J60j073O15M0
1965a68L98l02n06M96M96o44L30L89j32K61r42N47L18q06k66M95J33n5l00p0N71
1986B43m42J50M07p69N97J78m07J97J07P3j37k63L75K68o00k53N20k63l38K70
2006h7m13N58j6n56O55J12k73J9m36P94K84r30K76L50k23j37n1M54J43j066L6
2027e07N72j92j95k02K11L07n9j80L45k0J11L81m74N9K03j97L24k54m25L84j02
2048I0n37L86n2l60P6L7P18n07n79J046P7o21L99j86L32J64o55L25P03r67k16
$$ plain form
1903 409 -24 -58 411 509 235 -31 195 931 -82 -448 50 14 -104 -394 -543 77 295 -788 111 379
1923 379 100 -249 -154 208 598 -291 165 648 -211 64 -116 -381 22 33 -208 -122 -347 -10 -309 -513 -172
1944 -172 228 -103 -72 -26 222 745 -181 -414 593 254 327 -24 342 389 -468 -422 90 250 -823 -208 -168
1965 -168 230 -72 -578 -82 414 -230 100 489 357 618 -324 223 541 -265 -531 -36 97 42 -258 -328 243
1986 243 -199 -49 358 -411 186 364 -43 154 261 334 197 -66 309 577 -23 -276 244 -19 -357 -87
2006 -87 -500 58 42 -514 141 253 -20 -1 -437 357 641 -289 -13 337 114 -23 -74 380 523 -543 -507
2027 -507 65 -127 -322 -524 -313 -6 -65 -245 100 80 191 572 98 157 360 163 487 233 -192 192 90
2048 90 -447 -61 -113 -473 -397 -360 358 -149 -728 318 395 -226 173 -13 319 483 -172 153 856 -111 -327
2069c27J95L17k34l69L9N63k99m26N09K1K60l70j0M78l41m46R31m35j85M01m27
2090a55N3L10l96K49O4m50M69k77o1j33J46N13j99n98O91J78n98L0N57k32K01
2111C62o03J45N19p58O4L45j34r0k32K28M58p16m3N51J11j48L54m72K76p6P7K39
2133D57j94p91O01J58k78j15J36k8l67k78J030m1n69J80K26k4l34J28L94L78q93
2154b24R8M31k07l05O6O6N95r62q4N46l09k81L25L83l4j21j46M95l79k19M99M72
2176G05l42m28R0K51l40m40N54J36n89j7L06J51k59l19O36p6l34K95N84m81L20
2197D03l87K44L2p20K12P21n71k10L45K8n3o09M74M25o90j45P09r3l9k35J62M68
2219D71m55m41Q13l9p15L64J38j85j41l89O84O5o84K36L54k80K14l57N90N7p34
$$ plain form
2069 -327 -132 185 -49 -418 -379 184 -115 -541 -32 -11 249 -121 -131 347 6 -440 491 56 -129 272 -155
2090 -155 -102 208 -188 61 125 -325 144 -133 -194 -327 -181 332 133 -465 226 404 -194 -164 393 161 362
2111 362 -241 -96 423 -335 -271 74 -60 -150 -382 -154 304 -412 -455 96 207 59 413 -59 217 141 218 457
2133 457 263 -528 73 231 -47 -162 -26 -54 -421 -699 331 290 -279 -99 127 103 -231 -103 291 669 -224
2154 -224 -126 305 98 -207 -141 -75 520 -442 -526 20 -289 -570 -245 138 104 -17 -163 332 -47 -266 233 705
2176 705 363 -65 25 276 -64 -504 50 186 -403 -420 -114 37 -222 -541 95 19 -315 -20 564 83 403
2197 403 16 260 292 -428 -216 505 -66 -276 69 97 44 -565 -91 334 -356 -501 208 115 76 -159 3 471
2219 471 16 -425 388 349 -366 -2 136 -49 -190 -579 105 170 -514 -278 76 -204 10 -347 243 300 -434
2240d34M38L98l27j36J39J49o9m48M94J80m74j83K20Mo3r0j10O79l81k39O92l62
2262G7l52L46K01L3m40J5N62n32n13O35J09k94r8J48J77j21n03O58L10o44K68
2283D2j21M61Ol93L28L39p09o4K94m1p8m03J47K00l12j79L91J7o7K93j09J96n05
2306b67K96M70k17m98M54K06k1l63j0K86p37K22j12N43n03j5J92J11R3o60K41
2327b89O80m77J60J65j28L36n06K48J31o04Q6L17k55J41Jk66J38m6N3L32k17j67
2349a67N25j2j10l16J75Jj41N8L52k84j37k97L23L12m57k49N12P0l47j65N43j89
2371@K3k57N14K15n46k39N41Kj20kJ77k42o6k18K80l35j8L34n57M55j44j02M35
2394A30p3LK12Jo8R6k12Q6O7j94P5K12p61J35L40k03J6k40M36n2l69K57M33jl78
$$ plain form
2240 -434 4 402 75 -61 78 227 158 -290 204 384 -90 -273 -53 -49 -112 -202 -312 367 -14 -253 439 77
2262 77 -275 71 272 305 -135 -120 442 -90 -603 32 141 -153 -251 -103 74 -47 -550 108 418 -226 42
2283 42 -79 382 388 -5 323 662 -47 -111 183 142 64 -339 -192 8 -304 -483 -92 -75 -142 151 42 238 -267
2306 -267 29 499 282 -216 238 444 423 60 50 336 -401 -179 -291 252 -251 -266 -74 37 130 -530 -289
2327 -289 391 -86 74 239 111 447 -59 189 320 -284 -198 119 -136 5 6 -260 -122 -168 -115 217 0 -167
2349 -167 358 346 236 -80 95 96 -45 13 365 81 -56 -353 -30 282 -175 -424 88 158 -189 -354 189 0
2371 0 23 -234 280 495 -51 -290 251 253 133 131 308 66 0 -218 62 -273 -291 43 -514 -59 -203 -305 130
2394 130 57 60 272 273 205 301 89 175 242 48 123 335 -426 -291 49 -154 -138 -378 58 6 -363 -106 327 326 -52
2419e2K88J6O5m44k40R40p84J12k1Q5J08k34k93L82R4OR2k53J57q0k6M47k93j29
2443e7N01l26k69M92l35o7L93l35p3J49k56L1L14l45k59L45K17K7m64K35N24k45
2465A97j53l9J9o0J97k64K76k53K4J42j78M4Q8l26J90J02j92K96N0j66k8J15j95
2488a14N03j65J70j89m52L82m1o7j58Q4j06K30m56M30L75m80j75L96P3l85J35
2509a0K70K34m52q9J23J09l23J76k23L46l09m25K91K02l03L91l5m9J55k78M43
2530B44j06k50M20mk79M73l93n9L21o96l2M94l63K5K78j80M9J85k6J54n22M83
2552B16j04l46L49J24r8J04l45k8L92l28k19K01j13m9J54k20K22Q7n15L69K0P0
2574e7J44j68K76J73j89j02j23P3j21L80m01J41l42Q3K58l48L80J42m31O1J31
$$ plain form
2419 -52 236 252 317 -127 -367 573 -211 -99 -120 -35 73 -161 -454 -72 22 28 120 -133 24 -56 -82 365 72 -57
2443 -57 444 118 -151 341 6 -61 332 -3 -76 73 -183 -152 162 -183 -442 -97 120 147 -317 -82 442 197
2465 197 44 5 24 -36 161 -103 173 -80 -56 86 -92 -48 40 -286 -96 6 -186 110 160 -6 -34 81 -114
2488 -114 389 224 394 205 -247 135 94 27 -131 -47 -153 77 -379 51 426 -54 -229 167 240 -145 -10
2509 -10 260 494 42 -47 76 185 -138 38 -185 161 -148 -573 -282 -80 -383 8 -27 -76 79 -199 244
2530 244 138 -112 308 304 25 498 105 46 367 -329 -361 133 -230 -205 73 -107 -58 127 101 255 -267 216
2552 216 112 -234 115 239 141 245 -100 -128 264 -64 -283 -82 -195 -244 -90 -310 -88 -1 -516 -147 -127 -57
2574 -57 87 -81 195 368 179 77 -46 27 -94 286 -115 26 -316 -233 25 -323 57 199 -232 -171 -40
2595d0J05J30p3l85M78R7j48l6j03N2p6M1J73N7p86L64L89k60l7LK1J32j09K80
2619B69N2m86Q30p14L08j08q1j07j8k05J86P1k23n9LM42k77j40M5N35k60L2K95
2642C90m6k16m4L4J32j3n89M75k29L6k74K7M47k42m7K9j6J13l21L26L63l61N1
2665B5p3M59n67J52K9j54O90n32q1M0j61J2K79m29j4L94j08J5l5K83p7k98Q2K52
2689A83k10K88k12J69p1k09j30L41j77p8K74n27K38j41m2K22J84j69K15r7p1J04
2711H4j43K54p0j11P8P3k26M1l0l6kK64m05K61l24J21K42k01K62j30J98j03J24
2734B21l39K25p8Q5j28n4K94k13j94J08N3j02j04%L30L0j51q2K55l07K32M4r5
2757C0J18j07K91l6m30J73J3j2l42K56m55J30J98J82Q5o4l5J62R4j89j16K54l2
$$ plain form
2595 -40 65 195 122 -263 215 312 164 128 25 77 1 42 215 272 -514 -150 239 -21 -58 -55 -34 98 -11 269
2619 269 321 -165 665 -49 259 151 70 -37 -55 -260 -74 -3 -226 -285 -282 160 -117 -257 -212 323 63 95 390
2642 390 344 128 84 118 250 237 -352 123 -106 -70 -344 -317 130 -112 -159 -130 -146 -33 -354 -28 335 -26 25
2665 25 -48 411 -156 -4 25 -129 561 29 -52 -12 -173 -161 118 -311 -325 69 -39 -24 -59 224 147 -151 -69 183
2689 183 -27 261 49 218 147 -62 -192 149 -28 -106 168 -359 -121 -262 -304 -82 102 -67 148 51 -20 84
2711 84 -59 195 125 14 92 165 -61 -20 -50 -86 -88 176 -229 32 -292 -171 71 -130 132 2 200 97 221
2734 221 -118 107 29 114 -14 -68 226 13 -181 -73 -20 -122 -226 -226 104 134 -17 -99 156 -151 81 125 30
2757 30 148 41 332 296 -134 39 52 40 -302 -46 -501 -371 -173 9 94 30 -5 157 251 62 -54 200 168
2780A68j91j1j08P0p1K88n0j02j23L4J64n35M46P9Om08N06l75L65K4o8j10K53
2803B51m07J20M07o79M26q1R5p9k16k9M69l71k38K69J7M6J6O2O5L69n84K16Q0
2826B24k38K30m94L84j14j99j64K92j80L20k15J41R4j96k07O42o58K60J69j19
2846b8K18P0j96K1M5k18M13m48j37K87J1j99L8J1K32n63J40M57k5J31m80J91L89
2869C60l08j9J2l2j87P6J05k57M08l08J43j29j18K27K14j51Q2j55j79n1L42P1
2891A46L07o12L52k77j81M95n05M63k75r1k10L37J85j45o1k2K04p6j8j28L12l07
2913a07K43R2l30K61m54O00j09o70M18n7K73j20j00j21J07M3k6k3q4O31l78j61
2935g2K65k79K45j46Q3j47J97k66J71l7l78L48j81JJ18L72n23N41n54N00k25J3
$$ plain form
2780 168 -23 -34 -142 -72 -143 145 95 -7 -130 -96 68 -467 -21 58 64 -344 162 -213 152 176 108 -2 251
2803 251 -156 -36 371 -308 118 37 132 53 -163 -192 277 -94 -332 -63 -46 0 16 78 143 512 -72 144 224
2826 224 -14 216 -278 106 -8 -207 -371 -79 -259 61 -154 -13 81 -115 -322 320 -338 -78 91 -28
2846 -28 190 260 64 85 130 -88 325 -123 -260 27 38 -161 -123 -112 120 -443 -303 154 129 260 -220 -29 360
2869 360 52 33 45 13 -174 -98 7 -250 158 -150 -7 -136 -254 -27 187 36 118 -37 -216 -267 75 146
2891 146 453 -159 193 -84 -265 230 -275 188 -87 -178 -388 -51 134 -11 -72 -94 110 34 16 -112 200 -107
2913 -107 136 228 -102 159 -295 305 196 -474 -56 -113 160 40 -60 -181 -74 -31 -57 -80 -164 467 89 -72
2935 -72 193 -86 159 13 96 -51 146 -120 51 14 -364 -16 -197 -196 -78 294 -229 312 -242 258 33 46
2957D6J03O0k61rj37L29j35k39K64K8l07J54Q6J7k54J14J63J95l34J17J78k38
2979f0K54K50n95K36l2k6p7j99o3k7K03O7j00k77N37k00M0Q3j37P1O7K24m98M55
3003A96k11J50j39j30K0r8O5K45l52M23j99j45J68j94J78j44L59l59K31j78J47
3024C3K89j49k58J53j16j1K60k28J9j27j29L01j76p8L79m00l5J13K84j49K01o0
3046A16p3Q6j95Q4R7j63K06n37Q6K17j32K07n2j48K72j82k27N26l41L40O8m22
3068a67R9oj57M48j13j24K09j41p1J49M9m96K58k40L62n6m75J82O33j80j10J42
3090A95l2J66o83J92J44j96J13N2j27L11m23J74J10k49L7K5m6K69j42J19O8Mj94
3113a13L00j12R7J00n5j43l42M45j54j30p2M04m31P3J87J00l93P1o9L37O0J61
$$ plain form
2957 46 149 209 -52 -61 -198 131 -4 -243 21 49 -258 -104 -18 -1 -255 -141 22 217 -117 0 178 -60
2979 -60 194 444 -151 85 53 27 -50 -249 -312 -339 -136 -69 -169 -446 91 -109 -69 14 -123 -52 15 239 -259 196
3003 196 -15 135 -4 -134 -114 -212 -147 98 -254 169 -30 -175 -7 -201 -23 -167 192 -167 64 -114 33
3024 33 322 173 -85 68 -48 -59 201 -27 -8 -135 -264 37 -139 -217 162 -238 -273 -160 124 -25 176 116
3046 116 43 129 -66 18 115 -48 158 -379 -293 -76 -208 -1 -53 -201 71 -111 -338 188 -153 187 255 -167
3068 -167 -68 -74 -231 217 104 -20 189 48 -23 126 175 -321 -63 -303 59 3 -472 -290 343 163 53 195
3090 195 163 329 -354 -162 -18 -214 -101 -49 -176 135 -288 -114 -4 -253 -216 -191 -237 32 -110 9 77 81 -113
3113 -113 187 75 172 272 217 74 -268 177 23 -107 -179 225 -206 -133 54 154 -239 -168 -237 100 160 321
3135C21m19P7L10j97j42J18J22m07K61j22K40J19l08L8J1M0m1N9J31J0j06J81
3157B96J48k19k64J65J10j75J66j49Ok98K63l1j0k98N09j14k74K61k25r1O3J32
3179b9M07k78j34N8k14J81J20k19J09J31m2j44j67k23O34k35k78L07j07n0K32
3200E9m1j09K67p3n6j36J70j02o0L3L77m65j96P43o92j49K55J74l0J15k57M26
3222B53j26l47M15k69J89J30m53L32R1l91M58k28k92J81P6j06P9m01K05O7m9K97
3244A11q2j11O20m22m41L63p6Kq6m5K73j86k21M56j57j74R0R1P7m0j24K29K7q4
3268I0j28K46k37O7j57Q9O7k35R6K62K1l01p3j33L34k69P2J55L7j36K24k42K17
3291F6J26rm6k23R5j7k28L42Jr1J43l59L37o20K13K2M14k33j5m9J37J77K43m32
$$ plain form
3135 321 -98 -21 289 92 -50 68 190 -217 44 -78 162 281 -27 11 22 62 21 80 211 221 115 296
3157 296 444 225 -39 126 236 61 227 78 84 -214 49 18 8 -290 219 105 -169 92 -133 -224 -161 -29
3179 -29 378 100 -34 24 -190 -9 111 -108 1 132 90 -54 -221 -444 190 -45 -323 -16 -123 -173 59
3200 59 18 -91 176 103 47 -89 81 -21 -81 -48 329 -136 -332 411 -281 -430 -175 -1 -31 84 -173 253
3222 253 127 -220 195 -74 115 245 -208 124 215 -176 282 54 -238 -57 19 -87 -8 -409 -204 -137 -186 111
3244 111 29 -82 538 116 -325 38 -38 -36 -122 -167 106 -80 -301 155 -2 -176 -86 5 82 42 -82 147 174 90
3268 90 -38 208 -29 38 -119 -30 37 -198 -102 160 181 -120 -193 -326 8 -261 -189 -34 3 -133 91 -151 66
3291 66 192 183 137 -86 9 -8 -236 106 107 16 159 -200 137 -483 -270 -248 166 -67 -82 -131 6 183 426 -6
3315fJ39J59k26M2r0N4j57k05N5L98l81J13j55K12n6j4j10L14J6j27m6k37N16
3338B08l08j1J79l75M22l2q6j54N32m50m9o6K39p0l1k19L27O2l46M12k90J7K41
3361A52n2j82M85n45L14j15L17n87r8K05J73n4k95M41k71j3M19k68J9J12k24K18
3383A51j56j7J34j45j59K28j08j35p1L6J12j09J57K4L9o2O2O0r0R8K41l67M12
3406C35m42l7L14k21N9j32O1J28l17J78p8J00j09j94N46k44o4J27r9J85P2ql66
3429b06L47j27r9J20L1j75N8j00j16L61j84L68k02k65J15L11l81Q5J94j85J11
3450F1K6l4J82k71l5J28l5n0j65n9L78j38NP2j14J72l25K29O1j18j71M89k34k65
3474b11L09l20J28L16m14M6J13l55N68l98J79L2l83N15k8k20J59K09k78Q4J3l5
$$ plain form
3315 -6 133 292 66 108 18 72 -85 -290 -235 163 -218 -105 -260 -48 -104 -118 -228 86 102 -25 -71 -308 208
3338 208 -100 -111 68 -307 115 83 -3 -157 375 -75 -124 -190 49 -21 -52 -271 56 118 -228 184 -106 -89 152
3361 152 100 -82 403 -142 172 57 374 -213 -311 -106 67 13 -282 159 -112 -125 294 26 45 157 -67 151
3383 151 -5 -22 112 -33 -192 36 -72 -207 -278 -242 -130 -239 -82 -58 -19 -81 -19 41 -49 49 290 -77 335
3406 335 -107 -144 170 -51 8 -124 -63 65 -252 -74 -152 -52 -161 -355 191 -53 -117 10 -89 96 168 160 -206
3429 -206 141 14 -85 35 66 -109 -51 -151 -267 94 -90 278 76 -189 -74 237 -144 -59 135 -50 61
3450 61 87 53 235 -36 -71 57 22 -28 -193 -252 126 -12 -7 65 -49 123 -202 27 88 -30 -201 288 54 -211
3474 -211 98 -222 -94 222 -192 -146 -33 -388 180 -218 -39 -7 -390 125 97 -123 36 245 -33 51 64 29
3496B9L25l50J00L49l04j76k32n7M33l82J33J36J70m93L36k6JJ33o0j31J62L6
3518A32j72J66K1k63J95j85M1K25k54K57l35J52j2j71J71p2N2J4O7j83K53K8J18
3541B45j11p2j10K1L6q5j19n5K48j34K50l92J73K24k37M6J98j4J21k39Q5k89M60
3564B50j71J34l75L31n0k73p8J47J33j66l7J17J19nm6J09j10lJ79j21K0K9l59
3587b26K5L1K18j13l9MO56q22J69J76p2l79K28L1J89L14l27J36k88L96k0j44j77
3610c4J07j75j33K66q2L4Q9l46K39k72J84J90l02O29n95N8N2M13m13n8L3K28J92
3633C04l76j7j40N50o97K06J40J93l50j59M99k3k11L06j09P6K5k37q9L09n0J23
3655B73j09j96L54l47j20M93m90m9L15j78M0k3l11M38l0m4K27l66J84o2o1o2J30
$$ plain form
3496 29 354 4 104 453 149 -27 -259 -316 117 -265 -132 4 174 -319 17 -9 -8 125 65 -66 96 132
3518 132 -40 126 147 -116 79 -106 -65 160 -94 163 -172 -20 -32 -203 -32 -104 -52 -38 29 -154 99 127 245
3541 245 134 62 -48 -27 9 -76 -195 -250 -2 -136 114 -278 -105 119 -118 -72 126 112 233 -6 79 -210 250
3564 250 79 213 -162 169 119 -154 -232 -85 48 -118 -155 -38 81 76 30 139 29 26 205 84 104 133 -226
3587 -226 -201 -170 48 -65 -104 -100 556 -266 -97 79 7 -372 -144 -113 76 390 63 199 -89 307 287 143 -34
3610 -34 73 -102 -235 31 -51 -17 72 -274 -35 -307 -123 67 -235 394 -201 -143 -91 322 -91 -149 -116 112 304
3633 304 -72 -89 -229 321 -376 -170 -30 163 -187 -346 153 130 -81 225 116 192 217 -20 -109 200 150 273
3655 273 164 -32 322 -25 -145 348 -142 -191 124 -54 -14 -37 -348 90 60 16 243 -123 61 -1 -62 -124 6
3678Fq4J91m14K80Q8N2j14k71K33Q1L04m06o2J48J19k5p6k55L23k15J17K12l29
3701i7j26M67l67K48m94K30K01q9j80L46k21j16J86k58K11J80jPm92L19K8q6Q5
3724a9j0j54K92m33L54O0j52RJ48k14p8K24j2l5o6o8J05p7R4P9m16N21j47J24
3748A29j80j20Q0QM2J87j59K42j68J9j63K48q5J28l00K27J74k79j10P8P2L1k02
3771a01J71j89j66M93l22m2L2R3j41K15K9k0nK01K4j86j94L70l62Q1q5pJ29k04
3795a86q8K85k23L9J39J23j76J14j96M33j53k44j1J45j61K02J11j42J02l11N3
3816a45k3k03J59rQ1J48L7P5Q9m5p3J6j63J45J47p2r6P6j78J05J90o47J00OL64
3841H4Q1l26m3J61K39k67J71K13q5k49l7J60m32L86J65k73J49P9j43l0l26L70
$$ plain form
3678 6 -78 113 -301 -21 67 119 5 -266 -33 48 352 -54 -116 32 151 126 50 -205 118 -97 20 232 -97
3701 -97 -223 244 -123 125 -369 -139 62 -27 -207 139 -82 -198 -12 -270 -59 121 120 127 -365 -46 -18 -104 -19
3724 -19 -29 -183 109 -324 30 90 -62 -53 95 -119 -197 27 15 -20 -86 -154 -49 -126 -32 47 -369 152 5 129
3748 129 -51 -171 -91 -83 -41 146 -13 229 61 80 -83 165 80 208 -92 135 309 30 -80 -2 70 101 -101
3771 -101 70 -119 -285 208 -114 -156 -124 -31 -172 43 72 52 47 248 272 86 -108 262 -100 -19 -104 -111 18 -186
3795 -186 -274 11 -212 -173 -34 89 -87 27 -169 264 111 -133 -144 1 -160 42 153 11 113 -198 -145
3816 -145 -168 -371 -212 -221 -140 8 45 120 209 164 91 107 -56 89 236 164 68 144 -34 71 261 -386 -286 -280 84
3841 84 165 -161 -204 -43 196 -71 100 313 228 -21 -58 102 -330 56 221 -52 97 176 33 3 -323 47
3863D7k70J02p5K94r6Q6N2k09m6L25q2j49j12M7L7K4j61j46K22K51q8j95L71k69
3887d0j92K92R0K2Ml08L4L36l26N4L1J29R5j02j12Lk63j28L73k06J70j94J65L7
3911c6R3J0P7k26n4M01l02Q9J72ml6k17m7J79j71j44K14Pn7r3K66k49j22M09k60
3936a01K41q4J81k00kJ35K7N3l25K20L2l0k64M3l4N7NL06p2l67l42L95J84r0k7
3961e9J01J13j58k22J36J20j10K79l45J25J98n7k47J88k38J34N4Q0r5l7m4n1J9
3984a16J0K49j45J64k92L39j20l28M57j14j44N%j8rK06k0k7l3l7l36M28L7k52
4008i6M29k03q9j89J64l7j27j6J36L7k45L65k75J06j87J80Q9pq8M43m03r8K96
4031A85m45M25j9q7j49L95l68j24K33q9N0l34J07L93k01p1R5Pq4J29P2k2J4J27
$$ plain form
3863 47 -223 -121 -196 98 2 88 140 -69 -115 210 128 -21 -133 -86 -49 -25 -186 -332 -110 141 53 -142 229 -40
3887 -40 -232 60 150 172 176 -132 -98 238 -88 -34 -3 126 221 119 7 10 -253 -381 -8 -214 -44 -238 -73 -36
3911 -36 57 67 144 -82 -136 265 -37 52 224 220 184 -33 -80 99 -72 -216 -2 5 -52 -145 121 -128 -250 159 -101
3936 -101 140 56 237 37 35 170 197 250 -75 145 177 147 -117 -74 -108 -51 -46 260 188 -179 -521 -126 58 -32 -59
3961 -59 42 155 -3 -225 -89 31 -79 200 -145 -20 178 121 -126 62 -176 -42 12 92 -3 -40 -84 -135 -116
3984 -116 -106 143 -2 162 -130 209 89 -239 218 104 -40 -35 -35 -53 -62 144 124 97 64 27 -309 119 156 -96
4008 -96 333 130 41 -148 16 -21 -148 -164 -28 9 -236 129 -146 -40 -227 -47 42 35 -53 390 -13 -111 185
4031 185 -260 165 146 59 -90 305 -63 -187 46 -43 7 -327 -220 173 -28 -99 -4 3 -81 48 120 98 112 239
4055B39j87q6K39k65J21o8O5P7n4m12K87N4j84J69j64O5K17k1j44K41k0k18Q3
4078C4JrN9j71K3j19Q9k12J0P1K76j64J20o6n2J52r4k69Q67k69l78K02j3l3p0
4103a5K31m90K99j81JP8K11k3j74j46L55k75JJ08j97L61J77l30j2R4j1J22q1m0
4127F3K1j73%o4J40k66K00P5O2k2K21k75J7NK40m23J5jo2Q1J51k51L10O8k62j18
4153b48J37k6O3k15K55J81j65o4K13j91L9pj9P5l08K23L04j28N2l23J36n3R2l6
4177a3J51k49J06j64Q7j08Mm8L17j12J36m4k27K8L34l53K44N2k81K57l30K00j78
4200a91L84m66J89j67m3M02J3l02J61K34R7l14j77J22j74L34J19l65M5K40k36
4221i5J94J55k25K5O9p1K14k83J31k64L59l57J64J48j22j95J8K8r4j7J65k33K04
$$ plain form
4055 239 52 -34 205 -60 61 -7 58 135 81 -331 -44 10 -174 -5 -169 -104 113 92 -52 189 169 -49 34
4078 34 35 26 85 -86 -63 -182 -93 -305 -295 -224 52 -112 8 -58 -110 42 -52 -321 546 277 -101 101 88 55 -15
4103 -15 216 -274 25 -156 -155 -77 134 111 -63 -209 146 -129 -128 -20 -217 144 321 -9 -21 73 62 184 103 63
4127 63 84 -89 -89 -153 -13 -279 -79 -4 58 36 257 -18 -1 4 244 -179 -164 -165 -227 -146 5 -246 64 132 -130 -248
4153 -248 -111 -137 -74 -289 -34 147 -18 -82 131 -60 -21 -28 -47 28 -280 -57 247 119 171 -152 -16 -69 23 -13
4177 -13 138 -111 -5 -169 -82 -190 -186 -234 83 -29 107 63 -164 -136 198 -155 89 141 -140 117 -213 -13 -191
4200 -191 193 -273 -84 -251 -294 108 121 -181 -20 214 311 -3 -180 -58 -232 102 221 -144 -99 141 -95
4221 -95 99 254 29 54 123 52 266 -17 114 -150 209 -148 16 164 42 -153 -135 -107 -201 -218 -53 -286 -82
4244h2N40m36Q8l6qJ2j82J81j01K18k15J04q6J41m52mL61j00J68k26J05k1M2J23
4268A34k94KL15K9j68j03J97r0J32k7j81L5m0J5J91k41J03m4jK29j96j10J35M4
4292F6k46L79M7l73K94l3L0l47J78j12M50n18L32j53k8j05J33K9L8M5m9k34K7
4315a50j96N07j71K8M4M6O6k14K64k21J51q7r7k73M22J54m06KL21J02k86J41R7
4338B44o0n23L09J54k3L21j53l60K15R9k5n4j86J51k88J43k47J63J40l73M0P4
4360b39N39m19M09m4o8j44m6J16L6r2J03M1q4m62J58K65l07K62k60N38m54L16
4382A64j87K97l29K47j29k58K04j9K0L2p7J46k38kP5j71J05J75j96k5J99l30M81
4405A84j35Q2l80N64k51j85J9J31J5J64K5j71L8l68L63l29L6J64O8k33J50K06
$$ plain form
4244 -82 458 22 110 74 66 78 -104 77 -24 194 -21 83 -3 138 -314 -318 43 -57 111 -115 -10 -31 11 134
4268 134 -160 -158 157 186 18 -85 112 22 154 127 -54 -19 -59 -44 147 -94 9 -35 -36 193 -3 -113 22 66
4292 66 -180 199 246 -127 167 134 164 -183 -5 -117 333 -185 147 -6 -34 -139 -6 23 61 106 57 -177 -150
4315 -150 -346 161 -10 18 62 108 174 -40 224 3 154 67 -30 -303 119 273 -133 -131 190 292 6 147 244
4338 244 184 -339 -30 124 101 422 269 -91 124 223 198 144 -42 109 -179 -36 -283 -120 20 -353 -313 -239
4360 -239 300 -119 290 246 178 34 -12 104 140 48 151 192 108 -354 -196 69 -238 24 -236 302 -152 164
4382 164 -23 274 -55 192 63 -195 9 -10 10 42 -35 111 -127 -129 -54 -225 -120 55 -141 -166 33 -297 184
4405 184 49 131 -249 315 64 -121 -102 29 44 208 233 62 100 -268 95 -234 -198 -34 34 -199 -49 157
4427A57O9l57J80K69j19j74R2k87P8K82j47j15k7K53j7k30r5J47r3J53k29J54
4449e6o9M19l68k4N6K93j35k56K12K90n45M66j03m05J39n9L01q8Q8k25j7K13J96
4472C23l35r7K03j02l7l3k4K04J13m7k29K44k2l24J6jK96l8l95L90j04J30l7q7
4496Gk09L65l34N46k34O2l55L71o1k62J06J34m01K85k92P1L63j88%m2m5J22lo1
4520e5k26K35J75l78N06l67k26J84p1M51l26r1q6J44j27L26r1o8j69J19j6L41
4542A84k23J38LL3J94k98j03k98K51J19j98K28j25j24R7J29k07J90N2r8J81j8
4564A07k54M76k07l21n3K63j04J80j41Oj06O0J46K2K6r3P6o8K8p6K9k03K46J21
4588A60l59K58o5QL0N3j1j63J19j98J01O0q2l1%J82K0O0k03P8j29j62K20J75k20
$$ plain form
4427 157 226 -131 49 318 199 25 117 -170 -92 190 43 -72 -99 154 137 -93 -188 -41 -134 19 -210 -56
4449 -56 -125 294 -74 -98 -42 251 116 -140 72 362 -183 283 180 -225 -86 -145 156 68 156 -69 -86 127 323
4472 323 -12 -109 94 -8 -45 -78 -102 102 215 168 -61 183 161 -163 -147 -148 148 110 -285 105 1 131 94 7
4496 7 -202 163 -171 375 141 203 -152 219 158 -104 2 136 -265 20 -272 -201 162 -26 -26 -68 -113 9 6 -55
4520 -55 -281 -46 129 -249 257 -110 -336 -152 -223 228 -98 -189 -275 -131 -258 68 -23 -91 -260 -141 -157 184
4542 184 -39 99 102 135 329 31 -72 -370 -119 0 -198 30 -95 -219 -122 7 -200 -10 42 -56 125 107
4564 107 -147 329 122 -199 -252 11 -93 87 -54 -48 -154 -94 52 74 100 7 83 15 43 -33 -4 -207 39 160
4588 160 -199 59 -6 2 32 85 74 -89 30 -168 -67 -7 -89 -120 -120 62 82 142 -61 17 -112 -274 -54 121 -99
4613i9K91j27j31J48k7k7J38l08J22k1N4R2k86O7J21K01P8m85J10K79L1j59J84
4636B46k68K12q9M3q9Or2k51P9K16J16O8r2j81O0K20k41R1J51k45J96M2k49j05
4660a56J67J41j12k6Nj56J64l37N04l09K38k90M81k34j0J68o2Mk72K23q0j83K34
4683A02m0k49K18j78J86J73l80j05K91J19j98j60j07N90l88j06K67o3k4k0j0J30
4705D8J72k82l4P5J29R9l71J9J61M6o7J66j79o9J94M1k85n3M00k3j85j65Q5j26
4729b04K60k1J3M7j06l1k12j03L91l08K94Q6k92J17j55K47K32J6j01j88J47N9
4751A88l07K79j07Mj29j42K21Q1j57n7P4J42j50K38l22O7L21J68m82J11L9k08
4773a28K57K12m03J58n7n3j5K14n62K71j4k57O83j41k48K55j51m9K11j37O6k11
$$ plain form
4613 -99 192 65 -66 82 55 28 166 -142 -20 -41 13 105 -181 -114 7 208 286 -199 -89 190 221 62 246
4636 246 -22 190 101 144 55 61 -31 -282 -203 13 129 197 105 -76 -16 204 -37 54 205 -40 156 198 -51 -156
4660 -156 11 152 40 14 19 -137 27 -310 194 -115 123 -167 314 80 70 238 176 180 -92 131 51 -132 102
4683 102 62 -187 31 -147 39 212 -168 -273 18 137 -61 -221 -328 262 -126 -232 35 -28 -52 -72 -82 48
4705 48 220 -62 -96 -21 108 207 -164 -145 16 62 -5 161 -18 -87 107 148 -137 -190 210 187 2 -163 -78 -204
4729 -204 56 35 48 95 -11 -42 -254 -357 34 -274 20 106 -186 -69 -224 23 255 271 170 -18 129 188
4751 188 -119 160 53 57 -72 -214 7 88 -69 -126 -52 90 -60 178 -144 -77 244 412 -70 41 80 -128
4773 -128 129 341 -62 96 39 -14 -29 185 -377 -106 -120 -377 306 165 -83 172 21 -28 183 46 112 -99
4795i9o7K64k10QK62J38j54k10L23k77J08K21J11l40M0N8j73jP8L1l7K0m3P1k03
4820h1N9K6k41L43q7j60m2K43J6K2o3k8L28l10k50L88j59L4o7N5K12m88Q7L84
4844B21n3j81l43K13O9M1m7L02k26k00M77k44J32q3q7k32K49K9K09k82R5K23l32
4867e0m9L3K37l37N19k21j9m1q8m9J01K5k27J78J63j00k8p9J31j03n5K9J81j67
4891a6M5k68J78o7J02Q5k27J12p1K22O1k19j77L47n7j17K72k23K72k59j18O3j32
4914a92l8K32P5l38K96k61L17Q5k25j10K31Lj61j2L19J41j14l96O9L75k87k0k23
4937b34J32K46pj16j47K75J59o25K06N3L03j33j91J65Q3p7J4r9M4j2j02O6J25
4960A28L1p1j31Q0j1q1L43l47K35k56m9K12j74N3K45k8k71r0J52j9J45k42r0K69
$$ plain form
4795 -99 -166 98 -112 -104 158 296 142 -68 255 -22 86 307 418 78 118 176 3 2 80 111 74 94 51 122 -81
4820 -81 -22 4 -237 106 19 -141 -183 60 76 98 35 7 335 25 -225 163 4 38 -29 26 238 -250 -163 221
4844 221 168 -13 -356 -143 -74 -33 -80 222 -4 -204 273 29 161 78 -9 -241 8 37 246 -36 59 282 -50
4867 -50 -99 -66 171 -166 353 132 113 72 -16 -65 36 61 -166 12 175 75 47 -32 99 -4 -59 -30 151 -16
4891 -16 29 -239 -61 -128 -26 59 -168 -56 -127 95 156 -63 -240 107 50 -67 205 -18 254 -5 -123 -60 -192
4914 -192 -230 2 77 -261 35 -226 91 176 -49 -159 72 75 -86 -98 221 362 248 -148 -79 296 9 -11 -234
4937 -234 -102 144 137 21 -126 149 308 -317 -111 -58 245 112 -79 86 169 92 106 7 51 39 -63 3 128
4960 128 159 88 -43 37 26 -55 288 -59 176 -80 -129 83 -91 -38 207 179 -92 -182 -30 -49 96 -146 -236 33
4984C3j07J30k69M41l45j38J59J34J4q0l40L38K00j22l66M63m33J11L86k15O8
5005F2ok46L24n6n9k89M09l99K25k71K95K64k27l15J67rp6K2R6p3K42n9R8j29
5029a0o5K5n8M3J06K58k78Q1j60J7J1J7P6j7j83l2k3K47j50J67J38l91L7K81k12
5054g5L8M6K19k8j34J14k00J8k2q9J58j5Rk00L76j30L7J45n23oJ8M97m07K78p5
5079D9J22p7J41j54m1J14r9N7j98j3J38j01J73j38O2j69n9L19m28K99j8m4R4R
5103C8J32j50M7o6n6l28O52m96K10p0J29r4J89j69P8K6j26K4j45J25Mnn5K69M
5128A67k60j2J39l8L5J07q8j1j76K92L8m56M27l95K73j76J38q8J29k53M02l37
5150a43J15K73k91K13O2l16o5MJ26r4R9l5J60m26M43P0k06J28R5m05K79l0K9l91
$$ plain form
4984 33 -74 56 -213 228 -117 -255 -96 38 52 -28 -368 -30 170 48 -318 145 -288 -177 209 -6 62
5005 62 56 -190 134 78 19 -270 139 -260 -35 -306 -11 253 26 -289 -122 -131 -207 -185 -89 -162 80 21 119 -10
5029 -10 -75 -50 -108 -65 41 299 21 102 -58 -41 -30 -13 63 46 -137 -169 -192 55 -95 72 210 -181 -144 137 -75
5054 -75 -37 9 228 200 66 180 -20 -2 -24 -113 45 30 39 -161 215 85 122 267 -256 -262 -244 253 -154 124 49
5079 49 171 94 235 81 40 154 55 112 -86 -99 39 -62 111 -27 35 -134 -193 126 -302 -3 -21 -65 29 38
5103 38 170 20 67 1 -55 -383 269 -227 -17 -87 42 -52 137 -32 46 72 -54 -30 -175 -50 -46 -51 -106 163 167
5128 167 -93 -105 34 -4 31 138 50 39 -137 155 193 -263 164 -231 42 -134 4 -84 45 -208 194 -143
5150 -143 -28 245 -46 167 229 -87 -152 -148 -22 -116 -17 -52 108 -318 125 195 -11 117 212 -193 86 56 85 -306
5174c06M85J5m1j16k12L98j05j62r8m7K41p7k53L64j94K42n8j71M67l29q8k93
5196c38M32m62L08N5k8j35J69j7q7K08l25J64N6m3o0J45j25K74k70L0l4L1K71
5219B19m70K28J13J57j15K32o12L36o8n7q9O7j1L59l25K6j28P3J69J65m31K59
5241I7M2r1P5LK07k93k23N2K67J45k91J97k94M6J31m4J53k06M3K71j78J0J3j50
5265a8J89j25J6l10L28k02J02l7m1K18m08N26j56k15m8O35m44o7J6j84J46R0n0
5288c9k10M26m31L44J3j20k36K50k6Q4J27j6p1j37j11k4N6M5N7L19j79r5j65K71
5312A32l50M2L22l66K94o1J54j97l6J47J43m18M63l04j98L48k34P5p9J17M4J60
5334A98k74J3M6J18j07Q2l63J62J18o2Rj05M49m24J49J5j59K2J93k14Q8r5K51
$$ plain form
5174 -306 179 194 153 37 -175 223 118 -44 -142 -189 52 -25 -278 86 -108 134 76 -95 372 43 -45 -338
5196 -338 94 -368 -60 -5 -33 -168 1 -16 -103 105 -220 -56 0 -43 -103 42 -83 191 -79 -49 -83 -52 219
5219 219 -251 -23 90 247 132 364 -248 88 20 -37 -126 -59 -70 289 -36 -10 -138 -65 104 269 -162 97
5241 97 139 48 123 126 333 40 -183 -131 136 281 -10 187 -107 -61 70 26 179 -27 16 287 109 119 132 -18
5265 -18 171 46 62 -248 80 -122 -20 -57 -98 120 -288 238 82 -133 -181 454 10 -57 -41 -225 -79 11 -39
5288 -39 -249 177 -254 90 103 -17 -253 -3 -29 55 182 166 95 -42 -153 -177 -121 -76 -19 300 121 26 -139 132
5312 132 -218 -176 146 -220 74 13 167 -30 -66 81 224 -194 269 -35 -233 115 -119 -44 -123 -6 38 198
5334 198 -76 -63 -17 101 -6 76 -287 -125 -7 -69 -60 -165 284 -140 9 24 -135 -113 80 -134 -46 -141 110
5357A10J34n4J1l30J00p6O6j35J85M3J16k08Q4M3k61L77l4k19j27JL01k89K02
5380D0j11k5M07k36j47K02j63O4k59K52L0j9O0j42n5q3L82k46j67M01r7j9o7J80
5404A82j44j35J40J70j5l00j04K09L6l6R0l7J76k46J2N3N5k42L06l21J24MJ52
5427A29j29j40M8L51k47j96K41K7j53J40K16K9k34J3K7r5p5j64r8N28k60J56j74
5450f0m13N58j81l06M87k29L1j14J8J02J00j30K72P2o6l22L22k39M42l98J8K53
5472B17k43J76j05j9k11J40J28J62l57j18J47k6qj70M11k49N1j40J32K40k16J13
5494E5j07N5j00J05L5k79L9K43M9j54R1J11k12J95o0j07J60k28o3L32m22n0L14
5517BJ28j19K6j17l5J58J6k69K3K72J08Lk28J38ok83L43j85L93j60m05L38k04
$$ plain form
5357 110 244 190 201 -129 -29 -105 -39 -174 11 54 170 -38 46 89 -172 205 171 -48 -175 -174 127 -162 40
5380 40 -71 -96 311 75 -72 130 -33 31 -228 24 54 35 95 -47 -102 -185 197 -49 -216 185 88 69 2 182
5404 182 38 -97 43 213 198 -102 -206 3 39 3 93 56 232 -14 -2 51 106 -136 170 -151 -27 -23 129
5427 129 0 -140 -92 259 12 -184 57 84 -69 71 287 316 82 95 122 27 -48 -212 -310 218 -42 114 -60
5450 -60 -473 85 -96 -402 85 -144 -113 -227 -209 -107 -7 -137 135 207 141 -181 141 -98 344 -54 -36 217
5472 217 -26 150 45 26 -185 -45 83 245 -112 -230 -83 -109 -117 -287 124 -125 -74 -214 -82 158 -58 55
5494 55 -52 3 -97 8 43 -236 -197 46 95 -59 32 143 -69 126 66 -41 119 -109 -172 160 -262 -312 2
5517 2 130 11 37 -80 -115 43 59 -210 -187 85 193 196 -32 106 100 -183 160 -25 368 208 -197 141 -63
5540f3K1j8k1j82J70l1J42k7K4j32J4K83j4k38l4K35k03K9J94k23j40J59r7l4
5564a86K29Nj93M20j89o4j73M06m65J19K10k04L1L12o95K81L6L23j80j7M0K8p6
5587bK03j57j57J85k42P0j92K52r1O3k8J55l0ML7j28j26L88j25j22O5j45k7L99
5611B49j53n6J15j91J49j35J45Pl67L82j79j91N5L54n49J92P0J68j96j67K96j03
5633a05O2k90N15m20K57r5K01K38k62k13Q7j08N7L37j30l07O7K5k21P1M50J16
5655C32k96l00J73j74N40J41m34J93r6n7J45q7j67j01K01L08k57n8l30L73j04
5676e5j0K7J2K78j30k23J1nJ76l0r1j43N7J06K6J51K4j13k6j09j39K58p1k27J61
5701h5J94j2P2k76M1J18m8oN1j55M61l25R8q0l9J31j62O3p0o2r5K47O3P2j56K09
$$ plain form
5540 -63 -42 -60 -81 -263 -93 -124 18 -9 15 -117 -103 180 166 -72 -106 129 -74 -45 149 -74 -214 -55 -152 -186
5564 -186 43 48 -145 275 86 22 -151 255 -210 -91 119 -85 -54 258 -437 -156 -120 203 23 6 46 74 -2
5587 -2 201 44 -113 72 -170 -100 -292 -40 -131 -68 -96 59 29 33 70 -58 -184 204 79 -43 22 -123 -150 249
5611 249 96 40 155 -36 113 -22 123 130 -237 145 -34 -225 -170 184 -365 -173 -103 65 -131 -298 -2 -105
5633 -105 -43 -333 182 -238 19 -76 125 363 101 -112 -25 -133 -76 261 131 -176 -109 -84 -305 -234 216 332
5655 332 36 -264 -91 -265 275 416 -18 175 79 22 167 80 -87 -188 13 321 64 6 -324 49 -55
5676 -55 -65 -38 -26 252 122 -101 -90 -95 81 51 -40 -183 -126 -20 6 157 181 68 42 -67 -206 52 -19 -246 -85
5701 -85 109 97 169 -107 -66 52 4 -2 49 -106 355 30 128 48 9 140 -22 41 -29 -91 -186 61 124 196 40 249
5727B49k20N1o6j81K41r7n7K43k02l0J30k23J00K08m82J67K47k83J34L19l61K55
5749A42k67J41m2m8K67j63L8k9lj54J22j34p9J71k8N9j03K95j81M9k63Q2K09p6
5773Ej84L07j50P5J84l25J47q0Q5Q8k18J15L4l39J56K37j34j53N3k31M38r4R2
5796A08J64l69o1J96J06j1j32j2k3J59k08J19k67o9J23L86k91K36r6k75M7j00
5818b70M71k78M25l47N39n81M60l36m56L38J80j90J10n2r6j18L95p2j83j2k6J60
5840F1j48N2K0P3k30M86m29J57j50J0j66M57l36K04k6q9k4J70j6j9N6j58j51L2
5864a64K64J48j58o0J32l07K23J08j4j24j2M0M1j14m08N22l0j25J34K18l20K86
5886B80l22l00O91m14j67K58r7j56J43O4k7N3j53l5K20K47k95K42l84K67J82l70
$$ plain form
5727 249 29 80 14 -167 74 -23 -80 163 -39 -69 61 -162 -62 146 -336 -169 78 -205 -71 248 -113 142
5749 142 -125 16 -26 -74 193 30 68 39 36 -118 4 -130 -209 -38 -66 -7 -110 185 4 53 -210 -128 81 5
5773 5 -179 128 -22 53 237 -88 59 -21 64 152 -66 49 83 -256 -100 137 3 -150 -97 -328 110 16 108
5796 108 272 -97 -158 38 144 133 1 -11 -34 125 -83 36 -231 -300 -177 209 -82 154 58 -217 -170 -270
5818 -270 201 -77 348 1 540 -41 419 83 -373 -35 145 -45 65 13 -83 -201 194 122 -61 -73 -99 61
5840 61 -87 -35 -15 58 -172 314 -115 42 -108 -98 -264 193 -143 61 35 -54 -78 92 76 57 113 -45 -196 -164
5864 -164 100 248 90 30 162 -145 78 186 172 48 36 76 117 3 -405 117 87 -38 96 314 -6 280
5886 280 -42 -342 349 -65 -232 26 -71 -227 -84 -20 -47 6 -147 -182 38 285 -10 232 -152 115 297 -73
5908g3J49j6P5l01J64j57K97k7o6j36j37J29L36l35nR9K20j98j29J05Pn2M09l66
5932hR2j0k68J7J97O4M5N6j58J49k04j09K0J06R7l98K64L7l6j33O2J88K54j40
5956A84l05K18k46K97j35j98J27O7J01j17n5L02m47K18o7L12j09j61j01K89n9
5977A15l39K83JP3j2q6j33NK33l40N15j68k38L14n53M27N3l02J59j01L96l40p3
6000a11K7L09j91k73J83qP1n2r4L22q8M9j67J50j55L42l48N3N7j13q0J35k2OK92
6025B94M0j47n3j95k1q0L50j94R9k36J29J69k35p1L81j05k19K06K7j95J26K19
6047B89p9l29m9L23k77L71k30r9J69r9k80K10J70j79k7L84l87J16j20J46k21J26
6069g2J02J78j23q6rl5n5J54L4j69L73l01m6m7O5j05R2p0J8K22k51K04l38%L74
$$ plain form
5908 -73 76 60 135 -166 -2 -159 138 111 45 -91 -228 -99 237 -98 -103 -4 216 18 -111 -6 1 -51 358 -8
5932 -8 84 74 -194 -177 20 84 129 185 27 176 -28 -137 -117 -11 86 -312 -48 -11 -47 -180 -118 70 324 184
5956 184 -121 97 -149 148 13 -185 -58 9 110 -7 -62 240 -207 11 -56 256 147 -14 -115 174 115
5977 115 -224 59 60 133 121 35 -98 -93 140 -200 315 147 -91 223 -330 97 150 -152 7 -94 302 -38 -111
6000 -111 -84 225 34 -239 -56 -64 7 -45 -139 183 95 144 -23 127 -28 314 -34 19 76 -37 -117 18 -4 2 294
6025 294 334 187 134 -61 -82 -162 188 -6 93 -143 -14 155 -80 -151 230 125 -94 112 139 -56 70 289
6047 289 210 -119 -168 155 -122 249 19 -80 89 -10 -290 -80 90 -89 -116 268 -119 -3 -123 23 -198 -72
6069 -72 30 208 85 -1 -10 -45 -100 54 88 -81 292 -9 -55 -102 -37 -142 -50 -120 -102 120 -131 73 -265 -265 109
6094A09j54J85j92q8L99k98k11J16N3K19l17R0N6P8q6j1K00j57O1l28K73J93l21
6117a31K69M6l69N1J52m9K14rl82o2L48j26m5r5j3j35N5L81n02M03J04k80P4r3
6141a94K02jk1R2j66j29K75j73K30M3p2k9q1k06K61j14K65nq0l88K58P5q5O4J81
6166B02j54l7J19q8L8k89M00l02K17k7P6K3k10L76k69J1j26K6o5j25K78L4k3j30
6190d5k01L67j27n5N8J06K00m61R0k06O37n63J64J96o58O34k0n2j48J35J9o8L
6213Er5R5k45Q0J6MN4K31j48j29L6K67k29p8J72j56J64N0k50J71q0Rnl8QO7K21
6240A97n0k68R7m6j26J68k04N44j59jl04K02N1K59j61l56N0R6j72J61n2M7j85
6263b12M24k62k3J1k27N08j92N5K3qj31l05K47Q9n0J95K47l29Q2m6l82K8N32j88
$$ plain form
6094 109 -45 140 -52 -140 259 -39 -250 -134 -81 138 -179 -89 -33 45 -41 -52 148 -9 52 -276 -3 190 -131
6117 -131 138 184 -185 -134 18 -31 183 174 -208 -270 78 -48 -93 -188 -201 -336 -281 100 -402 1 105 -175 -101 -194
6141 -194 8 7 -14 78 -88 -217 58 -115 115 158 86 57 -24 -230 31 -83 182 177 97 -291 -33 42 -43 21 202
6166 202 48 11 130 42 80 -209 191 -111 106 79 155 178 -32 344 75 86 -40 -14 -79 -204 74 108 85 -45
6190 -45 -246 121 -6 -61 -3 103 303 -158 -68 -274 363 -200 -36 160 -498 136 116 64 -84 51 70 2 5
6213 5 -90 5 -240 -160 -144 -140 -86 145 -3 -132 -96 171 -58 -136 36 -120 44 94 -156 15 -65 -56 -61 -99 -91 -24 197
6240 197 147 -121 -24 -70 -196 -28 -232 312 153 152 -152 50 101 360 199 -157 -107 -11 -183 -22 -74 -27 -212
6263 -212 212 -50 -73 -62 -289 219 27 82 105 97 -34 -339 -92 -3 -53 142 389 60 142 96 -286 -258 274 86
6287H6Q3k4l62J44q3o8J16J80n5R2n1q2q6J88k37M14m48L19j33n7J67k69K84k7
6311I1J8L4rJq6k08K47r5J57j18j33K7Q7%KR6m5J8l0n6Pjj8K62m6k08j25L56j18
6340A07j18j32M6m3K78m03L37k87K1P1J41J16n1k07Ol1K09j35J34j26J20l50L03
6363Fj26O3L43n11R4J28J88n46L12R9L4j95J31K33p6j83K62k38M1k59M87j96M0
6386A31p5k48J1Q4J42r7m4J18L8k04K88k40O1N8P9j49J93k67K78j22q8k11K54
6409a0L2j78Q6k2J96j97Q1J24r9Oj19L90l31M1K05j28j02M25j20m58K34j07M12
6432C61m86J89j58m5M0k45L35l8J23N9j48J10j43J97P3l50J55K9k05J51K32j76
6454F0k79K31P0k91K54m0L3p7o3L4J6N84m08j54q4J33J2J34k98m2J39j8j37J75
$$ plain form
6287 86 169 145 -217 -73 -156 -224 -108 72 17 109 58 -24 -110 78 -159 255 -193 126 -7 -64 103 -166 118 91
6311 91 109 143 134 135 49 -159 88 -7 150 32 -101 -74 13 13 15 111 66 84 54 -2 5 4 -14 248 202 -6 -131 225 107
6340 107 -11 -143 -97 -140 138 -265 72 -215 -194 -123 18 134 83 -124 -118 -149 60 -75 59 -67 53 -297 6
6363 6 -120 -57 286 -225 -131 -3 185 -361 -49 50 84 -111 20 253 177 -6 256 18 59 -200 287 91 131
6386 131 56 -192 -181 -97 45 -52 -96 22 60 -144 144 -96 -35 23 102 -47 146 -121 157 35 -53 -264 -10
6409 -10 22 -156 -70 -92 104 -93 -12 112 13 19 -100 290 -41 0 205 77 -25 400 280 -178 56 -51 361
6432 361 -125 64 -94 -139 -99 -344 -9 -47 76 135 -13 97 -46 151 224 -126 29 58 -147 4 236 60
6454 60 -219 12 82 -209 45 5 38 -39 -102 -68 -52 532 124 -30 -114 19 31 165 -133 -175 -36 -54 -191 -16
6478a6o8J67r9M5Q1p7L4R9m21N76k37l03M01m19K28J31Ol4j04Q1m7oJ77j91J5
6503A9j79L77k4k61J57k40O0j43j13O45m37K31n1j85J84k31J48q3K22k35K48j82
6525g3J50k51K21R8m02L65j29Rl20K46K80j41K9J70r1J60j44j78J82l81J37L4
6547b9j66M46k79r1O1J1p3P7J44J1N3k35K01j34N7k51L56m9K7m47K98J36j51K3
6571dO8k2k23K29k09K87j45j41K50J20l90K30k06L47q6o7j60J65O7o1K12l11j68
6594b18K59n8l6n5R0N0l36J06K42q9M26k26k99P1nj71K00J0o8K47k27j3N7q9M49
6619C17n0k28K64k64n7n7J57m37K78J68j6l4k70L14l02J33K3P2j42K28k96J4J88
6642CNj29q5M84n20K70j4O9Q9k02K91k5l36m9J85M6l94N41k62KJ85j38K22l10
$$ plain form
6478 -16 -84 83 -16 29 110 33 67 166 -255 321 84 -219 182 -237 -9 122 128 94 -10 71 24 18 195 4 19
6503 19 -160 217 193 -68 89 -151 -91 -234 -347 298 -139 92 41 -144 40 -191 -43 -126 96 -139 109 -73
6525 -73 77 -174 47 145 -257 108 -21 -12 -332 -86 194 53 82 252 161 321 177 -1 181 -200 -63 -29
6547 -29 -195 251 -28 -119 -58 -47 -120 -43 101 112 165 -70 131 -3 54 -197 159 110 137 -310 -12 124 -27 -4
6571 -4 64 42 -181 48 -161 126 -19 -160 90 210 -180 50 -156 191 105 38 -122 43 110 49 261 -50 -218
6594 -218 41 -17 -53 -108 -18 32 -304 -198 44 -45 381 155 -144 -73 -78 -249 -49 -39 -107 140 -87 -100 -43 -132 317
6619 317 267 39 303 39 -18 -75 82 -355 -77 91 75 41 -229 85 -217 -84 -61 11 -131 97 -199 -185 3
6642 3 8 -121 -206 278 -242 28 14 83 172 -30 261 236 -100 -149 36 82 -312 229 -33 -31 154 16 238 -72
6666g2m1J29J16Rj51j0p6O3L09Q0l43P4k57J23K56j62j66KN2L4K97m85p1K56J2
6691b2P1J24l34K59N2j10o3J57M7j21k12j16K55lP0nK31m10j32M81l28JK33o3
6715F2K8J64k56N6%j10j00L64Rk06j16Rk27L21n4k7J12O3j65l8K44r6j35P9J24
6740A05l54L01j14j8J50k2j8o3J8M4N5J09l57O4J12r2m9J72O8j70o6l0K29P5l1
6765A18j75K34N1l89L25r3k08L01k33k16M81j42P0n3j30J98M9rj78k50M38l93
6787b04K41p8lk02K41l5J67n7j4m3j18j13L26j52J79J13k30K1M9l09J64j1k0L15
6811B27l74k06M14p0l44N28k11k93J52J72m3R4r1K2L07m16K93l61K07j14j10K51
6833C4j01l3L8K56m26M28l05K16j45K13j13J4r4L6Q5p3p0l7J45p0l39K50K77m93
$$ plain form
6666 -72 -113 16 132 141 -10 -20 -96 -33 276 356 13 87 -170 -47 209 47 -119 -117 -65 -31 266 -219 -290 -34 -22
6691 -22 49 173 -161 98 150 40 -23 134 181 60 -152 -268 -13 -16 54 49 280 -130 -262 219 -109 -108 125 62
6715 62 90 254 -2 54 54 -56 -156 208 217 11 -105 -96 -323 -2 -56 -83 29 92 -73 -111 133 37 -98 -19 105
6740 105 -249 52 -62 -80 70 48 30 -33 -15 29 84 193 -164 -100 12 -80 -129 43 111 -59 -125 -155 74 149 118
6765 118 -57 177 228 -161 164 71 -137 164 -69 -285 196 54 124 71 -59 139 188 179 1 -249 189 -204
6787 -204 37 -41 -44 -246 -5 -40 127 70 56 13 -105 -218 108 -44 135 248 18 39 88 -221 -57 -68 -88 227
6811 227 -147 -353 61 -9 -353 175 -36 -329 -177 -5 -48 46 -45 -23 284 -132 161 -200 7 -107 -217 34
6833 34 -67 -100 -62 194 -232 196 -109 107 -38 175 62 76 -18 18 103 30 -40 -77 68 -2 -341 -91 186 -307
6857c07J49KR3O1P2k5O3j05Q4Qj20j67K53k7j4r9J06j39K18m18K88M6Jm8k3j64
6883b12q4J86J19p2K71j46j48O4j09j47M15l93N0K13J32OJ38j85j84M4J69k09
6905h2k14M63l5k70J99L26j67j79j17K53o9kJ05o1R7m08k02L27L41m52J28r4L56
6928B43k76k94M41m09M61j45J87j78j26q1K89N1k36J89o7k75M13m25K79m4j22
6949a25M8n3K28n6L4k12J76M9L1j46MQ9K1j2n7m1P9j0o6K14m26N8K84r1k7q6J42
6976D9J87j43k86K35J41j40K81k78J77j09o0m61K95Q3K56p5m0l4k52l1L86j91
6998a0J07Nl84L58j52J9k09J25rK29j46J62o5k3O4k8n8k5R3J06k01k87L13n9k9
7023a04J02N5l45M47j28k46M59m24J18J21J0J00j51j2j31O0J60k97J51k1L5L93
$$ plain form
6857 -307 -158 -156 -63 -2 70 45 108 3 87 95 -25 -192 61 34 20 -79 27 -112 106 -312 -24 22 23 -25 -48 -212
6883 -212 -296 -110 9 -63 208 62 -86 -22 -131 -278 137 -256 -206 7 139 145 283 98 -86 -42 127 -82
6905 -82 -296 167 132 -138 61 387 220 41 -76 177 108 106 211 150 247 -161 -363 -36 305 -147 -19 -113 243
6928 243 -33 -327 114 -295 166 21 208 30 -96 -177 112 163 -73 116 49 -226 187 -238 41 -3 -125
6949 -125 -77 -130 98 42 76 -136 40 89 120 -26 -22 67 88 76 19 -22 57 47 -19 195 -231 -173 111 20 -7 -93 49
6976 49 236 93 -193 42 183 43 324 46 223 114 54 -407 -112 -29 227 152 112 78 -174 -205 181 -10
6998 -10 97 102 -282 76 -76 -57 -266 -141 -150 79 -67 95 30 7 71 43 -15 -40 53 159 -42 -329 -16 -75 -104
7023 -104 -2 53 -292 155 27 -219 240 -184 -66 55 65 165 14 2 -129 -69 91 -206 -55 -76 -41 352
7045C52o2m6k58l25K39P4M7q6J03k17N5K4K98k93k9J94j31J70m6r6p5j47J17R2
7069d6L28m65M16l24j67J74M2p7J79n7n4k92N28k89l9NJ61k23J68J9k75J59k0
7092a49Q1J18K00m45K87J19j43p0k13N8R4K53k61N6K1J75k15N0m9J10l71L31m0
7115cj94O3J50L6o0p3K27j28l60K71o7L3P3mJ60K04n19R0J70p9p7J58J51l14n5
7140a47M58j90j65J90J33m02P6O9M2l06K8l2J13Q9R5J77k35J97q8p7M4j56q8K06
7164C1j49K5j68K89l84L18k4k28K61n8J06N4o6j51P8L80m33N9J3k34M83J13n12
7187a97J92K24k01ok52J01P5oJ66J34n71K94n3J38k83J66l3j38j03N4N25k84r4
7210a52q3K49j07L66j18J09k11l53K33K88j65m2j56K31p8K58l87K02K36k96L20
$$ plain form
7045 352 290 244 -14 -339 -100 -26 21 -65 38 -179 -124 -100 198 -95 -124 70 -61 109 63 -33 -108 -255 -138 -46
7069 -46 282 -183 233 -91 -258 -84 -42 -119 60 3 -51 -343 185 -104 -143 -138 23 -200 -32 -13 -288 -129 -149
7092 -149 -68 50 250 -195 92 211 68 -2 -215 -157 -63 190 -71 -15 6 181 -34 16 -33 77 -294 37 -3
7115 -3 -197 -134 16 52 -8 -81 146 18 -342 -71 -138 -105 -32 -36 124 328 -191 -101 69 -10 -87 71 222 -92 -147
7140 -147 311 121 -44 146 279 -123 -47 22 64 -242 -214 -246 -133 -44 51 228 -7 190 102 25 69 -87 -175 31
7164 31 -118 -93 -261 28 -356 -38 -62 -290 -29 -87 19 73 7 -144 -66 314 -119 -60 -47 -281 202 315 -197
7187 -197 -5 219 18 12 -240 -139 -64 -70 96 230 -341 -47 -100 38 -245 -79 -112 -250 -353 -299 226 -58 -152
7210 -152 -235 14 -93 273 155 264 53 -300 -67 221 56 14 -142 89 11 269 -118 84 320 24 344
7231C44k20m96L68K37m77J27J39lL4k39M6K7j44P0J83K39k33j57J37K27k67K0
7253c8j19J09M64k02l71j78J46L44j69P2j7k60K68P5K84m15k60K30P1k29k8M20
7275A97l53K49m7j89L89l04j37j05K94j52M03k34j17J74r1N5q2k4J26j24j91P7
7297a86L20k03J56j28j5K23k05K17j50j0N7j89K87l11M47k08j19r8j3J19r3J07
7319Em2j66M19j39j33Q8Q3k50K9MQ5l2P9k70L01J0k43K31R8j16r3K01j32k35L87
7344A69l00K31p6n1J16j79N5Oj10L13K3o1n21M96Q3m1r6j4L8l11L30k14J00K19
7368B05q5J29j79k36K80k83P2k5J40j48K60r9J5Nj60K32j29J24m0M7o4j35J21
7391D7j25p4K09L27k91k67K87j99P4o0o8n3J66M9r8J78J34j32k49K88p6l2P6k0
$$ plain form
7231 344 124 -372 -4 233 -244 -117 22 19 53 -186 -140 -113 -257 -187 -4 235 2 -155 -18 209 -58 -38
7253 -38 -157 -48 416 214 -157 -335 -189 155 -14 58 41 -219 49 124 408 -7 -267 -37 34 -195 -223 197
7275 197 -156 93 46 -143 246 -58 -195 -300 -6 -158 245 11 -106 68 -23 32 -50 -74 52 -72 -263 -186
7297 -186 134 -69 87 -41 -56 167 -38 179 29 19 76 -113 174 -137 310 102 -17 -115 -128 -9 -102 5
7319 5 -37 -203 216 77 -56 32 115 -135 -106 -102 -17 -49 30 -240 61 71 -172 59 157 41 -52 149 17 -218 169
7344 169 -131 100 24 -27 89 -90 -35 -29 -139 174 197 136 -385 111 194 153 57 43 81 -230 100 -114 -14 205
7368 205 120 249 70 -166 114 -169 -97 -122 18 -130 130 31 46 51 -109 123 -6 118 78 125 61 -74 47
7391 47 -78 -152 57 384 93 -174 113 -86 -12 -72 -140 -193 -27 22 -76 102 236 104 -145 143 67 35 111 91
7415I1j67K05k6l65K70j1l5j96J78J06j19K61m19J76j54O8J71J67k30O4MN0r0
7438aP0Jk3o4L9m1J99k97K7Q7Nj29L87k95N1J29j29j18J52L2L3p1q8J90k81J12
7464b3j84K94k62j9L18r0o4P3q6m6M2O4k0r2m7J02q3P1j04K37j12J53j15J25q1
7489E1k8j20l8K09O0p0k15K09Qk66PR3j59K22r9M06k15p2q1J0pk52K10qO5O4R1
7516G5k05J29K40l4j28j65K21J14m78K53j07K71l33K66l7j93Lk8m4J02J4o6J00
7539c0P0j32j22K83J3nk48o4L30M9k86M6J63O9j35q2p2K15q1J08J3k00K51k22
7563f9J09J13o1j34L52l74O3m1k35N60k44P8j06j79N4J43J4k5J39l91L77j28L0
7586D5r4j0r3M00k23j76L71R4n75K45j06J66J16l40Q9J16k05K62k3k87L09J22
$$ plain form
7415 91 -76 129 103 -262 8 -3 -38 -234 -56 50 -69 192 -227 -51 -205 -137 34 201 -29 35 39 89 -1
7438 -1 69 70 47 -17 22 -19 180 -117 -90 -3 2 -127 260 -35 16 145 16 -102 50 82 115 44 -44 146 -135 -23
7464 -23 -207 87 -175 -194 124 34 -30 43 -43 -89 -47 17 -3 -95 -142 -40 -123 -52 -156 81 -31 122 7 132 51
7489 51 23 -97 -135 74 134 64 -151 58 66 -200 -193 -100 -259 -37 -136 270 55 -17 -98 -88 -95 -347 -137 -145 -80 -16 75
7516 75 -130 -1 239 205 77 -88 133 247 -231 22 -85 186 -147 119 82 -111 -108 -136 -180 -78 -64 -130 -30
7539 -30 40 -92 -214 69 82 77 -171 -235 95 144 -142 -96 67 136 1 -81 -153 62 -19 89 102 -98 153 -69
7563 -69 40 153 92 -42 310 -64 -1 -42 -277 283 39 117 11 -168 -114 29 43 18 157 -234 143 15 45
7586 45 -49 -59 -152 248 25 -151 220 314 -261 -16 -122 44 160 -180 -91 25 -180 82 59 -228 81 203
7608B03l08J97j04m07K33M94n96K49nM0N7L3o6o5M5m5j7M5J67j68K37k25j57J21
7632d2J77m9m57K80J48q8K18j96R7j04R7l38L49j68J03J1Q8l41l5M93k50R4j9
7655F8j51n6P4J48m9j63J2M7r1K0J32j79J52k24N23k08L0j58M09j81j59M8Kj83
7679a37J31j68P8N6l0j72J24J08j08J70k42L77j05q0K90m97KK08j58O1K25r2q3
7702d2L14m57K82o2p2p9K33m3j48N3j17K79j84R9j06l2P7M9K0j40K84l50J12J86
7726A56r8j17q9P37n54j79l7N24p6k85j94K29N3n1K5j57J66q8q8J85K09o2n48
7749c39M90O8k24j20MK05k4p1M2n7ln3K57k34J77l8j94L22l36J64N4j73k1j6K4
7774i6L42l34j77J52j09L03k35n8K82k39J84p5K18l80M10j93pL8M1j95Q6j30P3
$$ plain form
7608 203 -105 92 -12 -419 -186 308 -288 -39 -44 -4 53 86 20 -45 0 -45 -62 -17 150 -18 219 -6 -163 -42
7632 -42 135 86 -371 -91 57 -31 187 -9 88 -16 81 -257 92 -76 27 38 126 -215 -250 243 -7 87 68
7655 68 -83 -139 -65 83 34 -129 -117 -70 -161 -141 -9 -188 -36 -260 263 55 85 -73 336 155 -4 44 46 -137
7679 -137 -6 -174 -96 -40 -70 -242 -118 -10 -118 52 -190 187 82 2 292 -205 -203 5 -153 -92 133 41 -42
7702 -42 272 -185 97 35 -37 -116 117 74 -74 -21 -138 141 -43 56 -50 -82 -5 44 64 -76 208 -142 -30 156
7726 156 58 -59 -148 589 35 -144 -181 343 267 -18 -212 17 70 19 44 -113 53 -35 -123 62 271 209 -339
7749 -339 151 219 -5 -125 -121 84 60 -11 31 -26 -29 -82 175 -59 118 80 -114 208 -128 36 90 -83 -104 -120 -96
7774 -96 246 -88 -265 -113 -222 81 -154 -212 70 -169 15 -60 158 -222 188 -5 -12 26 67 -128 -42 -172 -99
7797i9O8L1J5l1J10j1Q4j38j26J6k8J17k27K71n1L87m05j83J37lK1J67ol06K40
7822E0m3m2j76n5K89o3J27Q3j53l3N4l9j59O6MJ03k3q0J15j10J66n8K44l34R9
7847C2J72k39k01L73l90J78K45j86K02l07J57J05j17j48R5k4K00N3k33l23M08
7868E2N5l3k32J32N4k34N21n68M10k64R2J94n91M04m8j32k00M00k62M06m3J59
7890B72k96j76j64N55k46m9J11O1l49L18k2L2j25K32l27J55j44K64k64K35L12
7911C85l01n8q3pj26K53K42j90k95N22j89Pk50J7J92j92J04K18m72K21j31K5Q3
7934b5r7q2M24j88j04K54l56J60RJ9J47m34M21j76M7n5R8k22J86j25l6n6N1O6
7958g4J30j43j13J26L38k02N9J54j88J01j59q0j58L39K9j16K26k89q6J59j51L9
$$ plain form
7797 -99 -31 0 15 -16 94 83 167 29 -97 -81 -109 8 -219 52 1 388 -17 -200 -63 -66 -45 122 116 -190 50
7822 50 7 -35 -211 -266 23 -40 87 170 17 -16 38 -1 -160 -94 -90 13 -10 -90 25 -85 81 23 267 -67 32
7847 32 204 -35 -236 137 -253 -75 170 -16 186 -121 36 141 24 -124 -29 -53 147 200 -33 -356 52
7868 52 107 74 -158 -26 28 -206 315 -253 157 -107 -15 179 -412 -8 -56 -188 -388 12 -250 156 113 272
7890 272 -24 -200 -364 191 -55 -104 7 68 -281 37 15 47 -78 154 -173 -18 -162 102 -162 73 385
7911 385 84 26 -57 -64 -190 63 305 115 -180 342 153 160 -90 -73 119 -73 31 249 -223 -2 -133 -108 -25
7934 -25 -122 -204 220 32 -72 182 -174 -14 -5 14 161 -273 148 -28 19 -36 62 -160 26 -99 -135 -191 -140 -74
7958 -74 56 -87 -200 -74 264 62 121 275 87 188 29 -51 -209 130 159 43 269 -20 -106 53 -98 -59
7980e9k10K53J12l8o0Rl0j49L89j13k87nJ42j33K39k30J57j8J80k43Q9l4J25j81
8004i5q2M5J11L8Q1j13K21m4L8k31j65J63K6N4KL33m51N12m34j22K00l02K97j79
8028i7l04M72mk04J69l7J36k76K4L4l8MK65j15K8q8p1J45L0J56k11J3M3l13L47
8053A08j59L10k30R7O4j54M4j05k21L85K1l84K88O5j72J50l74pK24m6J48n8j36
8076a42J46j69M63j46k49J52j44J26k22K96k75J87n9l7j01J33m0K66j93k0K93
8097B65l94J99N8l89k4L04J86m18K94j92L4Q4k46N2J56J50n10J93p0m0J97J27
8119A6j0K35l24n5KR2o9o2K70l56M52l50L62j79q0j31L52m87L44k16K5J54K7Q9
8143A01l0k2J78j26j28J35M0j63O0l0j42L26k86q9K43r2K18j01j59N4r6r2o1K66
$$ plain form
7980 -59 -269 -16 96 58 -2 7 -23 -172 217 104 -183 -188 -46 -179 60 -170 -13 -31 149 -94 -5 -39 86 -95
8004 -95 -177 -132 -21 17 98 -15 206 162 200 -31 -196 -33 -7 47 49 382 -69 443 9 -113 87 -215 82 -97
8028 -97 -401 71 67 -137 32 -5 131 -145 -121 -87 -125 -121 144 29 57 -31 -102 43 73 229 18 31 74 -239 108
8053 108 -51 259 29 126 190 36 80 -25 -246 139 160 -224 64 129 -43 107 -267 -274 -50 -96 52 -6 -142
8076 -142 4 -165 298 152 -97 55 -89 37 -185 111 -164 23 -36 -73 -174 -41 -81 185 -8 -28 265
8097 265 -129 70 128 -261 -285 19 205 -213 81 -111 -77 7 -239 -187 -31 119 -391 -198 -268 -308 -111 16
8119 16 6 241 -83 -138 -136 -44 -113 -175 95 -261 191 -159 203 24 -56 -187 165 -322 22 -194 -169 -15 12 101
8143 101 71 49 227 101 -27 108 148 -15 45 15 -127 199 -87 -176 67 -25 193 92 -67 -13 -109 -201 -262 4
8167Dk22L80Q7k18k71K41j64K74P3l03j53J75L3K9K9r3OJ61j06rQM8J14M6
$$ plain form
8167 4 -218 162 249 31 -240 1 -163 111 184 -119 -272 -97 -64 -35 -6 -99 -93 68 -38 -47 -39 9 123 169
8191A69
$$ Imaginary data points
##PAGE= N=2
##DATA TABLE= (X++(I..I)), XYDATA
0@%%%%%%%%%%Qj6J6j6K4l2M0m8N6p2Q8j04J21j45J74k02K35k72L13l61M14m72
32b51N37o09O88p77Q75r81J098j226J366j519J686j870K069k288K528k788L073
49A611l387L731m109M528m993N513o098O760p515Q386r406J0618j2090J3918j6257
64h790J9381k3783L0491m2090O7635k25523J69251M32986l51225l11579P9810
75a63436K48647J5949m7583m9790n8832p6277J29938J91486o2799k91336k7134
86a91167K73344J13762j95453j17608P0113O6195L377K0132j2490q7992m4198
97a01985J30062R2784j16845j02165Q7882N8364o0880R79Q5112n2211j47323O8760
109e7466K13571m7610k47768p530K35239O4236j94046r0164J43394O9012r7537
$$ plain form
0 0 0 0 0 0 0 0 0 0 0 0 8 -8 8 -8 16 -16 24 -24 32 -40 48 -56 65 -80 94 -108 127 -145 168 -193 221 -251
32 -251 286 -323 365 -412 463 -518 580 -646 720 -799 887 -983 1086 -1202 1326 -1462 1611
49 1611 -1776 1955 -2154 2374 -2619 2894 -3204 3556 -3959 4427 -4979 5639 -6451 7467 -8790
64 -8790 10591 -13192 17299 -24791 42844 -182679 -13428 419558 68333 -243246 -163436
75 -163436 85211 101160 53577 3787 -55045 -131322 -1384 190102 127303 -164033 -191167
86 -191167 82177 195939 486 -117122 -47009 19186 22563 42695 30205 -57787 -101985
97 -101985 28077 120861 4016 -98149 -10267 48097 -12783 -11804 73308 21097 -126226 -57466
109 -57466 156105 108495 -139273 -146803 88436 152672 -41374 -131538 11856 80868 -16669
120a6669j8084P9649l5452r2485P6421J35948r9172j81042R6710K05462o4486
131H6800k06808J0514J80328L6412j33742n4673O2732L6495J0461R513n2915o8650
143h3533N1476J27640q861j57484l9899J44561P3163r3211p4894L8026L9157j5924
155B17J9054L2336p8987p4933J01670J16669q3027j39878M4246J33140j6335r7436
167d3264K2121N6590m6661l8393P6784N8200r2008r7179Q0693J19934m6139j08006
179e7328K156O4017J5679j1048Q574l0012o2670M1439J15706j6172j34123l0403
191i4185J16377O9802p2055p1414K1074L3614J3231K0011j9211o3311j1098Q0504
203B3339N3693p4670q4074N2369Q6767k3084o7875O102M7247q329k8729K9193
$$ plain form
120 -16669 -34753 44896 9444 -83041 -6620 129328 30156 -150886 -54176 151286 86800
131 86800 -120008 -109494 70834 107246 -26496 -81169 -18437 18058 28519 38032 -14883 -83533
143 -83533 -32057 95583 86722 -70762 -110661 33900 107063 13852 -61042 -23016 16141 217
155 217 19271 51607 -27380 -102313 -643 116026 32999 -106879 -62633 70507 54172 -43264
167 -43264 -21143 35447 -11214 -49607 27177 85377 -6631 -103810 -23117 96817 50678 -57328
179 -57328 -55172 8845 24524 13476 22050 -7962 -70632 -29193 86513 70341 -63782 -94185
191 -94185 22192 91994 19939 -51475 -30401 3213 16444 36455 17244 -46067 -57165 23339
203 23339 77032 2362 -81712 -29343 57424 34340 -33535 -27433 19814 11485 -17244 11949
215A1949J7839m8524j3913N4611J6860n1368k3648M6359J8852m6003o817M3856
227B0053m348m3650M632M7751L272n0642q528M9107R523l4647o005J9531L26j2852
241f477J1618J5862l0858k3457M4123K8635m5400l7212L5661M3337k3662m1739
253b9569J7082K8181j1026p858Q775m078j3274P855K6507o762l9690L247M1647
266B1037J944l6578j0724K9001J3427k6145o856K3784m796j8006J2062J7181j1367
279C964j9086J2843K1558j5791j7611J9017J0136j9556q439J7370J2057k0078
291c616j7747K0109J7072j5624j3513P830J0333l070n533Q764j160j6419R642
304b932K3063j1231k4445L696K6142L008k6512m701J8987P29q522J140O88l565
$$ plain form
215 11949 29788 -18736 -32649 21962 38822 -12546 -36194 10165 29017 -16986 -23803 20053
227 20053 15705 -27945 -23313 24438 27710 -22932 -31460 17647 27170 -7477 -13482 6049 6375 -6477
241 -6477 5141 21003 -9855 -33312 10811 39446 -5954 -43166 -7505 35832 12170 -29569
253 -29569 -12487 15694 4668 -3190 5585 1507 -11767 -3912 22595 15833 -23857 -20610 21037
266 21037 22981 -13597 -24321 4680 18107 -8038 -14894 8890 4094 -13912 -1850 15331 3964
279 3964 -15122 -2279 19279 3488 -14123 4894 15030 -4526 -12965 4405 16462 -3616
291 -3616 -21363 -1254 15818 194 -13319 -5489 4844 1774 -3759 5005 3845 -12574 -2932
304 -2932 20131 8900 -15545 -11849 14293 17301 -9211 -13912 5075 5804 -2718 -1578 -890 -4455
318d455q29Q559O357j4245q504J6642R894j1189j1353N456J4269n591j2559Q433
332H85N509j0499j437Q480J525r916l433J1961K351j1847K959Q989m964m478L908
347gP263k453j0596K666J1065k992p680q96L740K816m673j131N528o153m203R378
363A672L381p589l795N545O623n306m563Q718k39p708K408N096O12m502n666L947
379a366M204j821r12k661l374L842M015K700l097j0602L186J4281M35q928o766
394f864K575R572K572m252o520o841P390J2525n416j0992k590N510Q399l81o514
409a827k345q58M790P514j815o718m242K093J1385J734j2393l837N724M401j039
424B567m513M16N88m914M295O125k969m584k729L594R109j849p495r91L844M182
$$ plain form
318 -4455 -5284 3275 9632 -4613 -13117 3525 13419 2230 -9123 -3667 10602 5011 -7548 885
332 885 6394 -4105 -5542 2938 4463 -5453 -8886 3075 5426 -6421 -3462 5527 563 -3915 -7
347 -7 7256 4803 -5793 -3127 7938 4946 -2734 -3630 110 2926 -1747 -2878 2650 -3503 -7706 1672
363 1672 5053 -2536 -6331 -786 5837 531 -4032 4686 4447 -3261 -853 4243 4855 353 -5313 -1366
379 -1366 2838 1017 105 -2556 -5930 -2088 1927 4627 1530 -9072 -5886 8395 8830 -98 -6864
394 -6864 -4289 5283 7855 3603 -2917 -9758 -2368 10157 4741 -6251 -8841 -3331 5068 4687 -1827
409 -1827 -4172 -5030 -240 7274 5459 -1259 -5501 -3408 7977 9711 -2682 -6519 -795 3606 2567
424 2567 -1946 -1530 -942 -5856 -1561 4564 1595 -2989 -5718 -2124 6985 5136 -2359 -3350 494 4676
440D676j934l996L764n89p230K521P013J246o418r382L643J2849J487r050p405
455h805L275J0353J093l758K6o226m274J0746J2025m683k0185q877K0311J9894
469B0915j0599k4555p323K0653J9807r473j8453l691P204J1138Q031n283j4670
482f299j1112J2290K6136n34k8006j7537J5195L0455K344l1043j7281J6444K2004
495A3056J863j6593j0434L514N641J0427P506j1877j8217J63K2040J8976j6774
508I291l0730K220K9475J3276j9862k2354P806J7177m47m771r82m544m522M953
522d014J4512L609j9944j2335J6757J9111n077k2407n377K0542Q342j3929q652
535h862P033O900m419p990N678P623n881o522K114P302L583p878m123Q608J001
$$ plain form
440 4676 2742 -1254 2510 1921 -5309 -2788 4225 5471 -947 -10329 -6686 6163 7650 -1400 -8805
455 -8805 -5530 4823 5916 2158 2184 -4042 -8316 2430 14455 9772 -10413 -19290 1021 20915
469 20915 10316 -14239 -21562 -909 18898 9425 -9028 -12719 -5515 5623 13654 8371 -6299
482 -6299 -17411 -5121 21015 20481 -7525 -25062 -9867 20588 22932 -8111 -25392 -8948 13056
495 13056 14919 -1674 -12108 -8594 -2953 7474 14980 3103 -15114 -14951 7089 26065 9291
508 9291 -21439 -19219 10256 23532 3670 -18684 -10878 6299 5852 1081 99 -4445 -8967 -4014
522 -4014 10498 14107 -5837 -18172 -1415 17696 12619 -9788 -15165 5377 13719 -210 -8862
535 -8862 -1829 5071 652 -7338 -1660 5963 82 -6440 -4326 2976 6559 -1319 -5442 3166 4167
550D167p281K244Q723o60j5495n544K0786J1637j8721j9762P933K4676M279k3199
564f217j0962J4025J0844k175m678q29k984n621R536J6763q156k3790k583K1485
578D658J6403j3378k4528P19J9410J0163o215j5016m341Q278Q673M406l034j3657
592g459n069J1040J5216J848j9929j5331J2886K2885K338k2739j7964J4721K2240
605A4683l424j5990o664N575Q138L180R24n995j1757L566J7880M823j4803j4529
619a4393P438J9525k71j7924m319Q760N998k171n346P79r9j432M634K661m350
634e10k721J084L955K463k815k510K92J252L517j982n237J671L271p75k191k365
650c601L545K395m135j909L813J363j803j041K857J451n778K31Q886r81q968j746
$$ plain form
550 4167 -3114 -870 7853 7193 -8302 -13846 6940 18577 -144 -19906 -11973 12703 16982 -6217
564 -6217 -17179 -3154 7690 5515 837 8 -2976 -8597 939 17702 9546 -14244 -16827 4658
578 4658 21061 7683 -16845 -16126 3284 13447 7232 -7784 -12125 -3847 4826 9232 6198 -7459
592 -7459 -12528 -1488 13728 15576 -4353 -19684 -6798 16087 18425 -4314 -22278 -7557 14683
605 14683 11259 -4731 -11395 -5820 2318 5498 6422 427 -11330 -7764 10116 14939 136 -14393
619 -14393 -6955 12570 12299 -5625 -9944 -1184 4814 2643 -2703 -1924 -2023 -3455 1179 3840 -510
634 -510 -3231 -2147 1808 4271 1456 -1054 -762 490 4007 2025 -3212 -1541 1730 955 -1236 -3601
650 -3601 -56 2339 -1796 -3705 108 1471 -332 -1373 1484 2935 -2843 -2612 6274 5293 -3675 -5421
666e421P018O071n952q520K882N368J238j017m554k200K868M393L359m408q065
681f940L460Q916J555n906o408K515O773j56k268k921m271L814O434j487o851
696c741k771N564N424l366l456R15N29J887J773j027j400k159P47N108p56n645
712b374k02K034K270j647k129J503n84k297M440J871m226j934K355M276k68m729
728a641J24K940r8Q36o96k982J59J424J719m86m515p44M989Q94j978l139Q41M544
746B191n90k385J574q02m98L008k20k213j457J083L241j793l651J774M44l90M81
763b03j046O01N99j765K122J204k061N00Q11M97M91j764O89J310l027L75K817
780B150j896k068NJ997J402l260r38K733k41PR79j504L27J025J8J509j640k218
$$ plain form
666 -5421 1597 7668 1716 -6804 -3922 1446 2684 1667 -2887 -5087 -2219 2174 5533 1125 -6940
681 -6940 -3480 5436 6991 1085 -5323 -2808 3965 3809 1541 -1380 -5651 -1837 4597 3110 -3741
696 -3741 -6512 -948 4476 1110 -2346 -1431 -902 985 2758 1731 331 -1828 -1081 4027 3271 -2374
712 -2374 -2576 -542 1728 81 -2048 -545 -1129 -3426 1014 2885 -1341 -3275 -920 3356 3088 -1641
728 -1641 -1517 1423 1325 2161 1465 -1517 -1358 66 1785 1299 -3216 -3960 1029 1923 -55 -3194 -2353 2191
746 2191 1601 -784 790 -12 -510 2498 2278 65 -1392 -309 2932 1139 -2512 -738 -294 -684 -203
763 -203 -1249 -648 -49 -1814 308 1512 -549 -49 762 1259 1750 -14 675 1985 -1042 -667 2150
780 2150 254 -1814 -1809 188 1590 -1670 -2608 125 -116 -109 870 -634 -307 718 736 2245 605 -1613
798a613K523J373j222k053j144K563J376l677P26P09j087J545K83r01j30k85K329
815A315R82l151N09J512k66K16m54j072P72q96l1J552j923j217J244P81P50j318
833f95j376K829n2j418J941J46j945N27J319J333j847l383K379J391j213L6j084
850a112n02J394l31R00m03k508J424K592j16j096j285J432K054k334j38J696j610
867E7j390J288Q39M1k525r2K150j153q32K413p68j604M46J193K455j327l001J398
885d12J831O10j48k618o08Q93M42K235j702m558J685L628P8j853j530Q94J526
902C93p75K637P20n720m57N304K790l005n707R33N775o89l031l61Kk18N55J903
920A049J945n562l347N966N402l003n605m39N221K818k934j289j710J23L131R47
$$ plain form
798 -1613 910 2283 1061 -992 -2136 427 1803 -1874 -1148 -439 -1526 19 302 -599 -729 -1014 1315
815 1315 2297 -854 -345 1167 901 1117 663 -409 363 -533 -564 988 -935 -2152 -908 -127 623 -695
833 -695 -2071 758 706 -712 1229 1375 -570 -43 1276 2609 762 -2621 -242 1149 -64 -28 -1112
850 -1112 -1614 -220 -551 349 -54 -2562 -1138 1454 1338 242 -1043 389 2443 109 -29 1667 57
867 57 -1333 -45 794 835 -1690 -1782 368 -785 -1617 796 28 -1576 -1130 63 2518 1191 -1810 -412
885 -412 1419 2029 1881 -737 -1345 -452 -10 2225 523 -4035 -2350 1278 1356 -497 -2027 -1133 393
902 393 -382 2255 2975 -2745 -3202 2102 4892 1887 -3820 -2887 2888 2199 -832 -1193 -1191 -1409 -854 1049
920 1049 2994 -2568 -5915 51 5453 2450 -3155 -3594 1627 4445 1511 222 -1488 -1365 1766 2713
936B713k705j878q38K258K048j438l47j482j191L311L080k119l998l89N434K893
952E352o632k234N723R73m639j091M521J688o763k445Q148J815o824k428M525
967c11M412l939l945N178K526n094j813M632L003l303n569K934N192k557k945
982a599K00o6J458K67j06o57j990J576K163j365J211M57m268L85N422K611m676
999A023p929M079R708k160q880q19N908J985m040j321M676k881n217N989P080
1014G201m113j0178J383J2442J482j1285k782O781L305l000k534J217P8k891K578
1029c16L630l075l878O66M017K112k637k494Q95J004K553J388m459l384M233L828
1045D083j966n075P86M997k615l789M350J851m826k991N433N684n350p369O353
$$ plain form
936 2713 8 -1870 -2708 -450 1598 160 -187 -1669 -2860 451 3531 1412 -2586 -2975 2459 5352
952 5352 -1280 -3514 2209 3182 -1457 -2548 1973 3661 -3102 -5547 2601 4416 -2408 -4836 -311
967 -311 4101 162 -3783 1395 3921 -1173 -2986 1646 4649 1346 -4223 -1289 3903 1346 -1599
982 -1599 -1399 -1465 -7 260 154 -503 -2493 -917 1246 -119 1092 1549 -2719 -2334 3088 5699 1023
999 1023 -6906 -2827 6881 4721 -4159 -4978 930 2915 -1125 -2446 2230 -651 -5868 121 7201
1014 7201 3088 -7090 -5707 6735 8217 -3068 -5850 931 4236 1236 -1298 -81 -3 -2894 -316
1029 -316 3314 239 -3639 -2973 1044 3156 519 -1975 -1080 -76 2477 3865 -594 -3978 255 4083
1045 4083 2117 -2958 -2172 2825 210 -3579 771 2622 -2204 -5195 238 5922 572 -6797 -444
1060d44O584m663n284K333O858k956o404L502M853m400l879L426L222k787m102
1075d141L408M033m512k428M705J713k728j775J859K084j907m81J958k065j889
1090b166L539J471l338l227K473M825k910m839L355K696k898q67L131J638m971
1105b088j753P033K212p157k631O048K361m093l098L624K073m707l9M893j411
1120A267m788N74N420J030o046j148O083J43l600M27K518r99k665J986M130m103
1136B29m641M408L257l298l220K093K997j765k809L588J098m095M66M095J16l899
1152a380j271N173J500n667q39M661o75l185j83L345n52m518K061M555k939m039
1168c953L273L599j914l837K327L952k980k866L356J549k847j759K370K729l720
$$ plain form
1060 -444 6140 1477 -3807 -1474 5384 2428 -3976 -474 4379 -21 -3900 -474 2748 -39 -4141
1075 -4141 -733 3300 -1212 -3640 1065 2778 50 -1725 134 2218 311 -170 1788 -277 -2166
1090 -2166 1373 2844 -494 -3721 -1248 3577 667 -4172 -817 1879 -1019 -1886 1245 2883 -2088
1105 -2088 -3841 3192 5404 -1753 -4384 1664 4025 -68 -3166 458 2531 -2176 -2215 2678 1267
1120 1267 -3521 -2947 2473 3503 -2543 -3691 2392 2535 -1065 -638 1880 881 -1784 202 4332 229
1136 229 -4412 -4 3253 -45 -3265 -1172 1825 60 -2749 839 1937 -2158 -1692 2403 2519 -1380
1152 -1380 -2651 2522 4022 -1645 -2484 2177 1502 -1683 -1866 1479 927 -3591 -1530 3025 86 -3953
1168 -3953 -680 2919 1005 -2832 -505 3447 467 -2399 957 2506 -341 -2100 270 2999 -721
1183g21l083M592J690l752j444K955J405k864j295M480K70m375J252L773j063
1198A820l292L10L149L02m688J418L152k569j836K114J596j911k710K709L241
1213B805k945k788L454J946k434j664K072K588l494j907M195M24m142l2K981N16
1229A575l185q20L624J86l754J105K994r38j882L10K814k11l407R86L227j838
1245G86k578J742J722j331k462J568K887l328j313K907P10j957j304K129J872
1260B050k513j503L674J63k414J25J831J52k375m76K942n70l403J056K758j326
1276A71j810j68L001l43k959J575K581k265j205J981J368j045k413J782K389k807
1292a67j607K201K31j048j060J007J591k088j165L003J99k123J18J460O01j728
$$ plain form
1183 -721 -3804 788 2478 -1274 -2718 237 1642 -1222 -2517 1963 2233 -2142 -890 2883 1820
1198 1820 -1472 -1162 1987 2289 -2399 -981 2171 -398 -2234 -120 1476 -435 -3145 -436 2805
1213 2805 -140 -2928 526 2472 38 -1626 446 3034 -460 -2367 1828 2252 -1890 -1922 1059 1575
1229 1575 -1610 -2430 1194 1380 -2374 -1269 1725 787 -1095 -785 2029 1818 -1589 -603 2624 786
1245 786 -1792 -50 1672 341 -2121 -553 2334 -994 -2307 600 1310 -647 -1951 178 2050
1260 2050 -463 -1966 1708 1871 -543 -418 1413 1565 -810 -1286 1656 1086 -2317 -1261 1497 171
1276 171 -1639 -1807 1194 851 -2108 -533 2048 -217 -1422 559 1927 882 -1531 251 2640 -167
1292 -167 -1774 427 658 -390 -1450 -443 1148 -940 -2105 898 1097 -1026 -908 552 1153 -575
1308e75l18K794o51k439J230J386j387j003P5J949j033k148J595J604j653r34
1324a508J513Q02n92j376J541J369j972p45K197J55j267j344J565J493k559j108
1340a836K482k80j569K42J045M92j477q2K244m39j820J002J114j92j206J47J227
1357A094o95j532J518N14j662k26N02J108p30j635J383J281j672J7J345q4o22
1374i6m20J227J129j860p91J529l7p44l02J95N49j042K9P65l74q53P18P93k37
1393A78l75p6J288n62p86J395J25j518N9Q26M82j123j388J663P05k089M25J094
1411C23l27r77k9J296J160k148n18K043J49m85q27O41O83q37l75J061p51q68K28
1430e58L76K96k67j017P85L17J0Q60j315r9J469K16o52o34k2R84j92j026M46P22
$$ plain form
1308 -575 -893 1901 1250 -1189 41 1427 40 -963 -888 1061 28 -2120 -525 1079 -574 -1508
1324 -1508 5 807 215 -1161 380 1749 -223 -968 1229 1384 117 -1227 338 1831 -728 -1836
1340 -1836 646 366 -1203 -961 84 576 -901 -983 1261 822 -998 4 1118 926 -280 -133 1094
1357 1094 399 -1133 385 899 -763 -989 -487 621 -109 -1744 -361 920 -752 -735 610 526 -96
1374 -96 -516 711 1840 -20 -811 718 681 -63 -365 -170 379 -663 -634 131 -243 -1096 -378 415 178
1393 178 -197 -273 1015 453 -333 1062 1187 -331 -272 554 1036 -87 -1475 188 893 -1196 -771 323
1411 323 -4 -981 -1010 286 1446 -702 -1220 823 972 487 -340 301 984 147 -228 833 82 -786 -558
1430 -558 -182 114 -153 -1170 -385 -68 -58 802 -513 -612 857 1073 421 -213 -235 749 557 -469 -23 699
1450F99j249n9P6J235q31k019J617K046j139j347J67J612L40j703P6J557l92j259
1468e73M86M06N00j169p69J555J62j494k7L36R77k47j414Q84J179o32J76p32O57
1487B61Q56q12n05N37N03l80q49o64J520j30j572O12Q63m25p25p8J197J091j804
1506e04m56J421O40m09j329K31J704q57j184R80L89q12n82J73J215p57j278R72
1524d43J153o19r2r91Q79J044p13k86J6L29M25n28k61P15l88p78M03Q9j03j40
1544b89j274J330J232j063n66J62J330K11j374K19R25k83o94L60r0L52p53l14
1562e79J029j42j228L87J52P62o13q88J007R24j008L6P40k69N0l07M78J98q91
1581a62J68J94n48M40m45l39O46l57OK47l25L50N95p02L4P21o7J85o11P3O66n97
$$ plain form
1450 699 -550 -609 -533 702 -129 -2148 -531 1515 376 -971 -804 808 1148 -555 -479 1078 686 -573
1468 -573 -87 319 819 -350 -1119 436 598 -896 -923 -587 390 143 -1271 -387 792 160 336 -396 261
1487 261 1117 305 -200 337 840 460 -389 -1053 467 337 -1235 -623 240 -185 -910 -988 209 1300 -504
1506 -504 -960 461 1101 692 -637 -406 1298 441 -743 237 626 -186 -768 -595 620 -137 -1415 -443
1524 -443 710 91 -1 -992 -113 931 218 -68 -52 277 702 174 -87 628 240 -538 -135 -46 -149 -289
1544 -289 -1563 -233 999 -64 -630 -468 862 1073 -301 -82 843 560 -134 226 136 488 -265 -579
1562 -579 450 308 -920 -533 -381 381 -232 -1120 -113 811 -197 -161 579 310 360 53 531 729 -162
1581 -162 6 200 -348 92 -353 -692 -46 -403 -397 -150 -475 -125 470 -232 -198 523 456 641 30 103 769 172
1603A72o36Q89m90k91o3m9J074j104n55J099L62l79l98K26N51l0p92P58M65o94
1623A15j36L61J03l71o03L70O47q11l03L11j31N02l64J5L56l03L70N08o27j16
1643a07N34k84L73l88r4K89l01k65Q36o03m36K87j26M25l57p65R94M65p13J74
1663f2K53J86j94l47P00K23j077K46M37l21j63l45M64J08o61j06M79r3r3M10m1
1684CK20n0l92N41J63o62N58q4M1j64k89m6J69o03P61l72o24O48Q8L1oJ4J77M6
1708A68m15N30K03l59M9J67J42O2r23M58J39k23n33K53l59N24j31o3P85n84k06
1729c16O18r6K30j49k52K73q5k84L91j96k19K78p11J51K82p16N84J8n41Q42k25
1750a23N7L17n13M04K61n58M48K64o29J07L91m55j50k21K35J53m09J35N08n67
$$ plain form
1603 172 -464 425 -65 -356 -419 -468 606 -498 -1053 46 408 29 -369 -143 408 378 -414 344 809 115
1623 115 -21 340 443 72 -531 -161 486 -325 -628 -317 -448 54 -310 -295 61 -242 128 636 9 -107
1643 -107 427 143 516 128 34 323 22 -243 593 -10 -446 -159 -285 140 -217 -982 12 477 -236 -62
1663 -62 191 377 183 -164 536 759 -318 -72 365 44 -119 -464 0 108 -553 -659 -180 -273 -366 44 3
1684 3 223 173 -219 322 485 -177 381 297 338 174 -115 -161 8 -595 166 -206 -830 -182 -94 -63 -69 -55 122 168
1708 168 -247 283 486 127 176 343 485 547 -376 82 221 -2 -535 -282 -641 -117 -248 -311 474 -110 -316
1729 -316 302 206 436 287 35 308 223 -61 330 134 -85 193 -518 -367 -85 -801 -217 -199 -740 102 -123
1750 -123 -66 251 -262 142 403 -155 293 557 -72 35 426 -29 -179 -400 -165 -12 -421 -286 222 -345
1770c45J72K52J22k1q7k58P35p6l83J30j58N14l55o43N34j81m92L70ro0L22o24
1792e41N84J11o13M09J44rN40k60k34J92k65r1K51k34j19N10p81L38k13p2L16
1813c7k69j82O23l44j04J35M15O3j73j86P36l67n57N24k8j19o5m57N02Q4r53N00
1835b59M18l39j0j52M43M0k26K40J98m58M0L54j40K08k94q6J0j19j8L46n39L3
1857c10M83k65p5N9l77R07k78m91M80L22j79l09K9K61m5n11M88K17n19q4k30K73
1879a54J1m07K48L64k9jl01J98O39n05q1L70j94J1N3r9J4q1J03k78m18J58N79
1902B00o02l94R69j65K20m46L01P23o54l11M94r9j30N4j82K44M1j000M90M04o80
1923e23K59K2K03K27n53Q1N17l39K50K83m00L44j41m09N62l0l47j58j97L79L21
$$ plain form
1770 -345 -173 79 201 180 93 -165 570 494 111 241 83 597 242 -401 133 -48 -540 -170 -179 -239 83 -541
1792 -541 43 154 -459 -50 94 85 625 365 131 323 58 -33 218 -16 -135 375 -406 -68 -281 -353 -37
1813 -37 -306 -488 135 -209 -313 -178 237 300 127 -59 677 310 -247 277 249 130 65 -392 110 194 -759 -259
1835 -259 159 -180 -190 -342 101 141 -85 155 353 -105 -65 289 149 357 63 -23 -13 -132 -150 196 -343 -310
1857 -310 173 -92 -167 -108 -485 422 144 -347 133 455 276 -33 -4 257 212 -299 189 406 -113 -197 -427 -154
1879 -154 -143 -550 -302 62 33 32 -269 -71 568 63 -18 352 158 169 222 123 137 56 159 -119 -537 -379 200
1902 200 -402 -796 173 8 228 -218 83 806 152 -159 335 236 106 160 -22 222 263 -737 -247 157 -523
1923 -523 -264 -242 -39 188 -365 -284 233 -106 144 427 27 371 230 -179 383 353 6 -152 -349 30 351
1944C51o53k02M09mK87n95J87K74p3k10J92J83M83m02p39Q69K7q68L84N06k78
1965A28n61p7L38L85p28K13L94j51M9r2j92R49n52l88P79j77o1k41o0J95O9n04
1987b85K99j11l47P58o73J33K01N5J40k2l63Q61m80k01M33m4jl27k6M48p1r35
2009e58K59P95q33jk12P47J7n69M7P23j69k13K27j4K01n34j05O34j03m49L00l66
2031a76L95n3n90K99K34l72J95J0l46N46k09J14Q4m65M33J56j98M25L9n27J48
2052A42M1k5l92k35L65Q8l78J42K09M08k85k79m7O49k77l48P06m1r2l48K54O1
2074C18k22m91O19m49K50j19k99L65j01R2j02Q5k16O03k22j34K71o2J50k65j67
2095i6L31J73o81M7N12o38J76m47O46L67p96J73L68n2L3j65M17J13k81k11M86
$$ plain form
1944 351 -302 -504 -95 -99 188 -407 -220 54 -19 -229 -37 146 629 227 -512 357 384 -484 -100 406 128
1965 128 -433 -510 -172 213 -515 -302 92 -59 -10 -102 -294 655 103 -285 494 317 256 15 -45 150 219 -285
1987 -285 14 -97 -444 314 -359 -226 -25 30 170 148 -215 646 166 -35 398 354 353 26 0 448 377 -558
2009 -558 -299 496 -337 -338 -550 197 214 -355 -308 415 246 33 260 246 447 -87 -192 442 339 -110 190 -176
2031 -176 219 166 -424 -125 109 -263 -68 -58 -404 142 -67 47 131 -334 99 255 57 482 521 -6 142
2052 142 183 158 -234 -469 -104 -16 -394 -252 -43 365 80 -199 -246 403 126 -222 484 443 351 3 257 318
2074 318 96 -395 224 -225 25 -94 -393 -28 -129 -37 -139 -54 -270 333 111 -23 248 186 336 71 -96
2095 -96 235 408 -273 -226 286 -352 -176 -623 23 390 -406 -233 135 83 116 -49 368 481 200 -11 475
2116D75k68m09K46j19L18l68m88N53L00o40J61J52P6O6n39Q01l8l70L85Lm80K54
2138G1J56q1k74O9J05P0p05M26L50o12J9M8L84K24n30J93Q71p05j63j00P11j61
2160C66n35O3P52n57m59K85J3j68j78O9M80K6m75K00M04m64L68O9J70j38n6K29
2182D64q2o19L28K66m51P2m45M55N9k61k90Q14m64j64K33J35M26r13K71R95n50
2203B79m14J36O72m61n60K9M44J78o46L88K34o41k1J54L89k29q2j1N49o15K34
2224FL11J9k04j68M09o6q32K46N37l94j65J39J99J62o50K01N65m67O9K5K31k72
2246i9l13L92O53l84p93N83n1l37J46m0L81j99o02P63j36l62K50N33l32k34k11
2267c92P90j6m06J29L18m76q0J26K88J76j023M26M50n07j55J92K35j36m24J83
$$ plain form
2116 475 207 -202 44 -75 243 -125 -613 -60 240 -400 -239 -87 -11 55 -484 317 279 -91 294 297 -183 71
2138 71 227 146 -128 -59 46 116 -589 -163 187 -425 -406 -358 26 250 -280 -87 784 79 -84 -184 527 366
2160 366 -169 -106 646 89 -370 -85 -72 -240 -418 -349 131 157 -318 -118 286 -178 190 259 429 291 235 464
2182 464 382 -237 91 357 -94 -22 -467 -12 47 -214 -504 310 -154 -318 -85 50 476 -437 -166 829 279
2203 279 -135 1 673 212 -348 -319 125 303 -343 45 279 -362 -383 -229 160 -69 -151 -162 387 -228 6
2224 6 317 336 132 -36 373 307 -525 -279 258 -136 -301 -162 37 199 -451 -250 315 -152 -83 -58 173 -99
2246 -99 -412 -20 633 249 -544 39 -12 -349 -203 -243 138 -61 -663 100 -36 -398 -148 385 53 -181 -392
2267 -392 398 382 -24 105 423 -53 -133 -7 281 457 -566 -140 310 -197 -352 -160 75 -61 -485 -302
2287c02O63n39M4K43J48n59N27k10K09l51l95N62j94j35K91j27K86k14k91L95
2307E1J42p31O17K04k77j5M3L62l95k40P2Q55p50k26M31k38j14k67J62P43m51
2328b2k01M47k18l6Q5j96O44m48j13L51j94J88j43k57J76J59k95L4j49j06K41
2349e3J14l54K30R1K92j14m27N71Q6n66J44K05k07k02q4J75L4m17K0M11n9Pk00
2372c03L16N4j83j74N72L21q20J02j57L46L23k87K66j43l69K63j18k13P0j08r6
2393c38K65J93l3k01r3J77K19q7M2m47N55m4l89L83L12j66m47J1M3L23o32J43
2415b11M78l36k91J17K10Q7j29K1K86L5m7j46J82K3Q0o49K95K87m66r5Q3R9j01
2438a88K10j73n2PJ50L80o82N09J00k58J59M6q8j70j06J42L90n29l68M54J70j68
$$ plain form
2287 -302 361 -178 -134 109 257 -302 225 15 224 -127 -522 40 -154 -289 2 -125 161 -53 -344 51
2307 51 193 -538 79 283 6 -9 34 396 1 -239 -167 688 -62 -288 143 -95 -209 -476 -314 429 -22
2328 -22 -223 224 6 -30 55 -141 503 55 -58 293 99 287 144 -113 63 222 -73 -39 -188 -294 -53
2349 -53 61 -293 -63 28 320 206 -221 350 436 -130 14 219 12 -190 -274 -99 -65 -482 -462 -51 -110 -103 -303
2372 -303 13 67 -116 -290 282 603 -217 -115 -272 74 397 110 376 233 -136 127 9 -204 -134 -242 -338
2393 -338 -73 120 87 -114 -207 -30 189 102 144 -303 252 208 -181 202 514 348 -99 -88 -45 278 -354 -211
2415 -211 267 -69 -360 -243 -33 54 -75 -54 232 267 220 74 256 279 359 -290 5 292 -174 -269 -186 -87 -188
2438 -188 22 -151 -203 -196 -46 334 -348 161 261 3 162 208 120 -50 -156 -14 376 -153 -521 -67 103 -65
2460f5k47k6O09q3p51N59J52O2m04K62K28J03l58p2K84k16J27o9PK81o89K59K9
2483a8j54Q1J11j84K30j28J85N7l35M62j09k52OL28l27J16k05K68q2m44J4K50
2505a30M1j70J68RK46k80j99O55j33j65J43P2J38j29m43K00K32n90L12P7j83J90
2527F1m21K69Qm1J81J6j72K89l03m0L60mj43O5l34K12Q1J17m62M5J56L7N5l10
2551b78K59q5J60J74k65M7K9j98M03J36m86j01J24P2M2m03J05N08n60J16j17N4
2573b64M35l50J08K65m04P8J37j60M08N4k44K84j63j97L08n24K4N89q18m0K19
2594b55J37p7J31j35K91R3m65M64m36J44M94l99P3o2j91J91J9j85p3N4K32m4n58
2617e57L24K20k34K97J25m21L01j29j03L65n2L1J40k35K08j45l34J54j56J30R8
$$ plain form
2460 -65 -312 -338 271 188 -563 -4 148 210 -194 68 296 399 41 -31 253 37 164 95 102 383 -306 -47 -18
2483 -18 -172 -91 20 -164 66 -62 123 180 -155 307 198 -54 -48 280 -47 69 -136 132 50 -394 -380 -130
2505 -130 -89 -259 -91 -82 164 -116 -315 340 207 42 185 257 395 266 -177 23 255 -335 -23 54 -129 61
2527 61 -360 -91 -83 -124 57 73 -99 190 -113 -153 207 203 60 125 -209 3 84 201 -261 -216 -60 -23 32 -278
2551 -278 -19 -104 56 230 -35 12 41 -157 246 382 -104 -205 -81 -9 33 -370 -265 243 -317 -201 -318 -264
2573 -264 171 -179 -71 194 -210 -132 5 -155 253 307 63 347 184 -13 295 -229 -205 384 -434 -474 -255
2594 -255 -118 -195 -64 -199 92 185 -280 184 -252 -108 386 -13 60 -2 -193 -2 17 -168 -241 -187 45 1 -557
2617 -557 -233 -13 -247 50 175 -246 55 -74 -177 188 136 167 307 72 280 135 -199 -45 -201 -71 27
2638B7n0j91j3K69j65J68j56L39k65oK65K1l76L96k56L10K2p65L45K08j16N1r6
2661c4m03L35K8R3m9PQ0j57l2N03p9l81K68n3j14K42j85L0n1k5q2N8l01L29l73
2686c46K23R9K09m6j58J29j79K27m16O17j14k19K35l83K15J43m37J45k31J26N4
2707a07l2p5L71K5m10N43j74j28N56n23K0J70n3k12M6r4L31j81k37o9J64k13K59
2730b3k7j46J05N0J28J12k37K62j48K12l58K90j27J40l60o3R6l7K24j40r9L32
2752A86n45K9K95j30J20L16l20K27j54r1J71o0M3J66q3k83L4k10M18k46k33K72
2774g8j35q9L33j54J05o2j6J98J03k30P6K30l04L18l17j02J85j50M1o6o4J71J47
2797A40j75r7oMj0J75l8J72J5k13L24j97K71l54J9J38l33j94K81J67k19k82K00
$$ plain form
2638 27 -23 -214 -227 42 -123 45 -111 228 -37 -43 222 243 -133 263 7 317 339 -426 -81 127 11 62 -34
2661 -34 -437 -102 -74 19 -30 -23 57 -100 -132 371 292 -89 179 126 12 254 69 99 48 23 -59 -1 -302 27 -346
2686 -346 -123 -24 185 139 -19 110 -69 158 -258 359 245 26 261 -122 93 236 -201 -56 -287 -161 -107
2707 -107 -139 -214 157 182 -228 315 141 13 569 46 66 236 183 -29 17 -77 254 73 -164 -233 -69 -282 -23
2730 -23 -50 -196 -91 -41 87 199 -38 224 76 288 -70 220 93 233 -127 -190 -94 -131 93 -47 -146 186
2752 186 -359 -330 -35 -165 -45 271 -49 178 24 -67 104 44 87 253 170 -113 -79 -289 129 -117 -350 -78
2774 -78 -213 -302 31 -123 -18 -80 -96 102 205 -25 51 281 -23 295 -22 -124 61 -89 -48 -114 -178 -7 140
2797 140 -35 -132 -138 -134 -144 31 -7 165 180 -33 291 94 365 11 30 168 -165 -359 -78 89 -130 -412 -212
2820b12O8J79l54L21K60l25J64Mr6n6J74m0k55N5M05m36l9L65j13k64j05J67j43
2843b76L99j83j73M82k53J75o3j2J0j60oQ8K62m68J44k37M40q3j26j17j87q3K10
2866b17J79K58l30P3J08L6J18k33l3P1Q6n3p0l3J66j62m1J08K36m43j54M97l58
2889a91M3Q7M02l69P9J44k29Q0P3k9p9r5M44k67l4m22L81r3k57J51K95j81J02
2912C5k13J1K52j70J19J1K05k60L4j2J21r5j23R5R2j81j03L49n09K24J83q2J97
2935A80q6j84Q3l8K70J84m35M0j97L28K5ol32K21P4n13M30j71J98J62l62j86L69
2958E4k9p2Q8O7J85k42RJ61k13L34m53L3J91l36J11J15j59q6L75j88Q8o1l62K79
2982a11o6K98L16m17K9L22l52K0j4p9O9k5P3j18k31RK58J98k89Q0o0J89J35j59
$$ plain form
2820 -212 -144 35 -319 2 262 -63 101 105 9 -47 127 87 -168 -113 292 -144 -183 182 69 -195 -300 -133 -276
2843 -276 123 -60 -233 249 -4 171 108 96 106 -54 -60 28 290 -178 -34 -271 169 86 -40 -157 -344 -427 -217
2866 -217 -38 220 -110 -37 71 107 225 -8 -41 30 116 63 -7 -40 126 -36 -77 31 267 -176 -330 167 -191
2889 -191 -148 -61 341 -28 51 195 -34 46 119 90 11 -84 360 93 59 -363 18 -75 -332 -181 114 -67 35
2912 35 -178 -167 85 -85 34 45 250 -10 24 12 133 38 -85 10 102 -79 -182 167 -342 -118 65 -17 180
2935 180 94 -90 -7 -45 225 409 -26 14 -183 145 170 164 -168 53 127 -386 44 -127 71 233 -129 -315 54
2958 54 25 -47 41 108 293 51 60 221 8 342 -111 -78 113 -223 -112 3 -156 -242 133 -55 33 -28 -390 -111
2982 -111 -177 121 437 20 49 371 19 39 25 -54 15 -10 63 -55 -286 -277 -19 179 -110 -30 -90 99 234 75
3006G5J2Q1j82n5J97k80M71l99N7J85p4j22J7K5k40J19J10K9k39J53M01k39M0
3029A42j13J05K5j2j35Q0j37j73l14M84r9J19Q2l48M07k23J34L79o07N87m79K21
3051A25J07j35k94K75P5k08J87r3J06J0m79M99k97mL20k24P7J0j32kJ22R1J31
3074B67j40j27P3R4k84j85L33J27j63k81K78J78j16j52K16j76J43m95K23M52l82
3095a17J95p9o9K17j35q8J24m2J25j80k05M96j72j23j3J1j18L22l5j71L31j02
3117A72j88K00j87k54M37k41K18j15k28K08J51k43k60K39K38j91j53J68K81j60
3137I2N4m05L52Nk61J89J38p1k4m4k09R6L37l99L34l55r5K72r4q3K50n15O20J30
3161C14k59l8p1J55K00k06J97m3l76j19K36j18J85k15k5N3r9L15J41n12N18j35
$$ plain form
3006 75 87 168 -14 -69 128 -152 319 -80 -23 162 88 -34 -17 8 -232 -113 -3 26 -213 -60 341 102 142
3029 142 29 134 159 147 12 92 -45 -218 -532 -48 -147 -28 54 -294 113 -110 24 403 -204 383 -96 125
3051 125 232 97 -197 78 153 -55 132 39 145 155 -324 175 -122 -126 194 -30 47 57 -75 -77 45 136 267
3074 267 127 0 73 167 -117 -302 31 158 -5 -286 -8 170 54 -98 118 -58 85 -410 -187 265 -117
3095 -117 78 -1 -70 147 12 -76 48 6 131 -49 -254 242 70 -53 -66 -55 -173 149 114 -57 274 172
3117 172 -16 184 -3 -257 180 -61 157 42 -186 22 173 -70 -330 -91 147 -44 -197 -29 252 92
3137 92 146 -259 93 98 -163 26 164 93 69 25 -184 -88 249 -150 184 -171 -266 6 -88 -171 79 -436 184 314
3161 314 55 17 -54 101 301 95 292 249 -127 -246 -10 -128 57 -158 -183 -130 -229 86 227 -285 233 98
3183I8k55J56J72p5r3m2J66L23m19o8J25j82K40j76l62M85j38l53M54K15l56K28
3205A43k69L37mj46L9J83k80O3p1l39L60N5k73J19L9j74J51r1K03m7J85j70j93
3228a80M10j96P5l88M19J91l55M6k77N71j36m46M24j81QQ0j68j5J23J59Q0j31
3250A13j0j64K76j11rJ17p9j19j1j86jL42l82K47rm3j63J88J98j90j06r2P5j1
3274a30K78k48L11j00m55K62Rj78J24L9n3K44n42L20J08O2J6M2K27n19J73K38
3296B28o1j59M32n08J36p5j8Rk1q6K73L5k09j98M40n3j81k05K04rR9J90l8l71
3320a46J23J97k5l0n9l63L60J25k49J55o6k89l7J17M18o18J08K71J18o9j90M93
3342C44n08K42J6J46j8l31J65n2k15N7j0J08j92j49K41K21k04J26j17j82M67q5
$$ plain form
3183 98 -157 -1 171 96 3 -39 127 450 31 -37 88 -94 146 -30 -392 93 -45 -398 56 271 -85 143
3205 143 -126 211 207 61 100 283 3 66 -5 -344 16 71 -202 -83 -44 -218 -67 -158 45 -2 183 13 -180
3228 -180 230 34 109 -279 140 331 -24 22 -255 316 180 -266 158 -23 -15 65 -103 -118 5 164 244 113
3250 113 103 -61 215 104 95 212 133 14 3 -183 -184 158 -224 23 14 -29 -192 -4 194 4 -102 -194 -119 -130
3274 -130 148 -100 211 111 -344 -82 -73 -251 -127 -88 -141 103 -439 -119 -11 51 67 109 336 -183 -10 228
3296 228 167 8 440 -68 68 -7 -25 -16 -37 -123 150 185 -24 -222 218 165 -16 -221 -17 -26 73 263 225 -146
3320 -146 -23 174 149 119 60 -303 57 182 -67 88 22 -267 -304 -187 231 -387 -279 -8 110 41 -149 344
3342 344 -164 78 94 240 222 -109 56 4 -211 -154 -164 -56 -248 -397 -156 65 -139 -13 -130 -312 155 70
3364G0J33j8p4j47j65L56M6j93lp7J24R9m17O3L69k21k31M19p5j84K12O0j56N53
3388E43m31o9M4j06j07K24k05J13j0k05P4o9L37j82j88K86kJ73k23J29k70K26
3410H2K38l50L06j04l05J00l0K1K36m5j45q4j28N05k54j50P1M0L1J0J8K5Q3k05
3434c4J79r6k2j66K21l40J11J97k10o8k06M22k84K95QJ81l03K47k69L88kj59o7
3457B3Nl6K2J41k09k1j74J19r4K42kK28j77J72o3l9q9l38L29j8j5J51j1l6j07
3482CR1p3Pj98K41j13j91L00l6m90K53K25k6J65j54j17K86j59J6L12k31l79K95
3505B7R6j84j19N4M81l68O7J2m36L0O42k26M8q0p4L92m52J1n5k8K49k0n9k23J12
3530a03N0o2M68n87L68j09L8n2M00m68K14Q0l33J47L4L6J90m55Q7R3k26M97n05
$$ plain form
3364 70 203 185 111 -36 -201 155 201 8 5 -72 52 151 -266 -203 166 -55 -286 133 58 -126 86 146 -10 543
3388 543 112 43 87 -19 -126 98 -107 6 -4 -209 -135 -204 133 -49 -237 49 47 220 -3 126 -144 82
3410 82 320 -30 276 172 -133 -33 -63 -42 194 149 4 -80 -208 297 43 -107 -36 4 35 45 63 88 171 -34
3434 -34 145 49 27 -139 82 -258 -147 50 -160 -228 -434 -12 -296 -1 7 188 -115 132 -137 251 249 90 23
3457 23 28 -8 14 155 -54 -75 -249 -130 -224 18 16 244 67 239 176 137 48 -290 39 21 6 157 146 110 3
3482 3 94 21 28 -170 71 -42 -233 67 31 -459 -206 19 -7 158 4 -113 173 14 30 342 111 -268 27
3505 27 123 -61 -180 -126 355 -13 54 66 -370 -340 302 76 124 44 -30 362 -90 -79 -134 -162 87 67 8 -215 -103
3530 -103 -53 -115 353 -234 134 25 63 11 411 -57 157 237 -96 51 85 121 311 -144 -57 36 -190 307 -198
3553a98K5jJ9K5J73J22lm9j76K07M6l12N30m40M52n66J49J9o2N7q2j36N4n2l1
3578b30j0L89O9l17J3L19j85J50l33lM09Pp8j51k6N2j53r4K83Nj78O2j0J57l12
3603a65RL44k25K41ml17K93k04O0J14m28N19r1k61P8J35n05M70M1j85m0j90L09
3626bN3j44j24K12j19K65J36R0m68L34k35J29R2n25O34n21k27M22l62N22j44j99
3648a81L70j6k31J80k85J57J45j80m9N33m28n5J60k44K06k13J98k80Q0J11j20
3669a42O6J52N0k07n7J46j75L41O0k65M84n8m96P9j73K58k01L02j80m1q4K04K6
3692H9M0m5N1Pj04K40j4k19M5j37K70m38J52o2J85l8N7J10m55O3J97k71k6R9J77
3717b7N8J33k35K8P5p5M51l12j1M6K39n25J50j51N6P1k12L14p2jo0l26M05J42
$$ plain form
3553 -198 -173 -174 -155 -130 43 165 162 113 -63 144 190 -122 408 -32 420 -146 3 22 -40 17 -65 -201 -147 -199 -230
3578 -230 -240 149 218 -99 -86 233 48 198 -135 -138 271 278 200 49 23 75 -78 -172 111 116 -62 0 -10 147 -165
3603 -165 -156 188 -37 204 200 -117 176 -28 32 146 -282 237 146 -115 -37 98 -407 63 104 -81 -121 -311 -2
3626 -2 51 -93 -217 -5 -124 141 277 367 -101 233 -2 127 219 -306 328 -193 -420 2 -360 162 18 -181
3648 -181 189 173 -58 122 -163 -6 139 -41 -90 443 15 -40 120 -124 82 -131 67 -213 -133 -22 -142
3669 -142 -76 76 126 -81 -138 8 -167 174 234 -31 453 395 -101 -22 -195 63 -138 164 -16 -57 -141 63 89
3692 89 129 84 135 142 38 278 264 45 90 -47 223 -215 -63 -125 60 22 79 189 -266 -203 -6 -277 -303 -204 -27
3717 -27 31 164 -71 -43 32 -43 408 96 85 131 370 -155 -5 -156 -100 -29 -241 73 1 0 -60 -386 19 161
3741A61k12K28j92k98N61j07Q3l38O5p3J71j54j58K04M6j25lK84j33k17O2K02
3763E7J51N4l72J45L9k6j74K94J31m63o2K15J70j93K07k97L04l23N7O1l48M13
3785D0q8K88J53j92j32J05P6j54k10O4j10J53J34l6l35J36pK06q3J47k75J2J37
3808B9J71L4k77J41K0m9m5j24K39l62L66j97j23K26j65M28o85N96j55L2ll30L23
3831I0J60q7k81K38j0j85K61r9J5p1pl03J88K43k31J05n0j60P6M4J30m16Q9N35
3855B74j13J10j52n4J%k44J55n4J28k64j62L6L81k8k99J73M00j89k54l5L74j98
3878a4j11J87n2J65k3L7m50L71n15N35k63L28l41K40k32O1j45L06k73J70K66j27
3900A20r2J16Jk27K70j33k45J54m0p5K22j06j1q0Q7J61p5q3K9K89l45J47K5N2
$$ plain form
3741 161 -51 177 -15 -313 248 141 224 -114 -49 -122 49 -105 -263 -59 -13 -138 -141 143 10 -207 -145 57
3763 57 208 262 -110 35 74 48 -126 168 299 -164 -226 -11 159 -34 173 -124 180 -143 -86 -25 -373 40
3785 40 -48 240 393 201 69 174 250 96 -114 -50 -160 -7 127 91 -244 -108 -115 91 8 155 -120 -108 29
3808 29 200 234 -43 98 118 69 24 -100 139 -223 143 -54 -177 49 -116 312 -373 223 68 100 97 -233 90
3831 90 250 163 -118 120 110 -75 186 87 102 31 24 -279 -91 152 -79 26 -24 -184 -108 -64 66 -350 -261 274
3855 274 161 271 119 65 66 66 -178 -23 -77 51 -213 -375 -339 42 14 -285 -112 288 99 -155 -190 184 -14
3878 -14 -125 62 10 175 152 189 -261 110 -405 130 -133 195 -146 94 -138 -77 -222 84 -189 -19 247 120
3900 120 28 144 145 -82 188 55 -190 -36 -76 -151 71 -35 -46 -126 -39 122 47 -36 -7 282 -63 84 109 161
3924A61m5j03J89j67j17R4J48l18O9J2J52k19K89Qk85R8L10l45Q1j9l3j4j7K12
3948A41k12J29j99J0J54q4J11k14M9J67L6o7k44L27L6n9j73J53J88j88L6J01n8
3971A40J8k41J84j80J98o5O2j28q5q7J27L52o87J90L53l68J08J87k14K65n01L33
3993c9K56j69k0P1k22L15m74J94N1l23K93K1l2j79N16j8j94N6J30n4L57l69j06
4016F1j26J06j02L1q1m5K01k09j31L29k00J82J07j39J01pM8m0j91K2J44j54J00
4039GL8J25k96J20p3k4J9K9J2j00K30r4k36L23n6k4J50j36K53l24P7j25MK12K36
4064C47l08M14n16J63p1j35N5j0P6r8P7J48K3l40J87O2J07r1J07q6n4K41n81J62
4088a21j0k63K88J98k67R0J30j03K07m10K04Q1J80q6p9J7l5k30J26M28l03K5k35
$$ plain form
3924 161 116 13 202 35 -82 12 160 -158 -89 -77 75 -144 145 153 -132 -34 276 -69 12 -7 -40 -54 -71 141
3948 141 -71 58 -141 -131 23 -61 50 -164 -115 52 88 21 -223 104 140 81 -92 61 249 61 97 198 140
3971 140 158 -83 101 -79 119 54 116 -12 -97 -184 -57 295 -392 -202 151 -217 -109 78 -136 129 -372 -39
3993 -39 217 48 28 99 -123 192 -282 -88 -37 -360 -67 -46 -78 -257 259 241 47 103 233 179 536 167 61
4016 61 -65 41 -61 -30 -111 -156 45 -164 -295 34 -166 16 123 -16 85 78 126 86 -105 -83 61 -93 7
4039 7 45 170 -126 -6 -79 -103 -84 -55 -43 -143 87 -7 -243 80 24 0 150 14 267 -57 20 -105 -101 111 347
4064 347 39 453 -63 100 29 -106 -51 -61 15 -83 -6 142 165 -175 12 74 181 90 197 111 57 298 -283 -121
4088 -121 -131 -394 -106 92 -175 -85 45 -58 149 -261 -57 24 204 118 39 56 21 -209 -83 345 42 67 -168
4111a68k44J80L27r9J03j88j92L02O5m0L9PJ86k65K70j93r6l9L08j84k25L81j75
4134F0J5l60J31J63K19l92J71p2L6J8j3kL38l88R0J6k88K64p2j43L51nK3l6j25
4159an6N5j45J92K8N4k03K17r4K6K23l44j95L62L6p8j95J13k28K71j52k22K08
4182a28j20P7J56J09k8k26J27J57j91j41K09j13R9P1K54l55M5r9M5K55l58J35
4204b0k55QM46j99J73j56J87N1l29K26K0j79j03K40p2j03p4K09q3j73LQ0K85k98
4228a16K82m4k07L8NJ65J14j51m6p3J50l29L52j36o1J16l0k27J50j56K02m2k22
4251b66o7M48M6r5j30j00K21o5k5J63j44J26j55j05J03p9K20k14l1P7o4P0j25
4274a91o7K82l07L48j03J48j78J94j94q7m0J72j70M18l35o2p1L51p5nj85J65J21
$$ plain form
4111 -168 -412 -232 95 -4 99 -89 -281 21 86 46 85 92 278 13 283 90 -6 -45 263 79 -146 235 60
4134 60 75 -285 -154 9 228 -164 7 -65 -29 -11 -24 -26 312 -76 14 30 -258 6 -66 -209 142 137 160 124 -1
4159 -1 -57 -2 -147 45 73 127 -76 141 47 73 296 -48 -243 119 155 77 -118 -5 -233 38 -114 -336 -128
4182 -128 -248 -171 -15 94 66 -160 -33 124 -67 -208 1 -112 -13 58 312 -43 2 -97 -52 203 -155 -20
4204 -20 -275 -267 179 -20 153 -3 184 235 -94 132 152 -27 -130 110 38 -65 -139 70 -13 -186 -183 -103 182 -116
4228 -116 166 122 -85 -47 -42 123 237 86 40 -33 117 -212 140 4 -57 59 29 -198 -48 -204 -2 -44 -266
4251 -266 -333 115 161 66 -64 -164 57 -8 -33 130 -14 112 -43 -148 -45 -124 96 -118 -149 -72 -136 -66 -191
4274 -191 -258 24 -283 65 -38 110 -68 126 -68 -155 -195 -23 -193 225 -110 -172 -243 108 33 28 -157 8 129
4297A29k73K04j63J06J25l23J39qj74M7M01m8p5M8K5k05Nm8j61L11J47k08Lj4
4321a0j28J39J21k0J21k90k92L63k0k05J42o2N0J37j42K74J55j90r8j11l32L21
4343g7J93J31n14N87n02L61m38K91K07m18l1K29N7l27M85n32K96m1j82J81K22
4364A78p9J17l12L28j57N5P2J19n02K12k83L96J9k30J08m9Noj9l5n3M4r7O1R5
4389a3nJ95k00oQ9j81N9J12o3j18J10k19J61K5K27k45j24j7j8M0K56R3k26J19
4413E1o5M6J63l35m4K11k9q0L95l67J48%j37J15l89L32J20l88p6K02L47l39K74
4436A55j85K24j14J26r6pk74J68NQ1j80M92k82m28K35r1n8L61k72J80q4LJ05q0
4460a6J21j91J91J10k63j32R5K25R1m99K17L96n18J72j52K38Q7j14j2J75p0j07
$$ plain form
4297 129 -144 60 -103 3 128 -195 -56 -64 -238 -191 210 162 87 135 160 -45 -40 -88 -249 62 209 1 4 -10
4321 -10 -138 1 122 102 223 -67 -359 4 -16 -221 -79 -141 -91 46 -96 178 333 143 45 -66 -398 -77
4343 -77 116 247 -267 320 -182 179 -259 32 239 -179 -210 19 76 -251 234 -298 -2 -43 -225 -44 178
4364 178 99 216 -96 232 75 130 202 321 -181 31 -252 144 163 -67 41 -8 -3 -9 -28 -63 -116 -72 -169 -108 -13
4389 -13 -18 177 -23 -29 60 -121 -62 50 -13 -131 -21 -240 -79 -54 173 -72 -196 -213 -231 -191 65 158 -68 51
4413 51 -14 32 195 -140 -184 27 -2 -82 313 -54 94 94 -43 72 -317 15 135 -253 -329 -127 220 -119 155
4436 155 -30 194 80 206 110 103 -171 -3 2 83 -97 395 113 -315 -80 -171 -229 132 -140 40 -44 -41 64 -16
4460 -16 105 -86 105 215 -48 -180 -85 140 231 -268 -51 345 -173 -1 -153 85 172 58 46 221 151 44
4482D4L31o57N35m78K7M30k99J30j06O4J5m1j46L3q7L52j28r7l3L96l40J81p7
4505D9P4n86M71j96K16K8l4j30J59k82J09N9k2K12l25k6K77J08j01N1m2K0r2J02
4529I9k3m2j98P3K21k23L6J0l0R7Q8k90j25R7%Q4J85j34J66j58kK69n2k47L56
4554B57k57J06J10k50j68K39j09j42J52J3k0N2M06k42k10J07J5J93j44J9l80n
4576b58J45p6j9J79l6J31q9p6m5j03K96j96M06m62L67l03J78p7J51K7k61J61J05
4599A45p1o6J93k5l24K69J07k04k48N7K01k08J47n2n7L27M08o75R7j3J06j41J8
4622im73N53J38j97jj08j50K50p2J96Q0k09J26j00J6j08J60j51O8Kj85KJ87R4
4646A09j74L9J78k98K04Rj01N2j03J06J05j53K71j64o0p5P8L22m26j46l3Q6J66
$$ plain form
4482 44 375 -282 253 -225 -198 232 -67 63 -43 21 36 -5 -151 -118 -205 147 19 -78 -111 285 -55 126 49
4505 49 123 -463 8 -188 28 56 22 -108 51 -231 -122 -63 -85 127 -198 -224 53 161 60 111 69 89 -3 99
4529 99 76 34 -164 -91 130 -93 -57 -47 -77 20 108 -182 -307 -210 -210 -126 59 -75 91 -67 -69 200 148 -99 257
4554 257 0 106 216 -34 -202 37 -72 -214 -62 -49 -69 -17 389 147 -63 44 59 252 108 127 -253 -258
4576 -258 -113 -189 -208 -29 -65 66 -23 -99 -144 -247 49 -147 259 -203 164 -139 39 -38 113 140 -121 40 145
4599 145 74 8 201 176 -148 121 228 24 -224 -167 34 -174 -27 -79 -136 191 599 -76 21 8 114 -27 -9
4622 -9 -482 71 209 12 11 -97 -247 3 -69 127 207 -2 124 24 40 -68 92 -59 9 11 -174 -172 15 109
4646 109 -65 -26 152 -146 58 67 -34 18 -85 21 126 -27 244 80 20 -55 23 345 -81 -227 -260 -174 -8
4669hm8J10j31M7J04m17L76J50j78K8J64j06k39L84k74K63k53l20L90J69j33p0
4691HK39k9j28k88K30K44n39oK56m8p2K73l68K96k36K87J6J93l39L4l04P3M42
4714B34j79j65M7J47j91o5J65j08M52m35K82q8k35R0R4P3L9q3l3J21J6m87K62
4737d7J11l68L57j09P0O1J8m73M73qj91J51k9m6K78P7k42J0j73q8J74J91l90p9
4761b72K6K76j6j42R0J69k00L8J27r2j86L3L71J28j45o9l0q0l0o7j26L45j20j91
4785a63j6J6k34N31m1o6q9MJ88J93k20j63Q9J98n2n12K45j9q7K48m01L58M0j31
4809h4P4j85L14j50R4j52K76k61K95j43p8K38j52j37J71j00j96n8K6K49k8L2m3
4832Bm1o9L52k17K39n5k33k1K86m22M07n95L14o2P9Q5oJ27k94m0J34K12J5l13
$$ plain form
4669 -8 -56 54 -77 -30 74 -343 33 183 5 33 197 91 -148 236 -38 225 -28 -348 42 211 78 8
4691 8 247 218 90 -198 32 276 -263 -269 -13 -61 -133 140 -228 68 -168 119 135 328 -11 23 -281 -208 234
4714 234 55 -110 -63 84 -107 -172 -7 -115 337 -98 184 96 -139 -49 45 118 157 74 41 162 178 -309 -47
4737 -47 64 -304 53 -56 14 75 93 -380 93 85 -106 45 16 -30 248 325 83 93 -80 -168 6 197 -193 -272
4761 -272 -246 30 14 -128 -38 131 -69 -31 96 4 -182 -149 222 350 205 136 106 26 -4 -71 -197 148 28 -163
4785 -163 -179 -163 -397 134 93 27 -62 -58 130 323 103 -60 29 227 175 -337 -92 -111 -198 50 -351 7 47 -84
4809 -84 -10 -195 119 -31 63 -89 187 -74 221 78 0 238 86 -51 120 20 -176 -234 -208 41 13 45 2
4832 2 -39 -108 244 27 266 211 -22 -43 243 -179 228 -367 -53 -115 -36 49 43 170 -124 -164 -30 182 197 -116
4856a16p0J77P1k0l8KM1q5J35k56L23k73K97k38J93j14k93J80j0k1K9r9L88k57
4880e4J40Pq2j64p0M78m33J05K06K2j78J60j38L9j13J61p8j04K97k92l4K28o6
4903C7m6q8L87j7l94K32j17k98L27K15p0k67q2L4j14K46j58M67l78k72J63K70
4925G7K3j16k16K57qJ63o7J16m92L71J68k03j10O2j30J38J13l39J71J55l33J84
4947a6K04J01l90O8K10k37K06kk19o9J86n7jj93J69o2J36k24M11j36j82L43k79
4970c3K11l34K53PKm2J34Q3l26k27K01pJ91q3l9k59K83lp5l7k1n0N17m42N5J82
4996A41k40J2K78j31J21j6k20J20k69L71O5r5k73j1p1Q0L18j74J20o8J68j64K
5019F4R9k64O2jp5L00j03j14p1j78K00n2J73j75K77O3j86k1j35M8M1p5K13k12
$$ plain form
4856 -116 -186 -9 62 42 4 6 47 -38 97 -159 164 -109 188 -50 143 29 -264 -84 -94 -115 -86 -185 203 -54
4880 -54 86 93 11 -153 -223 255 -178 -73 133 155 -23 137 -1 38 -75 86 8 -96 201 -91 -125 103 37
4903 37 -9 -97 290 273 -121 111 -6 -304 23 238 168 -99 -181 -147 -261 -15 -173 294 -84 -356 -193 77
4925 77 100 -16 -232 25 17 180 113 229 -263 108 276 73 -37 25 -105 33 146 -193 -22 133 -200 -16
4947 -16 188 289 -101 -33 177 -60 146 144 -75 -144 42 -15 -16 -209 -40 -102 34 -190 221 85 -97 246 -33
4970 -33 178 -156 97 104 106 64 198 281 -45 -272 -71 -78 113 30 -9 -268 15 12 -63 -100 -121 -171 346 -96 -41 141
4996 141 -99 -87 191 60 181 165 -55 65 -204 167 232 137 -136 -147 -218 -138 180 6 126 58 226 62 64
5019 64 163 -101 -39 -40 -115 185 82 -32 -103 -281 -81 -133 40 -135 142 205 19 -2 -137 -89 -48 -123 90 -122
5043a22q2K00j34K69j78J2J76j60j87J24K6O0N5Q6m11L54j18J02K15n03M13m18
5065b21L30k08O6K7q0P5k03J24j4Q2K07k37l4O0K99j22k01J21j39J12J50J5n4
5088A55m4l04K87j60K3J49l6j34K2J38L4m25L44K09k59j30M9K6J70j7R1k5j46
5111A7j30K14k82p5J54K48k04n9J02j67K34l27N76j56M3n3k10K41m57J20M20o7
5133A82k44K05k64J61k82k14N37J44R5m46K61L1m41J08J36K51j92L4J16k28M7
5154cj93J68kJ62j77K50j19l09R3N3j89M15k86K4j46J45J75m34J76K68n5n6J95
5177A55j47J9Q1j95K04l56J57P4n4l07N62l80K68j66q5j14K38MJ62k39L07q6q5
5200A7L69n78K07K03o5l09J40L9j49K61J9j92K2L33j76k91j07L59l11L46j33l1
$$ plain form
5043 -122 -204 -4 -138 131 -47 -35 141 -19 -206 -82 -56 4 59 145 -266 88 -30 72 287 -216 197 -221
5065 -221 109 -99 -33 -6 -86 -11 -214 -90 -104 -22 185 -52 -86 -26 273 151 -50 71 -68 44 194 209 155
5088 155 111 -193 94 -66 -43 106 70 -64 -42 96 130 -295 49 258 -1 -131 -82 -56 114 97 188 163 17
5111 17 -113 101 -181 -256 -102 146 -58 -117 -15 -182 52 -275 301 145 188 135 -75 166 -291 -171 249 182
5133 182 -62 143 -121 40 -242 -456 81 225 320 -126 135 166 -275 -167 -31 220 28 62 178 -50 -3
5154 -3 -196 -28 -30 132 -45 205 86 -223 -130 -77 -266 149 -137 -113 -259 -114 61 -373 -197 71 16 -40 155
5177 155 8 27 108 -87 117 -239 -82 -8 -62 -369 193 -187 81 -85 -170 -284 -46 -42 120 -119 188 102 17
5200 17 386 -192 15 218 153 -156 -16 23 -126 135 154 -38 -16 317 141 -150 -257 102 -209 137 4 -27
5222b7N3O0j50J53K68m39r3j30J79m8M19l94M01n48K56M10j55j75j75K16j3m4
5244B4j39L10l05K9J57o8j40J92l5j43L1J39N0k9k90J89k5M1J61Nj35o7K03q9
5268F6Lp3j55J5K54L5k89j73J86J05M3J08r3r9m8j43N39k97L50k17P2l13J43j6
5292Ck58L23o5k9K14l35%K22L5j25j4j80K51m0R9j92o9K67K2j82M27n93J45j46
5316b20J2J16K68k30l02L63q1K65j43p8k7k3j4K26l45K24j41J84k39l6N83l97
5338c5J59O8j42J69k03q4R5j89K47J59k92k38K13K6j61J13J85m9J5Q1J43m09J5
5361a14K35J0O4k60pmJ26l1J30l23K10l3J77l68J93J35J96n6m05j69M48Rk46L23
5385B40l75P5j9L4n0M4L63m49k1K61Q8m2l41K38j44M2q4J40J10M9j10k65L6M26
$$ plain form
5222 -27 26 86 -64 89 357 -82 -175 -305 -126 -174 245 -149 252 -296 -40 370 215 40 -135 81 68 24
5244 24 -115 195 -110 -81 76 8 -132 60 25 -118 -87 52 102 73 -217 -28 -53 -12 149 154 19 -48 155 66
5268 66 69 -4 -159 -144 110 145 -144 -317 -131 -26 17 125 32 -67 -115 -258 281 -16 334 117 189 -124 19 3
5292 3 -255 68 3 -26 188 -147 -147 75 110 -15 -29 -209 42 2 101 -91 -160 107 129 -53 374 -219 -74 -220
5316 -220 -208 -92 176 -54 -356 7 -74 191 48 -30 -57 -80 -94 132 -213 11 -130 54 -185 -221 362 -35
5338 -35 124 192 50 219 16 -68 27 -162 85 244 -48 -286 -73 -47 -208 -95 90 41 56 137 280 -129 -114
5361 -114 121 131 195 -65 -72 -76 50 19 149 -174 36 3 180 -188 5 140 336 280 -125 -294 154 163 -83 240
5385 240 -135 -60 -79 -45 -95 -51 312 -137 -158 103 191 149 -192 46 -98 -56 -140 0 110 159 49 -216 -180 246
5409B46k77R1r1j15J88j03K87n4k70J40j2R1K9m4j20j14j11K13Q7J02L2k57K65
5432B03l4j44N8k99K03j70J35K09J7m45R4j03J46L37q6j66J8K89o14M16k02K43
5454A05l19k55K91p6N2K70k46K91j9j88J84k94M40l00J4R2K55K6l42j10K10j82
5476a01J60j6J17k58p5j54L02J26k43L38l33M56m15J39j03N6K50k27Mk5k03J37
5498f8l3n4K36r2j48J83l9k05J5K56J78k08J19j38j92K70J96j57k5r3K20q2k24
5521h5K42J9j61l52J42l6P7K07Q4j94n4J05Rj17nJ08j25M3r7M11k67L03l15j78
5545b36K58K7k47J91j14R0k0N5j23L58n9q6P1l97M41j49P1L3j40O0k66q0K49j28
5569a41J16l2K02j70j42J73k16L91nj01K09j88%L9j00P6j6j04r2j6J73o8M7J54
$$ plain form
5409 246 -31 60 -31 -146 42 -61 226 172 -98 42 30 121 150 106 -14 -128 -239 -26 61 163 195 -62 203
5432 203 169 25 83 -216 -13 -183 -48 161 178 -267 -173 -276 -130 207 121 -45 -27 262 -352 64 -138 105
5454 105 -214 -469 -178 -254 -202 68 -178 113 94 -94 90 -204 236 -64 -50 42 297 323 -19 -129 81 -101
5476 -101 59 43 160 -98 -173 -327 -25 101 -142 196 -137 319 -96 43 -60 -4 246 19 23 -2 -205 -68
5498 -68 -101 -155 81 -11 -159 24 -15 -220 -205 51 229 21 140 2 -190 80 276 119 94 1 221 139 -85
5521 -85 157 176 15 -337 -195 -231 -154 53 137 -57 -111 -6 3 -114 -119 -11 -136 -93 -190 221 -46 257 -58 -236
5545 -236 22 49 -198 -7 -121 -31 -51 4 -119 239 180 94 165 -232 209 60 131 164 24 84 -182 -262 -13 -141
5569 -141 -25 -57 145 -25 -167 6 -210 181 176 75 284 96 96 135 35 111 95 -9 -101 -117 56 -12 35 189
5593A89j52r9R6M2J07j37qj58J93m98M26o6K32k33K52j51Jj60K80J18k66J46k42
5616h8R9Q1n8j33J49J37j13k47K33j27K64k69m8K36N9j00k24K23K8n6k12P2n3
5639a47J84O1j40J06L7N1J74l02m9qQ3m0K09l63J48k0k11K89q5N4J85j27j58j67
5663b36L45j34J71o5k12pq9M9L87N5k73l2K04k36o7M6K04q3k08K29j78K34l1q5
5687a2j73J62m0L13L4k18mL59l02k18L26q7j93m8R3k56N88N7n45Q6n7N3J61j50
5711g1P2L00j43j8r4l0l0Q0j98L36k31o3Q9k00O5K22j44J43M6k66o4K08k5J4J05
5736A03k07J86n4Kok80J60j1K49l33K8J9J65r4M3O4k27K17k18J33m4J63j15J20
5760F3k31J43K11K4k17R0k67K31J5l20K56q1J73m0N2J09Q4m94Q0j14K43J5l98
$$ plain form
5593 189 37 -62 34 76 183 46 38 -120 73 -425 1 -65 167 -66 186 35 36 -124 156 274 8 154 -88
5616 -88 11 92 34 -99 50 187 74 -173 60 -67 197 -72 -120 116 175 75 -149 74 102 46 -166 -94 -147
5639 -147 37 98 -42 64 101 152 326 24 -25 -33 50 10 219 -144 4 -16 -227 62 -23 31 216 89 -69 -236
5663 -236 109 -25 146 81 -131 -138 -227 -178 209 264 -9 -41 163 -73 -140 -94 110 27 -181 48 -130 104 73 -12
5687 -12 -185 -23 -63 250 284 66 62 421 119 -99 227 140 -53 -101 -8 -264 324 381 -164 -78 -135 -82 79 -71
5711 -71 1 301 158 140 46 16 -14 66 -132 204 -27 -90 -1 -201 -136 86 -58 85 131 -135 -199 9 -16 -2 103
5736 103 -104 82 28 30 24 -256 -96 -107 142 -191 -163 -144 21 -73 -30 34 -193 24 -194 -61 -105 58 -57 63
5760 63 -168 -25 186 210 -7 83 -184 47 62 -258 -2 -83 90 50 102 211 295 -199 -119 -233 10 25 -373
5783c73K42j01K97j07J66j25P3j45j9K54k35J05R9l37J31L88k96m3q4n8J40J03
$$ plain form
5783 -373 -131 -232 65 -42 124 -1 72 -73 -92 162 -73 32 131 -206 -75 313 17 -26 -110 -168 -28 75
$$ [...]
8191D
##END NTUPLES=NMR FID
##END=
