##TITLE=1H_Pr NCS-Ser
 CDCl3,8 sc, 
 23.9.2021
##JCAMPDX= 6.0         $$ Bruker NMR JCAMP-DX V2.0
##DATA TYPE= NMR FID
##DATA CLASS= NTUPLES
##ORIGIN= UXNMR, Bruker Analytische Messtechnik GmbH
##OWNER= root
$$ XWIN-NMR		Version 3.5
$$ Thu Sep 23 12:35:31 2021 Russian Standard Time (UT+4h)  she@DPX200
##.OBSERVE FREQUENCY= 200.1314
##.OBSERVE NUCLEUS= ^1H
##.DELAY= (6, 6)
##.ACQUISITION MODE= SIMULTANEOUS
##.ACQUISITION SCHEME= undefined
##.AVERAGES= 8
##.DIGITISER RES= 18
##SPECTROMETER/DATA SYSTEM= spect
##.PULSE SEQUENCE= zg30
##.SOLVENT NAME= CDCl3
##.SHIFT REFERENCE= (INTERNAL, CDCl3, 0, 15.7039)
##AUDIT TRAIL= $$ (NUMBER, WHEN, WHO, WHERE, WHAT)
$$ ##TITLE= Audit trail, XWIN-NMR		Version 3.5
$$ ##JCAMPDX= 5.01
$$ ##ORIGIN= Bruker BioSpin GmbH
$$ ##OWNER= she
$$ F:/spectra/data/she/nmr/H-F/1/audita.txt
$$ ##AUDIT TRAIL=  $$ (NUMBER, WHEN, WHO, WHERE, WHAT)
(   1,<2021-09-23 12:34:17.75 +0400>,<she>,<DPX200>,
      <created by zg, POWCHK disabled, PULCHK disabled
       configuration hash MD5:
       00 E9 B6 7A A2 85 ED C7 34 08 36 98 17 FE 4E 26
       data hash MD5: 16K
       8E 6C C4 18 72 C0 10 B8 5F 56 6E 6B 5B 70 B6 BC>)
$$ ##END=
$$ 
$$ hash MD5
$$ 02 82 B5 D1 95 35 F0 44 59 92 14 9C F1 A3 25 14
##$RELAX= 
##$RELAX= 
##$RELAX= 
##$RELAX= 
##$RELAX= 
##$RELAX= 
$$ Bruker specific parameters
$$ --------------------------
##$DU= <F:/spectra>
##$EXPNO= 1
##$NAME= <H-F>
##$PROCNO= 1
##$TYPE= <nmr>
##$USER= <she>
##$AMP= (0..31)
100 100 100 100 100 100 100 100 100 100 100 100 100 100 100 100 100 100 
100 100 100 100 100 100 100 100 100 100 100 100 100 100 
##$AQSEQ= 0
##$AQ_mod= 1
##$AUNM= <au_zg>
##$AUTOPOS= <>
##$BF1= 200.13
##$BF2= 200.13
##$BF3= 200.13
##$BF4= 200.13
##$BF5= 200.13
##$BF6= 200.13
##$BF7= 200.13
##$BF8= 200.13
##$BYTORDA= 1
##$CFDGTYP= 0
##$CFRGTYP= 5
##$CHEMSTR= <none>
##$CNST= (0..31)
1 1 145 1 1 1 1 1 1 1 1 1 1 1 1 1 1 1 1 1 1 1 1 1 1 1 1 1 1 1 1 1 
##$CPDPRG= <>
##$CPDPRG1= <>
##$CPDPRG2= <>
##$CPDPRG3= <>
##$CPDPRG4= <mlev>
##$CPDPRG5= <mlev>
##$CPDPRG6= <mlev>
##$CPDPRG7= <mlev>
##$CPDPRG8= <mlev>
##$CPDPRGB= <>
##$CPDPRGT= <>
##$D= (0..31)
0 1.2 0 0 0 0 0 0 0 0.06 0 0.03 0 0 0 0 0.0002 0 0 0 0 0 0 0 0 0 0 0 0 
0 0 0 
##$DATE= 1632386057
##$DBL= (0..7)
120 120 120 120 120 120 120 120 
##$DBP= (0..7)
150 150 150 150 150 150 150 150 
##$DBP07= 0
##$DBPNAM0= <>
##$DBPNAM1= <>
##$DBPNAM2= <>
##$DBPNAM3= <>
##$DBPNAM4= <>
##$DBPNAM5= <>
##$DBPNAM6= <>
##$DBPNAM7= <>
##$DBPOAL= (0..7)
0.5 0.5 0.5 0.5 0.5 0.5 0.5 0.5 
##$DBPOFFS= (0..7)
0 0 0 0 0 0 0 0 
##$DE= 6
##$DECBNUC= <off>
##$DECIM= 32
##$DECNUC= <off>
##$DECSTAT= 4
##$DIGMOD= 1
##$DIGTYP= 9
##$DL= (0..7)
0 120 120 120 120 120 120 120 
##$DP= (0..7)
150 150 150 150 150 150 150 150 
##$DP07= 0
##$DPNAME0= <>
##$DPNAME1= <>
##$DPNAME2= <>
##$DPNAME3= <>
##$DPNAME4= <>
##$DPNAME5= <>
##$DPNAME6= <>
##$DPNAME7= <>
##$DPOAL= (0..7)
0.5 0.5 0.5 0.5 0.5 0.5 0.5 0.5 
##$DPOFFS= (0..7)
0 0 0 0 0 0 0 0 
##$DQDMODE= 0
##$DR= 18
##$DS= 0
##$DSLIST= <SSSSSSSSSSSSSSS>
$$ [...]
##$SUBNAM2= <"">
##$SUBNAM3= <"">
##$SUBNAM4= <"">
##$SUBNAM5= <"">
##$SUBNAM6= <"">
##$SUBNAM7= <"">
##$SUBNAM8= <"">
##$SUBNAM9= <"">
##$SW= 20.0188988654967
##$SWIBOX= (0..15)
0 0 2 0 0 0 0 0 0 0 0 0 0 0 0 0 
##$SW_h= 4006.41025641026
##$TD= 16384
##$TD0= 1
##$TE= 0
##$TE2= 300
##$TE3= 300
##$TEG= 300
##$TL= (0..7)
0 120 120 120 120 120 120 120 
##$TP= (0..7)
150 150 150 150 150 150 150 150 
##$TP07= 0
##$TPNAME0= <>
##$TPNAME1= <>
##$TPNAME2= <>
##$TPNAME3= <>
##$TPNAME4= <>
##$TPNAME5= <>
##$TPNAME6= <>
##$TPNAME7= <>
##$TPOAL= (0..7)
0.5 0.5 0.5 0.5 0.5 0.5 0.5 0.5 
##$TPOFFS= (0..7)
0 0 0 0 0 0 0 0 
##$TUNHIN= 0
##$TUNHOUT= 0
##$TUNXOUT= 0
##$USERA1= <user>
##$USERA2= <user>
##$USERA3= <user>
##$USERA4= <user>
##$USERA5= <user>
##$V9= 5
##$VALIST= <valist>
##$VCLIST= <CCCCCCCCCCCCCCC>
##$VD= 0
##$VDLIST= <DDDDDDDDDDDDDDD>
##$VPLIST= <PPPPPPPPPPPPPPP>
##$VTLIST= <TTTTTTTTTTTTTTT>
##$WBST= 1024
##$WBSW= 4
##$XGAIN= (0..3)
0 0 0 0 
##$XL= 0
##$YL= 0
##$YMAX_a= 59459
##$YMIN_a= -102704
##$ZGOPTNS= <>
##$ZL1= 120
##$ZL2= 120
##$ZL3= 120
##$ZL4= 120
##$ABSF1= 10
##$ABSF2= 0
##$ABSG= 5
##$ABSL= 3
##$ALPHA= 0
##$AQORDER= 0
##$ASSFAC= 0
##$ASSFACI= 0
##$ASSFACX= 0
##$ASSWID= 0
##$AUNMP= <proc_1d>
##$AZFE= 0.1
##$AZFW= 0.1
##$BCFW= 1
##$BC_mod= 2
##$BYTORDP= 1
##$COROFFS= 0
##$CY= 11.3945322036743
##$DATMOD= 1
##$DC= 2
##$DFILT= <>
##$DTYPP= 0
##$F1P= 2.36226072786647
##$F2P= -0.459571619588291
##$FCOR= 0.5
##$FTSIZE= 0
##$FT_mod= 4
##$GAMMA= 1
##$GB= 0.15
##$INTBC= 1
##$INTSCL= 1
##$ISEN= 128
##$LB= 0.24
##$LEV0= 0
##$LPBIN= 0
##$MAXI= 10000
##$MC2= 0
##$MEAN= 0
##$ME_mod= 0
##$MI= 1.114404
##$NCOEF= 0
##$NC_proc= 0
##$NLEV= 6
##$NOISF1= 3.799351
##$NOISF2= 2.8
##$NSP= 1
##$NTH_PI= 0
##$NZP= 0
##$OFFSET= 15.70392
##$PC= 1
##$PHC0= -14076.33
##$PHC1= 12.20088
##$PH_mod= 1
##$PKNL= yes
##$PPARMOD= 0
##$PSCAL= 0
##$PSIGN= 0
##$REVERSE= no
##$SF= 200.130013532006
##$SI= 16384
##$SIGF1= 3
##$SIGF2= 2
##$SINO= 400
##$SIOLD= 16384
##$SREGLST= <1H.CDCl3>
##$SSB= 0
##$STSI= 0
##$STSR= 0
##$SW_p= 3612.71676300578
##$SYMM= 0
##$S_DEV= 0
##$TDeff= 0
##$TDoff= 0
##$TI= <>
##$TILT= no
##$TM1= 0
##$TM2= 0
##$TOPLEV= 0
##$USERP1= <user>
##$USERP2= <user>
##$USERP3= <user>
##$USERP4= <user>
##$USERP5= <user>
##$WDW= 1
##$XDIM= 8192
##$YMAX_p= 0
##$YMIN_p= 0
$$ End of Bruker specific parameters
$$ ---------------------------------
##NTUPLES= NMR FID
##VAR_NAME=  TIME,          FID/REAL,        FID/IMAG
##SYMBOL=    X,             R,               I
##VAR_TYPE=  INDEPENDENT,   DEPENDENT,       DEPENDENT
##VAR_FORM=  AFFN,          ASDF,            ASDF
##VAR_DIM=   8192,          8192,            8192
##UNITS=     SECONDS,       ARBITRARY UNITS, ARBITRARY UNITS
##FACTOR=    0.0002496,     1,               1
##FIRST=     0,             0,               0
##LAST=      2.0444736,     0,               0
##MIN=       0,             -102704,         0
##MAX=       2.0444736,     59459,           0
$$ Real data points
##PAGE= N=1
##DATA TABLE= (X++(R..R)), XYDATA
$$ [...]
$$ plain form
1871 45 -41 -475 157 188 -305 181 89 -336 137 -206 -331 309 -405 53 103 -447 366 66 -87 402 150 -98
1893 -98 310 343 95 308 150 187 617 -145 -62 411 -33 -255 381 -97 82 203 80 263 -85 -247 401
1914 401 87 -436 26 22 -11 122 40 -44 30 -234 -274 65 -121 -223 265 -78 43 -36 -324 189 134 -432 141
1937 141 274 -181 -11 -44 -273 -25 -226 -150 69 -121 -329 154 -236 129 139 -267 340 227 -150 120 199
1958 199 -148 325 231 -93 487 248 -48 281 126 -24 223 -167 -199 296 79 -8 334 -126 151 263 -17
1979 -17 80 327 -188 109 152 -263 208 -13 -440 294 -287 -322 198 -85 -146 51 -307 -240 51 -388 -254 -195
2001 -195 -672 136 225 -47 103 -132 -387 157 162 -276 -90 -22 -210 213 -225 -256 342 53 17 371 -43 88
2023 88 590 -128 72 307 -16 324 180 108 394 79 101 169 41 5 421 85 -237 128 45 -122 189 -191
$$ packed form
1871D5q6m34O32L1m93M86r2m25M73l43j25O40p14M58N0n50Q13l00j53M89k52k48
1893i8M08L3k48K13j58L7M30p62Q3M73m44k22O36m78J79J21j23J83l48j62O48
1914D01l14n23M62ml3J33q2q4P4k64m0L39j86j02M88l43J21p9k88N13n5n66N73
1937A41J33m55J70l3k29K48k01P6K19j90k08M83l90L65J0m06O07j13l77K70P9
1958A99l47M73r4l24N80k39k96L29j55j50K47l90l2M95k17q7L42m60K77J12k80
1979a7R7K47n15K97M3m15M71k21m27P34n81l5N20k83o1J97l58O7K91m39J34N9
2001a95m77Q08Q9k72J50k35k55N44Nm38J86O8j88M23m38l1N98k89l6L54m14J31
2023H8N02p18K00K35l23L40j44p2K86l15K2O8j28l6M16l36l22L65q3j67L11l80
$$ plain form
2045 -191 -67 69 -192 319 67 -156 -103 66 -265 136 -31 -201 -113 -173 -442 254 -95 -270 81 -256 -456
2066 -456 -44 -317 57 -155 -460 -74 -176 -245 276 73 -249 162 -155 106 16 126 87 550 -274 224 609
2087 609 -158 273 -31 121 -9 188 -140 355 250 -388 137 112 57 -23 172 -199 412 -28 -294 416 26
2108 26 -85 547 -132 -201 171 -166 118 263 -286 45 -95 -154 126 -266 -459 106 -170 -342 -41 -426 -74
2129 -74 212 -401 31 94 -254 -311 118 -223 118 98 -374 -194 78 -159 -20 -206 -93 242 46 160 277
2150 277 -13 130 329 -270 84 145 -43 204 386 -266 299 431 36 200 213 48 425 237 -317 226 9
2171 9 15 302 207 -73 130 -193 -50 256 -371 -115 -225 -236 49 130 -267 -308 14 -230 116 -106 -252 136 -203
2194 -203 -267 -129 -375 -89 161 -401 95 131 -457 -92 245 -16 57 137 -251 130 164 -172 205 41 -235 -88
$$ packed form
2045a91J24J36k61N11k52k23N3J69l31M01j67j70Q8o0k69O96l49j75L51l37k00
2066d56M12k73L74k12l05L86j02o9N21k03l22M11l17K61r0J10l9M63q24M98L85
2087F09p67M31l04J52j30J97l28M95j05o38N25k5n5q0J95l71O11m40k66P10l90
2108B6j11O32o79o9L72l37K84J45n49L31j40n9K80l92j93N65k76j72L01l85L52
2129g4K86o13M32O3l48n7M29l41L41k0m72J80K72k37J39j86J13L35j96J14J17
2150B77k90J43J99n99L54O1j88K47J82o52N65J32l95J64J3j65L77j88n54N43k17
2171IOK87r5k80K03l23J43L06o27K56j10j1K85Q1l97m1L22k44L46k22j46L88l39
2194b03o4J38k46K86K50n62M96L6n88L65L37k61P3Q0l88L81L4l36L77j64k76J47
$$ plain form
2216 -88 171 100 226 18 37 446 -314 93 308 -103 98 347 -225 78 13 -78 415 252 -2 329 461 -83
2238 -83 261 -139 302 189 66 156 120 -71 -115 152 -324 -100 2 -252 27 151 -275 -64 197 -19 230
2259 230 -362 -307 187 22 15 345 17 -157 8 -360 -131 30 -330 157 -241 -166 45 307 -483 166 226 71
2281 71 228 32 193 535 147 -100 275 137 111 284 80 39 220 -76 419 66 -1 191 185 -53 413 47
2303 47 -246 133 -41 -187 173 -99 -160 66 -245 -110 360 -236 76 154 -184 -62 -297 -274 293 -257 -434
2324 -434 -72 6 80 -145 -426 -74 121 -70 -16 36 -203 -94 -2 30 -28 294 -423 -86 150 -132 372 70
2346 70 -85 145 0 -77 158 3 -10 182 -62 220 175 -52 31 276 145 -89 257 -169 216 131 -252 191
2368 191 30 -2 279 212 141 95 59 -310 -267 -92 3 172 -143 -196 86 -60 33 -140 -284 -74 -157 -466 -31
$$ packed form
2216h8K59p1J26k08J9M09p60M07K15m11K01K49n72L03o5r1M93j63k54L31J32n44
2238h3L44m00M41j13j23R0l6j91m4K67m76K24J02k54K79J24m26K11K61k16K49
2259B30n92N5M94j65pL30l28j74J65l68K29J61l60M87l98P5K11K62p90O49O0j55
2281G1J57j96J61L42l88k47L75j38k6J73k04m1J81k96M95l53o7J92ok38M66l66
2303D7k93L79j74j46L60k72o1K26l11J35M70n96L12P8l38J22k35K3N67n50j77
2324d34L62P8P4k25k81L52J95j91N4N2k39J09R2L2n8L22p17L37K36k82N04l02
2346G0j55K30j45p7K35j55j3J92k44K82m5k27Q3K45j31k34L46m26L85q5l83M43
2368A91j61l2K81o7p1m6l6l69M3J75R5J69l15n3K82j46R3j73j44K10q3l09M35
$$ plain form
2391 -31 -55 -220 124 85 -69 -41 -131 -8 -104 127 -311 -49 -255 -94 174 -39 18 226 -105 23 310 -187
2413 -187 215 -35 -60 219 337 145 399 276 1 193 -161 -18 305 -12 158 139 -51 352 434 -568 -110
2434 -110 -64 -390 390 393 -533 -190 -115 -61 250 130 145 -98 -127 637 496 -462 -112 326 -69 -159 230 12 -78
2457 -78 123 -217 120 -38 -318 -65 -110 -29 31 248 -233 -224 -51 198 169 -147 -38 466 166 -397 62 178
2479 178 -92 -90 3 -353 244 -97 -27 -138 211 423 254 393 315 -162 83 196 -257 -64 270 -164 -70 126
2501 126 -193 100 -45 -182 273 182 -297 304 -12 -247 99 -80 -241 149 -176 -158 87 -685 -204 -66 -333
2522 -333 65 189 -478 -45 -38 -167 29 90 -115 200 19 -276 220 -135 -37 373 69 355 46 -117 57
2543 57 -154 72 135 293 -23 116 -169 127 195 -24 -65 198 -203 144 126 100 139 217 -59 103 287 -115 112
$$ packed form
2391c1k4j65L44l9j54K8r0J23r6K31m38K62k06J61K68k13N7K08l31J28K87m97
2413a87M02k50k5K79J18j92K54j23k75J92l54J43L23l17J70j9j90M03Q2j002M58
2434a10M6l26P80Lr26L43P5N4L11j20J5k43k9P64j41r58L50M38l95r0L89k18r0
2457g8K01l40L37j58k80K53m5Q1O0K17m81RJ73K49k9l16J09N04l00n63M59J16
2479A78k70KR3l56N97l41P0j11L49K12j69J39p8m77K45J13m53J93L34m34R4J96
2501A26l19K93j45j37M55r1m79O01l16k35L46j79j61L90l25J8K45p72M81J38k67
2522c33L98J24o67M33Pj29J96O1k05L15j81k95M96l55R8M10l04K86l09j63J74
2543E7k11K26O3J58l16J39k85K96O8k19m1K63m01L47j8k6L9P8k76J62J84m02K27
$$ plain form
2566 112 72 -251 316 301 -185 299 -114 109 -79 137 -318 -106 -261 -220 39 -343 -263 92 -292 45 82 -68
2588 -68 -2 -59 -132 -44 -200 -157 151 33 -126 9 57 -175 -10 -241 -104 208 -148 -181 29 160 134 215 19
2611 19 97 148 -174 191 107 -394 419 172 -144 233 -6 -12 323 -135 -49 530 -80 -41 299 -121 221 115 -57
2634 -57 -199 152 -6 80 36 -184 111 36 -267 161 -106 -35 -64 -79 -231 -71 -245 -53 212 -390 -13 119
2656 119 -204 108 131 -192 372 148 29 22 -61 -156 333 81 75 81 -245 116 159 -54 196 168 34 51 31 152
2680 152 121 -298 -74 248 219 -64 76 -159 -43 187 174 17 150 -145 30 -118 -254 230 159 -195 215
2701 215 94 -288 22 -62 -288 103 -74 -145 36 54 -156 153 -129 -329 397 -291 -229 213 -116 -145 228 -293
2723 -293 -360 5 -146 -96 84 -116 0 138 -84 82 275 -53 -48 18 153 265 47 112 179 152 14 288 204
$$ packed form
2566A12m0l23N67j5m86M84m13K23j88K16m55K12j55M1K59l82Q0L55l84L37L7j50
2588f8O6n7p3Q8j56M3L08j18j59J35M8k32J65k31J37L12l56l3K10J31k6Q1j96
2611A9P8N1l22L65q4n01Q13k47l16L77k39oL35m58Q6N79o10L9L40m20L42j06j72
2634e7j42L51j58Q6m4k20K95p5l03M28k67P1k9j5j52J60j74J92K65o02L77J32
2656A19l23L12K3l23N64k24j19pq3r5M89k52oOl26L61M3k13K50k8j34J7k0J21
2680A52l1m19K24L22k9k83J40k35J16K30j3j57J33k95J75j48j36M84p1l54M10
2701B15j21l82L10q4k26L91j77p1J81J8k10L09k82k00P26o88O2M42l29k9L73n21
2723b93o7L65j51N0J80k00J16J38k22J66J93l28NO6J35J12k18O5O7k7j38K74q4
$$ plain form
2746 204 -41 22 394 99 239 -174 231 -38 -40 192 -34 -136 210 -91 25 284 21 -211 -33 77 -116
2767 -116 -35 -22 -2 141 -9 -318 -14 -186 213 -17 160 -111 107 -84 -239 64 -274 -190 -99 110 208 49
2789 49 -96 -128 -32 37 258 -46 47 31 -223 145 -3 -260 -50 67 -132 254 -50 202 -43 -159 27 45
2811 45 -132 34 166 -209 8 185 63 107 67 34 179 190 129 -373 -43 129 158 -210 -50 357 -47 -58 144
2834 144 51 235 123 174 -112 153 8 87 93 -13 136 104 -237 -149 33 -288 272 11 -275 373 110 32 -60
2857 -60 212 9 -23 -297 44 7 -140 422 29 -120 -196 177 182 38 230 21 92 18 -205 207 -326 90 216
2880 216 33 -4 27 -65 -45 -185 40 212 190 -257 223 -26 16 -133 8 139 113 76 -99 141 -215 -19 -50
2903 -50 188 -206 -165 -88 -312 -64 -465 -22 127 8 211 -66 -17 219 161 -145 20 43 -351 12 199 -155
$$ packed form
2746B04k45O3L72k95J40m13M05k69kK32k26j02L46l01J16K59k63k32J78J10j93
2767a16Q1J3K0J43j50l09L04j72L99k30J77k71K18j91j55L03l38Q4R1K09R8j59
2789D9j45l2R6O9K21l04R3j6k54L68j48k57K10J17j99L86l04K52k45j16J86J8
2811D5j77J66J32l75K17J77j22M4m0l3J45J1o1n02L30J72K9l68J60M07m04j1K02
2834A44r3J84j12N1k86K65j45P9Oj06J49l2l41Q8J82l21N60k61k86O48k63p8r2
2857f0K72k03l2k74L41l7j47N62l93j49p6L73Nj44J92k09P1p4k23M12n33M16J26
2880B16j83l7L1r2K0j40K25J72k2m47M80k49M2j49J41J31k6l7j75K40l56J96l1
2903e0K38l94M1P7k24K48m01M43J49j19K03k77M9K36n8l06J65K3l94L63J87l54
$$ plain form
2925 -155 -199 -115 -14 89 -270 18 -70 -219 42 61 -125 147 -162 -195 154 93 34 278 74 445 128 -91
2947 -91 79 129 -143 261 196 92 76 83 27 261 -32 145 317 67 -207 0 126 -258 177 178 -63 76 -126
2970 -126 -24 -344 50 -116 -55 -110 111 -127 18 -84 -95 62 197 -105 6 79 -106 74 -186 -214 159 -134
2992 -134 49 173 -10 250 -34 -11 102 -121 14 47 79 35 -241 119 88 -108 384 -104 82 74 -67 24 -61
3015 -61 33 85 72 -20 228 131 233 40 22 -131 -37 228 -50 45 198 -138 -128 229 13 12 -196 -350 178 -54
3039 -54 9 -60 115 -55 50 -301 91 -176 -172 134 128 -104 194 -79 -92 271 -45 105 -32 223 53 51 58 124
3063 124 97 -137 49 363 329 19 387 -379 90 21 -77 521 130 111 92 -61 54 261 69 186 3 -173
3085 -173 -124 190 179 -53 -114 226 -80 4 -80 -202 1 -66 144 112 -116 63 -20 -195 53 -63 52 -117 -123
$$ packed form
2925a55m4Q4J01J03l59K88q8j49K61J9j86K72l09l3L49o1n9K44k04L71l17k19
2947i1J70N0k72M04o5j04j6Pn6K34k93J77J72k50k74K07J26l84M35Jk41J39k02
2970a26J02l20L94j66O1n5K21k38J45j02j1J57J35l02J11P3j85J80k60k8L73k93
2992a34J83J24j83K60k84K3J13k23J35L3L2m4k76L60l1j96M92m88J86qj41R1q5
3015f1R4N2j3r2K48r7J02j93j8j53R4K65k78R5J53l36J0L57k16jk08j54N28k32
3039e4O3o9J75j70J05l51L92k67ML06ok32K98k73j3L63l16J50j37K55j70kPO6
3063A24k7k34J86L14l4l10L68p66M69o9r8N98l91j9j9j53J15K07j92J17j83j76
3085a73M9L14j1k32o1L40l06Q4q4j22K03o7K10l2k28J79q3j75K48j16J15j69o
$$ plain form
3108 -123 -68 87 -89 44 196 -70 41 -72 -294 -80 -188 -12 148 -110 -56 196 -143 -76 189 -92 45
3129 45 237 -117 -84 -134 -257 97 455 -294 210 -152 97 -10 254 86 -32 58 -130 91 32 93 -131 2
3151 2 -252 149 -91 -34 -135 60 -142 -180 94 -139 -287 -358 -1 38 -136 -286 242 79 -187 90 -298 91
3173 91 12 -165 -92 -228 45 -86 -302 104 59 -6 -145 -77 115 -91 -7 -116 39 -99 105 202 -104 -144 -186
3196 -186 -1 93 154 -203 -106 -102 -32 -101 15 -209 160 275 -172 187 250 -95 179 30 -302 -7 -212 -49 58
3219 58 -162 -93 -189 -41 274 -56 -8 78 232 190 284 -53 -155 -159 -31 -53 -63 244 169 -178 -45 -204 -40 -8
3243 -8 56 27 -215 19 -60 35 78 -299 91 35 -208 -120 -41 -290 -69 5 215 -46 31 -83 146 364 51 -7
3267 -7 103 20 169 172 38 -179 36 -68 -8 84 133 -50 35 -79 -4 80 218 61 -422 23 -433 530 -675
$$ packed form
3108a23N5J55j76J33J52k66J11j13k22K14j08J76J60k58N4K52l39O7K65k81J37
3129D5J92l54L3n0j23L54L58p49N04l62K49j07K64j68j18R0j88K21n9O1k24J33
3151Bk54M01k40N7j01J95k02l8K74k33j48p1L57L9j74j50N28j63k66K77l88L89
3173I1p9j77P3j36K73j31k16M06m5o5j39O8J92k06Q4j09J55j38K04R7l06m0m2
3196a86J85R4O1l57R7MP0o9J16k24L69J15m47L59O3l45K74j49l32K95k05J63J07
3219E8k20O9r6J48L15l30M8Q6J54m2R4l37j02mJ28k2j0L07p5l47J33j59J64L2
3243hO4k9k42K34p9R5M3l77L90n6k43Q8P9k49K21P4K10k61P7j14K29K18l13n8
3267gJ10q3J49Lj34k17K15j04O0R2M9j83Q5j14P5Q4J38j57m83M45m56R63j205
$$ plain form
3290 -675 459 -180 29 -36 -165 -189 247 -121 38 21 -130 104 -23 -233 -140 68 -45 228 -498 169 159
3311 159 45 65 220 -107 287 246 -90 74 211 144 157 126 -2 -142 -124 -336 239 -26 171 143 -253 101
3333 101 330 -145 210 83 -110 103 -27 -72 228 207 -111 389 40 29 -79 -20 -206 188 26 -97 -181 -169
3355 -169 -166 2 -38 -163 -85 0 36 192 -108 -46 -166 -70 75 42 -77 -58 -85 -68 53 -165 -251 -10 -71 -126 -83
3380 -83 -14 -119 68 -207 0 -188 -159 252 -59 -37 126 9 -119 53 -114 10 -39 -129 81 18 -123 220
3402 220 -34 14 -100 161 31 -122 -150 -276 -96 126 -14 -90 -212 -347 -91 136 -234 -232 -293 136 88 -148
3424 -148 266 107 -158 -55 126 -75 36 -12 -260 -116 294 -54 -59 9 -53 26 -290 -60 -77 0 -266 427 6
3447 6 -50 414 -49 -260 71 -4 152 -149 -56 259 78 12 -73 -159 249 70 -94 -51 -23 49 96 87 -247 115 241
$$ packed form
3290f75J134o39K09o5j29k4M36l68J59j7j51K34j27k10R3K08j13K73p26O67j0
3311A59j14K0J55l27L94m1l36J64J37o7J3l1j28j40J8k12N75k65J97k8l96L54
3333A01K29m75L55j27j93K13j30m5L00k1l18N00l49j1j08N9j86L94j62j23q4J2
3355a69LJ68m0j25P8Q5L6J56l00O2j20R6J45l3j19J9k7J7J21k18q6K41o1n5M3
3380h3O9j05J87k75K07j88K9M11l11K2J63j17j28J72j67J24m9r0K10o3j41L43
3402B20k54M8j14K61j30j53k8j26J80K22j40p6j22j35K56K27l70Ko1M29m8k36
3424a48M14j59k65J03J81k01J11m8k48J44M10l48nO8o2P9l16K30j7P7k66O93m21
3447Fn6M64m63k11L31p5J56l01R3L15j81o6q5q6M08j79j64M3K8P2M7rl34L62J26
$$ plain form
3472 241 45 5 37 -173 -253 45 -78 -195 -92 26 -73 64 -184 87 -84 -224 -195 -313 157 -335 -31 15
3494 15 -184 -38 -239 54 -145 -5 -30 -402 171 -8 -32 51 160 -123 -98 -10 -133 -162 111 -188 109 -103
3516 -103 -171 26 118 -116 204 331 -26 68 -335 194 91 32 468 -78 -209 136 55 -348 -89 -92 -148 -281 100
3539 100 91 245 -126 105 30 -1 -95 120 56 295 29 -22 -266 -25 3 83 212 56 48 -89 122 89 -25 47
3563 47 -107 262 -153 87 205 -167 81 81 63 -103 110 -51 66 -249 122 45 181 -136 -189 -146 215 -35
3585 -35 43 -18 121 187 -130 -178 17 209 156 171 300 204 -222 167 -214 311 10 68 -130 92 3 -102 33
3608 33 -18 100 61 -72 288 -148 267 -143 -117 -10 -88 -363 -151 269 -58 181 -94 -81 217 -25 -107 4
3630 4 63 131 21 68 113 74 -178 -60 -48 -128 -17 -169 7 235 -108 22 135 103 172 162 97 -128 204 -133
$$ packed form
3472B41j96m0L2k10q0K98j23j17J03J18r9J37k48K71j71j40K9j18M70m92L04M6
3494A5j99J46k01K93j99J40k5l72N73j79k4Q3J09k83K5Q8j23k9K73k99K97k12
3516a03o8J97R2k34L20J27l57R4m03N29j03n9M36n46j31L45q1m03K59ln6j33L81
3539A00rJ54l71K31p5l1r4K15o4K39k66n1k44K41K8Q0J29j56qj37K11l3j14P2
3563D7j54L69m15K40J18l72K48%j8j66K13j61J17l15L71p7J36l17n3M3L61k50
3585c5P8o1J39O6l17m8J95J92n3J5J29r6m26L89l81N25l01N8j98K22q9j05J35
3608C3n1J18l9j33L60m36M15m10K6J07p8k75K12M20l27K39k75J3K98k42q2J11
3630DN9O8j10M7M5l9k52J18J2q0J11j52J76K28l43J30J13l2O9j0o5k25L32l37
$$ plain form
3654 -133 127 55 -169 209 221 30 170 120 -81 38 21 -154 -165 -158 -177 -99 -156 -212 221 -267 132 178 -183 -110
3678 -110 43 -97 -103 198 60 -4 86 -26 -164 -35 264 -201 -148 -10 213 -89 -45 46 -245 123 24 -109 -44
3701 -44 145 -212 225 130 -202 10 238 -212 -26 200 149 134 -155 201 -70 86 33 -40 -136 -81 147 186 242
3724 242 97 -344 154 292 -147 17 -78 203 199 300 39 206 -8 109 -136 142 -170 -138 165 57 -115
3745 -115 -205 19 -131 -60 35 148 -172 -189 -5 -246 168 -242 40 -29 207 145 52 -68 -13 72 -53 127 62
3768 62 -237 249 138 1 -46 -144 -90 -13 329 158 -139 -234 -29 -34 -82 19 153 -34 98 -27 258 50 256
3791 256 258 -199 273 -54 239 -14 -51 117 33 -42 93 -88 370 -105 -38 -115 43 188 -248 40 -149 -284
3813 -284 -169 28 208 281 -294 -186 -1 -100 -83 -257 -82 27 76 -234 -96 209 279 74 -61 15 67 73 -100
$$ packed form
3654a33K60p2k24L78J2j91J40n0k01J19j7j75j1Pj9P8n7n6M33m88L99M6l61P3
3678a10J53j40oL01j38o4R0j12j38J29K99m65N3J38K23l02M4R1k91L68r9j33O5
3701d4J89l57M37r5l32K12K28m50J86K26n1j5k89L56k71J56n3p3r6N5K28L9N6
3724B42j45m41M98J38m39J64r5K81mJ01k61J67k14J17k45K78l12L2L03j08j72
3745a15r0K24j50P1R5J13l20j7J84k41M14m10K82o9K36o2r3j20N5Q5j25J80o5
3768F2k99M86j11j37m7r8N4P7L42j71k97r5K05nm8J01J34j87J32j25K85k08K06
3791B56Km57M72l27K93k53l7J68q4p5J35j81M58m75O7p7J58J45m36K88j89j35
3813b84J15J97J80P3n75J08J85r9J7j74J75J09M9l10J38L05P0k05j35P6N2Oj73
$$ plain form
3836 -100 111 -222 88 -13 107 79 133 95 -1 -96 -222 328 -96 22 69 -256 -45 -208 158 282 -117 -18
3858 -18 -105 -197 -19 152 197 185 -385 -130 -72 104 -82 -199 -9 156 228 -142 91 67 87 -247 -42 -156 -115
3881 -115 238 138 290 214 118 -172 103 65 253 -106 101 299 359 -143 -80 117 28 88 29 -69 -173 9 -201
3904 -201 -71 -269 -85 291 -174 239 126 169 -172 44 100 -309 161 -71 -273 175 130 -20 -80 110 -168
3925 -168 -22 -181 92 -129 250 -8 232 108 -187 -65 118 -66 -132 -250 6 0 55 -174 113 65 107 -25
3947 -25 -45 158 247 -458 -68 352 141 4 -297 -29 57 -93 52 -35 126 456 24 -145 -101 -104 -116 -68 87
3970 87 -158 208 -144 -166 130 -238 -121 304 -226 -100 -24 -205 163 -215 166 176 -125 -66 -224 -231 36 -84
3992 -84 33 165 -102 -117 -15 -89 76 4 171 -30 231 4 -381 -109 -53 -166 -289 -21 -63 425 -170 75
$$ packed form
3836a00K11l33L10j01J20k8N4l8r6r5j26N50m24J18M7l25K11j63L66J24l99R9
3858a8q7r2J78J71M5j2n70K55N8J76j86j17J90J65P2l70K33k4K0l34K05j14M1
3881a15L53j00J52p6r6k90K75l8J88l59K07J98O0n02O3J97q9O0n9r8j04J82k10
3904b01J30j98J84L76m65M13j13M3l41K16N6m09M70k32k02M48m5j50o0J90k78
3925a68J46j59K73k21L79k58K40j24k95J22J83j84o6j18K56oN5k29K87m8M2j32
3947b5k0K03Q9p05L90M20k11j37l01K68Q6j50J45q7J61L30m32j69M4lj2M8J55
3970H7k45L66l52k2K96l68J17M25n30J26P6j81L68l78L81J0l01N9j58pK67j20
3992h4J17J32k67j5J02p4J65p2J67k01K61k27l85K72N6j13j23K68m2M88n95K45
$$ plain form
4014 75 -19 40 -11 81 -41 2 -99 -293 -300 -173 9 67 20 -206 224 300 260 303 -73 -79 -89 -24 -107 96 -107 42
4040 42 74 -144 -147 -125 -154 79 -164 95 77 220 -91 142 155 -183 208 78 -3 240 -222 -154 20 -96 202
4063 202 23 -132 -210 47 -174 -38 258 -92 36 -285 90 -65 36 -236 -159 -119 -81 -107 -188 164 1 -313
4085 -313 157 -83 68 82 78 -11 -11 214 67 -191 74 -251 142 4 79 203 -76 65 54 80 -4 -68 29 212
4109 212 -233 -42 137 297 -180 -33 332 7 138 -148 -20 -10 -95 -46 -72 -188 -214 175 -237 202 -57 -153
4131 -153 -60 -48 -183 21 -101 -102 -17 -33 221 -90 -87 152 -79 144 -113 -278 176 -46 -89 -91 273 -9 14 -373
4155 -373 59 307 188 4 -134 -169 -158 -21 7 25 -88 -187 231 -85 30 -44 -135 195 61 10 97 110 -57
4178 -57 -120 87 282 129 4 96 -113 -179 56 -40 -154 243 -23 -157 164 -155 12 262 -117 -264 123 45
$$ packed form
4014G5r4N9n1R2j22M3j01j94pJ27J82N8m7k26M30P6m0M3l76oj0O5q3K03k03J49
4040D2L2k18lK2k9K33k43K59j8J43l11K33J3l38L91j30q1K43m62O8J74j16K98
4063B02j79j55p8K57k21J36K96l50J28l21L75j55J01k72P7M0L8k6q1L52j63l14
4085c13M70k40J51J4mq9%K25j47k58K65l25L93j38P5J24k79J41j1K6q4o4R7J83
4109B12m45J91J79J60m77J47L65l25J31k86J28J0q5M9k6j16k6L89m12M39k59r6
4131a53R3J2j35K04j22jQ5j6K54l11LK39k31K23k57j65M54k22m3kL64k82K3l87
4155c73M32K48j19j84j38l5J1J37K8J8j13r9M18l16J15p4r1L30j34n1Q7J3j67
4178e7o3K07J95j53j25R2k09o6K35r6j14L97k66j34L21l19J67K50l79j47L87p8
$$ plain form
4200 45 1 105 111 37 168 43 -50 113 23 -64 -91 -192 -51 -241 98 186 71 212 -121 -254 -28 64 -93 142
4224 142 172 293 -27 -86 -2 40 -139 164 -131 -135 127 -155 238 34 -116 65 -17 180 49 -120 9 -30 22
4247 22 105 130 -30 -25 164 274 -57 -75 -263 165 -14 138 48 -91 250 27 -100 -7 -18 75 19 -321 -24 96
4271 96 -20 89 233 -117 -99 149 -39 -327 13 212 -45 189 73 -30 104 -319 92 128 135 -91 158 312
4293 312 82 192 16 72 -234 -135 -6 -35 164 -26 266 50 -142 -45 -95 453 -194 -136 59 -9 -37 -92 -21
4316 -21 -70 220 -56 6 -200 42 -162 -301 -130 -305 84 90 -127 -44 47 85 -94 52 -21 -108 -167 -202 -186 61
4340 61 -72 9 4 -6 116 -67 85 -152 301 315 45 -33 -151 110 -126 -132 84 -259 43 -30 -339 -158 19
4363 19 -178 -187 128 -154 -264 110 -295 98 -205 209 -175 -39 73 -120 5 291 184 196 -127 2 62 -129
$$ packed form
4200D5m4J04Op4J31j25r3J63r0q7k7j01J41j90L39Q8j15J41l33j33K26R2j57K35
4224A42L0J21l20n9Q4M2j79L03k95mK62k82L93k04j50J81q2J97j31j69J29l9N2
4247B2Q3K5j60NJ89J10l31j8j88M28j79J52r0j39L41k23j27R3j1R3n6l40K97J20
4271I6j16J09J44l50J8K48j88k88L40J99k57K34j16j03J34m23M11L6Pk26K49J54
4293C12k30J10j76N6l06R9J29k9J99j90K92k16j92R7n0N48o47N8J95o8k8n5P1
4316b1m9K90k76O2k06K42k04j39J71j75L89Ok17Q3R1L8j79J46p3q7n9l5J6K47
4340F1j33Q1nj0J22j83J52k37M53J4k70p8j18K61k36oK16l43L02p3l09J81J77
4363A9j97rL15k82j10L74m05L93l03M14l84J36J12j93J25K86j07J2l23J29O0j91
$$ plain form
4385 -129 -11 231 -69 -53 6 6 325 19 -177 -5 -68 -11 258 -77 11 -58 203 12 5 -52 36 -187 -107 -187 -124
4410 -124 -243 183 222 91 373 34 -316 78 82 20 40 143 110 -12 58 197 58 126 319 -140 253 -96 154
4433 154 -23 123 -101 179 -109 -260 -61 -26 188 252 -103 -19 -41 -116 -127 42 -55 -44 139 -341 -63 79 -76
4456 -76 84 194 1 -75 160 -39 223 -149 41 -39 -174 -201 -200 94 -366 30 -204 -6 34 -29 -43 -184 153
4479 153 205 185 -82 -1 -195 -42 96 -154 -291 -104 -46 306 -115 93 -32 -48 -131 -114 234 7 -153 176
4501 176 -63 -14 95 10 -77 -76 126 -54 251 -131 -215 90 59 -304 -79 4 169 -47 40 -54 17 -135 -249 -2
4525 -2 202 249 62 -39 191 2 -111 -119 103 -241 99 -122 -7 187 -30 -164 -48 37 -241 -271 141 -36
4547 -36 -37 12 -151 43 213 95 -19 49 -216 367 -66 -63 -169 166 85 -388 -151 10 7 -106 67 -30 17 58
$$ packed form
4385a29J18K42l00J6N9%L19l06j96J72o3N7K69l35Q8o9K61j91pn7Q8k23Q0q0O3
4410a24j19M26L9j31K82l39l50L94Mo2K0J03l3j22P0J39j39O8J93m59L93l49K50
4433A54j77J46k24K80k88j51J99L5K14O4l55Q4k2p5j1J69r7J1J83m80K78J42j55
4456g6J60J10j93p6K35j99K62l72J90q0j35k7JK94m60L96k34J98M0o3j4j41L37
4479A53N2k0k67Q1j94J53J38k50j37J87N8L52m21K08j25j6q3J7L48k27j60L29
4501A76k39M9J09q5q7JK02j80L05l82q4L05l1l63K25Q3J65k16Q7r4P1j52j14K47
4525bK04M7j87j01K30j89j13qK22l44L40k21J15J94k17j34J16Q5k78l0M12j77
4547c6jM9j63J94J70j18j14O8k65N83m33Lj06L35q1m73K37J61lj13J73r7M7M1
$$ plain form
4571 58 -174 123 252 96 -182 45 -30 119 -62 -35 91 -430 165 -84 -179 -162 -159 -183 6 44 -149 -30 -148
4594 -148 101 127 -54 228 -80 -103 62 103 -50 -349 57 -82 63 -139 105 -27 -20 -223 159 -6 -66 150
4616 150 -108 117 -225 -170 -119 -93 181 -77 -53 156 42 237 -63 144 35 -296 -42 104 108 -137 16 -4
4638 -4 139 217 27 138 70 109 5 -244 79 1 6 0 95 21 -51 32 294 301 -47 81 211 -49 76 64 -45 -208
4664 -208 198 -319 303 231 -316 217 -134 289 -515 241 -124 -62 -138 52 -341 38 -30 354 177 -50 63
4685 63 -26 24 78 19 328 123 -164 -286 17 356 406 -49 -8 135 91 230 -636 222 -74 -3 5 -129 -424 -442
4709 -442 -176 652 226 -453 -236 90 69 87 -389 -277 548 -298 -276 -142 31 216 -32 91 89 90 -94 348
4731 348 70 246 119 -18 -210 -44 69 83 -8 -114 225 -103 -116 -261 -52 50 91 7 107 124 81 91 44
$$ packed form
4571E8k32K97J29j56k78K27p5J49j81K7J26n21N95k49r5J7Lk4J89L8j93J19j18
4594a48K49K6j81K82l08k3J65M1j53k99M06j39J45k02K44j32Pk03L82j65o0K16
4616A50k58K25l42N5N1K6K74k58K4K09j14J95l00K07j09l31K54J46Mk45J53k0
4638dJ43P8j90J11o8L9j04k49L23p8NoR5p4p2Q3K62Pl48J28J30k60J25j2j09j63
4664b08M06n17O22p2n47N33l51M23q04P56l65O2p6J90l93L79o8L84j77k27J13
4685F3q9N0N4n9L09k05k87j22L03L39N0m55M1J43m4J39q66Q58k96P1Qj34k95j8
4709d42K66Q28m26o79K17L26k1J8m76J12Q25q46K2J34J73J85k48J23kJj84M42
4731C48k78J76j27j37j92J66J13J4r1j06L39l28j3j45K09J02M1q4J00J7m3J0m7
$$ plain form
4754 44 32 481 428 -74 -162 133 -125 18 424 -567 -349 -696 -384 99 -131 -119 218 -24 -104 -11 30 101 71
4777 71 -322 -160 128 -23 -82 -182 102 -169 -80 -3 180 -267 -34 141 -19 3 45 -54 56 -97 -20 264 -27
4800 -27 -60 -56 -36 192 44 28 -155 -88 191 57 232 129 -51 91 237 -25 -32 5 45 -225 -52 11 58 -33 -491
4825 -491 -165 78 457 403 27 -55 -244 -421 316 682 -389 250 -327 -394 52 -134 94 122 -168 -164 -51 72
4847 72 -358 -20 57 145 56 12 -51 23 -241 -86 -102 -251 92 134 -221 -29 -255 -269 -54 100 -49 39 95 43
4871 43 -59 -151 -149 112 -141 -96 62 22 24 -96 61 13 -100 144 -93 -38 107 66 52 72 43 -112 245 -152 99
4896 99 -62 -28 -88 237 58 11 -66 13 -51 -81 -103 -51 131 38 -113 30 11 -5 -77 -120 -105 153 -107 -31 157 -24
4922 -24 -257 -123 -157 51 -187 -134 322 -101 422 6 -205 177 118 76 -26 204 176 83 -67 -171 80 -209
$$ packed form
4754D4j2M49n3n02q8K95k58J43M06r91K18l47L12M83k30J2L37k42q0R3M1P1l0
4777G1l93J62K88j51n9j00K84k71Q9P7J83m47K33J75j60K2M2r9J10j53P7K84k91
4800b7l3MK0K28j48j6j83O7K79j34J75j03j80J42J46k62pL7M0k70J73O3M7r1m58
4825d91L26K43L79n4l76q2j89j77P37L66j071O39n77o7M46j86K28K8k90MJ13J23
4847G2m30L38P7Q8q9m4o3P4k64J55j6j49L43M2l55J92k26j4K15J54j49Q8N6n2
4871D3j02r2KK61k53M5J58m0Kj20J57m8j13K44k37N5J45m1j4K0k9j55L57l97K51
4896I9j61L4o0L25j79m7p7P9o4l0k2N2J82r3j51J43j9j6p2m3J5K58k60P6J88j81
4922b4k33J34l4K08k38N3M56m23N23m16k11L82n9m2j02K30k8r3j50j04K51k89
$$ plain form
4944 -209 -282 77 107 63 -111 -324 184 131 -183 170 31 202 22 135 -85 -10 4 152 -261 38 94 1 -1
4967 -1 -204 -42 -104 267 181 28 3 -287 -46 -9 94 -286 -71 -16 -54 -169 299 -224 96 34 -167 -115 40
4990 40 9 -63 -156 16 59 -48 62 79 -51 184 156 -46 89 -312 -163 84 -94 110 56 -102 41 -287 -322
5013 -322 -125 110 63 168 -66 -1 138 90 20 -235 -34 4 96 94 -238 -82 -98 141 -311 28 148 45 -23
5036 -23 -11 28 201 23 7 21 -130 -59 -84 -79 -43 -13 87 -176 -153 -199 -170 99 52 17 -277 -127 -74 137 -125 290
5062 290 -50 88 272 -198 79 -55 2 -127 11 -110 112 -159 113 168 -17 -83 23 -118 24 31 56 -53
5084 -53 -82 111 -319 130 -157 207 144 76 -59 9 86 -113 324 -81 138 -110 -75 -65 285 38 -59 114 184
5107 184 -32 -227 -111 11 -11 -49 -80 -442 -32 -12 184 -140 -70 -187 -43 -245 188 16 78 152 -241 80
$$ packed form
4944b09p3L59L0m4j74k13N08n3l14L53j39J71j80J13k20P5J4J48m13K99N6r3k
4967ak03J62o2L71q6j53k5k90K41L7J03l80K15N5l8j15M68n23L20o2k01N2J55
4990D0l1p2r3J72M3j07J10J7j30K35k8k02J35m01J49K47j78K04n4j58J43l28l5
5013c22J97K35m7J05k34O5J39m8p0k55K01L8R2kl32J56j6K39m52L39J20j03o8
5036b3J2L9J73j78j6J4j51P1k5NL6L0J00k63K3m6K9K69m7l5k94J50N3K11k62M15
5062B90l40J38J84m70K77j34N7j29J38j21K22k71K72N5j85o6J06j41J42PK5j09
5084e3k9J93m30M49k87L64o3o8j35O8P7j99M37m05K19k48L5J0L50k47r7J73P0
5107A84k16j95J16J22k2l8l1l62M10K0J96l24P0j17J44k02M33j72O2P4l93L21
$$ plain form
5129 80 -123 -64 179 22 223 -105 134 6 -5 3 356 192 -91 101 -18 50 93 60 135 -271 -60 -78 165
5152 165 -184 -187 53 258 105 35 -203 -174 -21 -310 104 -122 -76 246 -134 225 -217 86 159 -106 -31 -45 120
5175 120 221 -176 -362 33 6 91 -61 191 -306 26 -152 -45 85 28 147 0 302 218 -40 -78 182 -101
5197 -101 -30 190 52 -82 76 -114 199 49 -123 37 37 -8 -236 99 -229 132 -60 -159 -32 96 58 -142
5219 -142 24 -314 109 136 66 85 -27 198 -43 -109 -73 -9 -178 58 159 -50 -84 64 59 -81 -221 68 -17
5242 -17 -129 129 8 -81 -47 261 140 13 98 -60 -103 217 -195 191 267 42 52 237 -63 36 -63 -169 291
5265 291 47 -11 69 -256 281 -83 255 118 23 304 89 46 -30 46 56 17 39 -54 240 159 -303 -123 -45 -63
5289 -63 -85 -124 149 -79 74 -81 57 187 70 110 -106 -41 -432 -44 12 110 312 -250 -171 -21 15 35 -101
$$ packed form
5129H0k03N9K43j57K01l28K39j28j1QL53j64k83J92j19O8M3l3P5m06K11j8K43
5152A65l49lK40K05j53p0k38K9J53k89M14k26M6L22l80L59m42L03P3k65P5j4J65
5175A20J01l97j86L95k7Q5j52K52m97L32j78J07J30n7J19j47L02q4k58l8K60k83
5197a01P1K20j38j34J58j90L13j50j72J60%m5k28L35l28L61j92r9J27J28l8k00
5219a42J66l38M23K7p0J9j12K25k41o6L6O4j69K36J01k09l4J48nj40j40K89q5
5242a7j12K58j21q9L4L08j21j27Q5j58m3L20m12L86P6k25J0J85l00R9r9j06M60
5265B91k44n8Q0l25N37l64L38j37r5K81k15m3p6P6J0l9K2r3K94q1m62J80P8j8
5289f3k2l9K73k28J53j55J38J30j17M0k16O5l91L88N6R8K02n62P9J50L6K0j36
$$ plain form
5312 -101 -112 231 64 -83 83 139 -145 30 -148 -10 69 -5 -209 219 -11 -104 224 -325 89 -117 -72 -199
5334 -199 -18 -65 -71 104 41 -222 164 -164 -224 280 -123 163 27 -68 5 160 -48 22 -310 -17 101 103 -74
5357 -74 -101 -33 228 -64 11 -16 76 108 -68 -37 93 254 -57 -109 -121 15 54 -279 13 -73 37 -74 91 -7
5381 -7 139 17 27 -176 36 -211 218 -110 126 109 -146 -35 -49 52 -5 -121 -40 -15 105 34 -199 132 188
5404 188 -31 -81 -79 70 296 145 130 5 90 75 -218 -5 4 -77 -111 76 254 -24 -112 34 3 -99 141 -184
5428 -184 47 102 104 -170 -80 -223 -135 121 -166 -110 -314 176 55 -27 -94 29 -129 -45 50 68 123 -39 -186 200
5452 200 56 -177 -86 215 -28 23 208 31 194 106 166 -52 -39 -72 240 -32 3 -28 -82 56 144 197 -178 -44
5476 -44 49 165 -25 4 86 125 -275 -15 -6 -224 -51 -16 -21 227 -174 -250 132 -272 127 -161 -106 182 -55 -118
$$ packed form
5312a01j1L43j67j47J66N6k84J75j78J38P9p4k04M28k30r3L28n49M14k06M5j27
5334a99J81m7oJ75o3k63L86l28o0N04m03K86j36r5P3J55k08P0l32K93J18Kj77
5357g4k7O8K61k92P5k7R2L2j76L1J30J61l11n2j2J36L9l33K92q6J10j11J65r8
5381gJ46j22J0k03K12k47M29l28K36j7k55J11j4J01n7j16Q1K5J20p1k33L31N6
5404A88k19n0KJ49K26j51j5j25Q5j5k93K13Rq1l4J87J78k78q8J46l1j02K40l25
5428a84K31N5Kk74R0j43Q8K56k87N6k04M90j21q2o7J23j58Q4R5J8N5j62j47L86
5452B00j44k33R1L01k43N1J85j77J63q8O0k18J3l3L12k72L5l1n4J38Q8N3l75J34
5476d4R3J16j90K9Q2L9m00K60Rk18J73L5nK48m01p6L82m04L99k88N5K88k37o3
$$ plain form
5500 -118 152 -39 157 46 158 25 70 -131 -124 -90 -131 -38 111 -160 -26 41 -85 183 -55 110 113 -183 -243
5523 -243 -31 9 93 -242 -219 -96 43 24 142 -63 -176 223 253 159 -283 97 -257 28 -31 125 -367 6
5545 6 -146 97 188 -108 39 115 165 166 123 140 127 218 72 -189 57 -63 33 -253 14 5 -320 50 -65 -96 43
5570 43 245 99 151 78 -4 60 -121 -26 64 117 326 145 -12 21 167 23 190 -17 21 52 -73 42 -51 -73
5594 -73 226 -34 -155 -140 211 -54 60 262 -12 -12 -217 13 -11 -25 -46 36 -10 -77 -210 -93 137 139 -66 219
5618 219 -143 53 134 188 -139 93 134 -51 -24 28 283 77 87 122 -60 -102 236 411 -24 -185 342 30 -105
5641 -105 110 -160 -39 29 -16 63 225 40 -345 -87 -106 122 146 -114 -32 98 -56 -28 -15 -95 -47 91 156 36
5665 36 -268 8 -233 77 -249 24 -42 -3 -43 33 116 -52 -148 -44 -50 -132 -156 80 -28 -54 -139 81 147 -221 121
$$ packed form
5500a18K70j91J96j11J12j33M5k01PL4m1R3J49k71J34O7j26K68k38J65Lk96o0
5523b43K12M0Q4l35K3J23J39j9J18k05j13L99L0r4m42L80l54K85n9J56m92L73
5545Fj52K43R1k96J47P6N0Jm3J7j3R1j46k61K46j20R6k86K67rl25L70j15l1J39
5570D3K02j46N2p3q2O4j81R5R0N3K09j81j57L3J46j44J67k07L8L1j25J15r3k2
5594g3K99k60j21J5L51k65J14K02k74%k05K30k4j4k1Q2m6o7j33J17K30Kk05K85
5618B19l62J96Q1N4l27K32M1j85K7N2K55k06J0L5j82m2L38J75m35j61N27l12j35
5641a05K15k70J21O8m5P9J62j85l85K58j9K28K4k60Q2J30j54K8J3q0M8J38O5j20
5665C6l04K76k41L10l26K73o6L9m0P6Q3j68r6J04oq2k4K36j08k6q5K20O6l68L42
$$ plain form
5690 121 -204 -143 -67 -40 -188 48 -78 150 -60 42 -196 60 -2 -42 -206 -84 -144 -129 -325 -123 14 94 -74
5713 -74 -211 -46 45 -253 56 -104 50 97 124 133 -224 -12 14 -80 77 182 -228 93 -150 110 -63 -74 29
5736 29 -64 -140 -115 -295 -184 -42 -73 71 64 76 122 -48 120 -210 -96 155 154 -10 82 -112 151 -41 28 -51 -155
5761 -155 94 14 111 -76 59 -232 12 -135 -81 27 -27 144 -26 -6 -53 -101 135 134 -30 -93 86 54 141 -159
5785 -159 100 -68 -10 133 -128 -175 112 -131 -32 -112 126 93 45 7 325 193 -300 103 -173 -104 301 -65 330
5808 330 -172 127 -43 95 -165 -74 -98 -49 159 -78 49 132 23 -66 -56 -126 227 -49 -173 -422 -16 131
5830 131 16 98 43 187 -133 128 102 115 274 189 -275 -171 144 -12 199 -31 40 193 -38 36 275 -90
5852 -90 199 133 -25 110 43 146 -179 62 -70 -243 -86 -219 107 89 -114 -3 31 92 116 -18 -51 325 77
$$ packed form
5690A21l25O1P6K7j48K36j26K28k10J02k38K56o2m0j64J22o0J5j96K02J37Q0j68
5713g4j37J65R1k98L09j60J54M7K7Rl57K12K6r4J57J05m10L21k43K60j73j1J03
5736B9r3p6K5j80J11J42l1J44pJ2M6j70J68l30J14K51jj64R2j94K63j92O9p9j04
5761a55K49q0R7j87J35k91K44j47N4J08n4J71j70K0m7m8K36jj64o3J79l2Q7l00
5785a59K59j68N8J43k61m7K87k43R9q0K38l3m8l8L18j32m93M03k76O9M05l66L95
5808C30n02K99j70J38k60R1k4M9K08k37J27Q3j09q9J0p0L53k76j24k49M06J47
5830A31j15Q2n5J44l20K61k6J3J59q5m64J04L15j56K11k30P1J53k31P4K39l65
5852i0K89o6j58J35o7J03l25K41j32j73J57j33L26j8k03J11L4O1K4j34l3L76k48
$$ plain form
5875 77 -29 106 -139 -114 203 58 -190 -81 312 13 -448 67 93 132 3 -2 -207 126 45 -91 -124 -153 -1
5898 -1 126 -62 -16 -286 104 -35 25 -87 -134 173 96 -64 59 111 130 90 70 48 -211 -138 96 215 -82 87
5922 87 30 78 12 2 59 42 0 -336 -75 161 55 127 -26 96 137 0 274 163 145 82 13 77 281 46 -185
5947 -185 -235 -55 -34 218 18 -203 -140 -73 25 147 -131 -122 -20 208 118 -369 159 26 51 137 230 210 -79 73
5971 73 144 -118 115 61 96 142 -127 -14 -83 278 85 -36 -133 97 127 115 128 70 -102 -138 177 -159 132 -74
5995 -74 49 -198 122 61 83 82 139 148 17 -217 -132 63 118 -204 -59 -126 222 123 217 -210 166 -14 47 -78 -202
6020 -202 145 -99 -59 -137 -49 44 -71 141 14 109 -221 210 201 218 564 -74 17 -80 -17 114 -81 35 -84 -8
6044 -8 187 21 -82 33 -114 -127 -58 108 183 161 -64 -210 -69 -259 58 74 -100 73 -282 -95 243 -195
$$ packed form
5875G7j06J35k45K5L17j45k48J09L93k99m61N15K6L9j29nk05L33q1j36l3k9J52
5898aJ27j88M6k70L90j39O0j12m7L07p7j60J23N2J9m0k0k2k59P3K34J19k97J69
5922H7n7M8o6j0N7j7m2l36K61K36j06P2j53J22M1j37K74j11j8o3o9O4K04k35k31
5947a85n0J80K1K52k00k21O3O7R8J22k78RJ02K28r0m87N28j33K5Q6R3k0k89J52
5971G3P1k62K33n4L5M6k69J13o9L61j93j21r7K30L0j2J3n8j72l6L15l36K91k06
5995g4J23k47L20o1K2jN7Rj31k34Q5J95N5l22J45o7L48r9R4m27L76j80O1j25j24
6020b02L47k44M0p8Q8R3j15K12j27R5l30M31rJ7L46o38R1r7O3J31j95J16j19P6
6044hJ95j66j03J15j47j3O9J66P5k2k25j46J41j90L17J6j74J73l55J87L38m38
$$ plain form
6066 -195 -98 32 -94 296 -161 153 -132 -314 -51 -186 -42 -80 -170 158 -111 -35 -46 200 30 -116 167 -13
6088 -13 -431 -33 107 -39 -157 197 -193 4 -159 -120 96 47 -115 92 -72 -33 173 40 -118 114 -14
6109 -14 29 134 -235 49 99 -22 -119 -41 4 268 120 69 -300 -112 390 24 21 -71 -156 142 -22 -244 44 18
6133 18 64 100 24 79 235 45 -16 -11 120 124 50 -122 89 274 -22 53 -124 -44 10 181 -52 91 -174 40 67
6158 67 118 -186 59 -77 54 79 -90 38 -98 294 -174 162 -215 -120 -113 0 -77 225 133 -14 0 -268 146
6181 146 267 -9 -224 -8 221 223 242 -200 -149 -95 -116 -169 -42 -92 85 236 66 -142 101 -37 9 87 -58
6204 -58 45 -133 76 0 -137 -128 -130 30 -179 -146 -14 60 -107 -237 336 116 19 -20 -150 90 -234 -68 -126 118
6228 118 -303 -472 36 -52 -6 371 -12 -114 34 -123 63 20 -77 229 -188 -16 -181 -210 73 21 15 91 80
$$ packed form
6066a95R7J30j26L90m57L14k85j82K63j35J44l8r0L28k69P6j1K46j70j46K83j80
6088a3m18L98J40j46j18L54l90J97j63L9K16m9j62K07j64L9K06j33j58K32j28
6109a4M3J05l69K84N0j21r7P8M5K64j48n1l69J88N02l66lr2q5K98j64k22K88k6
6133A8M6L6p6N5J56j90o1NJ31Mp4j72K11J85k96P5j77Q0N4J71k33J43k65K14K7
6158F7N1l04K45j36J31K5j69J28j36L92m68L36l77R5PJ13p7L02r2j47J4k68M14
6181A46J21k76k15K16K29KJ9m42N1N4k1n3J27n0J77J51j70k08K43j38M6P8j45
6204e8J03j78K09p6j37RkJ60k09L3J32P4j67j30N73k20r7l9j30K40l24J66n8K44
6228A18m21j69N08q8M6L77l83j02J48j57J86m3r7L06m17J72j65k9K83n2oP6j1
$$ plain form
6251 80 -26 44 142 154 -37 86 -48 -68 133 -184 77 70 -23 67 -211 -23 22 170 -1 -9 -62 116 265 100
6275 100 58 -50 -2 91 47 -18 -277 258 -57 -44 74 73 -43 118 -28 18 117 -215 -60 -183 66 59 -432 -89
6299 -89 146 -199 13 -63 -313 154 184 167 160 -18 -46 -272 3 205 134 -64 -133 86 94 -39 119 -109 268 43
6323 43 -45 43 15 -4 78 67 -22 -8 137 137 40 127 23 96 -42 -64 162 354 -240 -265 -159 68 -38 152 -114
6348 -114 -77 -171 293 -185 -195 58 -96 -47 -44 115 41 92 -186 -18 55 156 138 -6 -36 -101 0 -109 73 -90
6372 -90 -73 42 -43 145 153 -304 85 177 -116 311 -9 98 -78 91 -41 50 26 160 1 152 311 -194 -288
6395 -288 -191 11 146 44 80 37 -43 234 -76 31 51 96 248 170 -162 142 67 32 -175 -205 -172 -38 -53 -109
6419 -109 -59 -7 -74 217 -34 -265 -21 -169 79 127 -270 81 -4 -130 -138 31 29 26 -106 17 -78 172 206 -17
$$ packed form
6251H0j06P0R8J2j91J23j34k0K01l17K61pr3R0k78J88M5J48j71qn3J78J49j65
6275A00m2j08M8R3m4o5k59N35l15J3J18jj16J61j46M6R9l32J55j23K49pm91L43
6299h9K35l45K12p6k50M67L0j7pj78k8k26K75K02p1j98o9K19Qj33J58k28L77k25
6323D3q8Q8k8j9Q2j1q9J4J45%r7Q7j04P3j38k2K26J92n94k5J06K27j06J90k66
6348a14L7r4M64m78j0K53j54M9LJ59p4N1k78J68P3J01j8j44l0o5J01j09J82j63
6372i0J7J15q5J88Qm57L89R2k93M27l20J07j76J69j32R1k4J34j59J51J59n05r4
6395b88R7K02J35j02L6m3q0K77l10J07K0M5J52p8l32L04p5l5k07l0L3J34j5n6
6419a09N0N2o7K91k51k31K44j48K48M8l97L51q5j26qJ69klj32J23r5K50L4k23
$$ plain form
6443 -17 -237 124 -173 -13 158 -103 159 104 162 86 -40 157 -336 -85 283 -142 -24 6 -79 163 53 -27
6465 -27 -125 232 -179 -2 -128 199 29 115 -108 160 -136 -199 133 167 -120 12 194 -143 -101 -209 60 59 4
6488 4 96 17 -91 -246 -7 -133 -113 10 -83 -140 -99 117 87 363 -105 -157 -297 82 63 -132 -199 -161 -217 -11 -269
6513 -269 -7 -84 70 -53 165 58 43 -344 -28 -15 -79 67 31 -55 -65 195 247 -9 -47 -89 -41 -51 13 -56 -96
6538 -96 48 91 -168 -132 -59 -211 260 66 3 -170 201 -190 36 25 56 -317 -249 -4 -127 79 0 26 45 -51
6562 -51 132 67 59 57 139 -5 -179 247 -52 53 94 305 55 -111 -2 -80 -29 305 -256 -141 -78 50 -198 -45
6586 -45 -132 -416 89 -301 -157 -105 -143 262 -171 192 112 210 -88 -12 -77 9 -42 46 148 29 125 62 -179 -11
6610 -11 -85 39 103 -7 30 95 -2 45 -198 -74 122 136 82 45 147 -8 -38 -140 78 48 -176 63 -55 105
$$ packed form
6443a7k20L61k97J60J71k61K62n5N8p6j26J97m93K51L68m25J18L0q5K42j10q0
6465b7r8L57m11J77j26L27j70Q6k23K68k96o3L32L4k87J32J82l37M2j08K69jn5
6488DR2p9j08j55K39j26K0J23r3n7M1K16l0K76m68n2j40L79j9j95o7L8n6K06k58
6513b69K62p7J54j23K18j07j5l87L16J3o4J46l6q6j0K60N2k56l8m2M8j0O4o9m0
6538i6J44M3k59L6P3j52M71j94o3j73L71l91K26j1L1l73O8K45j23K06p9K6J9r6
6562e1J83o5qkQ2j44j74M26k99J05M1K11k50j66J09p8N1L34n61J15O3J28k48J53
6586d5q7k84N05l90J44N2l8M05m33L63q0R8k98P6o5Q6n1Q8J02j19R6o3k41J68
6610a1p4J24O4j10L7O5r7M7k43J24J96J4n4l7J02j55l0j02K18l0k24K39j18J60
$$ plain form
6634 105 -29 -118 143 333 171 -159 62 -44 -57 -185 50 -185 -196 -43 220 26 41 -12 63 17 109 42 -137
6657 -137 -208 -224 -166 -95 9 189 92 -168 -177 -262 50 -174 4 49 -2 239 18 -266 90 -44 118 132 20 300
6681 300 -75 -67 -36 62 -234 9 140 -307 -166 360 -80 -38 -26 181 208 179 -4 -80 66 81 202 37 110 -132
6705 -132 105 73 -31 5 -128 -20 118 102 22 79 -26 142 -300 345 107 25 -170 -6 182 -221 28 -75
6727 -75 90 70 -50 112 -13 -254 338 174 98 -119 -24 -7 -43 -109 233 223 -27 179 -116 -125 -27 278 -105 42
6751 42 19 -13 288 5 -248 124 -17 230 117 4 -35 43 -19 -75 151 -139 102 -325 35 28 135 -240 -14
6774 -14 -245 -44 -37 -11 246 195 -122 15 -101 -162 71 62 -214 92 215 19 -260 -52 -61 5 -207 380 -64 -78
6798 -78 49 146 67 167 143 126 18 -155 125 69 -58 60 -104 127 121 -2 19 -144 6 -59 17 83 -134 17
$$ packed form
6634A05j34q9K61J90j62l30K21j06j3j28K35k35j1J53K63j94J5n3P5m6R2o7j79
6657a37p1j6N8P1J04J80r7k60rq5L12k24J78M5n1K41k21k84L56j34J62J4j12K80
6681C00l75QL1R8k96K43J31m47J41N26m40M2J2K07K7k9j83p6J46J5J21j65P3k42
6705a32K37l2j04L6j33J08J38j6q0N7j05J68m42O45k38q2j95J64J88m03K49j03
6727g5J65k0j20J62j25k41N92j64p6k17R5J7l6o6L42j0k50K06k95rR8L05l83J47
6751D2k3l2L01k83k53L72j41K47j13j13l9P8o2n6K26k90K41m27L60pJ07l75K26
6774a4k31K01PK6K57n1l17J37j16o1K33rk76L06J23j96k79K08rO6k12N87m44j4
6798g8J27R7p9J00k4j7j08j73K80n6j27J18j64K31oj23K1j63J50o5P6O6k17J51
$$ plain form
6822 17 10 -19 -114 80 159 153 142 -97 242 107 -40 65 -84 169 -5 -40 -3 81 -298 -229 268 -22 184 89 104
6847 104 62 221 -29 36 29 21 37 144 1 38 85 -58 93 -130 -77 -51 -59 53 -158 -257 -191 40 -130 81 -217
6872 -217 -40 -157 133 -241 -222 -81 111 -4 -173 -45 -23 -113 -192 174 42 88 94 -242 -66 -120 100 206 -70
6895 -70 99 108 98 151 113 -232 107 -73 54 -108 -64 -2 -140 -2 -192 52 41 -17 89 209 -25 75 72 116
6919 116 -255 -176 212 -179 115 138 75 9 84 -130 -107 21 -4 84 212 -37 -119 -115 -55 14 16 -34 -186 -15 147
6944 147 -56 103 -162 -128 87 87 -205 36 99 -105 -79 100 -136 -167 283 69 26 49 -132 24 190 83 25
6967 25 -104 -146 89 18 9 -111 -49 45 93 98 31 -45 150 183 20 331 -36 -10 75 -28 266 9 20 -21 -32 93
6993 93 28 104 26 212 -39 -126 -119 94 -58 -92 -81 -33 70 -51 -194 -97 -54 155 98 -47 193 -39 -31 -218 233
$$ packed form
6822A7pk9r5J94P9oj1k39L39j35j47J05j49K53j74l5L7Q4l79O9M97k90K06r5J5
6847A04m2J59k50O5pqJ6J07j43L7M7j43J51k23N3K6qJ12k11r9O6K31j70K11k98
6872b17J77j17K90l74J9J41J92j15j69J28K2r0p9L66j32M6Ol36J76n4K20J06k76
6895g0J69Rj0N3l8l45L39j80J27j62M4O2j38J38j90K44j1n8J06J20k34J00lM4
6919A16l71P9L88l91K94K3o3o6P5k14K3J28k5Q8J28k49q2MO0O9Kn0j52J71J62
6944A47k03J59k65L4K15%k92K41O3k04K6J79k36l1M50k14m3K3j81J56J66j07n8
6967B5j29m2K35p1rj20O2R4M8No7p6J95L3j63L11l67K6Q5j03K94k57J1m1j1J25
6993I3o5P6p8J86k51q7PK13j52l4J1M8J03j21j43R7M3K09n7j45K40k32Qj87M51
$$ plain form
7018 233 -2 -91 206 130 54 80 -57 8 -101 119 116 106 -172 37 83 96 63 -143 -67 -185 -98 -215 239 78
7042 78 30 295 -8 -97 -159 -119 -115 193 22 -31 -44 85 11 -211 -114 -190 2 -33 156 -10 29 148 -66 -48 -87
7067 -87 134 223 2 -86 189 132 217 -125 33 -121 -28 38 -151 4 252 -249 -49 -165 -81 -37 -80 8 -272 57
7091 57 261 -44 -6 128 211 211 64 87 33 -64 106 -98 -1 -245 143 83 -163 -138 -353 15 145 147 -160 124
7115 124 254 292 -43 -287 1 -73 -61 -128 -32 147 -67 116 58 -65 94 -135 -86 -120 -33 -18 -102 -31 239 -139
7139 -139 104 -130 -45 -30 -33 -217 25 -45 -267 -189 246 -70 120 170 197 -49 -60 -38 55 131 -38 210 31 83
7163 83 77 224 -197 -247 121 -123 -28 90 -68 -158 -172 -55 340 -154 37 15 30 284 -86 80 -7 58 -29 -10
7187 -10 -304 -80 127 -252 -221 -42 243 -107 135 117 164 251 -105 99 41 -105 -73 40 325 -71 124 -206
$$ packed form
7018B33k35q9K97p6p6K6j37O5j09K20lj0k78K09M6J3l3k06P6j18Q7j17M54j61
7042G8m8K65l03q9o2M0ML08j71n3j3J29p4k22R7p6J92l5J89j66L9J19k14J8l9
7067h7K21Q9k21q8K75n7Q5l42J58j54R3O6j89J55K48n01K00j16Q4M4m3Q8k80L29
7091E7K04l05L8J34Q3%j47K3n4r7J70k04R7k44L88o0k46K5k15L68J30Kl07K84
7115A24J30L8l35k44K88p4J2o7R6J79k14J83n8j23J59k29M9l4Q7J5q4P1K70l78
7139a39K43k34Q5J5lj84K42p0k22P8M35l16J90N0K7k46j1K2R3P6j69K48j79N2
7163H3oJ47m21n0L68k44R5J18j58r0j4J17L95m94J91k2J5K54l70J66q7O5q7J9
7187a0k94K24K07l79L1J79K85l50K42j8M7Q7l56K04n8j46L2J13K85l96J95l30
$$ plain form
7209 -206 -75 -201 -188 -54 -66 56 115 -223 3 -13 64 -32 9 -37 -26 -102 -335 96 158 175 -120 -203 -236 46 -85
7234 -85 -1 -46 -235 -277 -34 63 76 191 -27 -37 97 -182 -39 -21 -77 -123 31 -10 138 250 24 -24 146 71
7258 71 310 -83 -189 128 22 196 373 -35 -70 -67 145 97 -6 31 -43 64 -267 -138 -253 -46 41 -241 375
7281 375 -27 -26 -20 153 -3 -108 -19 -18 -10 84 -137 11 -151 199 -279 -100 316 -142 7 -63 -278 -45 -82 -35
7305 -35 96 -286 -30 252 -108 61 115 -190 428 117 49 -103 -101 -18 193 94 134 -322 -158 -120 57 -70 -85
7328 -85 -135 225 50 100 -103 -184 136 -95 -32 -178 -53 185 -226 -22 6 76 -247 -82 34 55 -215 50 -173
7351 -173 38 -66 -12 -191 99 29 1 -83 9 220 147 316 86 56 -160 -258 -172 139 -42 -244 9 184 -258
7374 -258 148 -51 -194 133 -250 -123 72 64 89 -291 99 -143 281 -45 -41 -80 -309 93 -171 -30 211 -27
$$ packed form
7209b06J31j26J3J34j2J22N9l38K26j6P7r6M1m6J1p6k33M31O2J7k95q3l3K82j31
7234h5Q4m5j89m2K43R7J3J15k18j0J34k79J43J8n6m6J54m1J48J12k26m8J70p5
7258G1K39l93j06L17j06J74J77m08l5LK12m8j03L7p4J07l31J29j15K07Q7k82O16
7281C75m02JOJ73j56j05Q9JQR4k21J48j62L50m78J79M16m58J49p0k15K33l7M7
7305c5J31l82K56K82l60J69N4l05O18l11o8j52KQ3K11r9M0m56J64L8J77j27j5
7328h5n0L60j75N0k03q1L20k31O3j46J25K38m11K04K8P0l23J65J16K1k70K65k23
7351a73K11j04N4j79K90p0k8q4R2K11p3J69k30l0k16r8Q6L11j81k02K53J75m42
7374b58M06j99j43L27l83J27J95qK5l80L90k42M24l26Ml9k29M02k64J41K41k38
$$ plain form
7396 -27 192 0 -241 254 -56 87 -60 9 64 -61 -48 -214 -284 -243 21 -146 -32 -24 48 15 10 45 -81 300
7420 300 201 -84 175 -74 195 -173 21 121 -41 -25 128 162 20 82 50 -74 138 -11 -117 323 -124 35
7442 35 -175 -16 137 -204 187 137 117 93 -103 -138 -67 46 37 -60 76 69 155 -209 -125 53 180 4 -127 -47 26
7467 26 -190 -41 -27 92 235 60 -67 173 72 -113 200 10 -66 -245 -173 202 60 72 87 17 75 39 -17
7490 -17 -42 -169 -292 126 47 64 -218 -3 -111 85 48 -59 40 91 44 95 -104 -71 152 -85 -180 182 147 100
7514 100 -116 -3 274 -59 145 81 18 74 -188 -72 -24 -153 119 -88 -163 -38 -66 66 -29 -162 35 -282
7536 -282 -51 -12 -33 -164 -97 138 43 140 127 -49 -31 28 -92 -30 4 -107 -79 -87 -59 29 -336 108 33 13 -234 -21
7562 -21 -108 -18 50 -22 -61 117 -90 95 161 251 69 82 -11 -20 198 151 125 130 -14 -120 115 45 62 -37 -16 -19 -34 -255
$$ packed form
7396b7K19j92k41M95l10J43j47O9N5j25J3j66p0M1K64j67J14QP2l3nL5j26L81
7420C00r9k85K59k49K69l68J94J00j62J6J53L4j42O2l2j24K12j49j06M40m47J59
7442C5k10J59J53l41L91n0k0k4j96l5P1J13rr7J36pQ6l64Q4J78J27j76j31Q0P3
7467B6k16J49J4J19J43j75j27K40j01j85L13j90p6j79P2L75j42J2J5p0N8l6n6
7490a7k5j27j23M18p9J7k82K15j08J96l7j07R9N1m7N1j99L3K23k37r5L62l5m7
7514A00k16J13K77l33K04o4o3N6k62J16M8j29K72k07p5J25k8J32r5j33J97l17
7536b82K31L9k1j31O7K35r5R7j3j76J8N9j20O2L4j11K8qK8Q8l65M44p5k0k47K13
7562b1q7R0O8p2l9J78k07J85O6R0j82J3r3rK18m7k6Nj44j06K35p0J7r9K1lj5k21
$$ plain form
7590 -255 116 32 81 97 27 42 -95 -147 -53 -22 -424 -70 54 52 -63 -13 -10 162 2 89 -195 44 246 14 259
7615 259 -170 41 129 95 52 289 125 130 15 -37 -1 81 -8 -23 -36 127 -6 -61 97 -149 132 -46 -167 237
7639 237 125 206 113 -266 -3 222 -4 67 48 48 -286 208 12 159 -112 99 -60 141 -57 -26 -19 -160 -352
7662 -352 61 -118 233 175 86 -226 286 -39 -42 99 -3 221 182 -39 -347 54 -244 181 14 154 170 -246
7684 -246 -47 -84 61 -314 9 -30 146 -363 -11 -112 -136 -12 251 98 93 103 30 176 -5 -17 43 114 -151
7707 -151 71 -37 51 232 31 -274 -75 6 108 -112 -164 -34 93 134 116 -59 -174 209 25 194 10 127
7729 127 -19 -151 -36 -26 -54 36 79 -109 74 -177 58 131 88 179 -19 55 -196 171 -173 -154 -58 -250 -14
7752 -14 209 -123 -250 -118 94 -98 -194 -48 200 47 77 -22 -345 -13 29 228 10 -249 114 110 -20 -171
$$ packed form
7590b55L71q4M9J6p0J5j37n2R4L1m02L54J24kj15N0LJ72j60Q7k84K39K02k32K45
7615B59m29K11Q8l4m3K37j64Nj15n2L6Q2q9j5j3J63j33n5J58k46K81j78j21M04
7639B37j12Q1r3l79K63K25k26P1j9%l34M94j96J47k71K11j59K01j98L1Pj41j92
7662c52M13j79L51n8q9l12N12l25lJ41j02K24l9k21l08M01k98M25j67J40J6m16
7684b46J99l7J45l75L23l9J76n09L52j01k4J24K63j53nJ0p3J46j81j2O0P1k65
7707a51K22j08Q8J81k01l05J99Q1J02k20n2J30J27M1j8j75j15L83j84J69j84J17
7729A27j46j32J15J0k8R0M3j88J83k51K35P3m3R1j98P4k51L67l44J9R6j92K36
7752a4K23l32j27J32K12j92r6J46K48j53L0r9l23L32M2J99k18k59L63mj30j51
$$ plain form
7774 -171 70 -73 -71 -238 83 101 251 336 -18 107 -278 -231 -46 -252 36 -58 15 158 119 120 171 -124 78 -126
7798 -126 -303 -176 -55 -220 103 -49 45 -228 -36 139 5 -93 226 -20 194 179 -113 172 -179 39 -76
7819 -76 -1 28 -60 -152 255 -31 70 151 129 403 137 32 183 -127 274 272 11 -86 31 165 -99 18 84 76
7843 76 96 123 -59 -63 125 -112 37 51 29 -55 1 119 42 -173 -211 -109 154 96 -4 -281 217 -99 77 -4
7867 -4 -79 157 23 -25 204 210 170 -219 174 -36 -204 -268 -14 63 -12 60 29 194 26 -80 -114 -98 24 164 46
7892 46 39 -127 5 174 207 -190 -174 -271 52 -228 -241 -90 -27 -82 -145 278 209 -95 -74 83 55 16 -276 232 -25
7917 -25 -96 -69 170 66 133 -14 -248 99 -49 176 -23 87 251 -41 204 -50 -136 -91 47 -166 76 186
7939 186 -21 111 5 39 134 102 -32 -12 9 102 -148 -188 201 -159 261 284 157 150 -257 -298 37 -269 -297 33
$$ packed form
7774a71K41j43Kj67L21J8J50Q5l54J25l85M7J85k06K88r4P3J43l9JN1k95K02k04
7798a26j77J27J21j65L23j52R4k73J92J75j34r8L19k46K14j5k92K85l51K18j15
7819g6P5K9q8r2M07k86J01Q1k2K74k66j05J51l10M01kk61r7J17J34k64J17O6q
7843G6K0K7j82mJ88k37J49J4k2q4N6J18p7k15l8J02K63n8j00k77M98l16J76q1
7867dp5K36j34m8K29Om0l89L93k10j68o4K54P7p5P2l1J65j68j06l4J6J22J40j18
7892D6pj66J32J69L3l97J6r7L23k80j3J51O3n5o3M23o9l04K1J57k8l9k92N08k57
7917b5p1K7K39j04O7j47k34L47j48K25j99J10J64k92K45k54q6M5J38k13K42J10
7939A86k07J32j06L4R5l2j34K0K1R3k50m0L89l60M20K3j27pm07m1L35l06k8L30
$$ plain form
7963 33 -25 175 -141 -232 180 -5 25 -30 -69 217 104 3 -69 82 85 19 -85 -350 -102 -111 137 134 -166 36 48
7988 48 269 -35 -81 83 103 20 -98 -111 -90 -62 87 201 260 -239 7 33 -9 93 259 4 93 240 -299 -272
8012 -272 172 340 272 -193 -110 -170 -99 52 51 26 122 154 13 -84 -274 -229 66 -90 56 -68 -86 -77 -201 -98 68
8037 68 -67 -77 15 -219 126 28 124 164 119 -6 113 233 -47 91 230 -144 -48 55 2 -143 -108 52 90 -173
8061 -173 88 -234 160 109 -9 -95 -36 93 86 -65 -270 -173 -89 -181 -163 -119 -48 -79 191 3 -42 -544 -158 -15
8085 -15 -64 23 121 -102 47 -53 125 -66 -54 8 169 -69 -32 39 165 -100 -68 -300 -9 239 -11 -47 67
8108 67 190 -145 -79 185 400 -276 -40 51 -163 26 -74 155 191 151 109 97 65 105 -274 29 -42 215 66
8131 66 -61 81 -107 -123 -173 120 -129 346 145 90 -50 20 -87 60 -35 310 -7 -78 0 58 213 50 54 -20
$$ packed form
7963C3n8K00l16r1M12j85L0n5l9K86j13j01p2J51Lo6j04k65K48rK48ll00K02J2
7988D8K21l04m6J64K0q3j18j3K1K8J49J14N9m99K46K6m2J02J66k55Q9J47n39K7
8012b72M44J68o8m65Q3o0P1J51jk5R6L2j41r7j90M5K95j56J46j24j8Rj24J03J66
8037F8j35j0R2k34L45r8R6M0m5j25J19J20k80J38J39l74R6J03n3j45L5J60L8k63
8061a73K61l22L94n1j18q6N9J29pj51k05R7Q4r2J8M4P1l1K70j88m5n02L86J43
8085a5m9Q7R8k23J49j00J78j91J2O2J61k38L7P1J26k65L2k32K91K48k50l6J14
8108F7J23l35O6K64K15o76K36R1k14J89j00K29L6m0m2j2l2M0l79L03p1K57j49
8131F6j27J42j88j6n0K93k49M75k01n5j40P0j07J47r5L45l17p1P8N8J55j63Mp4
$$ plain form
8155 -20 288 15 8 -29 161 249 349 -122 177 -255 -37 156 12 -101 80 -10 306 91 74 119 165 86 -37
8178 -37 5 -52 -164 41 -17 -32 166 69 218 -137 -28 -57 -99
$$ packed form
8155b0L08k73pl7J90Q8J00m71K99m32K18J93j44j13J81r0L16k15j7M5M6p9j23
8178c7M2n7j12K05n8j5J98r7J49l55J09k9m2
8191i9
$$ Imaginary data points
##PAGE= N=2
##DATA TABLE= (X++(I..I)), XYDATA
$$ plain form
0 0 0 0 0 0 0 0 0 0 0 0 0 0 0 0 0 0 0 0 8 -8 8 -8 8 -8 14 -16 16 -19 24 -24 30 -32 38 -43 48 -54 62 -70 78 -86
40 -86 94 -105 116 -129 141 -156 173 -191 208 -230 253 -280 308 -341 378 -418 465 -519 584 -658
60 -658 749 -863 1009 -1203 1475 -1882 2560 -3895 7502 -37074 -102704 884 59459 17647
74 17647 -39413 -29081 13856 24116 567 9064 1897 -25055 5860 41585 14646 -17341 -26943
87 -26943 7546 38757 -257 -25575 1772 5393 3214 12310 5552 -2866 -5162 4143 26255 9501
101 9501 -23068 -642 20623 -4694 -9091 5820 -385 -11397 -13076 10378 23150 -21058 -29585
114 -29585 21073 24522 -10972 -20310 -3839 18389 2588 -24175 -3163 9259 -15911 -11653 9683
127 9683 -570 -15924 -10942 12283 17975 -19673 -22928 25331 21369 -19985 -17968 5845 18510
$$ packed form
0@%%%%%%%%%%%%%%%%%%Qj6J6j6J6j6K2l0L2l5M3m8N4o2P0q1R1j02J16j32J48j64
40h6J80j99K21k45K70k97L29l64L99m38M83n33N88o49P19p96Q83r84J103j242
60f58J407j612J872k212K678l357M442o455J1397m4576o5630J03588N8575m1812
74A7647n7060J0332M2937J0260k3549Q497p167k6952L0915L5725k6939l1987r602
87b6943L4489L1211l9014k5318K7347L621k179R096o758q418k296R305K2112j6754
101I501l2569K2426K1265k5317m397J4911o205j1012j679K3454J2772m4208q527
114b9585N0658L449l5494r338J6471K2228j5801k6763K1012J2422k5170M258K1336
127I683j0253j5354M982K3225N692l7648l255M8259l962m1354K017K3813J2665
$$ plain form
140 18510 3129 -23327 -6159 14101 1605 1695 1905 -10211 2483 17946 10766 -1574 -11716
153 -11716 1051 25249 6966 -16477 -1275 7396 2059 3882 -374 -576 -1531 -5336 15299 17295
167 17295 -16003 -12585 15842 14209 -2420 -13027 -4288 11568 -2570 -12912 5614 2004 -14393
180 -14393 -4641 7365 5973 -4778 -15950 1030 15972 -3658 -10476 -721 -5482 -2022 3861
193 3861 -3305 -6800 -11363 -4407 14886 1552 -18904 -2881 10990 5682 -303 -6846 -367 8581
207 8581 -1135 -547 5043 -6654 -3375 8404 2563 -1429 -1701 -108 10783 4377 -5937 6878
221 6878 7862 -3936 1968 4163 2197 1114 -6211 1297 9697 -4559 -6088 7171 1228 -1879 2060
236 2060 976 2619 -1386 -5077 7018 4104 -9655 -2982 2371 -2129 -1765 -6736 -4201 3586 -4356
$$ packed form
140A8510j5381k6456J7168K0260j2496R0K10j2116J2694J5463p180j2340j0142
153a1716J2767K4198j8283k3443J5202Q671n337J823m256k02r55l805K0635J996
167A7295l3298L418K8427j633j6629j0607Q739J5856j4138j0342J8526l610j6397
180a4393R752J2006j392j0751j1172J6980J4942j9630o818R755m761L460N883
193C861p166l495m563O956J9293j3334k0456J6023J3871n308n985o543O479Q948
207H581r716N88N590j1697L279J1779n841l992k72J593J0891o406j0314J2815
221F878R84j1798N904K195j966j083p325P508Q400j4256j529J3259n943l107L939
236B060j084J643m005l691J2095k914j3759O673N353m500L64m971K535P787p942
$$ plain form
251 -4356 -5450 3153 -3329 -4162 3241 -1246 -3431 -1054 -3715 3253 -622 -10063 574 5266 -5183
266 -5183 -2530 290 831 3396 -2555 -1576 7908 574 -2145 5237 592 -1491 2848 -966 1509 2400
282 2400 -3771 3610 5123 -3278 2237 5696 740 2925 1050 1194 6536 -799 -3530 5398 803
297 803 -3017 2280 -892 -927 1172 -2456 1791 2394 -5453 965 4731 -3352 -1944 27 -2411 1842
313 1842 -3042 -6116 1619 -1907 -5012 847 -2565 -3697 1492 -2017 -845 817 -4669 568 3682
328 3682 -4844 -2242 2043 -2300 -42 -1112 -3021 3400 -5 -3627 4267 1816 -1334 4057 969
343 969 383 4183 -505 1217 3939 -2246 965 4429 -1625 441 2543 -24 3713 2101 -1777 4773
359 4773 3057 -1984 3117 1384 -1400 2009 -235 -1380 1787 -3454 -1125 2769 -2818 -1624 1187
$$ packed form
251d356j094Q603o482q33P403m487k185K377k661O968l875r441J0637M692j0449
266e183K653K820N41K565n951R79R484p334k719P382m645k083M339l814K475Q91
282B400o171P381J513q401N515L459m956K185j875J44N342p335k731Q928m595
297H03l820N297l172l5K099l628M247O03p847O418L766q083J408J971k438M253
313A842m884l074P735l526l105N859l412j132N189l509J172J662n486N237L114
328C682q526K602M285m343K258j070j909O421l405l622P894k451l150N391l088
343I69n86L800m688J722K722o185L211L464o054K066K102k567L737j612l878O550
359D773j716n041N101j733k784L409k244j145L167n241K329L894n587J194K811
$$ plain form
374 1187 -2102 111 556 -3685 921 -282 -4333 547 -1085 -4481 215 -2073 -3124 640 -3250
389 -3250 -2586 2377 -2725 -1453 2244 -2357 -328 2077 -1752 917 261 -3348 2400 1632 -2692 1803
405 1803 558 -1292 3652 867 -434 4131 596 1015 4701 -825 711 3738 -873 864 2573
420 2573 -1477 2140 2329 -2188 2209 2620 -1228 2275 481 -1020 3231 -144 -1696 1693 -2138 -1167
436 -1167 2539 -2766 -2605 578 -2038 346 364 -4251 -248 944 -2276 403 -1611 -4195 1143 -302
452 -302 -2885 142 -2831 -3134 2018 -1302 -2317 377 -2299 644 3227 -1812 -436 1167 -1644 2620
468 2620 2129 -2965 835 1133 -622 3571 782 -2069 2286 1577 2137 4169 -1636 -957 4408 1637
484 1637 1395 1344 -2526 1738 4046 -1156 -15 253 -1000 2683 1149 -1907 1461 -412 -1045 3036
$$ packed form
374A187l289K213M45m241M606j203m051M880j632l396M696k288j051L764l890
389c250O64M963n102J272L697m601K029K405l829K669o56l609N748p68m324M495
405A803j245j850M944k785j301M565l535M19L686n526J536L027m611J737J709
420B573m050L617J89m517M397M11l848L503j794j501M251l375j552L389l831R71
436a167L706n305J61L183k616K384J8m615M003J192l220K679k014k584N338j445
452c02k583L027k973l03N152l320j015K694k676K943K583n039J376J603k811M264
468B620m91n094L800K98j755M193k789k851M355p09N60K032n805O79N365k771
484A637k42n1l870M264K308n202J141K68j253L683j534l056L368j873o33M081
$$ plain form
500 3036 -854 -2557 1223 -1169 -943 1068 -3467 -1471 1312 -2431 -1494 -515 -2501 1356 -666 -4616
516 -4616 553 1190 -2632 -468 -2168 -1837 2359 -1424 -3005 755 -810 108 1536 -2497 -40 1876
532 1876 -1273 1763 2328 -2622 474 2181 703 2177 -913 -2089 3668 2401 -667 1491 -520
547 -520 1221 4344 -319 156 3164 -1276 559 3612 167 -157 -661 -1371 3456 1797 -3463 -679
563 -679 -22 123 2767 -1759 -3760 1549 308 -1175 594 -2826 -2342 346 -1241 72 -756 -4965
579 -4965 -560 2360 -1713 -1557 -2158 -1944 3098 111 -4444 -513 969 -166 124 -3124 -418 3110
595 3110 -1955 -1451 2284 261 166 1050 -738 2290 1802 -1494 1999 2320 -1193 1243 1237 775 2474 -1507
613 -1507 -850 4674 1200 -1440 1034 127 2293 2858 -2332 -413 2290 -422 633 177 -1836 1614
$$ packed form
500C036l890j703L780k392K26K011m535J996K783l743R37R79j986L857k022l950
516d616N169O37l822K164j700L31M196l783j581L760j565R18J428m033K457J916
532A876l149L036N65m950L096J707j478J474l090j176N757j267l068K158k011
547e20J741L123m663M75L008m440J835L053l445l24n04p10M827j659n260K784
563f79O57J45K644m526k001N309j241j483J769l420M84K688j587J313q28m209
579d965M405K920m073J56o01K14N042k987m555L931J482j135K90l248K706L528
595C110n065N04L735k023r5Q84j788L028m88l296L493L21l513K436om62J699l981
613a507O57N524l474k640K474r07K166N65n190J919K703k712J055m56k013L450
$$ plain form
629 1614 141 -2197 1389 129 -2654 450 -52 -752 278 -2957 -1785 2088 -950 -2305 -1061 -2245
645 -2245 585 390 -3448 -611 515 -2776 428 861 -1894 -912 -1512 464 3019 -1988 -3665 1828
661 1828 1415 192 369 -2517 529 3165 -619 302 1545 -594 1930 2053 -518 1681 597 -737
677 -737 3270 1029 -983 1630 167 403 2567 -1192 -550 2841 313 -233 453 -1394 1660 1425 -2941
694 -2941 -16 1201 -955 141 -898 -1976 1454 -446 -2131 1190 -791 -2036 255 -1103 -316
709 -316 18 -3391 -816 1129 -2232 -1309 89 -1874 47 -69 -1804 372 -332 -1358 1820 -448
725 -448 -1492 1366 369 -182 1469 -805 -174 2247 -128 368 1477 -831 1385 2396 -347 721
741 721 800 -159 2604 1097 -1198 1583 565 -154 1946 -154 -738 1548 -212 620 1593 -1589 -347
$$ packed form
629A614j473k338L586j260k783L104n02p00J030l235J172L873l038j355J244j184
645b245K830j95l838K837J126l291L204M33k755R82o00J976K555n007j677N493
661A828m13j223J77k886L046K636l784R21J243k139K524J23k571K199j084j334
677g37M007k241k012K613j463K36K164l759O42L391k528n46O86j847L054k35m366
694b941K925J217k156J096j039j078L430j900j685L321j981j245K291j358P87
709c16L34l409K575J945l361R23J398j963J921j16j735K176p04j026L178k268
725d48j044K858r97n51J651k274O31K421k375M96J109k308K216J011k743J068
741G21P9r59K763j507k295K781j018p19K100k100n84K286j760Q32R73l182J242
$$ plain form
758 -347 1765 -973 -45 278 -1411 827 -162 -2424 514 -521 -2013 261 -676 -1540 192 -1199 -1127
775 -1127 879 -1761 -1151 697 -1771 -714 300 -1636 -343 323 -1394 469 42 -1622 1176 624
791 624 -1100 962 229 -172 1924 -512 -127 1966 -523 217 1808 -492 614 1687 -130 1390
807 1390 1355 -803 1559 1530 -801 1365 728 -505 1608 124 -498 1408 -500 -506 1824 -808 -484 1156
825 1156 -893 -191 474 -1191 625 346 -2088 415 104 -2453 298 -953 -2709 1191 -943 -1199
841 -1199 965 -1077 -1286 736 -1457 -113 1029 -1077 -680 234 -1923 502 665 -1715 485 555 -1100
858 -1100 1077 -16 -723 1572 184 -448 1841 -223 -65 1990 -239 402 1500 -525 807 1660
874 1660 -679 902 1341 -502 1386 628 -604 1490 432 -872 1355 13 -701 1467 -545 -707
$$ packed form
758c47K112k738R28L23j689K238r89k262K938j035j492K274r37q64J732j391P2
775a127K006k640O10J848k468J057J014j936J293O66j717J863m27j664K798n52
791F24j724K062p33m01K096k436L85K093k489P40J591k300J106J073j817J520
807A390l5k158K362k9k331K166o37j233K113j484o22J906j908oK330k632L24J640
825A156k049P02O65j665J816k79k434K503l11k557K751j251j756L900k134k56
841a199K164k042k09K022k193J344J142k106L97R14k157K425J63k380K200P0j655
858a100K177j093p07K295j388o32K289k064J58K055k229O41J098k025J332Q53
874A660k339J581M39j843J888p58j232K094j058j304K227j342p14K168k012j62
$$ plain form
890 -707 1138 -952 25 507 -1573 -257 591 -1722 -188 109 -1756 121 -355 -1907 370 -910 -1643
907 -1643 485 -1097 -1170 537 -1337 -919 430 -1420 -279 615 -1512 -64 729 -1114 530 685 -731
924 -731 1127 285 -805 1365 337 -571 1786 131 92 2082 87 20 1627 -193 666 1804 -525
941 -525 765 1251 -575 1118 930 -801 945 649 -638 1193 -55 -918 1124 -257 -589 741 -918
958 -918 -513 808 -1632 -798 601 -1286 -70 -119 -1642 85 -358 -1958 463 -126 -1740 414 -740
975 -740 -1179 646 -968 -990 834 -994 -808 972 -893 -241 715 -773 440 783 -1082 797 625
992 625 -932 1255 561 -545 1080 275 -225 1662 -55 -67 1258 -5 586 1507 -340 408 1413
1009 1413 -444 869 586 -838 994 746 -880 345 223 -683 623 182 -704 599 -1058 -941 1299
$$ packed form
890g07J845k090R77M82k080J316Q48k313J534K97j865J877m76j552K277j280p33
907a643K128j582p3J707j874M18J349j850J141Q94k127J448P93j843J644J55j416
924g31J858q42j090K170j028r08K357j655l9J990j995o7J607j820Q59J138k329
941e25J290M86j826J693j88j731J746k96j287J831j248q63K042j381l32J330j659
958i18M05J321k440Q34J399j887J216m9j523J727m43j600K421n89j614K154j154
975g40m39J825j614k2J824j828J86J780j865O52R56j488J213L43j865J879j72
992F25j557K187o94j106J625q05n00J887j717j2J325j263N91R21j847P48J005
1009A413j857J313k83j424J832k48j626J225j22r06J306m41q86J303j657J17K240
$$ plain form
1026 1299 -732 -1125 -10 -923 143 182 -2096 -292 403 -1573 -270 -170 -1323 273 -439 -1139 472
1043 472 -1069 -1256 1062 -134 -919 691 -879 230 886 -666 -42 855 -772 834 934 -807 794
1060 794 729 -530 1149 480 -239 1484 312 -143 1930 168 -306 1124 181 634 836 -836 762
1077 762 1321 -1378 227 1183 -613 16 -220 -836 1205 -642 -1518 846 160 -1208 531 -739 -518
1094 -518 330 -1427 -277 636 -1858 -800 460 -778 -103 -374 -1275 203 42 -702 650 -806 -1404
1111 -1404 921 208 -822 431 -450 81 839 -283 35 1104 -673 703 1450 -469 314 281 -17
1128 -17 1346 176 -804 1511 1079 -279 593 462 293 871 -465 335 1224 -845 101 1655 -208 -341
1146 -341 140 -737 845 444 -1011 331 -6 -976 915 -294 -1027 471 -596 -768 412 -1269 -755
$$ packed form
1026A299k031l93J115r13J066L9k278J804O95j976J303J00j153J596p12p00J611
1043D72j541j87K318j196p85J610j570J109O56j552O24Q97j627J606J00j741J601
1060G94o5j259J679o69p19J723j172m55K073j762m74J430r43M53K02j672J598
1077G62N59k699J605R56j796O29k36o16K041j847q76K364o86j368J739j270K21
1094e18Q48j757J150R13k494J058J260j238O75k71r01J478j61p44J352j456n98
1111a404K325p13j030J253q81N31P58j122L18J069j777J376P47j919P83l3k98
1128a7J363j170r80K315m32j358Q72j31j69N78j336Q00Q89k069R46J554j863j33
1146c41M81q77J582m01j455J342l37r70J891j209p33J498j067j72J180j681N14
$$ plain form
1163 -755 572 -1151 -408 165 -1023 -418 -120 -850 128 -752 -1451 951 264 -1390 405 171 -470 -19
1181 -19 -408 -9 1156 -800 -426 1018 -15 -17 468 -58 924 835 -558 1116 1161 -966 663 961 147
1200 147 698 -293 227 1452 -260 -338 1435 -291 -275 1035 182 -59 461 -535 600 134 -1134 178
1218 178 428 -1080 81 47 -682 307 -683 -869 762 -907 -1188 830 -570 -800 -205 -756 77 193
1236 193 -1223 179 454 -1077 258 722 -540 191 -108 -381 1210 -525 -766 1044 205 -282 775
1253 775 -7 -53 528 -654 713 792 -745 619 1275 -472 670 480 174 800 56 -28 1454 -96
1271 -96 -531 1312 -25 -126 814 -366 303 512 -771 148 720 -882 -48 211 -341 41 -208 -892 643
1290 643 -765 -1097 678 -253 -979 110 -455 -297 142 -1145 -210 307 -1078 -463 657 -686 -3 78
$$ packed form
1163g55J327j723P43N73j188O05K98p30R78q80o99K402o87j654J795k34o41M51
1181a9l89L99J165j956L74J444j033kM85n26R82q9j393J674M5k127J629K98q14
1200A47N51r91N20J225j712p8J773j726J6J310q53k41N20r96J135m66j268J312
1218A78K50j508J161l4p29R89r90j86J631j669k81K018j400k30N95n51Q33J16
1236A93j416J402K75j531J335M64j262P31k99k73J591j735k41J810q39m87J057
1253G75p82m6N81j182J367P9j537J364O56j747J142j90l06O26p44q4J482j550
1271i6m35J843j337j01R40j180O69K09j283R19N72j602Q34K59n52L82k49o84J535
1290F43j408l32J775r31p26J089n65J58M39j287R35N17j385O15J120j343O83Q1
$$ plain form
1308 78 -596 436 -69 -831 1133 136 -547 675 309 -370 614 43 309 680 -548 603 945 -425
1326 -425 330 876 -246 457 387 -318 997 243 -602 1059 507 -206 817 158 111 797 -457 215 934
1345 934 -532 -324 486 -516 -300 -43 -428 282 -280 -1078 240 -46 -1199 -65 78 -447 -62 -670
1363 -670 -778 330 -1078 -441 302 -515 -357 308 -581 19 254 -632 402 141 -1027 560 258 -678
1381 -678 664 192 -18 593 -1 22 1022 -84 -163 876 -73 179 958 -115 830 632 -689 561
1399 561 268 -400 501 396 -298 517 185 -270 501 -596 -411 882 -502 -541 378 -531 -93 277 -606
1418 -606 -136 138 -918 64 -66 -961 -132 -181 -514 167 -393 -600 479 -603 -816 430 -542 -266 152
1437 152 -709 -109 25 -398 343 354 -917 52 89 -398 531 466 -273 786 -112 -43 865 14 86 723 101
$$ packed form
1308G8o74J032n05p62J964r97o83J222l66o79R84n71K66L71j228J151L42j370
1326d25P55N46j122P03p0p05J315p54q45J661n52p13J023o59m7O86j254O72P19
1345I34j466K08Q10j002K16K57l85P10n62p98J318k86j153J134J43n25L85o08
1363f70j08J108j408O37P43q17J58O65q89O00K35q86J034k61j168J587l02r36
1381f78J342m72k10O11n94K3J000j106p9J039r49K52P79j073R45j98j321J250
1399E61k93o68R01j05o94Q15l32m55P71j097J85J293j384l9R19r09M38L70q83
1418f06M70K74j056R82j30q95Q29m9l33O81n60k07J079j082k13J246r72K76M18
1437A52q61O00J34m23P41J1j271R69L7m87R29o5p39J059q98O9R08q51P2O37o22
$$ plain form
1458 101 455 557 -118 497 842 -285 222 455 -209 463 117 -333 462 188 -417 557 -277 -578 266 -267
1478 -267 -135 501 -633 108 284 -667 -271 470 -496 -84 -11 -654 -34 -476 -571 173 -305 -730 173 -58
1498 -58 -540 142 -426 -459 138 -345 -95 615 -434 -215 285 -599 375 166 -330 480 127 -374 729 228
1518 228 -145 418 40 178 565 -177 150 773 -97 189 857 -149 39 190 69 307 186 -363 377 67
1538 67 -411 360 -231 -517 260 -33 -356 298 -289 -302 71 -481 -340 220 -716 -192 -202 -436 32 -356 -1084
1559 -1084 194 -100 -652 192 -318 -317 283 -302 -228 236 -456 -188 268 -370 -8 277 -168 311 205 -339
1579 -339 368 299 -388 397 256 -298 607 101 -293 550 -227 -238 594 129 -168 598 -145 164 586 -44 229
1600 229 304 -406 469 287 -264 560 -49 -729 285 -302 -472 160 -432 -617 113 -604 -134 366 -502 118
$$ packed form
1458A01L54J02o75O15L45j127N07K33o64O72l46m50P95k74o05R74q34l01Q44n33
1478b67J32O36j134P41J76r51L96P41r66M12P3o43O20m42r5P44m78m25R03k31
1498e8m82O82n68l3N97m83K50P10j049K19N00q84R74k09m96Q10l53n01J103n01
1518B28l73N63l78J38L87p42L27O23q70K86O68j006J88J51j21K38j21n49P40l10
1538F7m78P71n91k86P77k93l23O54n87j3L73n52J41N60r36N24j0k34M68l88p28
1559a084J278k94n52Q44n10JO00n85P4M64o92K68M56o38L62K85m45M79j06n44
1579c39P07o9o87P85j41n54R05n06l94Q43p77j1Q32m65k97P66p43L09M22o30K73
1600B29P5p10Q75j82n51Q24o09o80J014n87j70O32n92j85P30p17M70N00q68O20
$$ plain form
1620 118 -77 -705 80 301 -732 -36 -217 -357 281 -99 -466 426 -368 -525 356 -96 -184 138 -230 -81
1640 -81 485 -347 52 504 -95 432 325 -87 113 319 -115 659 338 -195 471 -55 49 642 -307 -110
1660 -110 552 152 101 425 -166 359 548 -534 -155 307 -361 184 66 -160 498 -66 -369 336 111 -409
1680 -409 132 -267 -329 -184 -643 -141 -99 -521 46 66 -670 125 -103 -566 32 -167 -714 124 -291 -297 279 -217
1702 -217 -12 382 -168 -204 401 29 105 283 -281 80 569 -135 252 203 -139 237 328 99 457 75 -130
1723 -130 450 76 -268 292 73 53 390 -122 -234 313 -189 100 130 -125 -29 279 -223 293 58 -738 -34
1744 -34 -178 -548 84 -157 -159 199 -404 -125 -158 -465 -203 -112 -403 -59 219 -318 147 185 -288 167 257 -40
1766 -40 33 160 -183 176 -286 -298 532 -138 28 512 -228 2 373 102 310 68 -179 293 285 -544 536
$$ packed form
1620A18j95o28P85K21j033O96j81j40O38l80l67Q92p94j57Q81m52q8L22l68J49
1640h1N66q32L99M52n99N27j07m12K00K06m34P74l21n33O66n26J04N93r49J97
1660a10O62m00n1L24n91N25J89j082L79M62o68N45j18k26O58n64l03P05k25n20
1680d09N41l99o2J45m59N02M2m22N67K0p36P95k28m63N98j99n47Q38m15oN76m96
1702b17K05L94n50l6O05l72P6J78n64L61M89p04L87m9l42L76R1k29L58l82k05
1723a30N80l74l44N60k19k0L37n12j12N47n02K89L0k55R6L08n02N16k35p96P04
1744c4j44l70O32k41kL58o03K79l3l07K62R1k91L44K78n37M65L8m73M55R0k97
1766d0P3J27l43L59m62j2Q30o70J66M84p40K30L71k71K08k42k47M72qq29J080
$$ plain form
1787 536 202 -213 267 240 77 120 122 -107 269 -111 -83 53 -84 185 218 -526 26 85 -236 37 163 -269
1809 -269 -19 203 -225 100 -74 22 166 -334 -253 132 -480 -174 -13 -168 -318 -46 -437 166 -315 -661 -27
1830 -27 95 -327 351 161 0 371 -216 13 292 58 -283 643 -186 -164 300 -163 254 354 -60 402 584
1851 584 -255 -49 73 -334 460 83 107 601 -51 0 261 -232 -202 109 -361 -174 -93 -426 34 -21 -557 -193
1873 -193 -158 -231 -106 80 -189 -119 -262 -111 106 -439 -400 105 -83 -234 218 -57 -184 81 -697 -169 -58
1894 -58 -70 120 102 -138 220 97 28 133 -79 -315 212 -126 34 418 144 125 174 0 160 449 -32 290
1916 290 255 14 193 19 -148 417 143 -61 588 -76 -327 455 9 -230 368 -73 91 64 -254 -38 287
1937 287 -504 -157 204 -452 -185 -128 -485 177 -89 -94 192 -292 -261 79 76 -219 90 -230 -158 129 -248 -107
$$ packed form
1787E36l34m15M80k7j63M3Kk29L76l80K8J36j37K69L3p44N52N9l21K73J26m32
1809b69K50K22m28L25j74R6J44n00Q1L85o12L06J61j55j50K72l91O03m81l46O34
1830b7J22m22O78j90j61L71n87K29K79k34l41R26q29K2M64m63M17J00m14M62J82
1851E84q39K06J22m07P94l77K4M94o52N1K61m93L0L11m70J87Q1l33M60n5n36L64
1873a93L5p3J25J86k69P0j43J51K17n45L9N05j88j51M52k75j27K65p78N28J11
1894e8j2J90j8k40L58j23o9J05k12k36N27l38J60L84k74j9M9j74J60K89m81L22
1916B90l5k41J79j74j67N65k74k04O49o64k51P82m46k39N98m41J64k7l18K16L25
1937B87p91L47L61o56K67N7l57O62k66nK86m84L1L40lk95L09l20P2K87l77J41
$$ plain form
1959 -107 -93 -312 -5 3 -65 299 -55 -159 276 -172 -427 163 9 -143 416 1 -369 524 2 179 351
1980 351 -19 365 366 -103 135 561 -353 255 334 -266 472 -90 -202 254 28 -145 299 50 -84 333 -370
2001 -370 -84 173 -356 -293 146 -285 -100 125 -429 100 5 -436 -90 -58 -430 16 -204 -97 86 -266 -237
2022 -237 99 -181 -8 149 -154 48 -99 -257 15 4 -234 181 145 41 296 46 4 349 33 145 178
2043 178 160 191 153 -150 -94 153 -179 169 371 -149 99 165 -171 399 80 11 107 82 68 546 -143 -236 185
2066 185 -91 -206 352 -132 -139 321 -378 -14 42 -255 -16 -36 -148 44 20 -474 112 -144 -184 191 -68 -301
2088 -301 202 -361 -234 191 -226 -247 -16 -69 -18 95 -67 -22 -114 21 344 266 -318 165 -31 -63 356 -9
2110 -9 -127 288 -147 80 396 -92 155 316 79 -97 322 -174 253 203 6 234 -112 -43 225 88 87 181
$$ packed form
1959a07J4k19L07Qo8L64l54j04M35m48k55N90j54j52N59m15l70Q93n22J77J72
1980C51l70L84Jm69K38M26r14O08P9o00P38n62j12M56k26j73M44k49j34M17p03
2001c70K86K57n29O3M39m31J85K25n54N29r5m41L46L2l72M46k20J07J83l52K9
2022b37L36k80J73J57l03K02j47j58K72j1k38M15l6j04K55k50m2L45l16J12L3
2043A78j8L1l8l03N6K47l32L48K02n20K48O6l36N70l19o9R6k5j4M78o89r3M21
2066A85k76j15N58m84pM60o99L64N6k97K39k0j12J92k4m94N86k56m0L75k59k33
2088c01N03n63J27M25m17k1K31n3N1J13j62M5r2J35L23p8n84M83j96l2M19l65
2110ij18M15m35K27L16m88K47J61k37j76M19m96M27n0j97K28l46O9K68j37jR4
$$ plain form
2132 181 -106 -322 -40 -313 -51 425 -508 -115 99 -85 -111 148 -351 -54 -79 -53 -12 -175 -444 -45 23 -138
2154 -138 45 49 17 281 -115 -96 477 -20 97 42 45 364 326 -270 41 20 -53 25 119 19 255 -3 -84 179
2178 179 94 187 505 -45 -140 270 108 -19 207 -81 19 231 -62 403 -24 -182 -80 -69 -341 249 173 -220
2200 -220 154 -424 -255 -30 -182 12 -109 -110 -225 -32 -318 88 14 -265 150 161 -418 234 -160 -438 211
2221 211 -184 -167 139 -240 -67 238 -28 59 451 -40 36 192 -41 39 273 -6 153 -15 -188 183 -49
2242 -49 -151 356 275 0 285 35 167 337 -393 -51 378 -299 323 60 -220 31 -37 -250 180 167 -367
2263 -367 131 -36 -363 126 -93 -134 -167 -372 -174 -105 -186 -107 41 -557 0 -104 -421 113 -53 -513 -74 297
2285 297 -189 116 -315 -67 176 -17 -185 408 -3 -316 230 15 116 266 -125 -132 287 -125 -60 271 102
$$ packed form
2132A81k87k16K82k73K62M76r33L93K14j84k6K59m99K97k5K6M1j63k69L99O8j61
2154a38J83Ml2K64l96J9N73m97J17n5LL19l8n96L11k1p3P8R4j00K36k58q1K63
2178A79q5R3L18n50r5M10j62j27K26k88J00K12k93M65m27j58J02J1k72N90p6l93
2200b20L74n78J69K25j52J94j21jj15J93k86M06p4k79M15J1n79O52l94k78O49
2221B11l95J7L06l79J73L05k66Q7L92m91P6J56k33Q0K34k79J59j68j73L71k32
2242d9j02N07q1k75K85k50J32J70p30L42M29o77O22k63k80K51o8k13M30j3n34
2263c67M98j67l27M89k19m1l3k05J98O9q1P9J48n98N57j04l17N34j66m60M39L71
2285B97m86L05m31K48K43j93j68N93m11l13N46k15J01J50l91pM19m12O5L31j69
$$ plain form
2306 102 216 321 -167 299 -21 157 388 92 27 148 74 -211 178 -313 215 281 -406 236 334 -153 94
2327 94 22 -374 4 220 -235 67 -75 -460 -123 -106 -149 132 -323 -64 127 -369 -37 77 -142 -111 -143 -358
2349 -358 -30 -35 -316 271 -95 -241 240 -233 -74 354 111 130 46 -168 -275 255 70 -124 465 9 397
2370 397 96 -72 388 0 214 254 18 -107 50 42 -138 126 -252 -112 445 -242 -243 189 -91 -8 162 -210
2392 -210 -175 220 -262 56 -69 -405 48 212 -417 361 -71 -91 -57 -350 -161 96 -250 110 13 -172 -151 241
2414 241 -128 149 49 -158 244 90 -317 -206 131 2 12 -50 -23 -13 -111 140 167 203 -494 171 750 43
2436 43 -628 17 235 41 5 -101 -223 -747 381 -43 306 599 -711 0 213 -201 -14 -400 -609 -3
2456 -3 25 -90 147 166 -619 147 139 -286 5 -331 -635 -220 218 -408 -39 -265 -298 -78 -273 64 311 735
$$ packed form
2306A02J14J05m88M66l20J78K31k96o5J21p4k85L89m91N28O6o87O42R8m87K47
2327I4p2l96L78K16m55L02j42l85L37J7m3K81m55K59J91m96L32J14k19L1l2k15
2349c58L28nk81N87l66j46M81m73J59M28k43J9q4k14j07N30j85j94N89m56L88
2370C97l01j68M60l88K14M0k36j25J57qj80K64l78J40N57o87jM32k80Q3J70l72
2392b10L5L95m82L18j25l36M53J64o29P78m32k0L4k93J89K57l46L60r7j85K1L92
2414B41l69K77j00k07M02j54m07J11L37j29J0o2K7J0r8K51K7L6o97O65N79p07
2436D3o71O45K18j94l6j06j22n24J128m24L49K93j310P11K13m14J87l86k09O06
2456cK8j15K37J9p85P66qm25K91l36l04M15M38o26L69k26l3K20j95L37K47M24
$$ plain form
2478 735 117 74 -461 231 -374 -183 -242 3 -845 -237 192 -338 12 -92 -31 90 30 -16 71 -19 -134 449
2500 449 -79 177 244 124 352 113 -278 76 -2 -60 209 31 -244 1 -31 -10 -64 -65 -55 21 -83 -51 112 -153
2524 -153 -213 88 -348 -30 182 -311 210 -194 -357 -151 -267 -40 64 -183 -289 -137 116 2 37 -8 174
2545 174 311 -521 23 165 18 81 7 -195 43 -121 -97 -8 82 -333 81 -53 -144 139 -153 81 41 31 0
2568 0 308 -155 25 -33 -169 25 83 -288 91 -196 -275 230 296 -286 21 123 251 309 -101 -19 174 -42 -229
2591 -229 -29 -46 60 -79 4 -78 -138 -260 -72 236 -167 86 30 -296 182 -26 -334 62 -328 -192 153 -309
2613 -309 39 136 26 -163 369 -56 110 36 -133 301 16 -385 -67 205 -24 81 19 -70 -30 -58 94 357
2635 357 75 -245 259 -41 -55 299 3 297 156 66 114 42 -86 -116 -103 -126 246 93 -138 260 -32 1 -195
$$ packed form
2478G35o18m3n35O92o05J91n9K45q48O08M29n30L50j04O1J21o0m6Q7r0j15N83
2500D49n28K56O7j20K28k39l91L54p8n8K69j78k75K45l2K1n4jJ0P6j04L2J63k65
2524a53o0L01m36L18K12m93N21m04j63K06j16K27J04k47j06J52K53j14L5m5J82
2545A74J37q32N44J42j47O3p4k02K38j64K4Q9R0m15M14j34r1K83k92K34m0j0l1
2568@L08m63J80n8j36J94N8l71L79k87p9N05O6n82L07J02J28N8m10Q2J93k16j87
2591b29K00j7J06j39Q3q2o0j22J88L08m03K53n6l26M78k08l08L96l90J36L45m62
2613c09L48R7j10j89N32m25J66p4j69M34k85m01L18K72k29J05o2q9M0k8J52K63
2635C57k82l20N04l00j4L54k96K94j41r0M8p2j28l0J3k3L72j53k31L98k92L3j96
$$ plain form
2658 -195 -243 -161 117 -39 82 -43 38 -254 8 -123 0 303 -529 57 3 -86 232 -13 -58 123 -245 80
2680 80 -91 -206 -186 280 -14 46 216 1 44 143 -142 260 -3 -74 217 -6 -72 271 22 40 155 0 19
2703 19 238 122 -127 489 51 -175 102 -411 91 163 -140 120 -58 -156 -40 -64 -260 164 -160 -102 -52 -129
2725 -129 -250 216 -35 -148 -221 152 -190 -199 -103 -48 22 -189 -52 -98 -48 117 -348 -228 226 114 -117 232 -254
2748 -254 -289 60 62 218 -72 -164 15 183 101 -275 -93 60 188 119 -98 138 89 46 173 95 55 164 -150
2771 -150 -96 250 -162 11 319 -173 -126 200 -2 -6 105 -348 -106 -38 -354 119 48 -88 98 -67 171 -203
2793 -203 -11 -265 210 -139 45 102 82 16 186 -82 -64 135 -125 -163 -81 103 30 37 -26 47 -222 122 -107 42
2817 42 -43 268 -44 -99 425 -97 237 -127 -315 -155 88 173 164 8 -53 87 131 277 87 -172 -152 189 70
$$ packed form
2658a95m8Q2K78j56J21j25Q1k92K62j31J23L03q32N86n4q9L18k45m5J81l68L25
2680H0j71j15K0M66k94O0J70k15M3R9k85M02k63p1K91k23o6L43k49J8J15j55J9
2703A9K19j16k49O16m38k26K77n13N02P2l03K60j78r8J16k4j96M24l24N8N0p7
2725a29j21M66k51j13p3L73l42rR6N5P0k11J37m6N0J65m65J20M54j12k31L49m86
2748b54l5L49KJ56k90r2J79J68q2l76J82J53J28o9k17K36m9m3J27p8m0J09l14
2771a50N4L46m12J73L08m92M7L26k02mJ11m53K42O8l16M73p1j36J86j65K38l74
2793b03J92k54M75l49J84N7k0o6J70k68J8J99k60l8Q2J84p3Po3P3k69L44k29J49
2817D2q5L11l12n5N24n22L34l64j88J60K43Q5rj56o1J40M4J46j90k59K0L41j19
$$ plain form
2840 70 -130 200 58 229 -164 -75 -201 66 -53 182 -126 -326 120 -192 -73 82 0 128 243 -272 224
2861 224 10 -190 80 114 4 145 -58 -412 28 -1 17 -221 -35 -330 -249 170 -131 69 -179 -190 156 136
2883 136 12 238 -192 82 263 -90 -51 100 43 -144 183 -235 85 145 -123 -91 232 211 188 -185 89 141
2905 141 -200 -210 30 -135 64 257 -32 46 142 -308 -175 165 -181 39 -17 -43 -146 -282 -300 -106 316 -320
2927 -320 -39 -196 -194 -55 -316 9 -187 -89 -172 149 -237 99 -192 -31 20 -33 43 -152 -139 -166 259 192 -348
2950 -348 153 -62 -93 -118 -53 243 -143 -277 363 -45 209 102 34 -126 85 272 -210 -21 53 -32 -248 238
2972 238 232 91 -84 -157 386 32 -58 91 86 185 217 -102 234 -286 -97 135 101 -328 -172 -144 -99 83 -72 22
2996 22 -92 -46 -246 101 -259 -32 83 -78 -140 186 68 -55 237 -298 -13 -84 -60 -89 196 -47 105 124
$$ packed form
2840G0k00L30j42J71l93Q9j26K67j19K35l08k00M46l12J19J55q2J28J15n15M96
2861B24k14k00K70L4j10J41k03l54M40k9J8k38J86k95Q1M19l01K00k48j1L46k0
2883A36j24K26m30K74J81l53L9J51n7j87L27m18L20O0k68L2L23k1k3l73K74N2
2905A41l41j0K40j65J99J93k89P8R6m50J33L40l46K20n6k6j03j36j8J94M22o36
2927c20K81j57KJ39k61L25j96R8q3L21l86L36k91J61N1n3P6j95J3k7M25o7n40
2950c48N01k15l1k5O5K96l86j34O40m08K54j07o8j60K11J87m82J89P4q5k16M86
2972B38oj41j75p3N43l54r0J49nR9L2l19L36n20J89K32l4m29J56K8M5J82j55R4
2996B2j14M6k00L47l60K27J15j61o2L26j18j23K92n35K85p1K4k9K85k43J52J9
$$ plain form
3018 124 -61 147 -150 -19 44 -11 18 -31 -188 43 139 58 -66 -99 -88 -38 -61 -105 276 -55 -91 -135 -182 25 167
3043 167 -97 -17 54 36 166 224 -144 65 -14 -92 64 -132 90 -137 17 -47 36 -133 -18 -109 44 -94 126
3066 126 -108 57 -115 -248 -295 -19 -269 -96 103 73 318 -176 279 162 -17 -168 153 46 -98 197 -45
3087 -45 -41 -243 -108 253 172 71 -121 11 -78 -43 49 9 5 154 -60 110 -14 -198 93 13 -349 304 134 -177
3111 -177 -73 186 -61 -113 -175 15 204 -55 59 -92 -44 -156 -258 -351 28 -148 -44 60 -144 -192 203 -126
3133 -126 -212 -10 -302 -96 160 -91 225 91 -134 27 -122 -410 176 349 -294 447 176 111 41 -23 238
3154 238 324 70 185 71 396 61 191 0 -178 26 -54 152 -108 34 3 36 -201 -25 -41 71 147 74
3176 74 -144 385 -140 -77 124 -9 41 75 -279 -140 -97 -598 -141 -137 -237 23 8 167 296 -310 -393 280 32
$$ packed form
3018A24j85K08k97J31O3n5K9m9j57K31R6q1j24l3J1N0k3m4L81l31l6m4m7K07J42
3043A67k64Q0P1j8J30N8l68K09p9p8J56j96K22k27J54o4Q3j69J15r1J53j38K20
3066A26k34J65j72j33m7K76k50J73J99l0K45m94M55j17j79j51L21j07j44K95k42
3087d5Mk02J35L61q1j01j92J32q9L5R2m0mJ49k14J70j24j84K91q0l62O53j70l11
3111a77J04K59k47n2o2J90J89k59J14j51M8j12j02r3L79j76J04J04k04m8L95l29
3133a26q6K02k92K06K56k51L16j34k25J61j49k88N86J73o43P41k71o5p0o4K61
3154B38Q6k54J15j14L25l35J30j91j78K04q0K06k60J42l1L3k37J76j6J12P6p3
3176G4k18N29n25O3K01j33N0L4l54J39M3n01M57Mj00K60j5J59J29o06q3O73k48
$$ plain form
3199 32 -73 223 14 129 21 -49 -51 -19 -17 -131 -243 10 133 218 -48 143 41 -110 210 172 125 12 80 -281
3223 -281 30 188 -10 -150 -227 242 -65 -319 96 -13 15 64 -266 51 103 -20 -23 -169 93 25 43 63 -48
3246 -48 73 -20 112 -165 -182 -146 -163 -78 -3 -82 -115 -51 -47 -5 -156 -76 0 167 8 9 -6 173 270 19 -101 79
3272 79 -135 -43 -76 -261 -241 133 20 120 362 -10 129 390 327 -912 133 -315 -230 360 87 -185 164
3293 164 -91 -94 -167 4 175 120 -152 274 60 9 23 -110 -64 3 -272 26 -9 -196 40 52 -93 30 133
3316 133 -166 -34 -6 62 19 -64 -248 22 -19 -208 111 -144 -58 228 -227 25 213 -330 -338 34 65 -143 243
3339 243 36 -166 -86 176 112 143 -12 207 -22 116 50 -72 86 197 -37 -81 -51 23 -175 44 -89 241
3361 241 99 -160 79 62 -160 285 245 -183 277 -124 -207 14 217 -182 113 1 -124 -83 -116 -16 132 -48
$$ packed form
3199C2j05K96k09J15j08p0kL2Kj14j12K53J23Q5k66J91j02j51L20l8m7j13O8l61
3223b81L11J58j98j40p7M69l07k54M15j09K8M9l30L17N2j23lj46K62o8J8K0j11
3246d8J21r3J32k77j7L6j7Q5P5p9l3O4MM2j51Q0P6J67j59Jj5J79R7k51j20J80
3272G9k14R2l3j85K0L74j13J00K42l72J39K61o3j239J045m48Q5N90k73k72L49
3293A64k55lp3J71J71n5k72M26k14n1J4j33M6O7k75K98l5j87K36J2j45J23J03
3316A33k99J32K8O8m3q3j84K70m1j89L19k55Q6K86m55K52J88n43qL72L1k08L86
3339B43k07k02Q0K62o4L1j55K19k29J38o6j22J58J11k34m4L0P4j98K19j33L30
3361B41j42k59K39j7k22M45m0m28M60m01q3K21K03l99K95j12j25M1l3J00J48j80
$$ plain form
3383 -48 -136 49 67 -2 22 50 -329 132 -52 -204 255 -63 55 -41 32 61 371 22 41 280 96 35 30 -62 84
3408 84 -163 39 230 402 -55 -154 -129 50 168 115 -25 37 -92 265 58 16 125 52 133 141 9 -207 -30
3431 -30 -36 -377 -186 -190 -179 39 -16 -132 141 -112 254 -114 -355 -1 -74 49 -13 238 -13 -52 59 -248 -23
3454 -23 -68 -92 181 -163 17 -36 5 -224 -2 -9 140 -7 43 -295 233 47 115 -31 -126 351 -112 6 -40 211
3478 211 -192 -74 55 11 -38 -167 278 -34 -66 -100 227 17 141 -5 30 339 -280 -49 14 143 -231 -39
3500 -39 -210 -51 -49 -85 -196 -74 -138 -120 6 -221 211 167 92 138 182 -159 280 151 67 213 -136 17 -66 -49
3524 -49 -90 288 -101 -98 52 -102 180 288 -378 77 181 26 -44 146 87 65 -22 322 181 -264 86 281 -73
3547 -73 83 14 -54 160 125 -146 63 44 -6 -81 122 40 130 87 -82 165 -64 103 70 -121 114 207 -29 -101
$$ packed form
3383d8q8J85J8o9K4K8l79M61j84j52M59l18J18r6P3K9L10l49J9K39j84o1nr2J46
3408H4k47K02J91J72m57r9K5J79J18n3j40O2j29L57k07m2J09p3Q1Qj32k16J77
3431c0ol41J91mJ1K18n5j16K73k53L66l68k41L54p3J23o2K51k51l9J11l07K25
3454b3m5k4K73l44J80n3M1k29K22pJ49j47N0l38N28j86O8j46r5M77m63J18m6K51
3478B11m03J18J29m4m9j29M45l12l2l4L27k10J24j46L5L09o19K31O3J29l74J92
3500c9j71J59Kl6j11J22o4J8J26k27M32m4p5M6M4l41M39j29q4J46l49J53q3J7
3524d9m1L78l89LJ50j54K82J08o66M55J04j55p0J90n9k2q7L44j41m45L50J95l54
3547g3J56o9o8K14l5k71K09j9n0p5K03q2R0m3j69K47k29J67l3j91K35R3k36p2
$$ plain form
3571 -101 112 125 -24 -116 -23 237 186 -153 -133 50 155 -206 -238 -528 149 -68 -219 29 -99 -143 -16 219
3593 219 6 167 14 -2 -161 169 -237 -83 -70 67 16 247 155 -147 -58 279 333 230 10 301 123 -12
3615 -12 -289 86 57 70 106 -30 -19 -161 -5 -182 -47 195 -328 165 246 -32 -2 192 -265 -36 -155 -86 -57
3638 -57 -88 -118 152 -71 48 21 -78 254 -35 -13 -111 292 -138 121 35 210 125 45 70 88 -76 190 8 -71
3662 -71 128 -36 -277 0 -24 51 88 123 -1 -43 -179 55 132 0 58 48 138 256 199 203 139 -114 135 193 -101
3687 -101 -94 140 -144 6 98 23 -17 40 142 -29 -128 -232 -115 -2 -188 6 182 -109 -197 268 -13 -94 56
3710 56 -37 102 54 -328 64 184 153 103 258 -96 177 -14 -330 1 -6 163 83 -216 259 312 55 68 -95
3733 -95 -252 -71 224 9 35 47 -59 -97 -45 -5 -177 23 -8 180 25 223 24 -265 -32 -27 -185 8 309
$$ packed form
3571a01K13J3j49r2R3K60n1l39K0J83J05l61l2k90O77k17j51K48j28m4J27K35
3593B19k13J61j53j6j59L30m06J54J3J37n1K31r2l02Q9L37N4j03k20K91j78j35
3615a2k77L75k9J3L6j36J1j42J56j77J35K42n23M93Q1k78L0J94m57K29j19O9K9
3638e7l1l0K70k23J19k7r9L32k89K2r8M03m30K59q6J75q5q0K5J8j64K66j82p9
3662g1J99j64k41K77k4P5L7L5j24m2j36K34P7j32N8j0R0J18n7Mo4k53K49N8k94
3687a01PK34k84J50R2p5m0N7J02j71r9j04J17J13j86J94J76k91q8M65k81q1J50
3710E6r3J39m8l82L92J20l1n0J55l54K73j91l16L31pJ69q0k99M75N3k57J3j63
3733i5j57J81K95k15K6J2j06l8N2M0j72K00l1J88j55J98j99k89K33Nj58J93L01
$$ plain form
3756 309 -102 83 -217 67 -108 -179 161 94 230 22 -268 -102 -28 287 207 -169 56 -153 -208 22 -90 36
3778 36 41 58 236 -223 -229 -175 186 -207 -108 80 114 159 -1 101 230 -115 10 183 -30 -82 463 -148 145 -41
3802 -41 -217 128 26 169 97 127 -178 15 -251 -4 -135 -253 -8 60 514 -22 -213 97 46 278 -143 54
3824 54 -61 -46 60 -103 -155 -88 214 -161 -2 -306 -120 147 -93 -164 141 -191 -80 118 -24 -122 172 35
3846 35 -40 15 285 -2 -76 65 26 27 -96 90 -65 27 -47 63 -119 -88 181 -147 5 117 108 278 -301 -52
3870 -52 190 -293 -4 104 -116 193 -53 -87 -15 141 -154 -52 -157 161 151 17 71 -120 133 -50 25 146
3892 146 -155 -87 115 -22 54 -218 -47 -16 86 34 -8 -1 -90 18 -84 -141 -313 68 196 38 131 522 -83
3915 -83 -73 -96 -14 66 55 42 149 103 15 22 -4 323 204 144 127 7 170 -37 123 25 -28 -32 -231 83 170 -42
$$ packed form
3756C09m11J85l00K84j75p1L40o7J36k08k90J66P4L15q0l76K25k09n5K30j12J26
3778C6NJ7J78m59oN4L61l93R9J88L4M5j60J02J29l45J25J73k13n2N45o11K93j86
3802d1j76L45j02J43p2L0l05J93k66K47j31j18K45O8M54n36j91L10n1K32m21J97
3824E4j15J5J06j63n2O7L02l75J59l04J86K67k40p1L05l32J11J98j42r8K94j37
3846C5p5N5K70k87p4J41l9Jj23J86j55R2p4J10j82L1K69l28J52J12rJ70n79K49
3870e2K42m83K89J08k20L09k46l4P2J56k95J02j05L18j0j34N4j91K53j83P5J21
3892A46l01O8K02j37P6k72J71L1J02n2m2Pq9J08j02n7j72L81J28j58R3L91o05
3915h3J0k3Q2Q0j1j3J07m6q8Pk6L27j19o0j7j20J63k07J60r8n3mj99L14Q7k12
$$ plain form
3941 -42 61 -6 186 3 -196 -18 -181 -180 -72 -19 -26 28 212 -60 62 247 46 -104 -128 -55 -100 132 -139 -152
3965 -152 -84 -52 -192 134 -1 -78 -304 31 28 127 -118 -22 176 -199 -85 -125 58 72 -221 -123 -112 -103 269 277 -102
3990 -102 14 112 -36 280 225 15 72 -28 80 124 -29 44 165 -250 -22 181 67 71 111 -44 100 -32 -109
4013 -109 323 4 -169 -108 -119 33 229 -120 43 -296 -135 11 -224 65 -155 -51 -54 96 -54 -34 39 -144
4035 -144 212 25 -37 91 50 78 64 122 -49 -212 10 -48 254 -78 145 47 -21 -26 118 61 -194 123 -136 177
4059 177 -89 -103 -209 -65 233 54 72 150 -6 71 -55 38 127 -9 -131 52 -4 113 115 -90 24 -164 -50
4082 -50 100 37 211 -111 52 -69 -8 -229 -74 161 -123 115 74 -148 42 80 -114 -240 -48 124 137 -72
4104 -72 -254 37 41 84 129 -103 -32 -117 -20 321 -84 -75 -94 323 271 50 -246 -168 234 121 383 132 332 143
$$ packed form
3941d2J03o7J92j83j99J78j63JJ08N3pN4J84k72J22J85k01j50k4P3m5K32k71j3
3965a52O8L2j40L26j35p7k26L35lR9k45R6J98l75J14m0J83J4k93R8J1RL72Ql79
3990a02J16R8j48L16n5k10N7j00J08M4j53P3J21m15K28K03j14MM0j55J44j32p7
4013a09M32l19j73O1j1J52J96l49J63l39J61J46k35K89k20J04lJ50j50K0P3j83
4035a44L56j87o2J28m1K8j4N8j71j63K22n8L02l32K23r8o8nJ44n7k55L17k59L13
4059A77k66j4j06J44K98j79J8P8j56P7j26R3Q9j36j22J83n6J17Kk05J14j88J14
4082e0J50o3J74l22J63j21O1k21J55K35k84K38m1k22J90L8j94j26J92J72J3k09
4104g2j82K91MM3M5k32P1q5R7L41m05Rj9M17n2k21k96P8M02j13K62k51K00j89
$$ plain form
4128 143 218 -203 -6 231 173 59 230 -179 -100 -110 -117 -191 24 -40 -56 -239 -159 -38 62 -62 104 -112 -119 -25
4152 -25 -122 47 -158 33 -160 54 133 31 104 -172 -64 -36 120 116 -12 11 75 235 142 189 4 -197 18 7
4176 7 135 144 93 -30 48 75 255 280 375 -40 -198 66 -133 90 0 -70 -293 2 -155 160 -156 28 5 -63
4200 -63 22 81 68 175 -369 -96 60 -111 -54 151 -125 -81 -72 58 334 -70 -399 -150 34 -19 -88 154 141 194
4224 194 -82 -86 -60 125 -365 -117 -269 -56 224 -169 -29 94 -196 58 -177 41 -139 194 -47 111 -192
4245 -192 10 166 -238 -180 -68 142 -57 315 -20 -95 -183 140 265 9 -140 143 166 246 125 -74 171 208
4267 208 159 -64 -92 84 -99 58 87 55 -52 -114 11 203 -244 161 -148 -199 9 221 175 -165 -118 -112 -168 -226
4291 -226 -94 -51 -194 -125 -48 -358 -98 -260 -102 10 10 120 17 -228 -34 213 95 -49 245 -100 -41 -166
$$ packed form
4128A43P5m21J97K37n8j14J71m09P9j0pp4K15o4j6j83Q0J21J00j24J66k16pR4
4152b5r7J69k05J91j93K14P9j02P3k76J08K8J56mj28K3O4J60r3M7j85k01K15j1
4176GJ28Rn1j23P8K7J80K5R5m15j58K64j99K23r0p0k23K95j57L15l16J84k3o8
4200f3Q5N9j3J07n44K73J56j71N7K05k76M4RJ30K76m04l29K49J84n3o9K42j3N3
4224A94k76mK6J85m90K48j52K13K80l93J40J23k90K54k35K18j80L33k41J58l03
4245a92K02J56m04N8J12K10j99L72l35p5q8L23J25k56j49K83K3Q0j21j99K45L7
4267B08m9k23k8J76j83J57K9l2j07o2J25J92m47M05l09n1K08K12m6l40M7On6n8
4291b26J32M3j43O9P7l10K60j62J58J12%J10j03k45J94K47j18j44K94l45N9j25
$$ plain form
4313 -166 2 137 40 -172 65 -217 -40 -195 39 -13 127 -26 -99 59 82 -92 32 166 -31 64 205 198
4335 198 -253 5 -110 -183 -263 -80 153 95 -39 89 157 -116 -101 376 -241 26 8 -181 247 -33 -146 122
4357 122 -113 -3 199 -23 -247 200 18 -64 1 -38 98 -190 150 88 6 179 -127 21 40 -7 -12 -45 -45 54
4381 54 -174 129 222 0 -7 119 70 146 -152 -15 -92 -132 116 -10 122 32 -117 -9 83 -46 -88 9 -1 -238
4405 -238 41 19 -1 -98 -160 -246 -27 67 -135 164 179 -67 -4 78 153 -61 -217 -42 121 -189 250 24 103 -436
4429 -436 -103 4 -36 -60 -61 49 116 72 18 -63 -228 259 -51 -89 -44 -210 -42 -179 67 58 -16 147 -74 57
4453 57 123 -140 -67 -174 -134 -52 150 -31 -192 -368 174 -111 -16 -37 -37 -14 -215 120 -304 194 -126 -248 -82
4476 -82 156 17 12 -4 -121 -93 122 -135 148 195 258 -12 -15 16 -52 -38 -205 84 -112 289 236 25 -269 -21
$$ packed form
4313a66J68J35r7k12K37k82J77j55K34n2J40j53p3J58K3j74J24J34j97R5J41p
4335A98m51K58j15p3q0J83K33n8j34J28O8k73J5M77o17K67j8j89M28k80j13K68
4357A22k35J10K02k22k24M47j82q2O5l9J36k88L40o2q2J73l06J48J9m7nl3%R9
4381E4k28L03R3k22pJ26m9P6k98J37p7m0K48j26J32r0j49J08R2j29m2R7j0k37
4405b38K79k2k0r7o2q6K19R4k02K99J5k46O3Q2P5k14j56J75J63l10M39k26P9n39
4429d36L33J07m0k4jJ10O7m4n4q1j65M87l10l8M5j66J68j37K46rp4J63k21J31
4453E7O6k63P3j07M0Q2K02j81j61j76N42k85R5k1%K3k01L35m24M98l20j22J66
4476h2K38j39nj6j17K8K15k57K83M7O3k70lL1o8J4j67K89j96M01n3k11k94K48
$$ plain form
4500 -21 -72 26 -69 255 103 17 -49 221 -168 -97 -167 -55 -211 86 159 1 -206 50 -4 -103 113 -40 71 84
4524 84 -36 86 -135 -152 -14 -37 129 1 2 123 275 -171 50 -30 58 30 7 211 -97 -104 148 163 56 78
4548 78 -18 84 -209 -100 131 -22 63 70 181 -146 -69 45 -149 272 -83 182 -103 -74 -165 -3 32 112 40 -59
4572 -59 54 236 55 -204 -4 294 -56 -272 0 74 135 -92 95 32 111 -61 -281 185 -7 61 -68 -7
4594 -7 130 -153 -14 -91 -165 225 26 167 -9 43 110 161 220 -174 -110 -151 139 132 38 -219 -97 -5 15 -87 -194
4619 -194 119 208 -192 -32 12 -70 54 96 -59 398 -38 50 -1 99 98 88 59 96 292 241 174 125 62 -143 107
4644 107 -82 178 86 -1 -52 -46 51 213 56 -58 -181 174 -25 95 -250 224 103 -219 -6 84 -195 -4
4666 -4 -215 -88 -409 213 431 138 580 -33 75 -28 -140 79 -47 -27 127 -72 -137 -60 -53 -158 225 379
$$ packed form
4500b1n1R8r5L24j52q6o6K70l89P1p0J12j56K97P3j58k07K56n4r9K16j53J11J3
4524H4j20J22k21j7J38k3J66j28JJ21J52m46K21q0Q8k8k3K04l08pK52J5j07K2
4548G8r6J02k93J09K31j53Q5PJ11l27P7J14j94M21l55K65k85K9r1J62L5Q0p2r9
4572e9J13J82j81k59K00K98l50k16K72P4O1k27J87o3P9j72k20M66j92O8j29O1
4594gJ37k83J39p7p4L90j99J41j76N2O7N1N9l94O4m1K90pr4k57J22R2K0j02j07
4619a94L13Q9m00J60M4q2J24M2j55M57m36Q8n1J00jj0k9L7J96n1o7m9o3k05K50
4644A07j89K60r2q7n1OR7J62j57j14j23L55j99J20l45M74j21l22K13R0k79J91
4666dk11J27l21O22K18k93M42o13J08j03j12K19j26K0J54j99o5P7Pj05L83J54
$$ plain form
4688 379 -64 -259 -84 154 -17 -36 -328 -144 60 274 -103 210 46 110 291 221 200 -250 176 -20 -387
4709 -387 -661 140 -415 373 601 10 -90 -184 -298 310 -618 93 313 31 37 123 34 200 -62 -229 61 173
4731 173 62 -56 -208 -277 -396 192 187 194 29 97 -42 -167 -25 -237 249 -100 139 -12 -36 -105 -53 -70 -19 -376
4755 -376 7 -229 165 -219 86 -42 382 518 218 468 63 16 20 -64 21 133 -49 223 82 110 -273 11
4777 11 74 196 -6 -97 -66 -74 112 28 -70 202 -215 -355 142 31 -44 -64 250 35 -251 93 -165 -21 98
4800 98 -183 -51 -213 -8 -141 -109 -38 49 -70 168 69 -183 -154 -395 -56 80 270 7 428 -16 211 448
4822 448 330 115 325 388 -452 402 -184 -653 -65 -216 179 501 -579 -258 -208 219 -393 193 -232 -142 -81
4843 -81 -16 -36 -61 -382 -10 135 -107 -118 56 115 96 -265 -336 -77 -183 179 -182 75 14 -53 104 23 6 -79
$$ packed form
4688C79m43j95J75K38j71j9k92J84K04K14l77L13j64O4J81p0k1m50M26j96l67
4709c87k74Q01n55P88K28n91j00r4j14O08r28P11K20k82OQ6q9J66k62j67K90J12
4731A73j11j18j52o9j19N88nPj65O8j39j25J42k12M86l49K39j51k4o9N2j7N1l57
4755c76L83k36L94l84L05j28M24J36l00K50m05m7Mq4Q5J12j82K72j41K8l83K84
4777A1O3J22k02r1L1qJ86q4r8K72m17j40M97j11p5k0L14k15k86L44k58J44J19
4800I8k81J32j62K05j33L2P1Q7j19K38r9k52K9k41L39J36J90k63M21m44K27K37
4822D48j18k15K10O3q40Q54n86m69N88j51L95L22j080L21N0M27o12N86m25R0O1
4843h1O5k0k5l21L72J45k42j1J74N9j9l61p1K59j06L62l61K57o1o7J57q1j7q5
$$ plain form
4867 -79 95 59 118 -4 -144 40 -58 -173 -32 -170 -277 -150 32 -57 -26 -72 -196 -72 193 -150 118 97 206
4890 206 243 -156 -109 37 44 27 21 -80 29 1 128 130 -34 151 -18 -283 -174 44 234 -130 14 197 -120
4913 -120 4 -9 61 297 76 128 -96 156 -122 -45 182 -220 54 65 149 118 -95 -74 -70 -2 -85 184 47 269
4937 269 -41 -62 150 245 -18 29 178 -117 90 -34 -16 75 64 -91 0 141 311 2 -214 35 27 -62 46
4960 46 -312 -101 -151 -115 -44 -15 -298 -152 118 252 -19 198 -241 -132 -69 83 15 161 -19 1 9 -33 138 255
4984 255 95 -232 92 -72 -328 144 -1 -158 72 -71 47 138 100 -61 -167 -279 26 89 -127 189 -138
5005 -138 40 35 -1 351 -139 -21 77 -17 158 128 -105 157 177 -35 41 -132 42 -173 -56 29 -171 78 -83
5028 -83 -113 48 60 21 142 -169 134 -125 121 -143 241 -118 -125 189 -54 162 39 58 102 -166 -136 115 76
$$ packed form
4867g9J74l6N9j22j40J84r8j15J41j38j07J27J82q9L1m6j24J24K65l43K68k1J09
4890B06L7l99M7J46Pj7oj01J09k8J27Kj64J85j69k65J09K18J90l64J44J83l17
4913a20J24j3P0K36k21N2k24K52k78P7K27m02K74J1Q4l1k13K1MO8q3K69j37K22
4937B69l10k1K12R5k63M7J49k95K07j24J8R1j1j55R1J41J70l09k16K49qq9J08
4960D6l58K11n0L6P1K9k83J46K70J34k71K17m39J09O3J52o8J46j80K0Qm2J71J17
4984B55j60l27L24j64k56M72j45j57K30j43J18R1l8j61j06j12L05O3k16L16l27
5005a38J78nl6L52m90J18R8r4J75l0k33K62K0k12P6j73J74k15J17Q5k00K49j61
5028h3l0J61J2l9J21l11L03k59K46k64L84l59pL14k43K16j23J9M4k68L0K51l9
$$ plain form
5051 76 -61 -31 176 109 -21 -139 -41 13 49 -6 -6 -191 203 153 -3 -88 -48 14 117 -30 90 17 167 -156 146
5076 146 120 48 71 91 51 109 -162 206 -93 -21 155 -160 80 -18 -189 205 106 -75 -155 70 -192 -34 191
5099 191 27 90 8 301 160 77 2 68 30 296 -130 -96 -50 -57 -69 -111 -222 38 185 -41 259 -193 -10 160
5123 160 -159 -90 -202 -383 -25 66 241 -77 60 44 -95 -86 -202 -103 65 -9 -25 100 191 -66 206 77 -47
5146 -47 137 -2 -28 91 80 56 -226 -91 436 -20 74 106 150 136 97 -267 198 -245 5 -166 12 235 10
5169 10 -88 -268 243 132 -114 -32 199 -217 106 206 -235 -161 -153 119 -12 196 -151 120 -40 65 48 57 -14
5192 -14 -22 -6 -120 -12 -204 16 -15 -70 78 126 -237 -17 -257 -300 -69 -222 277 62 92 137 -38 72 41 99
5216 99 -114 -316 -4 25 246 47 -182 128 189 -30 -131 -12 -225 115 245 -19 -103 104 407 71 -16 137
$$ packed form
5051G6j37L0K07o7j30j18R8N4L6n5%j85L94n0j56q5M0O2J03j47J20p3J50l23L02
5076A46k6p2K3K0m0N8k71L68k99P2J76l15K40r8j71L94r9j81q0K25k62J58K25
5099A91j64O3q2K93j41q3p5O6l8K66m26L4M6pj2m2j11K60J47k26L00m52J83J70
5123A60l19O9j12j81L58R1J75l18J37j6j39Rj16R9J68p4j6J25R1k57K72j29j24
5146d7J84j39k6J19j1k4k82J35N27m56R4L2M4j4l9l64M65m43K50j71J78K23k25
5169A0r8j80N11j11k46Q2K31m16L23J00m41P4QK72j31K08l47K71j60J05j7Rp1
5192a4qJ6j14J08j92K20l1n5J48M8l63K20k40m3K31j53M99k15L0M5j75J10l1N8
5216I9k13k02L12K9K21j99k29L10O1k19j01J19k13L40J30k64q4K07L03l36q7J53
$$ plain form
5238 137 210 95 -134 -191 -29 167 -23 173 53 188 -65 12 56 -38 124 133 51 163 26 -201 -105 283 190
5261 190 -3 -15 25 321 -45 -42 221 25 -34 -13 52 -206 91 97 -196 -87 -21 -103 175 -5 212 216 132 212 -103
5286 -103 -78 -251 -87 230 270 -65 -9 146 -87 35 -71 -124 -55 9 -245 -286 97 147 -192 110 -141 -122 151
5309 151 -61 -97 -156 -33 -63 -332 144 290 -27 88 -40 -159 -198 15 -148 81 27 -25 -55 -71 -81 51 19
5332 19 -46 133 -169 -74 -7 95 -80 -205 -326 201 2 -272 163 275 -182 136 296 13 94 -82 498 -76
5354 -76 12 213 -277 55 112 224 -203 97 -100 -15 94 -57 -138 31 -225 90 66 -30 -3 63 114 -316 251
5377 251 4 -107 -98 -125 155 28 -154 -4 -79 -151 -89 -21 -94 -88 -90 29 -239 51 -55 -164 174 32 -134 -140 -206
5402 -206 -6 -200 -249 48 -176 -43 254 -168 34 -31 55 147 176 -28 -77 -32 41 -105 41 221 95 -185 -103
$$ packed form
5238A37P3j15k29n7J62J96j90J96j20J35k53P7M4r4J62Rq2J12j37k27R6L88r3
5261A90j93j2M0K96l66LK63j96n9K1O5k58K97Ok93J09O6q2K78j80K17Mq4Q0l15
5286a03K5j73J64L17M0l35N6J55k33J22j06n3O9O4k54m1L83N0l39L02k51J9K73
5309A51k12l6n9J23l0k69M76J46l17J15j28j19l9K13j63K29n4n2l0j6j0J32l2
5332A9o5J79l02R5O7J02j75j25j21N27j99k74M35J12m57L18J60k83Q1j76N80n74
5354g6Q8K01m90L32N7J12m27L00j97Q5J09j51q1J69k56L15k4r6K7O6N1m30N67
5377B51k47j11Rk7K80j27j82J50p5p2O2O8p3OkJ19k68K90j06j09L38j42j66oo6
5402b06K00j94m9K97k24J33K97m22K02o5Q6R2K9k04m9M5P3j46J46J80j26k80Q2
$$ plain form
5425 -103 155 30 -17 106 119 58 -122 -196 -30 -36 75 192 -22 -9 133 60 28 78 86 -100 325 -125 -51 -70 115
5450 115 -251 -77 -134 141 -61 30 135 -192 -90 -123 7 -102 106 6 146 -302 -71 -114 -91 -289 -7 22
5472 22 -138 159 -3 -57 -72 224 150 -280 -154 -69 29 -200 -53 -39 51 225 -207 -188 167 -71 -405 138 -1
5495 -1 64 60 116 205 -100 -278 -146 -80 70 -220 45 -154 -255 6 -91 391 -125 -68 -42 298 -36 -108 128 155
5519 155 179 112 -36 -64 -253 169 -67 63 -197 94 -173 -35 24 -68 102 -91 -25 173 148 -185 -116 354 1
5542 1 87 -115 -133 338 -273 189 80 -40 -132 -21 -72 12 -126 -60 21 140 -126 115 168 -53 134 103 -75 181
5566 181 -128 -81 -40 -12 183 -82 115 -99 -11 -82 -112 96 -27 -26 -80 -120 135 -33 180 -173 -17 -271 77
5589 77 -236 98 -185 191 -13 15 -66 -196 217 -133 175 -74 -339 123 150 29 -67 348 -182 -118 235 18
$$ packed form
5425a03K58j25m7J23J3o1j80p4J66oJ11J17k14J3J42p3l2N0Qj86M25m50P4j9J85
5450A15l66J74n7K75k02R1J05l27J02l3J30j09K08j00J40m48K31m3K3j98K82K9
5472B2j60K97j62n4j5K96p4m30J26Q5R8k29J47J4R0J74m32J9L55k38l34N43j39
5495aO5mN6Q9l05j78J32O6J50k90K65j99j01K61r7M82n16N7K6L40l34p2K36K7
5519A55K4o7j48k8j89M22k36J30k60K91k67J38N9r2J70j93O6J98k5l33O9M70l53
5542AQ6k02j8M71o11M62j09j20r2J11n1Q4j38O6Q1J19k66K41N3k21J87l1j78K56
5566A81l09M7M1K8J95k65J97k14Q8p1l0K08j23Jn4m0K55j68K13l53J56k54L48
5589G7l13L34k83L76k04K8q1j30M13l50L08k49k65M62K7j21r6M15n30O4L53k17
$$ plain form
5611 18 139 -47 11 1 136 -41 282 169 -134 -112 256 54 36 -85 134 -150 56 266 60 -110 154 -39
5633 -39 -282 -40 110 98 -76 146 -135 -386 -78 85 305 78 98 -68 58 -42 12 -12 -115 338 67 -101
5655 -101 -212 -245 67 1 -268 -34 38 42 9 96 -60 46 -101 13 35 -67 -49 186 26 -135 303 -8 -33
5678 -33 93 24 137 0 108 263 -12 87 343 -47 -91 150 -30 -134 -136 -21 -80 208 19 18 1 39 -149 244
5702 244 73 -155 -72 247 79 -395 108 72 -130 -47 28 208 -55 -94 369 -147 5 87 -53 39 -125 19
5724 19 -162 115 62 32 -44 26 -1 -91 83 -33 -178 156 83 -345 -28 145 -18 67 -136 166 -202 -13 -109
5747 -109 -210 85 -54 -179 57 88 160 -38 -102 -136 -295 108 113 60 -241 -44 51 206 -122 -202 65 96 -34
5770 -34 98 86 126 136 -47 97 173 -72 74 48 -57 181 -12 -162 -147 -243 50 187 180 92 94 -87 -298 21
$$ packed form
5611A8J21j86N8j0J35j77L23j13l03K2L68k02j8j21K19k84K06K10k06j70K64j93
5633c9k43K42J50j2j74K22k81k51L08J63K20k27K0j66J26j00N4k4j03M53k71j68
5655a01j11l3L12o6k69K34P2Ml3Q7j56J06j47J14K2j02J8K35j60j61M38l11k5
5678c3J26o9J13j37J08J55k75R9K56l90m4K41j80j04kJ15n9K88j89jj7L8j88L93
5702B44j71k28Q3L19j68m74N03l6k02Q3P5J80k63l9M63n16J52Q2j40R2j64J44
5724A9j81K77n3l0p6P0k7r0J74j16j45L34p3m28L17J73j63Q5k03L02l68J89r6
5747a09j01K95j39j25K36L1P2j98o4l4j59M03Nn3l01J97R5J55l28q0K67L1j30
5770c4J32j2M0J0j83J44P6k45J46k6j05K38j93j50J5r6K93J37pq8Kj81k11L19
$$ plain form
5794 21 -198 229 -3 44 -21 -211 -266 277 -110 -108 -34 83 -111 223 -23 -153 -74 84 -52 -94 -281 -97 -127
5817 -127 -98 -141 -129 498 -60 111 -291 106 54 22 -22 -101 145 96 -4 -114 142 68 -112 -3 -159 174 67
5840 67 63 166 -107 212 -28 150 317 -144 16 -6 -205 272 146 189 -223 32 -221 -72 -23 -135 126 56
5862 56 -127 104 330 -3 -100 -201 262 109 97 25 7 140 -30 53 -45 74 381 -21 -347 -156 105 -63
5884 -63 153 185 -68 85 96 180 -138 -4 -169 -15 -99 25 60 -115 121 123 -192 -83 12 -238 59 2 123
5907 123 162 29 -5 -96 81 -56 -45 106 12 93 -127 -70 -260 -136 -62 -146 -92 -210 -39 172 -41 -119 77 -41
5931 -41 4 -48 224 266 -81 -12 14 -211 -138 -52 71 -47 -215 147 -143 -133 49 -55 192 30 -117 -111 -6 -204
5955 -204 71 88 9 158 -90 -104 -128 -10 -132 17 -98 121 -149 186 -150 22 -104 16 -280 -241 -20 83
$$ packed form
5794B1k19M27k32M7o5j90n5N43l87KP4J17j94L34k46j30P9J58j36m2j87J84l0
5817a27K9m3J2O27n58J71m02L97n2l2m4p9K46m9j00j10K56p4j80J09j56L33j07
5840F7mJ03k73L19k40J78J67m61J60k2j99M77j26M3m12K55k53J49M9j12K61p0
5862E6j83K31K26l33r7j01M63j53j2p2j8J33j70Q3r8J19L07m02l26J91K61j68
5884f3K16L2k53J53J1Q4l18J34j65J54q4J24L5j75K36Kl15J09R5k50K97n7J21
5907A23L9j33l4r1J77j37J1J51r4Q1k20N7j90J24P4q4N4j18J71K11k13p8J96j18
5931d1M5n2K72M2l47O9K6k25P3Q6J23j18j68L62k90J0J82j04K47j62j47OJ05j98
5955b04K75J7p9J49k48j4k4J18j22J49j15K19k70L35l36J72j26J20k96L9K21J03
$$ plain form
5977 83 -234 35 -162 -25 -139 -43 -40 242 239 -25 220 -146 32 -287 160 201 -80 -52 55 125 -90 -71 35
6000 35 -145 -81 -48 36 -108 30 -131 314 333 -34 186 -105 94 110 -296 -141 22 -79 -68 418 270 -1
6022 -1 260 116 -187 -181 304 -16 333 207 -135 227 -19 80 -26 -18 -25 -168 -242 14 223 -161 34 -155 30
$$ packed form
5977H3l17K69j97J37j14R6LK82lk64K45l66J78l19M47M1k81K8J07P0k15J9J06
6000C5j80O4L3Q4j44J38j61M45J9l67K20k91J99J6m06J55J63j01J1M86j48k71
6022aK61j44l03OM85l20L49j26l42L62k46R9j06Qpj43p4K56K09l84J95j89J85
$$ [...]
8191G0
##END NTUPLES=NMR FID
##END=
