##TITLE=1H_Pr NCS-N2
 200.13MHz, CDCl3,
 8 sc
 
 7.8.2025
##JCAMPDX= 6.0         $$ Bruker NMR JCAMP-DX V2.0
##DATA TYPE= NMR FID
##DATA CLASS= NTUPLES
##ORIGIN= UXNMR, Bruker Analytische Messtechnik GmbH
##OWNER= pz
$$ XWIN-NMR		Version 3.5
$$ Thu Aug  7 14:09:19 2025 Russian Standard Time (UT+4h)  she@DPX200
##.OBSERVE FREQUENCY= 200.1313
##.OBSERVE NUCLEUS= ^1H
##.DELAY= (6, 6)
##.ACQUISITION MODE= SIMULTANEOUS
##.ACQUISITION SCHEME= undefined
##.AVERAGES= 8
##.DIGITISER RES= 18
##SPECTROMETER/DATA SYSTEM= spect
##.PULSE SEQUENCE= zg30
##.SOLVENT NAME= CDCl3
##.SHIFT REFERENCE= (INTERNAL, CDCl3, 0, 14.3821)
##AUDIT TRAIL= $$ (NUMBER, WHEN, WHO, WHERE, WHAT)
$$ ##TITLE= Audit trail, XWIN-NMR		Version 3.5
$$ ##JCAMPDX= 5.01
$$ ##ORIGIN= Bruker BioSpin GmbH
$$ ##OWNER= she
$$ F:/spectra/data/she/nmr/H-C/1/audita.txt
$$ ##AUDIT TRAIL=  $$ (NUMBER, WHEN, WHO, WHERE, WHAT)
(   1,<2025-08-07 14:08:07.23 +0400>,<she>,<DPX200>,
      <created by zg, POWCHK disabled, PULCHK disabled
       configuration hash MD5:
       00 E9 B6 7A A2 85 ED C7 34 08 36 98 17 FE 4E 26
       data hash MD5: 16K
       81 E8 01 2E 5B B2 32 B7 2D 4E 16 F6 BE 9E 6C 9D>)
$$ ##END=
$$ 
$$ hash MD5
$$ DA E4 70 09 92 D4 3D 34 47 B1 5E 6F 3C 0C 72 25
##$RELAX= 
##$RELAX= 
##$RELAX= 
##$RELAX= 
##$RELAX= 
##$RELAX= 
$$ Bruker specific parameters
$$ --------------------------
##$DU= <F:/spectra>
##$EXPNO= 1
##$NAME= <H-C>
##$PROCNO= 1
##$TYPE= <nmr>
##$USER= <she>
##$AMP= (0..31)
100 100 100 100 100 100 100 100 100 100 100 100 100 100 100 100 100 100 
100 100 100 100 100 100 100 100 100 100 100 100 100 100 
##$AQSEQ= 0
##$AQ_mod= 1
##$AUNM= <au_zg>
##$AUTOPOS= <>
##$BF1= 200.13
##$BF2= 200.13
##$BF3= 200.13
##$BF4= 200.13
##$BF5= 200.13
##$BF6= 200.13
##$BF7= 200.13
##$BF8= 200.13
##$BYTORDA= 1
##$CFDGTYP= 0
##$CFRGTYP= 5
##$CHEMSTR= <none>
##$CNST= (0..31)
1 1 145 1 1 1 1 1 1 1 1 1 1 1 1 1 1 1 1 1 1 1 1 1 1 1 1 1 1 1 1 1 
##$CPDPRG= <>
##$CPDPRG1= <>
##$CPDPRG2= <>
##$CPDPRG3= <>
##$CPDPRG4= <mlev>
##$CPDPRG5= <mlev>
##$CPDPRG6= <mlev>
##$CPDPRG7= <mlev>
##$CPDPRG8= <mlev>
##$CPDPRGB= <>
##$CPDPRGT= <>
##$D= (0..31)
0 0.7 0 0 0 0 0 0 0 0 0 0.03 0 0 0 0 0 0 0 0 0 0 0 0 0 0 0 0 0 0 0 0 
##$DATE= 1754561286
##$DBL= (0..7)
120 120 120 120 120 120 120 120 
##$DBP= (0..7)
150 150 150 150 150 150 150 150 
##$DBP07= 0
##$DBPNAM0= <>
##$DBPNAM1= <>
##$DBPNAM2= <>
##$DBPNAM3= <>
##$DBPNAM4= <>
##$DBPNAM5= <>
##$DBPNAM6= <>
##$DBPNAM7= <>
##$DBPOAL= (0..7)
0.5 0.5 0.5 0.5 0.5 0.5 0.5 0.5 
##$DBPOFFS= (0..7)
0 0 0 0 0 0 0 0 
##$DE= 6
##$DECBNUC= <off>
##$DECIM= 32
##$DECNUC= <off>
##$DECSTAT= 4
##$DIGMOD= 1
##$DIGTYP= 9
##$DL= (0..7)
0 120 120 120 120 120 120 120 
##$DP= (0..7)
150 150 150 150 150 150 150 150 
##$DP07= 0
##$DPNAME0= <>
##$DPNAME1= <>
##$DPNAME2= <>
##$DPNAME3= <>
##$DPNAME4= <>
##$DPNAME5= <>
##$DPNAME6= <>
##$DPNAME7= <>
##$DPOAL= (0..7)
0.5 0.5 0.5 0.5 0.5 0.5 0.5 0.5 
##$DPOFFS= (0..7)
0 0 0 0 0 0 0 0 
##$DQDMODE= 0
##$DR= 18
##$DS= 0
##$DSLIST= <SSSSSSSSSSSSSSS>
$$ [...]
##$SUBNAM0= <"">
##$SUBNAM1= <"">
##$SUBNAM2= <"">
##$SUBNAM3= <"">
##$SUBNAM4= <"">
##$SUBNAM5= <"">
##$SUBNAM6= <"">
##$SUBNAM7= <"">
##$SUBNAM8= <"">
##$SUBNAM9= <"">
##$SW= 18.0517328524113
##$SWIBOX= (0..15)
0 0 2 0 0 0 0 0 0 0 0 0 0 0 0 0 
##$SW_h= 3612.71676300578
##$TD= 16384
##$TD0= 1
##$TE= 0
##$TE2= 300
##$TE3= 300
##$TEG= 300
##$TL= (0..7)
0 120 120 120 120 120 120 120 
##$TP= (0..7)
150 150 150 150 150 150 150 150 
##$TP07= 0
##$TPNAME0= <>
##$TPNAME1= <>
##$TPNAME2= <>
##$TPNAME3= <>
##$TPNAME4= <>
##$TPNAME5= <>
##$TPNAME6= <>
##$TPNAME7= <>
##$TPOAL= (0..7)
0.5 0.5 0.5 0.5 0.5 0.5 0.5 0.5 
##$TPOFFS= (0..7)
0 0 0 0 0 0 0 0 
##$TUNHIN= 0
##$TUNHOUT= 0
##$TUNXOUT= 0
##$USERA1= <user>
##$USERA2= <user>
##$USERA3= <user>
##$USERA4= <user>
##$USERA5= <user>
##$V9= 5
##$VALIST= <valist>
##$VCLIST= <CCCCCCCCCCCCCCC>
##$VD= 0
##$VDLIST= <DDDDDDDDDDDDDDD>
##$VPLIST= <PPPPPPPPPPPPPPP>
##$VTLIST= <TTTTTTTTTTTTTTT>
##$WBST= 1024
##$WBSW= 4
##$XGAIN= (0..3)
0 0 0 0 
##$XL= 0
##$YL= 0
##$YMAX_a= 345756
##$YMIN_a= -359589
##$ZGOPTNS= <>
##$ZL1= 120
##$ZL2= 120
##$ZL3= 120
##$ZL4= 120
##$ABSF1= 10
##$ABSF2= 0
##$ABSG= 5
##$ABSL= 3
##$ALPHA= 0
##$AQORDER= 0
##$ASSFAC= 0
##$ASSFACI= 0
##$ASSFACX= 0
##$ASSWID= 0
##$AUNMP= <proc_1d>
##$AZFE= 0.1
##$AZFW= 0.1
##$BCFW= 1
##$BC_mod= 2
##$BYTORDP= 1
##$COROFFS= 0
##$CY= -3
##$DATMOD= 1
##$DC= 2
##$DFILT= <>
##$DTYPP= 0
##$F1P= 0
##$F2P= 0
##$FCOR= 0.5
##$FTSIZE= 0
##$FT_mod= 4
##$GAMMA= 1
##$GB= 0.15
##$INTBC= 1
##$INTSCL= 1
##$ISEN= 128
##$LB= 0.25
##$LEV0= 0
##$LPBIN= 0
##$MAXI= 10000
##$MC2= 0
##$MEAN= 0
##$ME_mod= 0
##$MI= 1.114404
##$NCOEF= 0
##$NC_proc= 0
##$NLEV= 6
##$NOISF1= 3.799351
##$NOISF2= 2.8
##$NSP= 1
##$NTH_PI= 0
##$NZP= 0
##$OFFSET= 14.38212
##$PC= 1
##$PHC0= -1195.218
##$PHC1= 6.592302
##$PH_mod= 1
##$PKNL= yes
##$PPARMOD= 0
##$PSCAL= 0
##$PSIGN= 0
##$REVERSE= no
##$SF= 200.129724274929
##$SI= 16384
##$SIGF1= 3
##$SIGF2= 2
##$SINO= 400
##$SIOLD= 16384
##$SREGLST= <1H.CDCl3>
##$SSB= 0
##$STSI= 0
##$STSR= 0
##$SW_p= 3205.1282051282
##$SYMM= 0
##$S_DEV= 0
##$TDeff= 0
##$TDoff= 0
##$TI= <>
##$TILT= no
##$TM1= 0
##$TM2= 0
##$TOPLEV= 0
##$USERP1= <user>
##$USERP2= <user>
##$USERP3= <user>
##$USERP4= <user>
##$USERP5= <user>
##$WDW= 1
##$XDIM= 8192
##$YMAX_p= 0
##$YMIN_p= 0
$$ End of Bruker specific parameters
$$ ---------------------------------
##NTUPLES= NMR FID
##VAR_NAME=  TIME,          FID/REAL,        FID/IMAG
##SYMBOL=    X,             R,               I
##VAR_TYPE=  INDEPENDENT,   DEPENDENT,       DEPENDENT
##VAR_FORM=  AFFN,          ASDF,            ASDF
##VAR_DIM=   8192,          8192,            8192
##UNITS=     SECONDS,       ARBITRARY UNITS, ARBITRARY UNITS
##FACTOR=    0.0002768,     1,               1
##FIRST=     0,             0,               0
##LAST=      2.2672688,     0,               0
##MIN=       0,             -359589,         0
##MAX=       2.2672688,     345756,          0
$$ Real data points
##PAGE= N=1
##DATA TABLE= (X++(R..R)), XYDATA
$$ [...]
1788a11K53k88q6J31J8M4L5j79jK62q0Q4j21K21P7l01j12M50l83k66L57P3k13
$$ -111 142 -146 -232 -101 -83 -39 -4 -183 -184 78 -2 82 -39 182 259 -42 -154 296 -87 -353 4 77 -136
1811a36K13k02L40m75R3N0K57k56m8L51p8k36J45J8J11l63J95q4p2N9k52L62p
$$ -136 77 -125 215 -260 -167 -117 140 -116 -164 187 109 -127 18 36 147 -216 -21 -105 -177 -118 -370 -8 -15
1834a5l09K85J55N0k65J89k42R3J55k5O2j18p8K81o6j14j09L54J4m81O8K01k72
$$ -15 -324 -39 116 166 -99 90 -152 -59 96 71 133 15 -63 218 152 38 -71 283 297 -184 -116 85 -187
1857a87j34K26L7K24j79k27N58Mk82J30P2q0j58j11L09j33ro0j35o2K00jN3K9
$$ -187 -321 -95 -58 166 -13 -240 318 322 40 170 242 162 4 -107 202 69 60 0 -135 -197 3 2 55 84
1881H4j18j30m6L37m06L97J17k25J54j69J02q7j15L33o3j73Q7m5P9j21j90L83
$$ 84 -34 -164 -210 127 -279 118 235 10 164 -5 97 10 -105 228 165 -8 79 34 113 -8 -198 185
1903A85k75j73M89J5j31j6j57K69j95q6j32M74m46j15J84N0J90k21%K36l13L07
$$ 185 -90 -263 226 241 110 94 -63 206 11 -75 -207 267 -179 -294 -110 -60 130 -91 -91 145 -168 139
1925A39l20K00J82m76L69j24L57q8j00k96L33Ql68J33O7j58L9J81l74L58p3k55
$$ 139 -181 19 201 -275 94 -30 327 239 139 -157 176 184 -184 -51 16 -142 -103 78 -296 62 -11 -266
1947b66J72J39k73L53j50p6j32j8K80K54l69J54k79K22L21l46j90M92m26j41J22
$$ -266 -94 45 -228 125 -25 -101 -233 -251 29 283 -86 68 -211 11 332 -14 -204 288 -138 -279 -157
1968a57n0L93k94J36K3J18l50J86M7J52K04m55N1P4j04n5N8oK78k73m2l8J79k04
$$ -157 -207 186 -108 28 51 169 -181 5 52 204 408 -47 4 78 -26 -81 -23 -29 249 -24 -66 -104 75 -129
1992a29Q4M9K69qm17J67J83j27r7K11O3j84k59P1K60j2j52O2k63M88j57k57K95
$$ -129 -45 4 273 265 -152 15 198 71 -26 185 248 64 -195 -124 136 124 -28 34 -229 259 102 -155 140
2015A40k26k6K57J78l73P4l4O4k9J8j20j06Q0K56n39L32J02k99J40l2J57J61l02
$$ 140 -86 -112 145 323 -50 24 -10 54 25 43 -77 -183 -103 153 -386 -54 48 -251 -111 -143 14 175 -127
2038a27J05J31Pm0k86J98K79p4k94n7O04j63n02K68pk48N4N4K67l61N09k22lj39
$$ -127 -22 109 116 76 -210 -12 267 193 -101 -158 446 283 -219 49 42 -206 -152 -98 169 -192 317 95 92 -47
2062d7J5N5N2q9R7rL0l13L67n8o0m1q6j68M84m08J9p4J75J1J09l1mj18L08k16
$$ -47 -32 23 75 -14 83 74 104 -209 158 100 40 -1 -87 -255 229 -179 -160 -234 -59 -48 61 30 26 -92 216 0
2088@M6J54j70j00J05J4J4M5n7j80K59k80P4J62j73KK08k17O4Q3n3L3P8J11m56
$$ 0 46 200 30 -70 35 49 63 108 51 -129 130 -150 -76 86 -87 -85 123 -94 -30 53 0 33 111 222 -234
2113b34K69l25M42j80j25J30j83K45j46j12L16K4l35L1l6Q4K78l55J27j68L25
$$ -234 35 -290 152 -28 -153 -23 -206 39 -107 -219 97 121 -214 -183 -219 -135 143 -212 -85 -253 72
2134G2k60O1J22J89r9j29n9Q0J24j55ML44l97j55K64K12k9j41m2l4J18k63J13
$$ 72 -188 -127 -5 184 85 -44 -103 -23 101 -54 -50 294 -103 -258 6 218 189 48 6 -28 90 -173 -60
2157f0J9p4R0k02K29j31O2J06j42J78o4k41K87J56k57m8J12K40l73L1J40K92k40
$$ -60 -41 -115 -25 -227 2 -129 -67 39 -103 75 11 -230 57 213 -44 -92 20 260 -113 -82 58 350 110
2180A10J2j0j25NK55j88j95P0j32K55j40L6K80k74J61oR5k34L14k66K28L8l46
$$ 110 122 112 -13 -8 247 59 -136 -66 -198 57 -83 -47 233 -41 120 114 209 -25 289 23 251 289 -57
2203e7K2P1j86J56K1j47J57L0j66J60lm0L8j40L4LN6J5J33k66P0J64K65l63j01
$$ -57 -35 36 -150 6 27 -120 37 67 -99 61 58 18 56 -84 -50 -47 9 24 157 -109 -39 125 390 27 -74
2228g4j30K48j09K20r8k59P6J39r7J05k56J95L27m78k17O20J49k70R9p1k05J12
$$ -74 -204 44 -65 155 57 -202 -126 13 -84 21 -235 -40 287 -191 -408 212 361 91 190 119 -86 26
2250B6K80j83j05j4Q6j65P9l06L03J18p1l09K16J74N6K9k20O7o8n5K6K0j00L25
$$ 26 306 123 18 4 90 -75 4 -302 1 119 48 -261 -45 129 185 214 -6 61 -7 -62 -36 -16 -116 209
2274B09l04K49k73J09Q0J29k09o2o7L47l15K5J63j38N5k07K70p8j25j70K72J36
$$ 209 -95 154 -119 -10 70 199 -10 -72 -139 208 -107 -82 81 -57 -2 -209 61 -17 -142 -312 -40 96
2296I6k21N0NJ01N8M0j66nK87R0l19k26M04k02K16j72l7J58k37j25J45j02J83
$$ 96 -125 -75 -70 31 89 129 -37 -42 245 335 16 -210 194 -8 208 36 -1 157 -80 -205 -60 -162 21
2319B1N5L4J42l2m06K90J34j80L9k13J80J74k1l08J83m8k49K72J87k91L3k86J22
$$ 21 76 110 252 220 -186 104 238 58 97 -116 64 238 217 -91 92 44 -205 67 254 -37 -4 -290 -168
2342a68L4J16J10k34J16N2j14L23k10J89l61L16j32j17K11J72r2l25j66L32J13
$$ -168 -134 -18 92 -142 -26 26 -88 235 25 214 -147 169 37 -80 131 303 211 -114 -280 52 165
2363A65k97p3J98j85Q7L50j79r7k43J85q5L54j64jq4m1M73k35j73L7M9j76KO9
$$ 165 -132 -205 -7 -192 -105 245 66 -31 -274 -89 -174 180 16 15 -69 -110 363 128 -45 -8 41 -135 -133 -64
2387f4K04L2j54Q6n7k84J27M83k85l81K74K56K16j97J64m25J7j88K4O8J52m7o8
$$ -64 140 172 18 104 47 -237 -110 373 88 -293 -19 237 453 256 420 -5 12 -176 -152 -84 68 21 -47
2410d7J62P0l25J12K35m36Q1K4L64k76J48Rm5r9k0j26J00L76k18k25J0J32p9L6
$$ -47 115 185 -140 -28 207 -229 -148 -124 240 -36 112 121 76 -23 -43 -169 -69 307 89 -136 -126 6 -73 -37
2434c7J5lJ8L84l92N6j77K14lk3j39L27m66J31K44k63J73j82M62k81K27l54q4
$$ -37 -22 -25 -7 377 -15 41 -136 78 75 52 -87 240 -226 -95 149 -114 59 -123 339 58 285 -69 -153
2457a53K24j00No8J30PJ87m75M59R6l12j8j77J94K50l37L0O0k3Q2q8J18j73m4
$$ -153 71 -29 -24 -92 38 45 232 -243 216 312 0 -18 -195 -1 249 -88 -58 2 -21 61 -27 91 -82 -126
2481a26J81l2j7p0j36L07kP8qk47K89P0n19L32j85K52l11j12L17L8j58j02K90
$$ -126 55 23 6 -64 -200 107 105 183 175 -72 217 287 -232 100 -85 167 -144 -256 61 99 -59 -161 129
2504A29r2j07J11j07K78n71K93j01M24L0l89J88j25L15o27K34m5J66M9l93L24
$$ 129 37 -70 41 -66 212 -359 -66 -167 257 287 -102 86 -39 276 -351 -117 -162 4 53 -340 -16
2525a6J4j21LJ70K4k14J80Q5o3p5o0n1J01J01q3k92L00j04O7k20M41j64K10l26
$$ -16 -2 -123 -120 50 74 -140 40 125 62 -13 -73 -124 -23 78 -5 -297 3 -101 -34 -254 187 23 233 -93
2549i3P3j07J51Q4P8l4k23J80p5R2p2l98L16O0j49R0j83J15K56k35R1k19k2L0
$$ -93 -20 -127 24 108 186 152 -71 109 34 126 54 -344 -28 32 -117 -27 -210 -95 161 -74 17 -202 -224 -194
2573a94J83kK78l36N28l52k79K68n0k29Q2O3Mj74J29J33J73q4l02J32l1J06k4
$$ -194 -11 -13 265 -71 457 105 -174 94 44 -185 -103 -40 -36 -210 -81 52 225 141 -161 -29 -60 46 22
2596B2J84k26j70K12m0q6J18m6P5L81n46j98K66k62J53J55N8O0k15N4L13j54j15
$$ 22 206 -20 -190 22 -18 -104 14 -32 43 424 -122 -320 -54 -316 -163 -8 50 110 -105 -51 262 108 -7
2619gO5n4r8L45l14k12M37j64j50M23l81r9K82R6k10k5o5J57l35L41L8j45J45
$$ -7 58 4 -94 251 -63 -275 162 -2 -152 271 -110 -209 73 169 -41 -66 -131 26 -309 32 70 -75 70
2642G0K85l84n5o5L79m47L35l92K71J33j79%mJ4r8K0L5l6P1k36K09K92J07m59
$$ 70 355 -29 -84 -149 230 -217 118 -274 -3 130 -49 -49 -53 -39 -137 -117 -82 -118 -47 -283 -74 218 325 -134
2666a34K78K00l88o2J98P4q2p5k06K71j75J72q9o9k97J46L64j20k42L35m5k00
$$ -134 144 344 -44 -106 92 166 84 9 -197 74 -101 71 -18 -87 -384 -238 126 6 -236 99 54 -146
2688a46J59K54j83k98Q7n9L28j63k8J48Pk00M6P3k04L27q5m7j2K22j64K9MqK3
$$ -146 13 267 84 -214 -127 -186 142 -21 -49 99 106 -94 -48 25 -179 148 63 16 4 226 62 91 95 87 110
2713A10p4K17j15j90K02j40qO1k70J63j11j91N11k58K31R8m01J90m6K15k83k12
$$ 110 36 253 138 -52 150 10 2 63 -207 -44 -155 -346 165 -93 138 236 -165 25 -21 194 -89 -301
2735c01M79k58K25j48J77j94k11M06j64j18J71o9K4J34m42K24K22j38L2k25K83
$$ -301 178 -80 145 -3 174 -20 -231 175 11 -107 64 -5 19 153 -289 -65 157 19 51 -174 109
2756A09J23k9n0k23L03k53k53P3K95k06k79K59J79P2k4j94K22j23r7L66j54k56
$$ 109 232 203 153 -70 233 -20 -273 -200 95 -111 -390 -131 48 120 96 -98 124 1 -96 270 116 -140
2778a40K09J4j12J79l45K23j28p1L89l51j2J13M3R7R7j24j10J73l22R5L32O6l65
$$ -140 69 83 -29 150 -195 28 -100 -171 218 -133 -145 -32 11 108 205 81 -29 144 -178 -83 249 315 -50
2801e0k63O06r7R9l19J40j08l42K22JR1J73l43K29n1J54k26M7K19j74j28K26j5
$$ -50 -313 293 196 295 -24 116 8 -334 -112 -111 -20 153 -190 39 -12 142 -84 -37 182 8 -120 106 91
2824I1j86K44j75r6j32N88k50k05L45m78L38m94K60M78k80J5m4l9L05l26k95N37
$$ 91 -95 149 -26 -122 -254 334 84 -121 224 -254 84 -410 -150 328 48 63 19 -20 285 -41 -336 201
2846B01J45l01P0Q6J06l28j05K86k56k76M47J82k82k35M58j43m6j11O4K5l7O7
$$ 201 346 45 115 201 307 -21 -126 160 -96 -372 75 257 -25 -260 198 55 9 -102 -38 -13 -50 17
2868A7J3l4l1j73L17J68k94j98K47P1n9J19j96J49r6L44m26L7j2M2M6N5j71R5
$$ 17 30 -4 -35 -208 109 277 -17 -215 32 103 44 163 -33 116 20 364 -62 -25 -37 5 51 106 -65 30
2892C0n6q9N0J60M1l41p1K34K02l10K31j29o9J26k86M52K4k96J35l52O54l82J03
$$ 30 -26 -115 -65 95 136 -205 -276 -42 160 -150 81 -48 -117 9 -277 175 199 -97 38 -314 340 -42 61
2915F1Q9l5N0l12o7K73j92j17K14r3nK08J01q2q4J06o1J60l99M06k57N1j57J37
$$ 61 150 115 165 -147 -214 59 -133 -250 -36 -129 -134 74 175 93 9 115 54 214 -185 221 -36 15 -142 -5
2939ej31K72k24n0Q7j79J98m8J6m6K73O5k54j43J25Q3k04K16P2J61k20J54k20
$$ -5 -136 136 -88 -138 -51 -230 -32 -80 -64 -110 163 228 -26 -169 -44 39 -165 51 123 284 64 218 -2
2962bJ7j09m2M27l36j9K21k50L74j35k32j85L88m8m3j27J96n7j31L10j14k06j08
$$ -2 15 -94 -136 291 -45 -64 157 -93 281 146 -86 -271 117 69 26 -101 95 38 -93 217 103 -103 -211
2985b11K06j22K57k65K51k94K20Q8k47K76l98L87n7k26J46L9k0R3k03j6K04k69
$$ -211 -5 -127 130 -135 116 -178 42 130 -117 159 -239 148 91 -135 11 50 30 123 -80 -96 108 -161
3007a61J35N5m5o3l9K53j31l23M13Q9l19J47j1n9J26R2k70k7K60J2r5mJ52l68
$$ -161 -26 29 -16 -79 -118 135 4 -319 94 183 -136 11 0 -59 67 159 -111 -138 122 134 39 35 187 -181
3031a81J10J79J0p7j24p0K14j35J06K8j45K9R1L5R0K8j39k55J64R6j7O7k5j19
$$ -181 -71 108 118 41 -83 -153 61 -74 32 60 -85 -56 35 70 160 188 49 -206 -42 54 37 104 79 -40
3055d0j46J57r5J09j12J74k17pL8P2J17K66m02M79k41O4L5k92K92l32n2N38n49
$$ -40 -186 -29 -124 -15 -127 47 -170 -177 -139 -67 50 316 -86 393 152 216 251 -41 251 -81 -133 405 -144
3078a44Q8k56N84l10L2l3m1K49j66P4mJ19l31K79j40l7J28Kj57L4q9K72K4J11
$$ -144 -56 -312 272 -38 -6 -39 -80 169 3 77 73 192 -139 140 0 -37 91 93 -64 -30 -119 153 177 288
3102B88m53K74o4J89m69K94P4j99L77l57K12K8k53nJ21M1Q2q6l8m0j79Q6M2m0
$$ 288 -165 109 45 234 -235 59 133 -66 311 -46 166 194 -59 -64 57 98 180 94 56 16 -163 -77 -35 -75
3126g5J47j5l1j39J07O5n9k46L92Kj85j35L02q2m4J8l54L83j35Q5j10l7Q1R4q2
$$ -75 72 57 26 -113 -6 59 0 -246 146 148 -37 -172 130 48 4 22 -332 51 -84 1 -109 -146 -65 29 -53
3151e3K37j72j9j59M81m49J79J48l59J65J35m8K13n65R4K95m04K36K0k06K57o5
$$ -53 184 12 -7 -166 315 -134 45 193 -166 -1 134 86 299 -266 -172 123 -281 -45 -25 -231 26 -39
3173c9K91r2k20Q4L2j54J73qj27J42o1k0R8q9l24L03p2J05j1k52K44j37k07J68
$$ -39 252 160 -60 24 56 -98 75 67 -60 82 21 1 99 10 -314 -11 -83 22 11 -241 3 -134 -341 -173
3197a73L27k39K79m96M31K48m83j46M38k55j62O0L34k51J11k44M46l49k46L41
$$ -173 154 -85 194 -302 129 377 -106 -252 186 -69 -231 -171 163 -88 23 -221 225 -124 -370 -29
3217b9k7Q4l66Q7L15j7Rk9J3J53p3N1j37J16m6j78J36j85K36r4k05P7r3K78n0
$$ -29 -56 28 -338 -251 64 47 56 27 40 193 120 171 34 150 104 -74 62 -123 113 19 -186 -109 -202 76 26
3242B6j69K04j02M0j24J58K54k51k76J93K09l26Kr9J21K36n8k69L78j18j53K77
$$ 26 -143 61 -41 -1 -125 33 287 36 -240 -47 162 -164 -162 -261 -140 96 38 -231 147 29 -124 153
3264A53k24j2J0n9K34q4m8M6Rj69Q7J35Qo4l9k3p2K89l17K76j50j05k2J06J53
$$ 153 -71 -83 -73 -132 102 18 -30 16 25 -144 -57 78 86 22 -17 -40 -112 177 -140 136 -14 -119 -141 -35 118
3289A18r1J73j25N5l73J10M91k87j95O6K83j11o9J50k50j97L57j57R8M8k18L71
$$ 118 27 200 75 130 -243 -133 358 71 -124 -58 225 114 45 195 -55 -252 105 -52 46 94 -124 247
3311B47j48k81K07L7q5J19k7j23M5q0L7J01k37J91K14j25j07j62K67l3l14L62
$$ 247 99 -182 25 62 -23 96 69 -54 -9 -89 -52 49 -188 3 217 92 -15 -177 90 57 -257 105
3333A05j44n1J10j09L9K01m28L63j96M80n82K39k19j34L69l97L57J20j22j13L33
$$ 105 -39 -90 20 -89 -50 151 -277 86 -110 370 -212 27 -192 -326 43 -354 3 123 1 -112 221
3354B21k89K0K6j23J00l2J17JL4k05K50j21N3j65J49O0j84N9k17P4K33M7k02J62
$$ 221 -68 -48 -22 -145 -45 -77 40 41 75 -130 120 -1 52 -113 36 96 -88 -29 -246 -172 61 108 -94 68
3378F8j35P8k4L2N7J26N1j63j79M11l00j90J46M6P6o6Mk8J12j21l7oK51k38j98
$$ 68 -67 11 -13 19 76 202 253 90 -89 322 22 -168 -22 24 100 34 38 10 122 1 -36 -42 209 -29 -227
3403b27N37k2k17L6O6J02k13l28K57K8j97L01NJ6Kl98L77k46L00k2k81J05J04
$$ -227 310 288 71 107 173 275 62 -266 -9 19 -178 123 128 144 146 -252 125 -121 179 157 -124 -19 85
3426H5o7j35J50J15M9l90O4K79j56q7K5P3o4J09l88L77J19k40P8O3m0J18j20k71
$$ 85 18 -117 33 148 197 -193 -129 150 -6 -93 -68 5 -59 50 -338 39 158 -82 -4 59 19 137 17 -254
3450b54K80M0q6R7R9k77J19p0p4K38m8O3j09j43K89Rj74J49k25J30L6Q3mo4R6
$$ -254 26 66 -20 77 176 -101 18 -52 -126 112 64 127 18 -125 164 173 -1 148 -77 53 89 172 168 104 200
3475B00L2l09K87j73j96qJ56p3j97Q7O0K10k42N8K12J11m76L32o2KK4m5P3N6m48
$$ 200 232 -77 210 37 -159 -167 -11 -84 -281 -194 -134 76 -166 -108 104 215 -261 71 9 11 35 -10 63 119 -329
3500c29N43j32j52R1K82k58j52L0k07K95P9L5O4q2j94J97j49M56l34O8q0m27N90
$$ -329 214 82 -70 21 303 45 -107 -77 -284 11 90 125 189 107 -87 110 -39 417 83 151 71 -356 234
3523B34j99P2J40k93J68j1j47j52K32k55L63M8l44J77r0K30q1ql91K20j46J70
$$ 234 35 107 247 -46 122 111 -36 -188 44 -211 152 200 -144 33 -57 173 92 84 -307 -87 -233 -63
3545f3J64l1q9pk07L61r8k33R2oJ84pj31K67k97P0K66k04m47P54k15j16Q8M8j62
$$ -63 101 70 -19 -26 -233 128 30 -203 -111 -117 67 60 -71 196 -101 -31 235 31 -416 338 123 7 95 143 -19
3570a9l03K51o7L31j88K29j83p5J20J69q6l7j72K4L30j97j12J08k73J89l34J35
$$ -19 -322 -71 -138 193 5 234 51 -24 96 265 179 142 -30 -6 324 127 15 123 -150 39 -295 -160
3592a60R0%L6O8j08K03Q6k73L19m32j26L99j73K42J19l06Q1k11L10k39O0j71P7
$$ -160 -70 -70 -34 34 -74 129 215 -58 261 -171 -297 102 -71 171 290 -16 65 -146 164 -75 -15 -186 -109
3615a09j7m5L17j15l72M10j95m0jN5kM57l69J66j08k45J28J57j27J97k87J95K5
$$ -109 -126 -171 146 31 -341 69 -126 -166 -167 -112 -114 343 -26 140 32 -213 -85 72 -55 142 -145 50 75
3638G5p1J56j73j43j32L32O5q0j46R8j11J5N2K94qk82p7N4J56P9j76L71k65k65
$$ 75 4 160 -13 -156 -288 44 109 29 -117 -19 -130 -115 -63 231 223 -59 -136 -82 74 153 -23 348 83 -182
3662a82J97j38J69k21K17o7Q9K1j8J46k26J15k19K07j89J63J5j38n9K61j23k13
$$ -182 15 -123 46 -175 42 -25 64 85 67 213 -13 102 -117 90 -99 64 79 -59 -118 143 20 -193
3684a93M38j50k41m6M2K43m05L25j59L68j73J12j39J8M0m6j88K54k09K53k40J67
$$ -193 245 95 -146 -192 -150 93 -312 13 -146 222 49 161 22 40 80 34 -154 100 -109 144 -96 71
3706G1k95K54Q3J00l45J07n5q5K13J4J31l59J00QK37r6n1J0j38K08j28j22K46
$$ 71 -224 30 113 213 -132 -25 -80 -165 48 62 193 -166 -66 -58 179 83 32 42 -96 112 -16 -138 108
3729A08N3j34RL4k7R5p9J75R2l36k45M56l33j33K73k58J59L26l11l0J87l32K08
$$ 108 161 27 36 70 43 138 59 234 326 -10 -255 201 -132 -265 8 -250 -91 235 -76 -106 81 -251 -43
3752d3J28j65J79j42N3n4L79m96L80j74JN5j28N0Q2l9Q0j60N2k20O8J63l13j6
$$ -43 85 -80 99 -43 10 -44 335 -161 219 45 46 101 -27 23 105 66 146 -14 38 -182 -114 49 -264 -280
3776b80L67Lj40J94L4j29J49k27M39k75k87J8j94L42O7R4k58L12l58K74k09Q8
$$ -280 87 90 -50 144 178 49 198 -29 410 135 -152 -134 -328 14 81 175 -83 229 -129 145 -64 24
3798B4P3rm17J76M3J67Nr1K53m66L78p4j9j32O9J39j43J31j82J28j43j13J06J02
$$ 24 97 88 -329 -153 -110 57 62 -29 224 -242 136 62 43 -89 -20 119 -24 107 -75 53 -90 -203 -97 5
3822Ej25K17k66q9M77J6m5k40J08j77K22j63M6J18k12K33l9l94K86j66J93N4j49
$$ 5 -120 97 -169 -258 219 235 190 -50 58 -119 103 -60 -14 104 -108 125 86 -308 -22 -188 5 59 -90
3845i0J68J91m28M55l33J0j10l0L22K1mM6M2j31m9L8j95L7j10L4Om4K46j17n5
$$ -90 78 269 -159 296 -37 -27 -137 -167 155 176 172 218 260 129 80 118 -77 -40 -150 -116 -110 -154 92 -25 -80
3870h0L4J52J2j83RQK05M8k03J4J70o6n1j18J25J16l89L21P3k10k02M30l24L36
$$ -80 -46 106 118 -65 -56 -48 157 205 2 16 186 120 69 -49 76 192 -197 124 197 -13 -215 215 -109 227
3894B27k05j53L68l73K14J27k23o7J67j37q3j0M6J73j69J93l18N00k72j56J12
$$ 227 22 -131 237 -136 78 205 -18 -85 82 -55 -138 -148 -102 71 -98 95 -223 277 5 -151 -39
3915c9N4K80m68L16l40J68K2R3J33Q1j78r8n0k%N0k75R1k73L23O8k8Q4J00o9J31
$$ -39 15 295 -173 143 -197 -29 -7 86 219 300 122 24 -26 -28 -28 22 -253 -162 -435 -112 -44 -72 12 112 43 174
3941A74p0J30j89j57J27J41k15j86K77k94K81n1r8O5J74l18J68k5l1J61l11L31
$$ 174 104 234 45 -112 15 156 -59 -245 32 -262 19 -32 -130 -65 109 -209 -41 -66 -97 64 -247 84
3963H4m0k01K54qj08Q4j52K70m16L41k2o3j99K16j20Q0P2N8N2l47k2L17j80k7
$$ 84 44 -157 97 89 -19 65 -87 183 -233 108 86 23 -176 40 -80 0 72 130 182 -165 -187 130 -50 -77
3987g7q4R9J20k28J08L0MJ33j36j68L14p2j48m9Q5J54q5J57j97p6J34q2p6K53
$$ -77 -161 -62 58 -170 -62 -32 -28 105 -31 -199 115 43 -105 -154 -69 85 0 157 -40 -116 18 -64 -140 113
4011A13L2j46M1p5p0P5j33J07J42k73J39J23l90K25m2j73L51r4j54K39p8K04o5
$$ 113 145 -1 40 -35 -105 -30 -163 -56 86 -187 -48 75 -315 -90 -132 -305 46 -48 -202 37 -41 163 98
4034I8Kj1j1K8o5NK6k63J03K53j42l06M87j52J59j61k89J95L12j26k26J99K6j35
$$ 98 100 89 78 106 41 46 72 -191 -88 165 23 -283 204 52 211 50 -239 -44 268 142 -84 115 141 6
4058FJ4M8J08Rk26O1L2r4M29l70o2L1mL35n5j89k49M7M4K61j35m5K7jM5ko9m7
$$ 6 20 68 176 185 -41 20 52 -42 387 17 -45 -14 -18 317 262 73 -176 -129 -85 176 41 -4 23 22 67 65 -4 -51
4086e1k02O8M3J34k55L54j01O1k44J52J72O7j04J20k98J55N14l32l21J73q8rr4
$$ -51 -253 -185 -142 -8 -263 91 -10 51 -193 -41 131 198 94 214 -84 71 585 253 -68 105 17 8 -86
4109h6O4o2J59l1N3l11Q0J79J05j97o2J61j17k6K98k97L16m73M03Pj95K19k75
$$ -86 -22 -84 75 44 97 -214 -134 45 150 -47 -109 52 -65 -91 207 -90 226 -247 156 163 -32 187 -88
4132h8k5K39J12M4M7k94n5P7o6p4J2L09k36L17k16k40oJ18P4r7l8J34j95k01M94
$$ -88 -113 126 238 282 329 35 -20 57 -9 -83 -71 238 2 319 103 -137 -143 -25 49 -48 -86 48 -147 -348 146
4157A46l09L25k17J67K10k38l43O02k57j65l8K59q6j2j18K42k45j46L23j57L01
$$ 146 -163 162 -55 112 322 84 -259 343 86 -79 -117 142 56 44 -74 168 -77 -223 100 -57 244
4178B44j39orm0j6J31j87M9K63j78j21J78j78K91k51PK93n02O2L20j54J00k26
$$ 244 105 99 90 50 34 165 -22 27 290 112 -9 169 -9 282 31 38 331 -171 -109 211 57 157 -69
4201f9RJ86k91M9L71k53L3p0O1O3pj94Q7Q4k17K15J4J15j86J29p7J6k21p0M97
$$ -69 -60 126 -165 -116 255 2 35 -35 26 89 82 -112 -25 59 -158 57 71 186 0 129 52 68 -153 -223 274
4226B74m74K18J18j16K00j95j1L87j58j89J8k87J76n7j19K68L04l37r2j02R5n5
$$ 274 -200 18 136 20 220 25 14 401 243 54 72 -215 -39 -96 -215 53 357 20 -72 -174 -79 -134
4248a34J11J36k60Q6K11J68k78K4j24q0N1J20P4l84L94k38K95l36J02j7J85j52
$$ -134 -23 113 -147 -61 150 318 40 64 -60 -140 -89 31 105 -279 115 -123 172 -164 -62 -79 106 -46
4270d6J18l9P5j33J31J43m11J40L02k70kj52K08J70m68R1K03j26N2K79l39J16
$$ -46 72 33 108 -25 106 249 -162 -22 280 10 8 -144 64 234 -234 -143 60 -66 -14 265 -74 42
4292D2J55k86p9p4J33K06j40l61M80o3o6Q8n5J05r8j37O6R9k36M69j94k0L02m77
$$ 42 197 -89 -168 -242 -109 97 -43 -404 76 13 -53 35 -20 85 -13 -150 -84 15 -221 248 54 34 336 -141
4316a41J06K2J96M0j5l5L2j20l3j06jQ8J16j49J21j50o5J02K54j90j96M32n06
$$ -141 -35 -13 183 223 208 173 205 85 52 -54 -55 33 149 0 121 -29 -94 8 262 72 -124 308 -198
4339a98K39K9n9k98M14j12q3J12j8j85J04j30K7K81J65k93J32k19r9K14o6nK71
$$ -198 41 70 11 -287 127 15 -68 44 26 -159 -55 -185 -158 123 288 -5 127 -92 -191 23 -43 -48 223
4362B23j63k46K43n1j71M09j06j69K04l29L16N1q9l44j9P5J48MQ5j7Q5r1K02l80
$$ 223 60 -186 57 6 -165 244 138 -31 173 -156 160 211 122 -222 -241 -166 -18 -14 71 54 139 48 250 -130
4386a30O7K58j76J70kk9k0l6Q4p1m20J04K82j55N7qk98K03N2P8P0j17M76l03k28
$$ -130 -63 195 19 189 187 158 138 102 186 115 -305 -201 81 -74 -17 -25 -323 -120 -68 10 80 -37 439 136 -92
4411i2L06k94j34J28p6pK75l54J27n8M7P2J03o3J9J53m03J0K48m8K83l70L8L41
$$ -92 214 -80 -214 -86 -162 -169 106 -248 -121 -179 -132 -60 43 -20 -1 152 -251 -241 7 -41 242 -128 -90 251
4435B51k89K52k48K18j83J27j89K1J67l07K03L7K0J12o2k20K14O0j71k1Nl8j5
$$ 251 -38 214 -34 184 1 128 -61 -40 127 -180 23 60 80 192 130 -90 124 184 13 -8 -3 -41 -56
4458e6r5J8J8L54j56j21R0j00J27n7j2N4j06K61k01q6n3J99N3o4Rn2j21Lj08J84
$$ -56 -151 -133 -115 239 83 -38 52 -48 79 22 10 64 -42 219 18 -68 -121 78 131 67 76 24 -97 -94 -202 -18
4484a8K07q5l89K97R1Ll40K98j49R2l5Q1m5J06M3k68K55n9q4l1k02J74l6J04j37
$$ -18 189 104 -285 12 103 106 -234 64 -85 7 -28 53 8 114 157 -111 144 85 1 -30 -232 -58 -94 10 -127
4509a27K67k53L37l27K47j20j34M0Lj02J77L0J70j69rJ93M8q9p2l07Q9K3J16o1
$$ -127 140 -113 224 -103 144 24 -110 -70 -67 -169 8 38 208 39 30 223 271 182 110 -197 -108 -85 31 -30
4533c0r8j77K51J8jP7o8Mk3j29J87K88k05l4l9r9L52r4j41om1oj34K46l88K87
$$ -30 -128 -305 -54 -36 -37 40 -28 -24 -47 -176 11 299 94 60 21 -78 274 180 39 33 -8 -14 -148 98 -290 -3
4559cj3m2P8J50j3j98J36l2J65j66j41Q0M6jM5Ll19M26m96J71P0j26K91q0o8K83
$$ -3 -16 -58 20 170 157 -41 95 63 228 62 -79 1 47 46 91 94 -225 201 -295 -124 -54 -180 111 31 -37 246
4585B46j73o9k2k7Nj39K33q1k37K51K39l19K41l17M17J30m79K17j50n0p8K18j22
$$ 246 73 4 -18 -45 -40 -179 54 -27 -264 -13 226 -93 148 -169 248 378 -101 116 -34 -84 -162 56 -66
4608f6j5L84n61K80J39o7J19l06Q8j4l78M52K5QO5l98q2L30j93L14P0j81r9N3
$$ -66 -81 303 -258 22 161 94 213 -93 -5 -19 -397 55 80 88 153 -245 -327 3 -190 124 194 13 -86 -33
4632c3K26m41N04j18J11k19N6r9Q4j15o1K91n36J06M52k08K19j66j37j31K18P3
$$ -33 193 -248 256 138 249 30 86 -13 71 -44 -105 186 -350 -244 208 0 219 53 -84 -215 3 76
4654G6k43L20j34JM6p9q9M35k58K60r7l5p8k35L99m75K68k72N5J42p7o6K11o6
$$ 76 -167 153 19 20 66 -13 -102 333 75 335 238 203 125 -110 289 -186 82 -190 -135 7 -70 -136 75 9
4678Ij09M5O6J08j86%J61O8j61q0J71j33k48J42J63N5k4M5j92j08J01M5k9K51
$$ 9 -100 -55 11 119 -67 -67 94 162 1 -79 92 -41 -289 -147 16 71 47 92 -100 -208 -107 -62 -91 160
4702A60j45j13K11k38L45N6l16j08m5M15m15L96m81K95k04l0N30k74m8q8j6J52
$$ 160 15 -98 113 -125 220 276 -40 -148 -193 222 -193 203 -278 17 -187 -217 313 39 -9 -97 -113 39
4724C9K27m5k29n7P7j36J12o8n0J70j10K35k4j02j18P5l4j27J5J86o1M4Q0k53
$$ 39 266 221 -8 -65 12 -124 -12 -80 -130 40 -70 165 141 39 -79 -4 -38 -165 -150 36 -25 19 99 -154
4748a54O3J8Q6O6K9k5L7m20K94o7j31J07K42r3j00R0k5k2q5j92M58l03J31K94
$$ -154 -91 -73 13 79 108 83 120 -300 -6 -73 -204 -97 145 52 -48 42 17 -5 -90 -282 176 -127 4 298
4772B98k78j05K77r0l82J83J7K5j5l2p9j4L45j61J16l9J3o6n7k21L03K93l90j81
$$ 298 20 -85 192 102 -280 -97 -80 -55 -70 -102 -181 -195 150 -11 105 66 79 13 -44 -265 38 331 -59 -240
4796b40N0N7K88qk2j40L69j76j42K3j16k8R4l37M5M87j13oq7K16l50J26N1j48
$$ -240 -190 -133 155 147 125 -15 354 178 36 59 -57 -85 9 -328 -283 204 91 85 -2 214 -136 -10 41 -107
4820a07J24J47k49J92n9j11M6j29J3R6P5MR5j41m8k8J16K09j80P2J22k01j23j4
$$ -107 17 164 -85 107 48 -63 -17 -146 -133 -37 38 42 137 -4 -52 -80 36 245 65 137 259 58 -65 -79
4844g9K21p4J14j04j90R3k50L48l7k1j35J5o9K61j56L30l77K9J43k31Q4J31K23
$$ -79 142 68 182 78 -112 -19 -269 79 42 21 -114 -99 -168 93 -63 267 -110 -81 62 -169 -85 46 269
4867B69l18J20J38J96l10k09l9P1j04J05L62j98L3j54j71K20r3P9l2Q7jQ9O0j34
$$ 269 -49 71 209 405 95 -114 -153 -82 -186 -81 281 83 116 -38 -209 11 -82 -3 -35 52 51 140 200 66
4891F6j8K23k60l01j5L76k4j80k4K08n7J59n3Q2m35K06L50l59q7L49j80R2j43
$$ 66 48 271 11 -290 -305 71 47 -133 -157 51 -6 153 100 182 -253 -47 303 -56 -143 206 26 118 -25
4914b5j9K1j47q0K78K9K2N5n0k55K09k59N2K61M08m11j45j64n2K69J19o2k02l2
$$ -25 -44 -23 -170 -250 28 57 79 134 84 -171 38 -221 -169 92 500 89 -56 -220 -272 -3 116 54 -148 -180
4938a80J42r4R6o9P2L6j60R6K97q2j49r2j37L79J63k89r5MP5j03P8q9j23L59O5
$$ -180 -38 -132 -36 -105 -33 3 -157 -61 236 154 5 -87 -224 155 318 29 -66 -62 13 -90 -12 -101 -224 135 200
4963B00q6j04O4k14K20N1j5k46J78n1J61j73j90K46l4R3q9j70L57j87j73J61j5
$$ 200 114 10 74 -140 80 131 116 -130 48 -3 158 -15 -205 41 7 100 11 -159 198 11 -162 -1 -16
4986a6l27L45l19K93Q8k86L66Q3k43nO8J65k83J21J55j04k29k1k31M54j52l7k19
$$ -16 -343 2 -317 -24 64 -222 144 227 -16 -21 47 212 -71 50 205 101 -128 -149 -380 74 -78 -115 -334
5009c34J96J74o5J46j85j08K12O4k33J54j77J16o5J63J86k05o2j60J70J16Jm61
$$ -334 -138 36 -29 117 -68 -176 36 100 -133 21 -156 -40 -105 58 244 39 -23 -183 -13 103 104 -357
5031c57K95o9K90j18m3j05J95J07k18Q3j23J7K23J43m02M0j67K59M5j46k48N40
$$ -357 -62 -131 159 41 -2 -107 88 195 -23 60 -63 -46 177 320 -82 -42 -209 50 95 -51 -299 241
5053B41l22O2L9K52k70r4K4K0lK23j58P7l5N6J68Ll22K25m50J79K25j64J48j31
$$ 241 -81 -19 20 272 2 -92 -68 -48 -51 172 14 91 56 112 280 283 -39 186 -264 -85 140 -24 124 -7
5077gQ1k55r1J08M8J47q3k15L68qj98J84n4J0Q4r2oP3j71P0k3P4j83L2J09n1R
$$ -7 74 -181 -272 -164 -116 31 -52 -267 101 93 -105 79 25 35 119 27 21 94 -77 -7 -30 44 -139 -107 2 -49 -40
5104d0j36K40k14o6K22k6p8P3l74N76J02j65r9O4R4j31j24K10Q3k30R8r3j32J84
$$ -40 -176 64 -150 -216 6 -20 -98 -25 -399 177 279 114 15 79 173 42 -82 128 211 -19 79 -14 -146 38
5128C8J05j73k89K33K84j79R5m68L61J00j95J31jm6q4L1J21j41O8Pj40L09j94
$$ 38 143 -30 -319 -86 198 19 114 -354 7 107 -88 43 42 -4 -88 -57 64 -77 -9 -2 -142 167 -27
5151b7m1M0R4o8p2M4r7K88k04j00J2K2J80j11J99j82K5j31J76j03O6N4k15m1M39
$$ -27 -68 -28 66 -2 -74 -30 -127 161 -43 -143 -131 -109 71 -40 159 -23 2 -129 47 -56 10 64 -151 -192 247
5176B47o72L89J17k3k69K22R5k0N8L9k21O1p0j51J94o4Q9O1k27O3J51r1j77P6
$$ 247 -425 -36 81 58 -211 11 106 86 144 183 -38 23 -47 -198 -4 -68 21 82 -145 -82 69 -22 -199 -123
5200a23L55j65j04J12n5k43J77j74L85j92o0J46j32j21Q2M5J39j07J90j73N3K4
$$ -123 232 67 -37 75 20 -223 -46 -220 165 -27 -87 59 -73 -194 -112 -67 72 -35 155 -18 35 59
5222E9j9j97j18L18K40j25Lj49k72N19k55Q6k60J30k42R3K21j55K92j85J11j08
$$ 59 40 -157 -275 43 283 158 161 12 -260 259 4 90 -170 -40 -282 -189 32 -123 169 -16 95 -13
5244a3r7J14J18j43%N6O7M3j28K08m41M12n0k91J53j88K12k32K16O4j1L4p1r0
$$ -13 -110 4 122 -21 -21 35 102 145 17 225 -216 196 146 -145 8 -180 32 -200 16 80 69 103 32 -58
5268e8L44k72N3j84j30K80n5j38M66N3l64J13k1p8Qp5N4j75L50m01L59l50J63
$$ -58 286 14 67 -117 -247 33 -22 -160 306 359 -5 108 87 9 17 -58 -4 -179 171 -230 129 -221 -58
5291e8Q1J54j46N8p9J60l99L35m61L81q9P8%j08K90l43K77R1j29j06O7n9J42j14
$$ -58 23 177 31 89 10 170 -229 106 -355 26 -63 15 15 -93 197 -146 131 222 93 -13 54 -5 137 23
5315B3K4q6rJ05m08L94R3Mok87O2K58j11q9mN3J76k68j82K65J39P8l37K4J85K64
$$ 23 47 -39 -48 57 -351 43 136 140 134 -153 -91 167 56 -33 -37 16 192 -76 -258 7 146 224 -113 -89 96 360
5341C60j66j43k2o3m5j31J1R8J37K76j70j11m9Q6J88l6l5j72Mjm0O5L2k13K26
$$ 360 194 51 29 -34 -79 -210 -199 -101 36 312 142 31 -18 68 256 220 185 13 17 16 -24 41 73 -140 86
5366H6j49p9O5p5K97R0j31l31N2J06j21N1j3K99q7N3k86L78k29l3K1L6R4k70K56
$$ 86 -63 -142 -77 -152 145 235 104 -227 -175 -69 -190 -139 -152 147 60 113 -173 205 -24 -57 -36 0 94 -176 80
5391H0K8k35K27k63J69K27k30N1k2j03N8J36j57P6J7J35j89O7j09L6j35K19J53
$$ 80 108 -127 100 -163 6 233 3 54 32 -71 -13 123 -34 42 59 194 5 72 -37 -1 -136 83 236
5414B36m70L6K77j90P5R3p7Qk8N8j09J77j00q3J31j05m9J34J3J60j85O0o3k01
$$ 236 -234 -198 79 -111 -36 57 -20 -12 -40 18 -91 86 -14 -97 34 -71 -120 14 27 187 2 62 -1 -202
5438b02K44KL5l7K77l08O7q8l12O53k90k27K18K8j5P9K84k13j70j3j61P0j84L65
$$ -202 42 44 79 42 319 11 78 -10 -322 331 41 -186 32 60 45 124 408 195 25 12 -149 -79 -263 102
5462A02k12L8K10n7q8K4k8P9j06k60N21l03O5Q7Q5m14L64k83L75p2j42o0O2j35
$$ 102 -110 -72 138 81 -7 17 -11 68 -38 -298 223 -80 -15 72 157 -257 107 -176 199 127 -15 -75 -13 -148
5486a48K90n17L09j70K25q9kJL17l29k22L03k69J69k9N10o17K30m9j07K86k15
$$ -148 142 -375 -66 -236 -11 -100 -102 -101 216 -113 -335 -32 -301 -132 -161 349 -268 -38 -87 -194 92 -123
5508a23L46j59l4j32QJ85j06PK0q1K0Q4j07R7l74L04J72M0o6R5j62J39k54j39
$$ -123 223 64 30 -102 -94 91 -15 -8 12 -69 -49 35 -72 25 -349 -45 127 167 101 196 34 173 -81 -220
5532b20J91J91j66k74L23k59L9P6M6j66K36j08N2J60m9j4OPL9Q7k09K22k83J63
$$ -220 -29 162 -4 -278 45 -214 -175 -99 -53 -219 17 -91 -39 121 72 58 64 71 110 197 -12 210 -73 90
5556I0j35%Q2M6j1J57j14m5j70j15J84K40k20J00l2j22J36k17J99l03K37J77l24
$$ 90 -45 -45 37 83 72 229 115 70 -100 -215 -31 209 -11 89 57 -65 71 -146 53 -250 -13 164 -160
5579a60K14mm2P4l25L44j68J05K40j84ol8j03K95J12l56p0m1L56l60J68j00J74
$$ -160 54 50 8 82 -243 101 -67 38 278 94 88 50 -53 242 354 -2 -72 -113 243 -117 51 -49 125
5602A25q5k7l1ok36L43J44j66j05l0N2l32L45r4j85L77k4q3j94n2L42j23q5N1
$$ 125 40 13 -18 -24 -260 83 227 61 -44 -74 -22 -354 -9 -103 -288 89 65 -18 -212 -264 78 -45 -130 -79
5626g9k6J78l11L27j14Np2O0K74j70j25j19J9L83o3o9j62J4M9N1j8qJ61M9n06
$$ -79 -105 73 -238 89 -25 -20 -92 -32 242 72 -53 -172 -153 230 167 98 -64 -50 -1 50 32 24 185 234 -272
5651b72M01O1l57J99j30J93n7k31M59m16J78P0J61l62K07J3r8J87m0j41j64K71
$$ -272 129 190 -167 32 -98 95 38 -193 266 -150 28 98 259 -103 104 117 19 206 166 25 -139 132
5673A32J3qj15j29K62l13K89lj63K39l66l4J55K85Kl12l9M7R0j3k2J24j52J56
$$ 132 145 137 22 -107 155 -158 131 128 -35 204 -162 -196 -41 244 246 -66 -105 -58 32 19 -3 121 -31 125
5697A25k71L41ol48O2L14k82L65n58N19l00J5R8j32K10j3l4j78J3J5K87k59J45
$$ 125 -146 195 189 -159 -97 217 -65 300 -258 261 -39 -24 74 -58 152 139 105 -73 -60 -45 242 -17 128
5720A28m3j62lP6Q3j31l64L36K6J6Q6M7k6R7j26j97N3m9Q0k6K79j82j85K63j17
$$ 128 85 -77 -80 -4 79 -52 -416 -80 -54 -38 48 95 69 166 40 -157 -104 -153 -73 -99 180 -2 -187 76 -41
5745d1NJ86Q9k12m35N12l3nj33l0K09l39K73j93K27mj85K49j68L75j19k58m3J23
$$ -41 -36 150 239 27 -408 104 71 66 -67 -97 112 -227 46 -147 80 76 -109 140 -28 347 228 -30 -73 50
5769E0l65M27j99K23j14n5K01j03j00L39p8k44j39J8M25m28J77Lj64J0K36j25
$$ 50 -315 112 -87 136 22 -33 168 65 -35 304 226 -18 -157 -139 286 -142 35 38 -126 -116 120 -5
5791eK82l61L86m31K48j47K19l31K84J50k70J48j03J41N8l20J12jj28J56p7P9
$$ -5 277 -84 302 -129 119 -28 191 -140 144 294 24 172 69 210 268 -52 60 59 -69 87 10 89
5813H9o1q5P6J77J81m45p7K00J7n4r9K0L9r6J11K67l64R9k42K92j38J58k93M43
$$ 89 28 -57 19 196 377 -68 -145 55 72 18 -81 -61 -22 -118 -7 260 -104 -5 -247 45 -93 65 -228 215
5837B15j92O6m44P22n61o7K85j64J48j0j69q3K60L98m98J77j79j47K56o0p3RK0
$$ 215 23 89 -355 367 -194 -261 24 -140 8 -2 -171 -254 6 404 -94 83 -96 -243 13 -47 -120 -111 -91
5860i1j30MJ67j1%j00J57J62k55J23K1j31M21k03l38K01R2k66M85l15j27N18o54
$$ -91 -221 -217 -50 -61 -61 -161 -4 158 -97 26 47 -84 337 134 -204 -3 89 -177 308 -7 -134 384 -270
5883b70J25M25k27L2j03K80n45K91J00q0M9j99J47k79K22j20K66M1l18K65k92
$$ -270 -145 280 53 85 -18 262 -283 8 108 28 77 -122 25 -254 -32 -152 114 155 -163 102 -190
5904a90L52j11j12J27R5j24J43j33M8r0n4n1K73k2j05N2k4o2n4J48l4k89M61j92
$$ -190 162 51 -61 66 161 37 180 47 95 5 -49 -100 173 151 46 98 74 12 -42 106 72 -217 244 52
5928E2q9K90j20n1Q8j42k27J85n0O0O1K08l50K07J10k61L4q8L3l4L59l19J10k52
$$ 52 -37 253 133 82 170 28 -199 -14 -64 -4 57 265 -85 122 232 -29 5 -83 -50 -84 275 -44 66 -186
5952a86K62n4K54l67M6J01k2l2K27j06k71m1J45j05J32J82j02k33J88l81L40o0
$$ -186 76 22 276 -91 -45 56 34 2 229 123 -148 -189 -44 -149 -17 165 63 -170 18 -363 -23 -83
5974h3L00l74P7J10j33J13J58Rk55J2L0J56l29J10J78j37J10j70J26L58m04k46
$$ -83 217 -157 -80 30 -103 10 168 177 -78 -66 -36 120 -209 -99 79 -58 52 -118 8 366 -38 -284
5996b84M39m1q3j05p9K07J70j24j58n1P6L4J18k96nM00k09J97l47J25J51j25k57
$$ -284 155 114 31 -74 -153 54 224 100 -58 -109 -33 1 119 -177 -182 218 9 206 -141 -16 135 10 -247
6019b47J96J53r8r8J74P1k41j4J08N2j83j9j1M94j89j08O4J02m15K34j22J65j48
$$ -247 -51 102 4 -94 80 151 -90 -104 4 56 -127 -146 -157 337 148 40 104 206 -209 25 -97 68 -80
6042h0o5M9oJ09k6K87k69O1j6j44J52mK62k97M5m0j21K00k33J98O2K25j41l27
$$ -80 -145 -96 -102 7 -19 268 -1 60 44 -100 52 48 310 13 58 18 -103 97 -136 62 124 349 208 -119
6066a19P1R9M3k23R5M8M0P8K8k14O6q3L11k59J18j77Nj7R1J38r3K28j82K5N9k57
$$ -119 -48 51 94 -129 -34 14 54 132 160 -54 12 -71 240 -19 99 -78 -73 -90 1 139 46 274 92 117 176 -81
6092h1J68l7M7k58j18M80j20O3mM8r0r9J93M6r6k54J72n8K60j69k79R6K31k42
$$ -81 87 50 97 -161 -279 201 81 144 140 188 98 -1 192 238 142 -112 60 2 262 93 -186 -90 141 -101
6116a01o7K59J13r1m72M51j47K32j96k5q7J04J54j10J91l25K46j14M9j19K2R1
$$ -101 -168 91 204 113 -359 92 -55 177 -19 -44 -131 -27 127 17 208 -117 129 15 64 -55 -33 58
6138E8J59j30j88J17P1l17J41K78l22K75j21R6j59%l0j03K18L5l29L64m8j66j1
$$ 58 217 87 -101 16 87 -230 -89 189 -133 142 21 117 -42 -42 -72 -175 43 78 -251 113 65 -101 -112
6161a12K54l27L64r3l5j98K76j77J39J0j42mn6J99rJ6J54l62J50J82l57J3m9p5
$$ -112 142 -185 179 86 51 -147 129 -48 91 101 -41 -45 -101 98 89 105 259 -103 47 229 -128 -115 -164 -239
6185b39L37l4j29K7k14J97J18k10L70j3l82J19K98k30N3j4N6k9l0k43P4P6J46
$$ -239 98 64 -65 -38 -252 -55 63 -147 223 210 -172 -53 245 15 68 54 110 81 51 -192 -118 -42 104
6208A04k81J34k3OL17k90j54O18l52j6N4j07j04jL27l23L2L08j04k12K32q6l9
$$ 104 -177 -43 -66 -60 257 -33 -187 431 79 63 117 10 -94 -95 232 -91 -59 249 145 -67 165 79 40
6231D0j77K49l9l29K75l0P2k6K03l84L62m85J80k4J67K48j51m17L66mj92o6M40
$$ 40 -137 112 73 -256 19 -11 61 35 238 -146 216 -269 -89 -113 54 302 151 -266 100 96 -96 -162 278
6254B78k70N9J04k38K59l80L19j98mj01nL29J40k7l6n77L68Mk32L57Pq1j02qj36
$$ 278 8 67 171 -67 192 -188 131 -67 -71 -172 -177 152 292 265 229 -348 20 24 -208 149 156 75 -27 -35 -171
6279a71K00l14L26N3l31L68j86Q1o6j6m6J80j9O9j28J77j93L1J24k09M0R7l71
$$ -171 29 -285 41 94 -237 131 -55 26 -40 -56 -102 78 59 128 0 177 -16 15 139 -70 -30 67 -304
6302c04o0M53J50l9j85J03j79J25k59M17k76j58J89K30o6j33N8j94L6Q8J54N5
$$ -304 -364 89 239 200 15 118 -61 64 -195 222 -54 -212 -23 207 141 8 66 -128 -92 -4 150 205
6324B05l25o9K77j36J85j29l0m7L4L8m3N3J12M9N2j89k9l0j17L15j15l16K21k5
$$ 205 -120 -189 88 -48 137 8 -22 -69 -35 3 -40 13 125 174 226 37 8 -22 -139 176 61 -255 -34 -59
6348e9P6L03k52o9J09Q2j93J01o3j60j32K78j88j88M76M3l6l29J91R7O4j47N6
$$ -59 17 320 68 -1 108 190 -3 98 35 -125 -257 21 -167 -355 121 164 128 -201 -10 87 151 4 60
6371F0J23j27j92J12r8K86k33J6m1K66Pj00k69Q3pJ0K73j68KK32l36q0Q3J60k7
$$ 60 183 56 -136 -24 -122 164 -69 -53 -94 172 179 79 -190 -107 -114 -104 169 1 3 235 -101 -181 -98 62 35
6396C5M1m9j45J47O8J11Jk95M4J37k29j00K03J51j2m37K79q8N2K3l6O2k6Q6l9
$$ 35 76 27 -118 29 97 208 209 -86 -42 95 -134 -234 -31 120 108 -329 -50 -138 -86 -63 -99 -37 -63 23 -16
6421a6j1k7lL9Q1K1j5l9r6R6J17l21J23J50m6K29l42L04j21l50K29M9n4q4Q5k44
$$ -16 -27 -54 -57 -18 63 84 69 30 -66 30 147 -174 -51 99 53 282 -60 244 123 -227 2 51 -3 -87 -2 -246
6447b46L16k43K22j62L12k87K0N3k11L71j25Rq0J30m6j97O5L55r6M3j29o6N2k20
$$ -246 70 -173 49 -113 199 -88 -68 -15 -226 145 20 29 -51 79 33 -164 -99 256 160 203 74 8 60 -160
6471a60L26l07L6L22k24j26J85J20k27j94L50k15Q1K03k45j74M33l26J29n2P1
$$ -160 166 -141 -105 217 -7 -133 52 172 -55 -249 101 -114 -33 170 -75 -249 184 -142 -13 -65 6
6492FJ37j02pj86J91j80j66L62j54Q5r3M02j11k74J89j51m3O3j42J41J49k78K64
$$ 6 143 41 34 -152 39 -141 -307 55 -99 -14 -107 295 184 -90 99 -52 -95 -32 -174 -33 116 -162 102
6515A02q7j14K69l26J48m9J66j5j0m9m9K13j34J21k22J45Qn5nM5o2j5J05O9m27
$$ 102 15 -99 170 -156 -8 -57 109 94 84 35 -14 199 65 186 -36 109 117 62 57 102 40 25 130 199 -228
6540b28K77k6P7k29K58k19K0M5K14l15K02j35L57l23mj77K51R5k30J07k03J64
$$ -228 49 23 100 -129 129 -90 -70 -25 189 -126 76 -59 298 -25 -29 -206 45 140 -90 17 -186 -22
6562b2J31j62R1Mj8J3j97j38L66l9P3J84k99j44J04O4m6M1o0J57q6J92NK3l3o0
$$ -22 109 -53 38 42 24 37 -160 -298 68 29 102 286 -13 -157 -53 11 -35 6 -54 103 17 209 214 237 204 144
6588A44k62K66j41j10J07k4J46L9n2j18q7K0K06J5r9j79J47j51J27k8J0j2q9P8
$$ 144 -118 148 7 -103 4 -20 126 165 113 -5 -92 -72 134 149 50 -129 18 -133 -6 -34 -24 -36 -125 -47
6612d7K5p6LJ20q6J21J3k16N1j3M0k4L8j87K33j52M4O0l6p3m2K50j79K79k4p8
$$ -47 -22 -98 -95 25 -61 60 73 -143 -92 -105 -65 -89 -51 -238 -5 -157 -113 -53 -89 -162 -204 46 -133 146 122 44
6638D4o0M2m4n3J89j34J3L3R7k02J79k17K43l43K50j98J87n8l2K14j79K81j18
$$ 44 -16 26 -18 -71 118 -16 -3 30 127 -75 104 -113 130 -213 37 -161 26 -32 -64 150 -29 252 134
6661A34L6k98N0l1O9r3M5q4k5N1J09j03J4L10L4o19M43n6J91j81jn5P7N7o7O0
$$ 134 170 -128 -78 -109 -40 -133 -88 -172 -197 -146 -37 -140 -126 184 218 -401 42 -14 177 -4 -5 -60 17 74 7 67
6687F7j97L81j06j70P0j42O8J3j31K18j77R8J54M5p32L48o5L66K10j71j52k23
$$ 67 -130 251 145 -25 45 -97 -29 -16 -147 71 -106 -8 146 191 -541 -193 -258 108 318 147 -5 -228
6709b28J59J55J88j25o0k37Q3J1J22j7K6r6k15J67K21r1m9rj58M8J54j66J86Q8
$$ -228 -69 86 274 149 89 -148 -65 -54 68 51 77 -19 -234 -67 154 63 14 5 -153 -105 49 -117 69 157
6733A57m14O5L71j72J74m34P5K29R2j82J75k51J18k41J57J4j0R9K34J1j92j05
$$ 157 -257 -192 179 7 181 -253 -178 51 143 -39 136 -115 3 -238 -81 -67 -77 22 256 267 75 -30
6755c0j21o2K66k31K08j08J63j42l5J48j44Ll1L40j45q4o1M28l72J52j50l0K41
$$ -30 -151 -213 53 -178 30 -78 85 -57 -92 56 -88 -85 -116 224 79 -5 -66 362 -10 142 -8 -38 203
6778B03k47L68k43k48J99k42J47K05j19j43K70l71Q2J73j3l5P1Q6l0k40L2K61
$$ 203 -44 324 81 -167 32 -210 -63 142 23 -120 150 -221 -139 34 21 -14 57 143 113 -127 -95 166
6800A66k5k11R6m3J30J9N5n0j92Q9j73Q8J85j6l21J62O3J69Kp6n1k22L21j54n2
$$ 166 141 -70 26 -17 113 132 187 137 -55 34 -139 -51 134 118 -203 -41 22 191 193 117 66 -156 165 11 -41
6825d1K76k37j50L20J79l87N9L2K9j31k8J29k62M40l18j88n0K43K54p6l29K69
$$ -41 235 -2 -152 168 347 -40 19 51 80 -51 -79 50 -212 228 -90 -278 -328 -85 169 93 -236 33
6847C3R8r3j70J83j3j10K78l28K35o1Q9q7j3q6J24q8l1M2o6OP1k17K89j07LMJ77
$$ 33 131 38 -132 51 38 -72 206 -122 113 52 141 54 41 -45 79 -9 -40 2 -64 -58 13 -204 85 -22 -19 -15 162
6874A62j12k74K18k89L67j04q8K23J14ok66RJ63Q0l47L69l45lK12k1Q0K41m27
$$ 162 50 -224 -6 -295 72 -32 -120 103 217 211 -55 -46 117 197 -150 219 -126 -129 83 62 142 383 -44
6897d4j03J43P8m1m9N9O5r8j4n1R8l51K46j2J9k8k22J56l6L15K78n84J47o4oK92
$$ -44 -147 -4 74 33 -16 43 108 10 -4 -55 43 -308 -62 -74 -55 -83 -305 -149 -185 130 408 -176 -29 -93 -99 193
6923A93M7j36J51j67K3j28k0M4p1K54j57j25J13k4J68k92pL85k59o0J36j57J42
$$ 193 240 104 255 88 111 -17 -37 7 -64 190 33 -92 21 -3 165 -127 -134 251 -8 -68 68 -89 53
6946E3r1K63j48p1o8j05K46n4m4K9J0q1j20K90k91k43M00l6J37J3j84l4m2m4L3
$$ 53 -38 225 77 6 -62 -167 79 25 -19 10 20 -61 -181 109 -182 -425 -25 -61 76 89 -95 -129 -171 -215 -182
6971a82J16L13l44J46k6K1mp7J67k27m2K19k38J69K09k65P9j22L36m20K75k06
$$ -182 -66 247 -97 49 23 44 40 -37 130 -97 -139 80 -158 11 220 -45 34 -88 248 -172 103 -103
6993a03J38r3J11R7j79J5j8J52l93L58J8k02J38j25n8l7K18r2J1K31o5j22r6L03
$$ -103 35 -58 53 150 -29 -14 -32 120 -273 85 103 -99 39 -86 -144 -181 37 -55 -44 187 122 0 -96 207
7017B07k17n7J15o7J01j89n3R7J25J49k35m8n0J11o9j78L53k16r2L47k18K66j79
$$ 207 -10 -67 48 -19 82 -107 -160 -63 62 211 -24 -72 -122 -11 -80 -258 95 -121 -213 134 -84 182 3
7040CK0JO2r3j6M5q1J46j35K37l33J29O4oN8Q1l48J18l7J52n8q2o8q3K69K86p82
$$ 3 23 24 86 -7 -23 22 -59 87 -48 189 -144 -15 49 43 101 182 -166 -48 -85 67 9 -73 -141 -224 45 331 -451
7067d51M66N7Q5n07K24M0k08L24J03k53Q4j34J3Q2P1mP3r5J96k27J81j32J18k99
$$ -451 15 72 157 -350 -126 -86 -294 30 133 -120 -36 -170 -157 -75 -4 -8 65 -30 166 -61 120 -12 106 -193
7091a93J88jM7J18l5Lk53J18J12k2j36K67j67j92kJ97J88l40M7m0J01J8N9J9l97
$$ -193 -5 -6 41 159 124 127 -126 -8 104 82 -54 213 46 -146 -148 49 237 -103 -56 -96 5 23 82 101 -296
7116b96M67j92R0j71J36M3k69K33lj98J32M9k24J72j00O9o7K23k77J59j76K28
$$ -296 171 -21 69 -102 34 77 -192 41 38 -160 -28 21 -203 -31 -131 -62 -129 94 -183 -24 -200 28
7138B8J17k14m3J04P8n8J68m46J65L34k87j3J11J05j63j21L7J80Nj73p8L7J57
$$ 28 145 -69 -112 -8 70 12 180 -266 -101 233 -54 -67 44 149 -14 -135 -98 82 87 -86 -164 -127 30
7161C0k9k4qK42n30M81n93M93j98Q8K42o6j83k35J43K70L0m18L29k89L27j48J90
$$ 30 1 -23 -31 211 -319 162 -431 62 -136 -48 194 128 -55 -290 -147 123 153 -265 64 -225 102 -46 144
7184A44k84K83j18j00QJ21pj17J26Q9k40K7J48M7l07j09K59j47K63k37q9J50M8
$$ 144 -140 143 25 -75 -67 54 47 -70 56 145 -95 -68 80 127 -180 -289 -30 -177 86 -151 -240 -90 -42
7207d2j12P7l5J27J88k81J22J90l48j90K83M05n88K66J55j30j14J41r4J0j9K25
$$ -42 -154 -77 -112 15 203 -78 44 234 -114 -304 -21 384 -204 62 217 87 -27 114 20 30 11 236
7229B36l65J16lk2K46p9J28k37k26K11l5O5K05l87J67L0q9J20r0j25J87k01K05
$$ 236 -129 -13 -16 -38 208 129 257 20 -206 5 -30 35 240 -147 20 50 -39 81 -9 -134 53 -148 57
7252E7l36K31J6K75j53J50j7l78K69j94J63k2J01m21M58k86n5KQ6j74K41j12J0
$$ 57 -279 -48 -32 243 90 240 223 -155 114 -80 83 61 162 -259 199 -87 -142 -140 -54 -228 13 -99 -89
7275h9J04Q0J15l72K30k31J72j44j28J71J19JJ11j77m9k4Q5j69K46J36K18m96
$$ -89 15 95 210 -162 68 -163 9 -135 -263 -92 27 28 139 -38 -87 -111 -26 -195 51 187 405 -91
7297i1J14j26K37r1k08N92l64l24K48P9J59j23J0l32J84L83l11R1j00k32L32l87
$$ -91 23 -103 134 43 -165 427 63 -261 -13 66 225 102 112 -220 -36 347 36 127 27 -205 127 -260
7319b60l2L33q0J8p5L61k57K3j30L49k97P5p4K37l34J04J92m6ML0mk81M53l21
$$ -260 -292 41 -39 -21 -96 265 8 31 -99 250 -47 28 -46 191 -143 -39 153 107 111 141 137 -144 309 -12
7343a2j20L19l94L02J46k54O4K07m05M9J21M3r4J5m1j62M05l80O8L00k16J18j16
$$ -12 -132 187 -207 95 241 -13 51 258 -147 -98 23 66 -28 -13 -54 -216 189 -191 -123 177 -39 79 -37
7366c7P6Q9k06m2J40K4J1N4j82OL18j82q8L26l27K44l08K82j85jj27L27R0k73
$$ -37 39 128 -78 -120 20 44 55 109 -73 -67 251 69 -19 307 -20 224 -84 198 13 12 -115 212 302 29
7390B9k2k0k10K59P7j79j11L87N4m50N8L08M9j21p9q3M7K4q7J83k9j54JJ13O6
$$ 29 7 -13 -223 36 113 -66 -177 210 264 -186 -128 180 229 108 29 -54 -7 17 -70 113 84 -70 -69 44 110
7415A10k09j21LN0J02L81l94K8j24N5l7K68L6j16k50O5j03L37J07l63K56J69k02
$$ 110 -99 -220 -217 -167 -65 316 -78 -50 -174 -119 -156 112 148 32 -218 -153 -256 81 188 -175 81 250 48
7438D8j85L03m23M93r9k59L44k73PK09k97N92n15P3L14k89L8Q6j29l77K89L00
$$ 48 -137 166 -257 236 137 -122 222 -51 -44 165 -132 460 -55 18 332 43 81 167 38 -339 -50 250
7460B50l75J49j78J84l22L53j46r2L55J0P7m57J14K1K3J38n0p7J38p4M3K4k33
$$ 250 -125 24 -154 30 -292 61 -85 -177 178 188 265 -192 -78 -57 -34 104 54 -23 115 41 84 108 -125
7483a25j77N56k93m5N2L32k99L6j6N4N2J64k18k03Q3k5O9q7k5J67k5j07j43K43
$$ -125 -302 254 -39 -84 -32 300 1 37 21 75 127 291 73 -130 -47 -72 -3 -90 -115 52 27 -80 -223 20
7507B0j55K93l50j08L15J41l2j51J84k6Q9k97J42Q8k08J53M3m03K11K6K35j31
$$ 20 -135 158 -192 -300 15 156 124 -27 157 131 220 -77 65 153 -55 98 141 -262 -51 -25 210 79
7529G9Q0J80l76K06N0k01J91q6%j36K9j07N1J5K8J16k01Q7k16M49j40o3P8j77
$$ 79 159 339 -37 169 219 18 209 123 123 -13 16 -91 -40 -25 3 119 -82 5 -211 238 98 35 113 -64
7553f4qJ35N4N6k10J49l27L61j76j36K64j32J58j39J86l82J19LJ07r6L53k75J7
$$ -64 -72 63 117 173 -37 112 -215 146 -30 -166 98 -34 124 -15 171 -211 -92 -89 18 -78 275 0 17
7576A7k25L7L71q4l72P4K78Lj04qo0J57l35K98p9J18m1l53O41l00j16K44l24r2
$$ 17 -208 -171 200 116 -256 -182 96 99 -5 -13 -73 84 -251 47 -32 86 45 -308 333 33 -83 161 -163 -255
7600b55N16k18j3o8o6J24K16m39J84m2J96p9PJ10o4j07j41J70p3O1j2q2K62j91
$$ -255 261 43 30 -38 -104 20 236 -203 -19 -61 135 56 63 173 109 2 -139 31 -42 19 7 -75 187 -4
7624dN9l3k30q1O49n11J71J38j69r3q4L67p0j31L0p1J92PM1j82j14J74j85N5J20
$$ -4 55 22 -208 -289 360 -151 20 158 -11 -104 -188 179 109 -22 8 -63 129 136 177 -5 -119 55 -130 -75 45
7649D5kP5O0j76K89m01K01K8k3R8r3k09J45j7J26k27k12L7L96M8l45%j96L37o6
$$ 45 43 118 178 2 291 -110 91 119 96 194 101 -108 37 20 146 -81 -293 -256 140 188 -157 -157 -353 -16 -82
7674h2J61q7j07K47j38J4R1j45k51M69o8j63J29j11M6J03k4k62K37j30J64j36
$$ -82 79 -8 -115 132 -6 8 99 -46 -297 172 104 -59 70 -41 5 108 84 -178 59 -71 93 -43
7696d3K35j72K58q5J5l11K79J87l29k07K38JNk41L42l88K86j65K41J24l59J84
$$ -43 192 20 278 193 208 -103 176 363 34 -173 65 66 71 -170 172 -216 70 -95 146 270 -89 95
7718I5j68lj4Qk28M47k28L8O1J58j98j90K17k82M39l09K62j65K3j97O7K13O7q0
$$ 95 -73 -76 -90 -82 -310 137 -91 -53 8 166 -32 -222 -5 -287 152 -157 105 -60 -37 -234 -167 46 113 33
7742C3m2J29j06P7k25J6K04r3j04J40P5q9j68J33k0j35l6J67J62O9j42N8k61J11
$$ 33 -9 120 14 91 -134 -118 86 -7 -111 29 104 15 -153 -20 -40 -175 -211 -44 118 187 45 103 -158 -47
7766d7K37l37Q2P6J3j29J4Q5k22L47l39L27M3k25p9J10L7Rl5j66J00Q1p5j35J53
$$ -47 190 -147 -65 11 24 -105 -91 -6 -228 119 -220 107 150 -75 -154 -44 -7 2 -33 -199 -99 -18 -93 -228 -75
7791g5L9K67j57j79J51j98Q9j21J33J2K32n37K44J5J6K38k52J49n1K76l60l3L02
$$ -75 -36 231 74 -105 46 -152 -63 -184 -51 -39 193 -344 -100 -85 -69 169 -83 66 15 291 -69 -102 200
7814B00j68j16L55k55N2j98O30n44L2j5J26k6k32L4R9M0QRoj59J6K62o7l7L7k42
$$ 200 32 -84 271 16 68 -130 500 -44 -12 -27 99 73 -159 -125 -26 14 22 31 25 -134 -118 144 77 40 77 -165
7840a65L50j97j13L5j21K61r0k1J39l51L16k6K9o8m2J24k10NL59j95k52J28J36
$$ -165 185 -12 -125 -90 -211 50 -40 -61 78 -273 43 17 46 -22 -64 60 -150 -145 214 19 -233 -105 31
7863C1K48m13K17k19M4P5Lj15L33l10J14M1k9j96J48K03m98K39n5L24j64r9K76
$$ 31 279 -134 83 -136 -92 -17 -14 -129 204 -106 8 49 20 -176 -28 175 -323 -84 -139 185 21 -78 198
7886A98j20k76r0L22Mj80N9p9J45K80j72r6j27J77P1k26J60m5J75p5R6k11K27
$$ 198 78 -198 -288 34 38 -142 -83 -162 -17 263 91 -5 -132 45 116 -110 50 5 180 105 201 -10 217
7909B17O9l60j27K00J9K2N2k54J57kJ30kj76K30k10m0J88k2j93L29o5p0PJ16l36
$$ 217 286 -74 -201 -1 18 40 92 -162 -5 -7 123 121 -55 175 -35 -75 113 91 -102 227 162 92 99 215 -121
7934a21K23q7J44l57J59j6O0L19n30pL17J39p2l94jK34q6l1J85j67j3Q4l2P9n6
$$ -121 102 15 159 -198 -39 -55 5 324 -206 -213 104 243 171 -223 -224 10 -76 -107 78 -89 -102 -18 -50 29 -27
7959b7J22J66K2m32J18j50J34Kj19L36j94J78j55R7l57K92L2k49L23k18k38J82
$$ -27 95 261 283 -149 -31 -181 -47 -45 -164 172 -22 156 1 98 -259 33 65 -184 139 -79 -317 -135
7981a35Q7M3o9l5o3j20M28l6j5j30N4k3K6j01K56l82J19J69p5k2N3K79k97P5j25
$$ -135 -48 -5 -74 -109 -172 -292 136 100 85 -45 9 -14 12 -89 167 -215 -96 73 -2 -24 29 308 11 86 -39
8006c9K0K64k00N5K0J1k03n0j34L40j56K18q2j65K5J73rN0k05J10l6J86l20k7
$$ -39 -19 245 45 100 120 131 -72 -122 -256 84 -72 146 64 -101 -76 97 88 138 -67 43 7 193 -127 -154
8030a54L37k60K86l48J58K24l00J20N4q5l2l7Qj6Mj75J90M5j52k2J29M0j8j69
$$ -154 183 -77 209 -139 19 243 -57 63 117 32 0 -37 -29 -45 -41 -216 -26 19 -133 -155 -26 14 -4 -173
8054a73L36m8N7j07O5O3k04m33N77j01r3J24k23r7L4L47k17K72j54j3Q3J56k62
$$ -173 163 115 172 65 130 193 -11 -444 133 32 -61 63 -160 -257 -223 124 -93 179 25 12 95 251 -11
8077a1K3j07J02J02k13K13l7j25N5k14J03L05L4j46k92J77j23K44J79o84M41N3
$$ -11 12 -95 7 109 -104 109 72 -53 2 -212 -109 196 230 84 -208 -31 -154 90 269 -415 26 79
8099G9p2k56L91j4j22j82P2K04k29K96j75K19R2j60k81J80P6m3lj84K26k61K40
$$ 79 7 -249 142 128 6 -176 -104 100 -129 167 -8 211 303 143 -138 42 118 75 72 -112 114 -147 93
8122I3J01j68j6J20k47J43j88J30j01j7J75j5k30L1l6j53L02q8K41j21j66L4K74
$$ 93 194 26 10 130 -117 26 -162 -32 -133 -150 25 10 -220 -189 -225 -378 -76 -164 77 -44 -210 -176 98
8145I8k09J18J62r4J90j79K3l03L74m0j24k07K28o5j6j3j66kJ33K9m8k27L79k36
$$ 98 -111 7 169 75 265 86 109 -194 180 140 16 -191 37 -28 -44 -57 -223 -225 -92 -63 -111 -338 41 -195
8169a95L01k53J08L7m9K5L30k90j50r4J70K93k10Q7j48l82L64L10l23J11k11K47
$$ -195 106 -147 -39 -2 -51 -26 304 14 -136 -230 -60 233 23 110 -38 -420 -56 254 -69 42 -169 78
8191G8
$$ Imaginary data points
##PAGE= N=2
##DATA TABLE= (X++(I..I)), XYDATA
0@%%%%%%%%%%Qj6J6j6J6k4L2m0M8n6P2q8J04j20J40j64J92k24K57k95L40l88M41
$$ 0 0 0 0 0 0 0 0 0 0 0 8 -8 8 -8 8 -16 16 -24 24 -32 40 -48 56 -64 76 -88 104 -120 137 -158 182 -206 235
33B35n00N65o38P18q05R00j005J121j248J386j536J701j880K074k287K522k780
$$ 235 -265 300 -338 380 -425 475 -530 591 -657 729 -807 894 -986 1088 -1199 1323 -1457
50a457L063l374L718m101M526n004N548o170O885p721Q716r921J1417j3335J5893
$$ -1457 1606 -1768 1950 -2151 2375 -2629 2919 -3251 3634 -4087 4629 -5292 6125 -7210 8683
65H683j9495K4989l4493N5466j87041J37660L59987k73555k86213N9604K59736
$$ 8683 -10812 14177 -20316 35150 -151891 -14231 345756 72201 -214012 -154408 105328
76A05328N533j04631l7199o345l8106J21113J14513j25118k26525P0643K75546
$$ 105328 110861 6230 -30969 -37314 -75420 45693 160206 35088 -191437 -120794 154752
87A54752L7576k73791j08744J76105J35994o7456r6772j7935K9800L9370O1454
$$ 154752 192328 -81463 -190207 -14102 121892 54436 -42336 -60271 -30471 8899 70353
98G0353j8744j27442j8954J52109N8399j23940q2692P7249P0907n0616k3053N4143
$$ 70353 51609 -75833 -94787 57322 115721 -8219 -90911 -13662 57245 6629 -16424 37719
110C7719m1431q4429P4098J23772o6272j59756L2289J78766k094j60849p197J17725
$$ 37719 -3712 -88141 -14043 109729 43457 -116299 -84010 94756 92662 -68187 -75384 42341
122D2341j349p2945L2369O2146q0537q5544J23405J24220j34997j60626J01293
$$ 42341 40992 -31953 416 62562 -17975 -103519 19886 144106 9109 -151517 -50224
133e0224J77888m7304j72575M249J33417J1004p1354o92J4824k4875J1840O5591
$$ -50224 127664 80360 -92215 -87966 45451 56455 -14899 -15591 -767 -25642 -13802 51789
145E1789l698j03721j8383J21174L9724j05535n3920O9278N6260l9235m3087K4361
$$ 51789 48091 -55630 -74013 47161 86885 -18650 -72570 -3292 52968 13733 -29354 -4993
157d993R775k1525K5665K2041m7977k8347N3173M2588n2787n2607N8481N1937
$$ -4993 4782 -16743 8922 30963 -17014 -45361 7812 50400 -2387 -54994 3487 55424
169E5424o2379m2318O2253L9298n8517m5491N6269M9316n6043m1972M7546K2800
$$ 55424 -6955 -49273 12980 52278 -6239 -51730 4539 53855 -2188 -44160 3386 26186
181B6186l6292o555L4324p454n0703K0269P6544k5267r3518J6259R7521J1286
$$ 26186 -10106 -16661 17663 10209 -40494 -20225 56319 31052 -62466 -46207 51314 62600
193F2600q8869l5787P1165M1795m2599k6627Q287L64J0358K4354n365n0607j8638
$$ 62600 -26269 -62056 9109 50904 8305 -18322 -10035 -9671 687 25041 19676 -30931 -49569
206d9569O7092M2962o5248n5002M2392N9712j2664n0481l497L1478L127j856Q343
$$ -49569 17523 60485 -4763 -59765 -17373 42339 29675 -20806 -24303 7175 10302 8446 16789
219A6789k2730k3145K7587L7978j7882n4864L196N9495L360m9366o822L0476Q842
$$ 16789 -5941 -29086 -1499 36479 18597 -36267 -33071 26424 29784 -19582 -26404 4072 12914
232A2914j6609k296J6035r957j7278K4953J8975k8582k0040K1622K3659j5936
$$ 12914 -3695 -5991 10044 87 -17191 7762 26737 -1845 -21885 -263 23396 7460
244G460k7489J5439J9606j9410r543J9808K799k0609n469K5605J2357l0392j1071
$$ 7460 -20029 -4590 15016 -4394 -13937 5871 8670 -11939 -17408 8197 20554 -9838 -20909
257b0909K9547R062j8412o497R178N080q608J119J2324j4072j5925J9739J6348
$$ -20909 8638 17700 -712 -7209 1969 7049 -1559 -440 11884 -2188 -18113 1626 17974
270A7974j8040k1486J0393K7543n857k7243N846J9663k217p640N72K766k421j540
$$ 17974 -66 -21552 -11159 16384 10527 -16716 -10870 8793 6576 -1064 -492 2274 -147 -1687
284a687J2255p17k2219K053K3704j074k1552p418J8119J3358j7821j0946J3074
$$ -1687 10568 9851 -12368 -10315 13389 12315 -9237 -16655 1464 14822 -2999 -13945 -871
297h71M596m292R04N84k195k477O873R809j2715j2634J4443J2014j0360j3541
$$ -871 3725 -567 337 921 -1274 -3751 3122 12931 216 -12418 2025 14039 3679 -9862
311i862K865J5131j905j4857L923P192m962M38L787j738l560l64R726K123j3931
$$ -9862 -6997 8134 6229 -8628 -4705 2487 -2475 -2037 1750 12 -3548 -3912 5814 7937 -5994
326e994Q60J2629q31q334l082O210N082q778l068Q002k330m550L274J813j319
$$ -5994 -5134 7495 6664 -1670 -4752 1458 6540 -2238 -5306 2696 366 -4184 -910 903 -416
341d16l833J414Q144m555o464P192L593m687k092J830M668k998n755N726K362
$$ -416 -4249 -2835 5309 754 -5710 1482 5075 388 -1704 126 4794 1796 -3959 1767 4129
356D129o894J82L264j57j226l469L247L290n281J105L904k488o75J583J709M71
$$ 4129 -2765 -2583 681 524 -702 -4171 -924 2366 -2915 -1810 2094 -394 -1069 514 2223 2694
372B694n259J494O909l572n441K234K232J424l019l522L558J40j316K525k726
$$ 2694 -2565 -1071 5838 2266 -3175 -941 1291 2715 -304 -3826 -268 -128 -1444 1081 -1645
387a645k314M242J257O98k925l371N591L574l631j887r33J073M326k246l360p06
$$ -1645 -3959 283 1540 2238 -687 -4058 1533 5107 1476 -411 -1344 -271 4055 1809 -1551 -2257
403b257p35N140J158p052r72M076K129R5m454L28M990j819o18K589k031o87J023
$$ -2257 -2992 2148 3306 -3746 -4718 -642 1487 1582 -2872 -2544 2446 627 9 2598 567 -120 903
420I03J122K007m594l652N722J659m164k241J6M825k38o260L068L996k514q80
$$ 903 2025 4032 -562 -4214 1508 3167 -997 -3238 -3222 1603 1365 -4895 -1827 2169 -345 -1225
436a225M68K838J644n280k71N986j197l005j846J267M461l071n307L567K032k469
$$ -1225 -757 2081 3725 -1555 -1826 4160 2963 -42 -1888 -621 3840 769 -4538 -971 1061 -1408
452a408j141J52L879m94n992L584O977k878n670n59O807N197r290n934Q107M275
$$ -1408 -2549 -2397 1482 988 -5004 -1420 5557 2679 -2991 -3550 3257 8454 -836 -6770 1337 5612
468E612m106n793J333O271l122o367O237M546o894m925N716R567l654j2974L477
$$ 5612 1506 -4287 -2954 3317 195 -6172 65 4611 -2283 -7208 -1492 8075 4421 -8553 -5076
483e076J3243p33r561l993P177O452p265m748O522j60n659L97O010K219r523n818
$$ -5076 8167 7434 -2127 -6120 1057 7509 244 -4504 2018 1858 -3801 -3404 2606 4825 -4698 -10516
499a0516J2451Q674j0011r790L179J3502L289j4003m983R734N338l559o067L62
$$ -10516 1935 10609 598 -9192 -6013 7489 10778 -3225 -8208 1526 6864 3305 -2762 -2400
513b400M323l143j162O907k237j0151m0J1549Q120j2631j5229J1783J8853m764
$$ -2400 1923 -1220 -2382 4525 2288 -7863 -7903 3646 11766 -865 -16094 -4311 14542 9778
527I778j8536l132J6663R658j4305q525P986M246l481r82L301j481r883K617J5635
$$ 9778 -8758 -11890 4773 14431 126 -8399 -413 3833 352 -630 2671 1190 -8693 -6076 9559
542I559j214j7548m480J6011J2596j1322j6965P129J5979j285j0750l284N998
$$ 9559 8345 -9203 -13683 2328 14924 3602 -13363 -6234 9745 8460 -2290 -5574 424
555D24M134m852p5L696m928m158M340O644p07j0952l842J2767P321q861r323K443
$$ 424 4558 -294 -369 3327 -1601 -5759 -1419 5225 4518 -6434 -10276 2491 9812 951 -8372 -5929
571e929J2093K533j1036k494O623J475k602q35K482q32p484K233J1637k289j3641
$$ -5929 6164 8697 -2339 -4833 1790 3265 663 -172 2310 1478 -6006 -3773 7864 5575 -8066
586h066k412J3193R193j1885j3193R331J2795l359r091j301O492J880l724K618
$$ -8066 -10478 2715 11908 23 -13170 -3839 8956 5597 -3494 -4795 1697 3577 -147 2471
600B471P54p224j280Q621M396p364j0571M547J3498j495j1435l041O699P710k425
$$ 2471 3225 -3999 -5279 3342 7738 374 -10197 -5650 7848 6353 -5082 -8123 -1424 6286 3861
615C861p187P45L075J218J388j323k633o20J99L829K170n630m324K157N613L013
$$ 3861 -3326 -2581 494 1712 3100 1777 -856 -1476 -1277 2552 4722 -908 -5232 -3075 2538 5551
631E551p332n674N781N835j221m313k535L661K752j336J077q19m476J186N351
$$ 5551 -1781 -7455 -1674 4161 2940 -1373 -3908 -247 2505 1169 2246 1427 -3049 -1863 3488
646C488J824n288p709M459R864j965r171k363N933O163l041n818N43K265K532
$$ 3488 5312 24 -7685 -3226 6638 4673 -4498 -6861 -928 5235 2194 -3624 -3081 -816 1716
661A716K568l455m035P78M590M017l937p816J976O542J557l644n969P55O405J359
$$ 1716 4284 829 -3206 -2428 2162 6179 2242 -5574 -3598 2944 4501 857 -5112 -4357 2048 3407
677C407l668l254q51N774K876l622l020K93L261K851k688l065J058O03K122o0
$$ 3407 -261 -3515 -4366 1408 4284 662 -2358 -2065 1196 4047 1359 -1706 -648 -45 2077 2017
693B017l633o81J601J677M10l391j039L425M36n44p26p81J693J003j308P46J19
$$ 2017 -1616 -2297 -696 981 1391 -2000 -3039 386 822 278 -448 -1229 464 1467 159 905 1024
710A024j452J510N1o88m70j090P60J386j919M3L93n98R51j03n47O10o39J022J505
$$ 1024 -428 1082 1133 445 -25 -1115 -355 1031 -888 -845 -452 -1050 -99 -202 -749 -139 -778 244 1749
729A749j393n79O87j06Q85n40j531J300P6q15K43j153K97J303q28k37Nl90J852
$$ 1749 356 -223 464 358 1243 703 -828 472 548 -267 -24 -1177 -880 423 -405 -642 -637 -1027 825
748H25j43j476M86Q55O32O68k114m15J902m91j42q26j175J774M04q50n14j142
$$ 825 682 -794 -308 547 1179 1847 -267 -682 1220 729 587 -239 -1414 360 764 -86 -600 -1742
766a742J106J863j659q68Q57K66J435m94j534J074O23K7L65j807m34J975k58m41
$$ -1742 -636 1227 -432 -1300 -443 -177 1258 764 -770 304 927 954 1319 -488 -922 1053 795 354
784C54j014r28J699M66j551J99k76R38J345j658l13R18k15J117o3j360Q31J52
$$ 354 -660 -1588 111 577 -974 -775 -1051 -113 1232 -426 -739 179 -36 1081 1018 -342 489 641
802F41p7J48j469K87J142q83l55K75o45Q92J34r80J148l54k2P97n78l85J004n38
$$ 641 564 712 -757 -470 672 -211 -566 -291 -936 -44 90 -890 258 -96 -118 679 101 -284 720 182
822A82M89J51j129Q85m6j028M21j77m98P10n22L17J10j037R91Q77j053K21L0k4
$$ 182 671 822 -307 578 532 -496 -75 -252 -750 -40 -562 -245 -135 -1172 -181 696 -357 -136 -106 -130
842a30J220n70k46N23j103J06J320j160n42R2P1J122j018j546J436P4R6Q38j264
$$ -130 1090 520 274 797 -306 -200 1120 -40 -582 -490 -419 703 -315 -1861 -425 -351 -255 583 -681
861f81J86O64J12Q81q15j368J488J010p98o68q03Q19O51j092K36M9j108J050J088
$$ -681 -495 169 281 1162 347 -1021 467 1477 679 11 -792 27 678 -414 -178 -129 -1237 -187 901
880I01j080p83k58J654J692k146r37J617J67N49j020m68N19n01j6J185r06k043
$$ 901 -179 -962 -1220 434 2126 -20 -957 660 827 1376 356 -112 407 -94 -110 1075 169 -1874
898a874P88J641N63j349k134K076J298q45J3p97M23J277k31l78m67r12J465J104
$$ -1874 -1086 555 1118 -231 -2365 -289 1009 164 177 -620 -197 1080 849 471 4 -908 557 1661
916A661j662o93K9j11J276k99o70q85l35K259J604l202j189K062K058l18k708
$$ 1661 -1 -694 -665 -776 500 201 -469 -1354 -1689 570 2174 -1028 -2217 -155 1903 1585 -1123
933a123J09K759o28j642J233j23j195o39J543J924l154k818L407L259k409l065
$$ -1123 -1014 1745 1117 -525 708 585 -610 -1249 294 2218 -936 -3754 -347 2912 503 -2562
949b562P20L373O48l192k66K527q56n45N21P00p47j947J059K742j418k949M79
$$ -2562 -1842 1531 2179 -1013 -1279 1248 392 -153 368 1068 321 -1626 -567 2175 757 -2192 -1713
966a713K083J079j304k194J038J736J62o96j209L55K214p30j064P01n7k32q01
$$ -1713 370 1449 145 -2049 -1011 725 887 191 -1018 -663 1551 821 -243 458 401 169 -632
983f32Q39J597k461k026K344K793j663l851O41M854o3m881L87L818L66k941m65
$$ -632 207 1804 -657 -2683 -339 2454 791 -3060 -2419 2435 2372 -2509 -2122 1696 2062 -879 -1344
1000a344K727O37l818N37M001q43m114j94M261J094m765j694M494J050k871j043
$$ -1344 1383 2020 -1798 -1261 2740 1897 -2217 -2411 1850 2944 -1821 -3515 979 2029 -842 -1885
1016a885J857J534j152j365J548R50k052L51J152M40j161j285O01J530q72p57
$$ -1885 -28 1506 354 -1011 537 1487 -565 -214 938 1378 217 -1068 -467 1063 191 -566
1032e66n84K68K276p32k031N25J329O57j423j158K190J165k735l38K789j85k435
$$ -566 -1150 -882 1394 662 -1369 -844 485 1142 -281 -1439 751 1916 -819 -1157 1632 1447 -988
1049i88q17K964J630m103j842M162J580l693j635K316K837k725k368L332J428
$$ -988 -1805 1159 2789 -1314 -3156 1006 2586 -1107 -2742 -426 2411 -314 -2682 650 2078
1064B078k612j210K609J569k292k096K487J950k915j500J839J033p97j690J132
$$ 2078 -534 -1744 865 2434 142 -1954 533 2483 -432 -1932 -93 940 143 -1547 -415
1079d15J238j284m61J366l04p44L06O18N16q24l37J113p84l48J257l59j523P74
$$ -415 823 -461 -922 444 140 -604 -298 320 836 12 -325 788 4 -344 913 554 -969 -195
1097a95R23k80j936L39K208o12k617J484J781q27j569Q28K320j072k494J532K184
$$ -195 728 448 -1488 -1149 1059 447 -2170 -686 1095 268 -1301 -473 1847 775 -1719 -187 1997
1114A997j674j455R61J723r32k120R09K243j996j466J368J354j003j317R97J789
$$ 1997 323 -1132 -171 1552 620 -1500 -591 1652 -344 -1810 -442 912 -91 -1408 -411 1378
1130A378j106j587J907N50j077n07O45J089j247j029J765J54j720o3J380l10q54
$$ 1378 272 -1315 592 1142 65 -442 203 1292 45 -984 781 935 -785 -848 532 222 -632
1147f32m13J587m9j481P90J180r18n05O61O40l26j272Q57J188j563n60J451k5
$$ -632 -1045 542 493 -988 -198 982 64 -441 220 860 534 -738 119 1307 -256 -816 635 610
1165F10q64p20J015O47j626k87K011l86j280L64J205N7j293N5J889p17j753J054
$$ 610 -254 -974 41 688 -938 -1225 786 400 -880 -516 689 746 -547 -492 1397 680 -1073 -19
1183a9J032o65j013J10J279l12j996J297J306j253r18O77J425p61j271J309J088
$$ -19 1013 348 -665 -555 724 412 -1584 -287 1019 -234 -1152 -475 950 189 -1082 227 1315
1200A315j376o78J511Or75n59P29R14j392n69J439P6j449J92R83K35j019j38J483
$$ 1315 -61 -739 772 778 -197 -756 -27 887 -505 -1074 365 441 -1008 -816 167 402 -617 -755 728
1219G28m18j280J091O34l59o11j89J486m70j570J006Q29j035n74P06L38l78q95
$$ 728 310 -970 121 755 396 -215 -404 1082 612 -958 48 877 -158 -732 -26 312 -66 -961
1237i61Q65J022j698j39J691r3j218j8J165L14r81l18J194l62r03P9Q25l18j033
$$ -961 -96 926 -772 -911 780 687 -531 -549 616 930 -51 -369 825 463 -440 -361 464 146 -887
1256h87K77J307m83j222P82O43n02o58Q19N40m14r54J159O43j244p1O41K7o47
$$ -887 -610 697 214 -1008 -226 417 -85 -743 76 616 202 -752 407 1050 -194 -265 376 403 -244
1275b44o12Q82Q27j421M2P18j58n70J15M69L03n88l24J000K41j010L31L86l5n52
$$ -244 -856 26 853 -568 -526 192 34 -536 -421 48 351 -237 -561 439 680 -330 1 387 352 -200
1295b00rR22p03l58M89J55o45j73L49j5M56j127Q76O09r39J20N11L48n36k56N74
$$ -200 -209 713 10 -348 141 296 -349 -522 -173 -188 268 -859 17 626 -313 -193 318 666 130 -126 448
1316D48M57j221K1R14l99o19K46L13Rp59J07R55l42n75L31K56p3k77r4P81j82
$$ 448 905 -316 -295 619 220 -399 -153 160 169 -590 -483 472 130 -445 -114 142 69 -208 -302 479 297
1337B97o80N47J67k00J00k31L15l78l57N48k4k83K96j09j26j27K35J87O5l98N8
$$ 297 -383 164 331 131 231 0 315 -63 -420 128 104 -179 117 8 -118 -245 -10 177 242 -156 -98
1358i8N39j47k57K7J84J69l86l02O85m00m55L50J36j27k94K15O26l26m96O27j33
$$ -98 441 294 37 64 248 417 31 -271 414 14 -441 -91 45 -82 -376 -161 465 139 -357 270 137
1379A37j44L02k83J16J21pj99J7l6m7j52p4J71P6m14K78O7K64Jn22J32O49j01
$$ 137 -7 295 12 128 249 242 43 60 24 -23 -175 -249 -78 -2 -416 -138 -71 193 194 -328 -196 453 352
1402C52l52M0R5K33l53k22M25j48k20J83k36K75k46n61M19L63m02J49O9N66j9
$$ 352 0 40 135 368 15 -207 218 70 -150 33 -203 72 -174 -735 -316 47 -355 -206 -137 429 410
1423D10n29Q9O71m83j89r4K87j7M11j053P36J34o33J87m56R25l80n89Q54K65n66
$$ 410 -119 -30 641 158 -31 -125 162 145 556 -497 239 373 -260 -73 -529 396 16 -573 281 546 -20
1444b0r9k30O37M42j003r9R57k86k60m39N27L00p88l14R96J6q59q4O45K56m35
$$ -20 -119 -349 288 730 -273 -372 585 299 39 -400 127 427 -361 -675 321 337 -522 -606 39 295 -140
1465a40n70Q40L51k04l02j95M69L03q11k13R74j09m14j27K09L98m47p60P55M36
$$ -140 -710 130 481 277 -25 -220 249 552 -259 -472 502 393 -21 -148 61 459 12 -748 7 443
1485D43l61o70M71O52k59r45M42R52j77q05pP20J05r70j52J055o9r97k54P98M49
$$ 443 82 -588 -117 535 276 -669 -227 725 548 -257 -264 456 561 -409 -561 494 425 -572 -826 -28 421
1506D21p87k46J023J52p19j08L31J32R8o31O13L35m57l05J07KlP4m84N52O3m09
$$ 421 -366 -612 411 563 -156 -264 67 199 297 -334 279 614 157 -148 -41 -39 -42 32 -452 100 163 -246
1528b46J52R9J79j10p02P18N1M9k54k28N69L1r02L29R10m45o12J43L62N1q53J80
$$ -246 -94 5 184 74 -628 90 141 190 -64 -292 277 308 -594 -265 645 200 -412 -269 93 144 -709 -529
1550e29O97n3l48k37O48M53l43q14P70K48n89n9K52N5o2l43J84O04o61j00N20
$$ -529 168 115 -233 -470 178 631 288 -526 244 492 -97 -156 96 151 89 -254 -70 534 -127 -227 293
1571B93r7k31k15R4K05k22j95L68L8M0J00k46K28K14j44ml26J70K1j57j86J94
$$ 293 196 -35 -250 -156 49 -173 -368 0 38 78 178 -68 160 374 230 226 -100 70 91 -66 -252 -58
1593e8j79L50j74p0J97nm00M61M4k25J80rJ41j43n27N92L76n87l89K54L25J4o20
$$ -58 -237 113 -61 -131 66 61 -339 122 166 -59 121 112 253 110 -417 175 551 -36 -425 -171 154 168 -452
1616d52M5M01j11l05L52M32o1m83L2O32k69l26J10K12k72K18k39L74k03n12M23
$$ -452 -407 -6 -117 -422 -70 362 301 -182 -150 482 213 -113 -3 209 -63 155 -84 290 87 -425 -2
1637br0J19k56J88j22P0j76N87j61n53LO54k78k53K04J62K0m52L71N3l56J49K32
$$ -2 -92 27 -229 -41 -163 -93 -269 318 157 -396 -393 261 -17 -270 -66 96 116 -336 35 88 -268 -119 113
1660A13k93J84l82K18L14n45K2L52L4J9k52N28k05j36p2K32Jk62j49N22l65J73
$$ 113 -180 4 -378 -160 154 -391 -369 -17 17 36 -216 312 107 -29 -101 131 132 -130 -279 243 -122 51
1682E1n00N80J26m30K37P7j62k87K57J46J00m28J70M42l49k14M52J03n28p7L54
$$ 51 -449 131 257 -173 64 141 -21 -308 -51 95 195 -233 -63 379 30 -184 268 371 -157 -234 120
1703A20k04m5P9K06j67o9K89k7k23J76l22K13Pp4K77J10l63Q2j05P7J52l46qK36
$$ 120 -84 -129 -50 156 -11 -80 209 182 -41 135 -187 26 33 -41 236 346 -17 65 -40 37 189 -157 -165 71
1727G1k41k47O55j70q5m93M05K6o3o5M67j39j89L06j81J11j76n0L99l7o41J15
$$ 71 -170 -417 238 68 -17 -510 -105 -79 -142 -207 260 121 -68 238 57 168 -8 -58 341 304 -337 -222
1749b22J59q0Q5k79K11L88n83M14J52m08k3J34R1J92l00J0M40l62KP4k14P2j6
$$ -222 -63 -143 -58 -337 -126 262 -321 93 245 -163 -186 -52 39 231 -69 -59 381 19 21 95 -119 -47 -63
1772f3RJ14j28j58O69n21J74pJr7J69n1j99K52p1k20K29J27k11r9J39m0k17N75
$$ -63 -54 60 -68 -226 443 -78 96 89 90 -7 162 111 -88 164 93 -127 102 229 18 -81 58 18 -199 376
1796C76m45m3J63J3R3j09j70M11R8o97K48L56k54o6R3l28M98j96k36M28om45j5
$$ 376 -69 -112 51 64 157 48 -122 289 387 -310 -62 294 40 -26 67 -261 237 41 -195 233 227 -218 -233
1819b33M9L90k59k80L35J2m04K96J08K94l47L38j90q5j60J94J01q5q4K6j63K09
$$ -233 -184 206 -53 -333 2 14 -390 -94 14 308 -39 299 109 24 -136 58 159 74 -10 16 -147 62
1841F2k35RJ74j75K11J67m90n1J82M93k48jk73M23l97N8K05k66J60j68O1L39j29
$$ 62 -173 -164 10 -165 46 213 -277 -328 -146 347 99 98 -175 248 -149 -91 114 -152 8 -160 -99 240 111
1864A11k96J69K83j59j1r0N6J21l70K60L7k42Q4J37j52J94M4k29R1j71J36K65
$$ 111 -185 -16 267 108 97 7 63 184 -186 74 111 -131 -47 90 -62 132 176 -53 38 -133 3 268
1886B68k16j12j12J95Q4j94L8J6R5j92K94j32n5k32M24k4q9n8P0p3J0Pk7R5k5
$$ 268 52 -60 -172 23 107 -87 -49 -33 62 -130 164 32 -23 -255 169 145 56 -2 68 -5 5 12 -15 80 55
1911E5k44K07L70o73K89o8K16K78q11N02Mj85K42r9k18j78L36k99J92l1rJ71l2
$$ 55 -189 18 388 -285 4 -64 152 430 -381 121 125 -60 182 83 -135 -313 23 -276 -84 -115 -124 47 15
1934A5J52r5k45J56K13l18m4N58m0n0m71J62L16j7l69Q0l2o5j67n4M36j77N0k7
$$ 15 167 72 -173 -17 196 -122 -166 392 352 302 -169 -7 309 292 -77 3 -29 -94 -261 -315 121 -56 -6 -33
1958c3J1j13K73j61%K89Qn5m22J75J58N1m05K49J17m96K39K44jk16J17j29K81
$$ -33 -22 -135 138 -23 -23 266 274 219 -203 -28 130 181 -224 25 142 -354 -115 129 128 -88 29 -100 181
1981A81l20OK37j29M04m58kM10m95K41o4j49J79j76j15M86j06k02l7J15R2Q6o24
$$ 181 -139 -133 104 -25 379 -79 -81 329 -166 75 11 -138 41 -135 -250 236 130 -72 -109 6 98 184 -440
2004d40L55L15m10K26p3M10j88l03q2K39J10m5j51L69k81p0k13M40l90M82l95
$$ -440 -85 230 -180 46 -27 383 195 -108 -190 49 159 114 -37 332 51 -19 -232 208 -182 300 -95
2025i5j69N13K8l63K14k98N69l71j05K47pJ3j23k38L97J37o34R1J01K01j87Q5
$$ -95 -264 249 277 -86 128 -170 399 28 -77 170 163 176 53 -185 212 349 -285 -194 -93 108 -79 6
2047FK0j8k6j13L08k3k00p3L49k74L1nq4L64l68K88q0ql03L7P4L60l12k18N46
$$ 6 26 8 -18 -131 177 154 -46 -119 230 -44 -13 -18 -102 262 -106 182 102 94 -209 -172 -98 262 -50 -268 278
2072B78J29m24n4K1q0K4pj9J68K7l11L11l01J98J0O9j84R0L85m17J93k18L92l71
$$ 278 407 -17 -71 -50 -130 -106 -113 -132 36 63 -248 63 -238 -40 -30 39 -145 -55 330 -87 106 -112 280 -91
2096i1p1K71r9p6q0J11R0p9K8M1J43k97Q5P3J09j32k23k1M52j44k49L14j62k27
$$ -91 -162 109 10 -66 -146 -35 55 -24 4 45 188 -109 -24 49 158 26 -197 -218 234 90 -159 155 -7 -234
2120b34M02Q1n7k42M5k34M19l28J47L35l31k08j68M14R0k39Q1J58l34L16k21K87
$$ -234 168 249 192 -50 -5 -239 180 -148 -1 334 3 -205 -373 41 131 -108 -27 131 -203 113 -108 179
2142A79j21j64j29K94J4j46j88L48l56O8J87j25k49M29n6Q4k42J21J19Q0%k75
$$ 179 58 -106 -235 59 73 -73 -261 87 -269 -201 -14 -139 -388 41 -15 69 -173 -52 67 147 147 -128
2164a28P18l12j91l35L70k08J76k96J57J14p9k00J76j49K26J38k80J62j53K22
$$ -128 590 278 87 -248 122 -86 90 -206 -49 65 -14 -214 -38 -187 39 177 -103 59 -94 128
2184A28j03m8k84P4J86Pl4O3j52P9J68k14J82nj42K06J20l70J31Q1o0K4j2k84
$$ 128 25 -23 -307 -233 -47 -40 -74 -11 -163 -84 84 -130 52 47 -95 111 231 -139 -8 73 13 37 25 -259
2208b59L92j25l25K42j7M5L81m13j36qM5J48R0K6kk52N20m33j1K69j49l41O16
$$ -259 133 8 -317 -75 -92 -47 334 -79 -215 -223 -178 -30 60 86 84 -168 352 -81 -92 177 28 -313 303
2231C03j81K41l00J13l45M4m1K92K37m31Q5N5p9j05o0L23j70o8j12L07J31k67
$$ 303 122 363 63 176 -169 -125 -166 126 363 -68 17 72 -7 -112 -172 151 -19 -87 -199 108 239 -28
2253b8k1K09r3l8J4J11j41K11l48K00n7J51m9p5O9j51rJ56j93K90k45R1l60N81
$$ -28 -49 160 67 29 43 154 13 224 -124 76 19 170 121 46 115 -36 -45 111 -82 208 -37 54 -306 275
2277B75k18j39J56j0J12k63j11J42j05n8J5K54j01K5K0N0k53K16n0Ro5J87j69
$$ 275 57 -82 74 64 176 -87 -198 -56 -161 -219 -204 50 -51 -26 -6 44 -209 7 -43 -34 -99 88 -81
2300h1J09l42L37q9q0j8J19K2J68m0j88kl3K52Q4j2mk16o5J75n0n0P3j23K66m42
$$ -81 28 -314 23 -66 -146 -164 -45 -23 145 105 -83 -85 -118 134 218 206 202 -14 -79 96 46 -4 69 -54 212 -230
2326b30K54k11K99J01l42O5J90j81J73J10j92k85K49J12j42q0J21j04r4J58k46
$$ -230 24 -187 112 213 -129 -64 126 -55 118 228 36 -249 0 112 -30 -110 11 -93 -187 -29 -275
2347b75K2K72K15l82m8M14k96K4J71k53J78j54K48m04L41j30K34j46k59K01J29
$$ -275 -253 19 234 -148 -196 218 -78 -54 117 -136 42 -112 136 -268 73 -57 177 31 -228 -27 102
2368A02L4k44j07K31q1J44l57L39O2k05M3N05l17j08J93k92K37j22J23o0l81M11
$$ 102 136 -108 -215 16 -65 79 -278 61 123 -82 -39 466 149 41 234 -58 179 57 180 120 -261 150
2390A50J01l62j61K50j60M3K44l24M26kl7o1l09K15Q1j42j8J61k92J40L45j22
$$ 150 251 -111 -272 -22 -182 -139 105 -219 207 205 168 107 -202 13 94 -48 -66 95 -197 -57 288 166
2412A66o3J61k98l52N05k02J10J14K8l23N13j51k62J37k34J10K15n0k27L38j49
$$ 166 103 264 -34 -386 119 -83 27 141 169 -154 359 208 -54 83 -151 -41 174 124 -103 235 86
2433H6m6j89j37K60oK69j88L3n1L2K40j10j48l11L26K3m9j74L09L3j10k68Q3Q5
$$ 86 40 -149 -286 -26 -32 237 49 82 31 63 303 193 45 -266 60 83 34 -140 169 202 92 -176 -93 -8
2457hK24l99p7K39k34J14J40J16O5P2l73M49l93m1Lj93L21L1q9k21J21M58n46
$$ -8 216 -183 -260 -21 -255 -141 -1 115 180 252 -121 328 -65 -106 -103 -296 25 56 -33 -254 -133 325 -221
2480b21kJ38P6J32l30K74J53m93J62K96j16R1k13M05l47k9K49l88K69l9n1l1j59
$$ -221 -223 -85 -9 123 -207 67 220 -273 -111 185 69 160 -53 352 5 -24 225 -163 106 67 16 -15 -174
2503a74J69J68j43M9l6j5k41K22m5L01l17J04m7J50n6J94l77K93Ll59J58K3k7
$$ -174 -5 163 20 69 33 18 -223 -1 -46 255 -62 42 -5 145 89 283 -94 199 202 -157 1 24 -3
2526cq0N7j06M31l13J90n8k52K12J43j48rm9k41K01J6l09O59m29N8J14k91N3L19
$$ -3 -83 -26 -132 299 -14 176 118 -134 78 221 73 64 15 -226 -25 -9 -318 341 -88 -30 84 -207 -154 165
2550A65k47j2m7J85k02K74L9J64k49j24L74m05J73L2k12Ql09O12k26k64K63L5
$$ 165 -82 -94 -141 44 -158 116 155 319 70 -54 320 -85 88 120 -92 -84 -393 219 -7 -271 -8 27
2572B7N3j25kJ20j1O7L5J4k03j53K98J47r2p1k44m4Q6K61k20J20m59M16l7j7J25
$$ 27 80 -45 -47 73 62 129 164 178 -25 -178 120 267 175 104 -140 -184 -98 163 -57 63 -396 20 -17 -34 91
2597I1k02J9J90m77K36K32j0K0j13q1J60j09q8K45n6r0k02L71j12k6j49J93j71
$$ 91 -111 -92 98 -379 -143 89 79 99 -14 -95 65 -44 -132 113 57 -33 -235 136 24 -2 -151 42 -129
2620a29J84j27n8j4K39k7l61L90K8r1P1r6K04m34K00lj87J79J73J36l01J42k25
$$ -129 55 -72 -130 -144 95 68 -293 97 125 34 105 9 213 -221 -21 -24 -211 -32 141 277 -24 118 -107
2643a07k8N6K20k1l79q5M44L6l80L42N3r6r6k65K57P9J50n2k92J90l14J35R3n9
$$ -107 -135 -79 141 120 -259 -344 100 136 -244 98 151 55 -41 -306 -49 30 180 128 -164 26 -288 -153 -60 -119
2667a19j49M39j17j79M2L70k78R1l03J15K5j31J16J15L09l11k53J23l8j20J7L49
$$ -119 -268 171 54 -125 -83 287 9 100 -203 -88 -63 -194 -78 37 346 35 -218 -95 -133 -253 -236 113
2689A13k35OJ78nj32k3r0L31j07k55L63k52J45r5J03o1l3R1k52K46Q7j70J8K54
$$ 113 -122 -116 62 57 -75 -98 -188 143 36 -219 144 -108 37 -58 45 -16 -49 42 -210 36 123 -47 -29 225
2713B25j02p6J73p0k10j53K52J8j7m2J41k27J7j67K12J48j33M9J83l30O2q2J01
$$ 225 123 47 220 150 -60 -213 39 57 40 -2 139 -88 -71 -238 -26 122 -11 38 221 -109 -47 -129 -28
2736b8J08q7j36J68o8K43r5j26k70J06J26K18k31P6K29o5k33j13K42J54Q6n67
$$ -28 80 -7 -143 25 -43 200 105 -21 -291 -185 -59 159 -72 4 233 168 -65 -178 64 218 304 -263
2758b63L79j32k7J61j11J62j49j45K48j40m0J48l32J23N7k55J91j3J01Qj35P7
$$ -263 116 -16 -43 118 7 169 20 -125 123 -17 -57 91 -241 -118 -61 -316 -125 -138 -37 -29 -164 -87
2780h7J88n6J25j62k81K07K34j35Kn6P1P3j37l4L19m42O8K04j36K1J5J23P3l60
$$ -87 101 45 170 8 -273 -66 168 33 35 -21 50 123 -14 -48 271 -171 -103 101 -35 -14 1 124 197 -163
2804a63q0K07J07K1j26J33N0K2l75M68R3o42K64P6l67J05L32J00m7k90J28J31
$$ -163 -243 -36 71 92 -34 99 149 171 -204 264 357 -285 -21 55 -312 -207 125 225 178 -112 16 147
2826A47j68j8L29j09K13o50J60j89J53M4J62l51J98J79k24O6L5J7O4m1k34L36
$$ 147 -21 -39 290 181 394 -256 -96 -285 -132 -88 74 -277 -79 100 -124 -58 -23 -6 58 17 -217 119
2848A19k3O2j39Q2q1N67p82L81pj03j0j80K39r6r5j88K83R4q3J06l16J91J14k54
$$ 119 96 158 19 101 20 587 -195 186 179 76 66 -114 125 29 -66 -254 29 123 40 146 -170 21 135 -119
2872a19K38j94Q4R4q3K0j62O4P5j16K0J27j6k11J67k83K88O8m7k7R7j40M38l55
$$ -119 119 -75 9 103 20 40 -122 -58 17 -99 -79 48 32 -179 -12 -295 -7 61 14 -13 84 -56 382 27
2896B7M9l43R4P9K87m70K65l4k38j4K44L56l14l48K65L55k51j74K29j9n1K42j36
$$ 27 76 -267 -173 -94 193 -277 -12 -46 -284 -298 -54 302 -12 -360 -95 260 9 -165 64 45 -6 236 100
2919A00M6r8j18K29k78qK09M8j43m5k1L95j0m74J28R7J8j5j59J11O9K00l91J58
$$ 100 146 48 -70 159 -119 -127 82 130 -13 -58 -79 316 306 -168 -40 57 75 60 -99 12 81 281 -110 48
2943D8j75J49J18k54K44m4k32K71j78J88j08l2K7J2n3j65mJ81K8L48l53k39K07
$$ 48 -127 22 140 -114 130 86 -146 125 -53 135 27 -5 22 34 -19 -184 -188 -7 21 369 16 -223 -16
2966a6R7q1k0L9l9j65nJ99j31L77j5j24j81M5J63k16J31N6k47K51M1K07m77j0
$$ -16 81 0 -20 19 -20 -185 -190 9 -122 255 240 116 -65 -20 143 -73 58 114 -133 118 159 366 -111 -121
2990a21l7J44R7k93J50o6K56k00J70o6n2K33j70P5o9O1m0rq6q8M9K96J48p13L69
$$ -121 -158 -14 83 -210 -60 -126 130 -70 100 34 -18 215 45 120 51 112 72 63 -23 -111 -62 234 382 -331 38
3015C8J33l30L44k69J04J57k49J6K19j9r3K28J9j60n1O2Lk8k00Q4M3j01R6j38
$$ 38 171 -159 185 -84 20 177 -72 -56 163 144 51 279 298 138 87 149 152 124 -76 8 51 -50 46 -92
3039i2j70K88N0l51K59K3O6j68K60j10k23L14Np9m2J5%J8j26J26j44K03M7Ll76
$$ -92 -262 26 76 -275 -16 7 73 -95 165 55 -168 146 151 72 30 45 45 63 -63 63 -81 122 169 172 -204
3064b04j21L48q2Q5J43l76K93j23j0J72r3L21k84l4j92K80Oj41m1K51p7On80L44
$$ -204 -325 23 -59 26 169 -207 86 -37 -47 125 32 353 69 35 -157 123 129 -12 -53 198 121 127 -453 -109
3088a09N8K43o8k61L5K77j71k23L41l30L45k6J47j95j08K2J12k54O3J40j72L59
$$ -109 -51 192 124 -137 -102 175 4 -219 122 -208 137 111 258 63 -45 -23 89 -165 -102 38 -134 225
3110B25k50J8J46M0j15k32K07K97k64r7O2l3J05k09N46l93J63k30p2N4j4P7M0
$$ 225 -25 -7 139 179 64 -168 39 336 72 -25 37 4 109 -100 446 53 216 -14 -86 -32 -46 31 71
3133G1k73J03L1N7K4K0jJ64k4k6j55q9K87l05K59j31j03P3M47n85M9N7k58L62
$$ 71 -202 -99 -68 -11 13 33 32 196 172 146 -9 -98 189 -116 143 12 -91 -18 429 -156 -107 -50 -308 54
3157E4P6J61l26J7N1Q7m03J78L90k94J71j31k0j58l1O2k9L13m12L03k29l4K9K08
$$ 54 130 291 -35 -18 33 120 -283 -105 285 -9 162 31 11 -147 -178 -116 -145 168 -244 59 -170 -204 -175 33
3181C3j41k3O9J95l4k05J28J73o7l64J52n8K28l71J67nL10l02J59R9j8l63j0M77
$$ 33 -108 -131 -62 133 99 -106 22 195 128 -236 -84 -142 86 -285 -118 -123 187 -115 44 143 125 -238 -248 229
3205B29m8l09M02k73J75j14k11J79m3J29J9q9k7J48k63j08L30k47j75J27J77J13
$$ 229 181 -128 274 1 176 62 -149 30 -13 116 135 46 19 167 -96 -204 126 -121 -296 -169 8 121
3227A21K17k88j20L88j86K8l85L84J1J28j24j41Q4o3p1P6j4j28N5m4K49O7m60
$$ 121 338 50 -70 318 132 160 -225 159 170 298 174 33 117 54 -17 59 45 -83 -28 -72 177 244 -216
3250b16J75J89J2k64L10m8m20K27o6k0J91k94K90K2j52K34k36j02J35j64p2L87
$$ -216 -41 148 160 -104 206 158 -262 -35 -101 -121 70 -224 66 88 -64 170 -66 -168 -33 -197 -269 118
3272A18j74M1K70k95J40m8m9N7r6l33K32J20r6j8M2K93j75r0K3p1Q4L12l48K14
$$ 118 -56 -15 255 -40 100 52 3 60 -36 -369 -137 -17 -113 -131 -89 204 29 -61 -38 -109 -25 287 -61 153
3296A53l68K97J5k40J34J14J41k31j17j1Ok53K56o4K75j86Q8J52j8m45M18k14
$$ 153 -215 82 97 -143 -9 105 246 15 -102 -113 -107 -360 -104 -168 107 -79 9 161 143 -302 116 -98
3318i8J57j30N7L03k71L2r9J05K9m23M19Rj29p5M5J10n6J23J71l0l34K09j03o5
$$ -98 59 -71 -14 289 18 50 -49 56 85 -338 81 90 -39 -114 -69 41 -15 108 279 249 -85 124 21 -44
3342d4o9J32m4Q5j02J2O8m2n64L75K38j71K51j31o1mr3K8J30r4K08k9L8m0K4J00
$$ -44 -113 19 -25 60 -42 -30 38 -4 -568 -193 45 -126 125 -6 -67 -71 -164 -136 -6 -100 108 79 117 77 101 201
3368B01J6m8j25J30j57j7o5k03L11J08j46O1k46J04m8K07j99J50K3j3K2K32p7
$$ 201 217 169 44 174 17 0 -65 -268 43 151 5 66 -180 -76 -124 83 -116 34 57 44 66 298 221
3391B21N5l71j23K96P5k27R7k39J69o3R4K59l29M7N0j07K09o1l85L68M1j62J18
$$ 221 276 -95 -218 78 153 -74 23 -216 -47 -110 -16 243 -86 -39 11 -96 113 52 -333 35 76 -86 32
3414C2Kj11K61n19L03L6m23N83m6k00P0p6mR4j53M22k03N0Lo0l6K00k65K85k91
$$ 32 34 -77 184 -335 -32 4 -419 164 118 -82 -12 -88 -92 2 -151 271 68 118 121 61 25 225 -40 245 -46
3439d6k8K3j04r1J67rK24j09r6j12M92k33l0P6m4J4J35k71M03o53L03p3R3J80
$$ -46 -74 -51 -155 -246 -79 -88 136 27 -69 -181 311 78 48 124 80 94 229 -42 361 -292 11 -62 31 211
3463B11Q6o10J57J07j66m5K37J00n4J09r5O3k64J52r3J56J72k68l6M8J08j39K81
$$ 211 297 -313 -156 -49 -215 -260 -23 77 23 132 37 100 -164 -12 -105 51 223 -45 -81 -33 75 -64 217
3486B17l53pJ39r9J27L7K04l89J71K99j15J00m46J88n3k1J73M4k72p5K28m16M73
$$ 217 -136 -143 -4 -103 24 61 265 -124 47 346 231 331 -115 73 20 -1 172 216 -56 -131 97 -319 154
3509A54l35K82k53J21Ll5J47j10r6P0J62j13K5J24k05J35k97K99K27j93R2k40
$$ 154 -181 101 -152 -31 -28 -63 84 -26 -122 -52 110 -3 22 146 -59 76 -221 78 305 112 204 -36
3531c6J3N8M9j37q1N7q2K54o7l71L04q1R8k56L77j24K90n20L54m3j64R3P8k87
$$ -36 -23 35 84 -53 -134 -77 -159 95 28 -343 -39 -120 -22 -278 99 -25 265 -255 99 56 -108 -15 63 -224
3555b24J85O7o5n5J30Nk13K55p6N3l00L30o9j74J59K18j67l18K86j56J03l22J97
$$ -224 -39 28 -37 -92 38 43 -170 85 9 62 -238 92 23 -151 8 226 59 -259 27 -129 -26 -348 -151
3578a51J83j14l7N1K6K50j57q5k2j55J3L39j66R4M3k21K02q4j73J99j71o3p1j5
$$ -151 32 -82 -119 -68 -42 208 51 -34 -56 -211 -198 141 -25 69 112 -109 93 9 -164 35 -136 -199 -270 -285
3602b85J74r7p8J03M2J83k24L19J48m88K01J37L7l47K32q0P2J12j04j31k36J78
$$ -285 -111 -208 -286 -183 -141 42 -182 137 285 -203 -2 135 172 -175 57 -23 49 161 57 -74 -310 -132
3624a32J19j5J28o2J4J27k23K5j52K91%j03M7j6J55j68l15L38j23K76l50N7K74
$$ -132 -13 -28 100 38 52 179 -44 -19 -171 120 120 17 64 48 203 35 -280 58 -65 211 -139 -82 192
3647A92j59J4l82M2L18J40l46J99N1J02l28L42J64k21J5k5p8j26O7k4J84rk8k11
$$ 192 33 47 -335 -293 25 165 -181 18 69 171 -157 185 349 128 143 118 40 -86 -19 -43 141 132 104 -107
3671a07J44j08R5k90K39k02K31K74K8k54m4J00k79K87J30m36J38J99j34q3N0J87
$$ -107 37 -71 24 -266 -27 -229 2 276 304 50 6 106 -173 114 244 -192 -54 145 11 -72 -22 165
3693A65l87J99L0j3L43p2l81J83P5j75k29P1K04J67k31J34J23l27j8N0J45j43
$$ 165 -222 -23 7 -6 337 265 -116 67 142 -33 -262 -191 13 180 -51 83 206 -121 -139 -89 56 -87
3715h7M22j81k02J62L5J0K1N7k04Rj49K34r8nl6M6j9l22K29J2j58L90l02J02K09
$$ -87 335 154 -48 114 149 159 180 237 33 42 -107 127 29 24 -12 34 15 -307 -78 -66 -224 166 -136 -34 175
3740A75j79j52L27J02j98q8o0K22k2j41K12p5J6j30q9J68n4j94K10L0k45R6m9
$$ 175 -4 -156 171 273 75 -13 -73 149 127 -14 198 123 139 9 -80 88 34 -160 50 80 -165 -69 -118
3763a18K22j69LL36l58J15O9m02J87J40K4m4j02N7jQ8J30k35J99k44J63m5j35
$$ -118 104 -65 -62 274 -84 31 100 -302 -115 25 49 5 -97 -40 -41 47 177 -58 141 -103 60 15 -120
3786a20M83j29k74l1OK82j43j43J4O0ko2Nm0K66k04j55J95l39K64K62k61J15O0
$$ -120 363 234 -40 -71 -65 217 74 -69 -55 5 3 -59 -54 -94 172 -32 -187 8 -331 -67 195 -66 49 109
3810A09j64j4l2K10q1j46K69k9K07j57k46P8J39p3j80J83o1O2p1Rj54L30o37N68
$$ 109 -55 -69 -101 109 28 -118 151 122 329 172 -74 4 143 70 -110 73 12 74 3 12 -142 188 -449 119
3834A19n7J9l80L85R0j32J17l13O2k1M6lJ8JJ26r2P3j19J56O8k4P2P8m25J71j63
$$ 119 62 81 -299 86 176 44 161 -152 -90 -111 -65 -68 -50 -49 77 -15 58 -61 95 163 139 211 289 -136 35 -128
3860a28L7O8J60k12L86Ll78J8j61J19J84j84j23J62L44r1j35j76j31J89J98l0
$$ -128 -91 -23 137 -75 311 314 -64 -46 -207 -88 96 -88 -211 -49 295 204 69 -107 -238 -49 149 119
3882A19j47j64J51J0j79L59Pj31j22m5K39k83M18k14OL06k79J63l48O8R9l93M51
$$ 119 -28 -192 -41 -31 -210 149 156 25 -97 -142 97 -186 232 18 24 330 51 214 -134 -66 33 -360 91
3905I1n4J45Kj7j36l16L18J70P8j44k56J80k91K75k41J34k28J46N00n20M49k22
$$ 91 37 182 184 167 31 -285 33 203 281 137 -119 61 -230 45 -196 -62 -290 -144 356 -164 285 63
3927F3k34J56j02j67K08m1O7J62j99m1J69k4j90K63J09j30j82Q4K2J39j86k30
$$ 63 -171 -15 -117 -284 -76 -117 -50 112 -87 -128 41 17 -173 90 199 69 -113 -29 -7 132 -54 -284
3949b84K83J9j17l8L01k30L2j62L15m47J96M3J63j52L27L1l19k6L6K44j35K2n
$$ -284 -1 18 -99 -137 164 -66 -34 -196 119 -328 -132 -89 74 -78 249 280 -39 -65 -29 215 80 102 97
3972I7r5J57l32J60p3K33k90L63j30j17j47j28M76l53K07j00J96k74k0J82J08
$$ 97 2 159 -173 -13 -86 147 -143 220 90 -27 -174 -302 174 -179 28 -72 124 -150 -170 12 120
3993A20k35Q6m1K09j80J43Nm79K95J2J28O5k90J24q1P7J05q0R0O5j51k69M01j53
$$ 120 -115 -29 -70 139 -41 102 107 -372 -77 -65 63 128 -162 -38 -119 -42 63 -17 73 138 -13 -282 119 -34
4017c4O6J71l7l07P2o8P7Nj59L03j52k22R1K97j72n8K61j09J09j68J06Q9j38o8
$$ -34 32 203 166 -141 -69 -137 -60 -55 -214 89 -63 -285 -194 103 -69 -127 134 25 134 -34 72 161 23 -45
4041d5j42m3L73k63Q5J76j06J52l91K09j20o7J85J17J8J04j30J3K3l16Q0K61l15
$$ -45 -187 -230 143 -120 -35 141 35 187 -204 5 -115 -182 3 120 138 242 112 125 148 -168 -88 173 -142
4064a42n1J90j95m7K95O5l6r5J11m4k47K34M3p1k12L16N1l4j51J81O8k52k68K33
$$ -142 -193 -3 -198 -245 50 115 79 -16 95 51 -196 38 81 10 -202 114 165 131 -20 161 229 -23 -291 -58
4088e8j18J02J95k47O4M2J7r5J61N8R7l14N4K0P2j11mL95n56M89n22K18P0n1j51
$$ -58 -176 -74 121 -126 -62 -20 -3 -98 63 121 218 -96 -42 -22 50 -61 -65 330 -226 263 -259 -41 29 -22 -173
4113a73J62k84K77J26l03K32K7J65l23k16K38J30j83O5K25k58j05J64J0j3m5j24
$$ -173 -11 -295 -18 108 -195 37 64 229 -94 -310 -72 58 -125 -60 165 -93 -198 -34 -24 -37 -82 -206
4135b06K1K31q9m6k8K12m2k68O9N5p9K47K7j04J63M1k50R5o3J4J22j61p0N0J06
$$ -206 -185 46 -43 -89 -117 95 53 -215 -146 -91 -170 77 104 0 163 204 -46 49 -14 0 122 -39 -109 -59 47
4160D7j78K59k31J2k6J93N3k28K82j26j66nK55j28J47j62J30j45j62K32R5l2k05
$$ 47 -131 128 -103 -91 -117 76 129 -99 183 57 -109 -114 141 13 160 -2 128 -17 -179 53 148 116 -89
4183h9r8RK51q3q1j84L66oj55J65r6N4J67l39J13n5L3n8kJ9Nj07K71k73L44j15
$$ -89 -187 -178 73 -10 -91 -275 91 85 -70 95 -1 53 220 -119 -6 -61 -28 -86 -88 -69 -64 -171 100 -173 171 56
4209E6k42J14K32j99j29m4K46j10K7O6k2J4J6j58j31L31r0r2PJ87k53Lo1M14l80
$$ 56 -186 -72 160 -39 -168 -212 34 -76 -49 17 -5 9 25 -133 -264 67 -23 -115 -108 79 -174 -171 -232 182 -198
4234a98J50M7q0L9K77l49J21P7j48J53j5l45J07R6j8L31k40J1J28j37M4k2j24
$$ -198 -48 -1 -81 -42 235 -114 7 84 -64 89 74 -271 -164 -68 -86 245 5 16 144 7 51 29 -95
4257i5J42J13j22j34K42J10l01j2J81Q1l13Q1j05M28k98P9k53P5j34K5K17n6J08
$$ -95 47 160 38 -96 146 256 -45 -57 124 205 -108 -27 -132 296 -2 77 -176 -101 -235 -210 7 -49 59
4280E9l9j60K1J52k86O72l77L8J21l34J05o6K38k78L49k31R9L6k28J74J93l93
$$ 59 20 -140 -119 33 -253 419 42 80 201 -133 -28 -94 144 -134 215 -16 83 119 -109 65 258 -135
4302a35K12j68K51j01J18Jm51NJ65l6J49J36m3l87M03j28Q3M0l33K15M2n1L29
$$ -135 77 -91 160 59 177 178 -273 -268 -103 -139 10 146 103 -284 119 -9 74 114 -219 -4 38 -13 316
4325C16j73j49n6n8L21j55Q0J46m48O0J19M3j23J28J54j06l91L56n6m8J97k53
$$ 316 143 -6 -62 -120 201 46 126 272 -176 -116 3 46 -77 51 205 99 -292 64 8 -40 157 -96
4347i6J89o0K11ql58K40j68n9M68l75l9q7J08J60q0q3j35J26J39l5l0R9j29J62
$$ -96 93 33 244 236 -122 118 -50 -109 359 -16 -55 -142 -34 126 46 -37 -172 -46 93 58 28 127 -2 160
4371A60k28J52l3J5M4k29K01P6k51k9P0l1j3J0L24l30J57j69RJ72J93j86q5l1
$$ 160 -68 84 51 66 110 -119 82 158 -93 -122 -52 -83 -96 -86 238 -92 65 -104 -95 77 270 84 -1 -32
4395c2N4J79k00K34l85L38j98K0K04k85qo2K4L39j15j76k7J12j28J33k44J93j90
$$ -32 22 201 1 235 -150 188 -10 10 214 -71 -79 -141 -117 222 107 -69 -96 16 -112 21 -223 -30 -220
4418b20K46J16j64P3J28p1j17J59l85J16M3O3r6M6J54j81J04k22O8J69j86J7j35
$$ -220 26 142 -22 51 179 108 -9 150 -235 -119 -76 -13 -109 -63 91 -90 14 -208 -140 29 -157 -140 -275
4441b75L26K12k60m2n5K09j11r2R1K0k90L28J41j15j02j56K69J01j95k24M09k38
$$ -275 51 263 3 -39 -94 115 4 -88 3 23 -267 61 202 87 -15 -171 98 199 4 -220 189 -49
4463d9J48J38k10j35KJ44K12k42M5J97j81j14j77K5R8m26M24L61m18J08rK46l4
$$ -49 99 237 27 -108 -106 38 250 8 53 250 69 -45 -222 -197 -99 -525 -101 260 -158 -50 -59 187 153
4486A53j79M7R8L50n35J48r1l45L82j48k8K43j53o7M18j45k22J44r9J00Q3k88
$$ 153 -26 21 119 469 -66 82 -9 -354 28 -120 -148 95 -58 -125 293 148 -74 70 -29 71 154 -134
4508a34j7K91r2M6l6J08k71K1rk08M39j39Q7k09K70l76L44M8m22K59l62L68qJ38
$$ -134 -151 140 48 94 58 166 -105 -84 -93 -301 138 -1 86 -123 147 -229 115 163 -259 0 -362 6 -2 136
4532A36j23P3j03k17r9N13j28n7K7k00J78k02K90r1K26l01K11k22J96l6J37Lj
$$ 136 13 86 -17 -234 -333 180 52 -5 22 -178 0 -202 88 -3 223 -78 133 -89 107 71 208 211 210
4555B10j09l3j86N2N2j05K36O7j69J83l05K56p2j01K24j94k36L35l70N83kl88
$$ 210 101 68 -118 -66 -14 -119 117 184 15 198 -107 149 77 -24 200 6 -230 105 -265 318 316 -72
4577g2J79l63k0K16Q6j68K12l18j3J87J6J48L7j73K3J89j94j7j09q9L49j13L4
$$ -72 107 -256 -276 -60 26 -142 70 -248 -261 -74 -58 90 127 -46 -23 166 -28 -45 -154 -243 106 -7 27
4600B7m0N6L7J02l28K92j15j22J02lj14o8J34M3j01K69q0Q0k70L7J63r3J18no9
$$ 27 -13 43 80 182 -146 146 31 -91 11 8 -106 -174 -40 3 -98 171 91 171 -99 -62 101 8 126 121 52
4625E2M2k4j26K47m51J56N3k52J16J44J66l33M87J14m21J04J42n8K6j33L4j47
$$ 52 94 70 -56 191 -260 -104 -51 -303 -187 -43 123 -210 277 391 -30 74 216 158 184 51 85 -62
4647f2N7qk07K15J71l24J65J36k80K42jk60N71m42N4j4J66j41J75k07j91K3K53
$$ -62 -5 -13 -220 -5 166 -158 7 143 -137 105 104 -156 415 -27 27 13 179 38 213 6 -185 -162 91
4670I1n3k6J97l01J25J07j3k93N6oj97J76Q8P9m4K28k14K87j96J95m90J58K38
$$ 91 38 12 209 -92 33 140 127 -166 -110 -116 -313 -137 -49 30 -14 214 0 287 91 286 -204 -46 192
4693A92k78M5j50R3lk7J54N9M9j29j67L53j18k44P6J87rK3l9m8M8j02n5L15j26
$$ 192 -86 -41 -191 -98 -101 -128 26 85 134 5 -162 191 73 -171 -95 92 83 106 67 19 67 -35 -90 225 99
4718I9ml84M64k89J40j96M12k96J68k65K09kj09K39l15J51Q5N6n7K61m14J42K4
$$ 99 95 -289 175 -114 26 -170 242 -54 114 -151 58 56 -53 186 -129 22 107 163 106 367 -47 95 119
4741A19m4l70L59k17J55%P8q2m6r9M27n46J47J78j35K35k27k19L48k08K96j69
$$ 119 75 -295 64 -153 2 2 80 -2 -48 -147 280 -266 -119 59 -76 159 -68 -287 61 -147 149 -20
4763b0j01M7J3K84k10j22k60K17QM2J02Q1j80K06j83K33j61P9r4LP8K6R6k49j41
$$ -20 -121 -74 -61 223 13 -109 -369 -152 -144 -102 0 81 -99 107 -76 157 -4 75 -19 -16 62 88 184 -65 -206
4788b06J84O9j66K50n1q1j21Rk9J37J33K80m27k9j5k1J07N6m18L05j31q7K49j48
$$ -206 -22 47 -119 131 80 -1 -122 -113 -142 -5 128 408 -19 -48 -63 -84 23 79 -339 -34 -165 -252 -3 -151
4812a51l2J67R4q0Q0j26K0L3k3L01j28q4P7O4k31j22Q7J13Q6k61K63r4J04j46
$$ -151 -183 -16 78 -2 78 -48 -28 5 -18 283 155 71 148 212 -19 -141 -54 59 145 -116 147 53 157 11
4836A1N7O8j64%j8O9k70L78l29R5L82m79M02k52m5L09j71k51K12k5j38K25j6j95
$$ 11 68 136 -28 -28 -46 23 -247 131 -198 -103 279 -200 202 -50 -95 214 43 -208 4 -21 -159 66 50 -145
4860a45K04K18k32m5k8R2m6j3j13lJ51p8LJ36j66J72j90M5O6p7j79K77q5p1L86
$$ -145 59 277 45 0 -28 64 18 5 -108 -111 40 -38 -35 101 -65 107 -83 -38 28 -49 -228 49 -36 -107 279
4885B79l75J85j64j3O9L01O8l52j51M14j61l53K0L86k35k27J97r1K15l14N0L56
$$ 279 -96 89 -75 -88 -19 282 350 -2 -153 261 100 -253 -233 153 -82 -309 -112 -203 12 -302 -252 104
4907A04K24k22j32j8l5j97J83J6Q2N2P2j21j15Q8J47j21N26n45J52j24j58%K9
$$ 104 328 106 -26 -44 -79 -276 -93 -77 5 57 129 8 -107 -19 128 7 533 -12 140 16 -142 -142 -113
4930a13j97J61J22K17p1k8J49k74%k05N42m56M08k97J36J06q6J52o05M50j51j75
$$ -113 -310 -149 -27 190 119 91 240 -34 -34 -239 303 -153 255 -42 94 200 114 266 -339 111 -40 -215
4952b15J21J58L3J32k87oK98m05k0J89P7j03J49nj64J02KJ69r3q2K01o82L90K29
$$ -215 -94 64 97 229 -58 -64 234 -171 -191 -2 75 -28 121 116 -48 54 56 225 132 50 251 -431 -41 188
4976A88j21O7j05m3Q4k32M08j25n1n4m6J10J67j06k87nL9J22M6j69L6J81j34J45
$$ 188 67 134 29 -14 70 -162 246 121 70 16 -30 80 247 141 -146 -151 -112 10 56 -113 -77 104 -30 115
5000A15j79J39M2n5j13j37M0j43L33J00o1K4o4j34j63K51K83k62k77K28m3K16
$$ 115 -64 75 117 62 -51 -188 -148 -291 42 142 81 105 41 -93 -256 -5 278 16 -261 -33 -76 140
5022A40j85K9L39j83p6l3J32k4k13M4p3N7K76l4m0jR0J14n51J12R8k8J3K7Q9n4
$$ 140 -45 -16 323 140 64 31 163 139 -74 -30 -103 -46 230 196 156 155 245 359 -192 -80 18 -10 3 30 119 65
5048F5p2J24P7k77j27Q1N3R7O1k54K47j51J30j95J41o8K53l3k33J51j84m3N6r4
$$ 65 -7 117 194 -83 -210 -129 -76 21 82 -172 75 -76 54 -141 0 -68 185 152 -81 70 -114 -157 -101 -195
5072a95J14K75p0nr7l45K51k6J05j47J46j67J16J0k7j89N9J05J20j27k31Q5K44
$$ -195 -81 194 124 119 22 -323 -72 -98 7 -140 6 -161 -45 -35 -62 -251 -192 -87 33 -94 -325 -240 4
5095Dm8L5N2m6J51j32q3j49L17q4L31k38l55J65m3K61J65j84j16J29k22R1J81
$$ 4 -44 -9 43 -3 148 16 -67 -216 101 17 348 110 -245 -80 -123 138 303 119 3 132 -90 1 182
5118A82m6ok39J64R0j34L2j79J88M2k62J53K8j55l3R9q2K10o2j86J51k87J85J42
$$ 182 136 130 -109 55 145 11 43 -136 52 94 -168 -15 13 -142 -175 -76 -158 52 -10 -196 -45 -332 -147 -5
5142epM5j03k25J41p3O9n9L79k73j08L42r3j49K27L1l27J28l54N48k55K17k4Q1
$$ -5 -12 33 -70 -295 -154 -227 -158 -217 162 -111 -219 123 30 -119 108 139 -188 -60 -414 134 -121 96 72 153
5166A53r9P6l9l50L63k02j17L87Q0k87j86K44r7k0J62j97K44j10J49k97J78k60
$$ 153 54 130 91 -259 104 -98 -215 172 252 -35 -221 23 -74 -94 68 -129 115 5 154 -143 35 -225
5188b25M7K01o8j09Q9n7J96j8j41Lq3K1L8P2J16R9k77o7O2J42m15M04K7L0Q1q1
$$ -225 -178 23 -45 -154 -65 -122 74 56 -85 -82 -165 -144 -106 -34 82 181 -96 -163 -101 41 -374 30 57 87 168 87
5214H7j74J61N7j76M8k36L25J5l1p6J76j68Q3l92N08k63L15j94k05L04j54J14
$$ 87 -87 74 131 -45 3 -233 92 107 76 0 176 8 91 -301 207 -56 259 65 -140 164 10 124
5236A24j65M9j36K54O6k08p5R4m2l7m4K35m2q5r0N03m03pj56L27j75K7k35K86
$$ 124 -41 8 -128 126 192 -16 -91 3 -39 -76 -120 115 73 -12 -102 401 -2 -9 -165 162 -13 14 -221 65
5260F5n9j27k34L62O7l8K62l32LK79j87LR4j92J04j2j21J7L8j18J41K3r9O0k4
$$ 65 6 -121 -355 7 74 36 298 -34 -31 248 61 64 158 -34 70 58 -63 -46 -8 -126 15 38 -61 -1 -25
5285b5J30l3k18K50ml05O4R3K39l9j54N6j47J10K3L6j41L2J25k7Q3K26k86k10
$$ -25 105 72 -146 104 100 -205 -141 -48 191 152 -2 54 -93 17 40 76 -65 -33 92 65 148 374 88 -122
5309a22M07l14P5k98L24k4j0N8j58k00K71Q1j73R3J49J16l08R5j54K26j97j05
$$ -122 285 -29 46 -252 72 48 38 96 -62 -262 9 90 -83 10 159 275 -33 62 -92 134 -63 -168
5331a68K22L2k69R0J23J97k5Q8j66J42m7l45K35l8k58N7J41J10j45J50k63L57
$$ -168 54 86 -183 -93 30 227 202 290 124 266 219 -126 109 71 -187 -130 11 121 -24 126 -137 220
5353B20k40J34j24n3J97N8k45j93k2j56N48K47m46J73j31jj15K59k14K34k55R2
$$ 220 -20 114 -10 -63 134 192 -53 -246 -268 -424 124 371 -75 98 -33 -34 -149 110 -104 130 -125 -33
5375c3J31j3MJ62m23L29R5j99j01Jk40O4J96k27L92Nj71J82p6q2J26l28K81p2
$$ -33 98 85 89 251 -172 157 252 53 -48 -47 -287 -223 -27 -254 138 143 -28 154 78 -4 122 -206 75 3
5399CM5J00j88o2J09Q3J45l44oN13n09m0J15k24K36k58M07q6O1n9k04K59o8J47
$$ 3 48 148 -40 -102 7 90 235 -109 -115 398 -111 -151 -36 -260 -24 -282 125 39 100 41 -163 96 28 175
5423A75k48K54k00J74k90MK19j62L85k60K76l96J52j53K26k05J58Q1m72K98q1
$$ 175 -73 181 -19 155 -135 -131 88 -74 311 51 327 -69 83 -70 156 -49 109 190 -282 16 -65
5444f5K15k92K84N3l15K29J58l13J13k77M9K97k3k4k20L8J97k14Q3L45l63K17
$$ -65 150 -142 142 195 -120 109 267 -46 67 -210 -161 136 113 89 -131 -93 104 -110 -27 318 -45 172
5466A72j96M4j13J50j2j7r5P7k10kK03j84L63l38J39P3j78N35n41J28J4j38O9
$$ 172 -24 20 -93 57 45 28 -67 10 -200 -202 1 -183 180 -158 -19 54 -124 411 -130 -2 12 -126 -57
5489e7J63l7r6l6p0R2K30k99M07k63k61L00j64M14n40M23k68J78j01j12L1PL4
$$ -57 106 69 -27 -63 -133 -41 189 -110 297 34 -227 73 -91 323 -217 206 -62 116 15 -97 -66 -59 -25
5512b5O9J65l59Q5J19L8j5m3J96l60J22q1j5J70j63K40kJ9J13J1l89Q5m3J48R9
$$ -25 44 209 -150 -65 54 92 77 34 230 -130 -8 -89 -104 66 -97 143 141 160 273 284 -105 -20 -63 85 184
5537A84k9j07k85K96k1J66j16J42j82l0J19o5q6n1J66m2n0M2l5m8J05j4k59K68
$$ 184 155 48 -237 59 38 204 88 230 48 18 137 72 -14 -65 101 59 9 51 16 -32 73 59 -200 68
5561F8O1j84q1J79J41k28K07r8m8P2j23m4J7l7p0j56J39K05l5M7J3k3k28K42n1
$$ 68 129 -55 -136 43 184 -44 163 65 17 89 -34 -78 -61 -98 -168 -324 -185 20 -15 32 45 22 -206 36 -15
5586a5J54j94R8m4j28K00o5j62K58j0k14P4J32j58M8K01j09n4o3K28k22J71j28
$$ -15 139 -55 43 -1 -129 71 6 -156 102 92 -122 -48 84 -74 -26 175 66 12 -51 177 -45 126 -2
5609bl5k9P0k74M64j38M6J24k47j02n9n0M27n5r4m4j14J50l57K98K5J3j49l5K3
$$ -2 -37 -66 4 -270 194 56 102 226 -21 -123 -182 -232 195 140 46 2 -112 38 -319 -21 4 17 -132 -167 -144
5634a44Q7j52K87o0L7J75m19K61j33oj91N02Q2n03J29MO0k0l3K16k34K88q3J18
$$ -144 -57 -209 78 18 55 230 -189 72 -61 -67 -258 244 326 -177 -48 -44 16 -4 -37 179 -55 233 150 268
5658B68j04n4n6K04k03k07J07J12l2n5j10L21l72K10J06J58p8n25K54L52j13l70
$$ 268 164 110 54 258 55 -152 -45 67 35 -20 -130 191 -181 29 135 293 215 -310 -56 296 183 -187
5680a87J39poJ44k3j91l4p8J49j3K34j25R8p1N6j64J82m9K5r7J24j21N7J42k33
$$ -187 -48 -55 -61 83 60 -131 -165 -243 -94 -107 127 2 100 29 85 -79 103 54 79 -18 106 -15 42 184 -49
5705d9J96k48L1R6J69k98L57l16q9J93j42J22j79J68j82O6L8J51n1j4j05J69k52
$$ -49 147 -101 -70 26 195 -103 254 -62 -151 42 -100 22 -157 11 -171 -105 -67 84 33 19 -86 83 -169
5728a69N1J88J45o5n8k05K87j39l3m6j0K5J23Q9k81L07j22j11n2r8K2L40K7p9
$$ -169 -118 70 215 150 92 -113 174 35 2 -44 -54 -29 94 183 -98 209 87 -24 -76 -174 -152 188 215 136
5752A36k32K11J13k16j20K44l94J25L28n0j34R5K0l18N30k27j84J27j57L63j20
$$ 136 -96 115 228 12 -108 136 -258 -133 195 145 11 106 126 -192 338 111 -73 54 -103 260 140
5773A40j96O4Rj7j3J17o5mj56K94j88J53o2J3K5J66n22M18j90j03j96M70j12n03
$$ 140 -56 8 17 0 -13 104 39 35 -121 173 -15 138 76 89 114 280 -242 176 -14 -117 -313 157 45 -458
5797d58K92R1K24j13q0K64j87q5JM5k5K44j19j6K19n33K78J23nk25mk96M47j46
$$ -458 -166 -75 149 36 -44 220 33 -52 -51 -6 -31 213 94 78 297 -236 42 165 160 -65 -69 -365 82 -64
5821f4J33j38r0M01l52n1J43K69k74J91m39K95n4J65k46M7L1J03j35L20l4k93
$$ -64 69 -69 -159 242 -110 -161 -18 251 -23 168 -271 24 -30 135 -111 -64 -33 70 -65 255 221 -72
5843g2K68k04J44j53m7P1O7J89o42K83MN7P1j81o9J10j0N3J22K4r3N0j71m2K85
$$ -72 196 -8 136 -17 -64 7 74 263 -379 -96 -92 -35 36 -145 -214 -104 -114 -61 61 85 -8 42 -129 -171 114
5868A14k57n6K39k47O3J42J44j19j87J25K72j01J3o1j91J65K10k98j10J97j04
$$ 114 -143 -199 40 -207 -144 -2 142 23 -164 -39 233 132 145 84 -107 58 268 -30 -140 57 -47
5889d7J40p8J94l49n4J08L9O4K0Q0j15q3K08l05L73j67j17K59j20J25j07j55j4
$$ -47 93 15 209 -140 -194 -86 -47 17 37 117 2 -81 127 -178 195 28 -89 170 50 175 68 -87 -101
5912a01L04k22J61J30m80J7K7J49j28J93j07J37l94L94j21J62L4k98K45j54J2
$$ -101 203 -19 142 272 -208 -191 -164 -15 -143 50 -57 80 -314 80 -41 121 155 -143 102 -52 -40
5933d0K55jl53L7J23qK9O3k16k0J53q6k18L09j85M09l15q6J65N5J1o9j94J82J54
$$ -40 215 214 -139 -102 21 13 42 105 -111 -131 22 -64 -282 27 -158 251 -64 -150 15 70 81 12 -182 0 154
5958A54k39R9j29J48k7J2k36L31J32Nk88N3K7K1M4P4o9n8q6K46L0l20J31p9J95
$$ 154 -85 14 -115 33 6 18 -218 113 245 250 -38 15 42 63 107 181 112 54 -32 214 244 -76 55 -24 171
5983A71j20j71K6L0J28o7J07j92J12r7M9J40m72N00k23J40j83K85Kl87J71K48
$$ 171 51 -120 -94 -64 64 -3 104 -88 24 -73 -24 116 -356 144 -79 61 -122 163 165 -222 -51 197
6005A97j79J45l96K14M6J22L4j32k22J50J47J3l37R2q6K52J7Jk12Q6O7L6j29k71
$$ 197 18 163 -233 -19 27 149 183 51 -171 -21 126 139 -198 -106 -192 60 77 78 -134 -48 19 55 -74 -345
6029c45M33K2j36q0K43l9j23J9J20m61L15j82P9k9J90k39L2J07J36k28K22J98
$$ -345 88 110 -26 -106 137 98 -25 -6 114 -347 -32 -214 -135 -164 26 -213 -181 -74 62 -166 56 254
6051B54r1l46K48j03l51L86J16j55J25K26k81J53l90L0L44J90l20j6j06Q9r6N4
$$ 254 163 -183 65 -38 -389 -3 113 -42 83 309 28 181 -209 -179 165 355 35 19 -87 2 -94 -40
$$ [...]
8191b47
##END NTUPLES=NMR FID
##END=
