##TITLE=1H_Pr NCS-Me
 200.13MHz, CDCl3,
 8 sc
 
 29.8.2025
##JCAMPDX= 6.0         $$ Bruker NMR JCAMP-DX V2.0
##DATA TYPE= NMR FID
##DATA CLASS= NTUPLES
##ORIGIN= UXNMR, Bruker Analytische Messtechnik GmbH
##OWNER= pz
$$ XWIN-NMR		Version 3.5
$$ Fri Aug 29 13:48:30 2025 Russian Standard Time (UT+4h)  she@DPX200
##.OBSERVE FREQUENCY= 200.1313
##.OBSERVE NUCLEUS= ^1H
##.DELAY= (6, 6)
##.ACQUISITION MODE= SIMULTANEOUS
##.ACQUISITION SCHEME= undefined
##.AVERAGES= 8
##.DIGITISER RES= 18
##SPECTROMETER/DATA SYSTEM= spect
##.PULSE SEQUENCE= zg30
##.SOLVENT NAME= CDCl3
##.SHIFT REFERENCE= (INTERNAL, CDCl3, 0, 14.3821)
##AUDIT TRAIL= $$ (NUMBER, WHEN, WHO, WHERE, WHAT)
$$ ##TITLE= Audit trail, XWIN-NMR		Version 3.5
$$ ##JCAMPDX= 5.01
$$ ##ORIGIN= Bruker BioSpin GmbH
$$ ##OWNER= she
$$ F:/spectra/data/she/nmr/H-C/1/audita.txt
$$ ##AUDIT TRAIL=  $$ (NUMBER, WHEN, WHO, WHERE, WHAT)
(   1,<2025-08-29 13:47:21.56 +0400>,<she>,<DPX200>,
      <created by zg, POWCHK disabled, PULCHK disabled
       configuration hash MD5:
       00 E9 B6 7A A2 85 ED C7 34 08 36 98 17 FE 4E 26
       data hash MD5: 16K
       80 08 BA CD 41 F8 7F 45 A3 C1 11 0D A1 2D 07 7A>)
$$ ##END=
$$ 
$$ hash MD5
$$ FF B1 53 03 04 69 1D 5F FC 7C 96 04 1D 52 02 CF
##$RELAX= 
##$RELAX= 
##$RELAX= 
##$RELAX= 
##$RELAX= 
##$RELAX= 
$$ Bruker specific parameters
$$ --------------------------
##$DU= <F:/spectra>
##$EXPNO= 1
##$NAME= <H-C>
##$PROCNO= 1
##$TYPE= <nmr>
##$USER= <she>
##$AMP= (0..31)
100 100 100 100 100 100 100 100 100 100 100 100 100 100 100 100 100 100 
100 100 100 100 100 100 100 100 100 100 100 100 100 100 
##$AQSEQ= 0
##$AQ_mod= 1
##$AUNM= <au_zg>
##$AUTOPOS= <>
##$BF1= 200.13
##$BF2= 200.13
##$BF3= 200.13
##$BF4= 200.13
##$BF5= 200.13
##$BF6= 200.13
##$BF7= 200.13
##$BF8= 200.13
##$BYTORDA= 1
##$CFDGTYP= 0
##$CFRGTYP= 5
##$CHEMSTR= <none>
##$CNST= (0..31)
1 1 145 1 1 1 1 1 1 1 1 1 1 1 1 1 1 1 1 1 1 1 1 1 1 1 1 1 1 1 1 1 
##$CPDPRG= <>
##$CPDPRG1= <>
##$CPDPRG2= <>
##$CPDPRG3= <>
##$CPDPRG4= <mlev>
##$CPDPRG5= <mlev>
##$CPDPRG6= <mlev>
##$CPDPRG7= <mlev>
##$CPDPRG8= <mlev>
##$CPDPRGB= <>
##$CPDPRGT= <>
##$D= (0..31)
0 0.7 0 0 0 0 0 0 0 0 0 0.03 0 0 0 0 0 0 0 0 0 0 0 0 0 0 0 0 0 0 0 0 
##$DATE= 1756460841
##$DBL= (0..7)
120 120 120 120 120 120 120 120 
##$DBP= (0..7)
150 150 150 150 150 150 150 150 
##$DBP07= 0
##$DBPNAM0= <>
##$DBPNAM1= <>
##$DBPNAM2= <>
##$DBPNAM3= <>
##$DBPNAM4= <>
##$DBPNAM5= <>
##$DBPNAM6= <>
##$DBPNAM7= <>
##$DBPOAL= (0..7)
0.5 0.5 0.5 0.5 0.5 0.5 0.5 0.5 
##$DBPOFFS= (0..7)
0 0 0 0 0 0 0 0 
##$DE= 6
##$DECBNUC= <off>
##$DECIM= 32
##$DECNUC= <off>
##$DECSTAT= 4
##$DIGMOD= 1
##$DIGTYP= 9
##$DL= (0..7)
0 120 120 120 120 120 120 120 
##$DP= (0..7)
150 150 150 150 150 150 150 150 
##$DP07= 0
##$DPNAME0= <>
##$DPNAME1= <>
##$DPNAME2= <>
##$DPNAME3= <>
##$DPNAME4= <>
##$DPNAME5= <>
##$DPNAME6= <>
##$DPNAME7= <>
##$DPOAL= (0..7)
0.5 0.5 0.5 0.5 0.5 0.5 0.5 0.5 
##$DPOFFS= (0..7)
0 0 0 0 0 0 0 0 
##$DQDMODE= 0
##$DR= 18
##$DS= 0
##$DSLIST= <SSSSSSSSSSSSSSS>
$$ [...]
##$SUBNAM0= <"">
##$SUBNAM1= <"">
##$SUBNAM2= <"">
##$SUBNAM3= <"">
##$SUBNAM4= <"">
##$SUBNAM5= <"">
##$SUBNAM6= <"">
##$SUBNAM7= <"">
##$SUBNAM8= <"">
##$SUBNAM9= <"">
##$SW= 18.0517328524113
##$SWIBOX= (0..15)
0 0 2 0 0 0 0 0 0 0 0 0 0 0 0 0 
##$SW_h= 3612.71676300578
##$TD= 16384
##$TD0= 1
##$TE= 0
##$TE2= 300
##$TE3= 300
##$TEG= 300
##$TL= (0..7)
0 120 120 120 120 120 120 120 
##$TP= (0..7)
150 150 150 150 150 150 150 150 
##$TP07= 0
##$TPNAME0= <>
##$TPNAME1= <>
##$TPNAME2= <>
##$TPNAME3= <>
##$TPNAME4= <>
##$TPNAME5= <>
##$TPNAME6= <>
##$TPNAME7= <>
##$TPOAL= (0..7)
0.5 0.5 0.5 0.5 0.5 0.5 0.5 0.5 
##$TPOFFS= (0..7)
0 0 0 0 0 0 0 0 
##$TUNHIN= 0
##$TUNHOUT= 0
##$TUNXOUT= 0
##$USERA1= <user>
##$USERA2= <user>
##$USERA3= <user>
##$USERA4= <user>
##$USERA5= <user>
##$V9= 5
##$VALIST= <valist>
##$VCLIST= <CCCCCCCCCCCCCCC>
##$VD= 0
##$VDLIST= <DDDDDDDDDDDDDDD>
##$VPLIST= <PPPPPPPPPPPPPPP>
##$VTLIST= <TTTTTTTTTTTTTTT>
##$WBST= 1024
##$WBSW= 4
##$XGAIN= (0..3)
0 0 0 0 
##$XL= 0
##$YL= 0
##$YMAX_a= 269029
##$YMIN_a= -273786
##$ZGOPTNS= <>
##$ZL1= 120
##$ZL2= 120
##$ZL3= 120
##$ZL4= 120
##$ABSF1= 10
##$ABSF2= 0
##$ABSG= 5
##$ABSL= 3
##$ALPHA= 0
##$AQORDER= 0
##$ASSFAC= 0
##$ASSFACI= 0
##$ASSFACX= 0
##$ASSWID= 0
##$AUNMP= <proc_1d>
##$AZFE= 0.1
##$AZFW= 0.1
##$BCFW= 1
##$BC_mod= 2
##$BYTORDP= 1
##$COROFFS= 0
##$CY= -3
##$DATMOD= 1
##$DC= 2
##$DFILT= <>
##$DTYPP= 0
##$F1P= 0
##$F2P= 0
##$FCOR= 0.5
##$FTSIZE= 0
##$FT_mod= 4
##$GAMMA= 1
##$GB= 0.15
##$INTBC= 1
##$INTSCL= 1
##$ISEN= 128
##$LB= 0.25
##$LEV0= 0
##$LPBIN= 0
##$MAXI= 10000
##$MC2= 0
##$MEAN= 0
##$ME_mod= 0
##$MI= 1.114404
##$NCOEF= 0
##$NC_proc= 0
##$NLEV= 6
##$NOISF1= 3.799351
##$NOISF2= 2.8
##$NSP= 1
##$NTH_PI= 0
##$NZP= 0
##$OFFSET= 14.38212
##$PC= 1
##$PHC0= -1565.364
##$PHC1= 20.39228
##$PH_mod= 1
##$PKNL= yes
##$PPARMOD= 0
##$PSCAL= 0
##$PSIGN= 0
##$REVERSE= no
##$SF= 200.129724274929
##$SI= 16384
##$SIGF1= 3
##$SIGF2= 2
##$SINO= 400
##$SIOLD= 16384
##$SREGLST= <1H.CDCl3>
##$SSB= 0
##$STSI= 0
##$STSR= 0
##$SW_p= 3205.1282051282
##$SYMM= 0
##$S_DEV= 0
##$TDeff= 0
##$TDoff= 0
##$TI= <>
##$TILT= no
##$TM1= 0
##$TM2= 0
##$TOPLEV= 0
##$USERP1= <user>
##$USERP2= <user>
##$USERP3= <user>
##$USERP4= <user>
##$USERP5= <user>
##$WDW= 1
##$XDIM= 8192
##$YMAX_p= 0
##$YMIN_p= 0
$$ End of Bruker specific parameters
$$ ---------------------------------
##NTUPLES= NMR FID
##VAR_NAME=  TIME,          FID/REAL,        FID/IMAG
##SYMBOL=    X,             R,               I
##VAR_TYPE=  INDEPENDENT,   DEPENDENT,       DEPENDENT
##VAR_FORM=  AFFN,          ASDF,            ASDF
##VAR_DIM=   8192,          8192,            8192
##UNITS=     SECONDS,       ARBITRARY UNITS, ARBITRARY UNITS
##FACTOR=    0.0002768,     1,               1
##FIRST=     0,             0,               0
##LAST=      2.2672688,     0,               0
##MIN=       0,             -273786,         0
##MAX=       2.2672688,     269029,          0
$$ Real data points
##PAGE= N=1
##DATA TABLE= (X++(R..R)), XYDATA
0 0 0 0 0 0 0 0 0 0 0 0 0 0 0 0 0 -8 8 -8 8 -8 8 -15 16 -16 21 -24 29 -32 37 -41 48 -55 63 -70 79 -88 99
37 99 -110 123 -138 152 -170 187 -206 228 -252 279 -304 337 -370 409 -451 498 -549 607 -673 751
57 751 -840 945 -1070 1223 -1417 1664 -2001 2482 -3216 4475 -7040 14322 -80039 -273786
71 -273786 -15352 226577 91060 -139825 -97852 47895 66576 23183 16519 -38225 -92152
82 -92152 4710 143458 56353 -149198 -125101 102284 150753 -42262 -144493 -21124 91442
93 91442 51191 -24644 -40792 -30313 6993 65028 48708 -54412 -79331 29377 88295 2578
105 2578 -66074 -16448 28460 152 -5741 24717 -8756 -62643 -7717 80303 30164 -81626
117 -81626 -50811 67555 61056 -40835 -42840 32772 22504 -31958 5333 53189 -17918 -81414
129 -81414 10547 100308 6403 -110729 -38757 89923 53478 -61059 -54343 26248 32345 -4000
141 -4000 4060 7428 -28558 -18728 48702 46704 -41745 -62612 25583 66565 -5500 -57028 -12918
154 -12918 30213 9146 -11949 -2054 -7394 -17486 12467 34899 -8546 -43491 4069 49605
166 49605 7173 -39357 -3643 35191 -45 -29726 9318 31705 -16739 -41419 11814 40801
178 40801 -10272 -42437 475 30030 -2035 -18030 11812 11215 -24136 -8438 43451 24279
190 24279 -45853 -36485 42811 50125 -27093 -52864 6507 40710 4503 -25128 -14057 -2207
202 -2207 3051 18380 12780 -26661 -33799 20805 51830 754 -50823 -16356 43779 32805 -20304
215 -20304 -30731 -158 17294 12626 2146 -16569 -26130 1519 33659 10963 -36987 -26674
227 -26674 27351 33367 -13245 -30142 4020 24269 6946 -6729 -3105 -2718 -1919 11421 12810
240 12810 -12310 -23181 3985 24057 -714 -26229 -8338 17218 7463 -12221 -4115 8542
252 8542 26 -5988 7458 10741 -6121 -8772 9160 11374 -7976 -10689 7194 8665 -9236 -9527
266 -9527 5632 3851 -9328 -5283 8895 3233 -11135 -3455 13229 6688 -9798 -4518 11421
279 11421 7609 -5855 -3185 5858 -335 -5990 2461 6232 -6802 -11336 3536 9247 -5818 -12021
293 -12021 3689 11645 -2108 -9796 1478 10213 2618 -3276 873 2699 -737 1190 5930 -1160
307 -1160 -9857 -2353 9509 2998 -12071 -8899 6433 6654 -5235 -6145 2586 4149 -561 509 2766
322 2766 121 -78 5661 4186 -5106 -5949 4680 7351 -3458 -9200 -1485 5340 73 -5671 -2769
337 -2769 1161 212 -167 1672 576 -2225 1047 5815 2419 -3297 21 5925 1763 -5432 -3131 3857
353 3857 2387 -3683 -4387 -1457 -309 -232 791 -670 -3112 -1188 4125 4287 -1490 -3205 2549 5660
369 5660 1771 -2803 -494 2029 716 -1221 -907 -1488 -3087 -779 1950 -960 -5863 -2555 4539 4565
385 4565 -1550 -4706 -174 4816 5163 1804 -2666 -2962 1187 5312 2740 -4107 -6842 -1239 5244 3033
401 3033 -4991 -7880 -1787 5284 4827 -2071 -6554 -2229 7022 8178 -947 -7856 -1203 8724 7491
416 7491 -3017 -8217 -2848 4603 5910 -425 -8163 -8296 1351 9016 4032 -8752 -11022 2562 13843
431 13843 6047 -9226 -9802 4741 13063 4321 -6965 -7075 721 6243 4546 -2474 -8279 -5615 4442
446 4442 8257 -1188 -12218 -7673 7829 12967 -101 -12924 -6491 10113 13251 -587 -10440 -4597
460 -4597 6435 8259 1200 -5758 -7043 -2319 5566 6979 -2043 -12169 -8149 8243 13512 -1829
474 -1829 -14823 -4876 13385 11791 -4946 -10558 513 8740 4830 -1585 -3730 -4445 -1873 5120
488 5120 7283 -3631 -14873 -6068 13503 12395 -9222 -18481 -103 18091 9243 -9990 -11393
501 -11393 2951 10456 5663 -1498 -5596 -5703 898 9065 6173 -8435 -14832 -459 15225 7616
515 7616 -13606 -16279 4865 18598 4766 -14207 -10470 7812 13565 2216 -7536 -5588 1352
528 1352 5086 5584 922 -8587 -10525 3295 14922 4044 -16976 -14500 9860 18632 -1548 -17442
542 -17442 -5534 12793 10221 -3298 -6408 -205 2555 2824 4874 1109 -8636 -8872 6725 13683
556 13683 -2105 -18198 -7281 14255 12921 -8299 -15885 -425 12909 7785 -4198 -7546 -1666
569 -1666 4471 7398 4021 -4365 -9097 -2087 9624 8672 -6726 -15030 -2296 13790 8666 -10148
583 -10148 -14403 2015 14119 5404 -8998 -8132 4170 8826 3219 -3049 -3834 -2174 2371 6753
597 6753 2637 -8445 -10273 3725 12785 1283 -14018 -8962 8359 10887 -2856 -9857 -1527 6642
611 6642 4250 -704 -1279 -838 -420 1911 4720 751 -6156 -4228 3844 5386 -2804 -7482 -1788 5016
627 5016 2851 -3027 -4233 -74 3386 2835 370 -1368 -816 580 2606 3361 392 -3604 -3129 1957
643 1957 4244 -681 -5842 -3779 2931 4036 -1251 -5209 -1728 2913 3026 85 -1157 -797 700 2358
659 2358 2834 -147 -3646 -981 4253 2832 -3641 -5368 -17 4349 1167 -4046 -4050 416 3011 1545
675 1545 -1005 -1819 -296 2348 3046 713 -1815 -1601 1598 2909 254 -2559 -1882 287 487 -551
691 -551 -1513 -1587 -398 759 29 -888 -1008 654 1321 1289 350 -207 29 1108 1747 478 -1124 -1907 -199
710 -199 1272 274 -2120 -2345 -363 1320 683 -1152 -1776 6 1569 1984 545 -944 36 2117 1872
727 1872 -131 -1174 58 1436 533 -1422 -1995 -532 870 558 -1365 -1958 -344 1565 1104 -710
743 -710 -1036 130 2032 1869 -374 -995 285 1635 1105 -512 -1361 -517 168 -248 -1199 -1279 -64 816
761 816 -454 -987 -906 580 1247 712 -209 -200 1045 1514 811 -624 -646 358 1031 248 -1287 -1079 -276 -247
781 -247 -536 -887 -680 -13 94 -467 -275 858 785 857 447 -251 92 952 763 -100 -790 -528 116 105 -551
802 -551 -1133 -673 -427 -162 -384 -130 40 166 -6 421 649 594 905 474 86 -43 239 866 -41 -839 -1096
823 -1096 -544 -103 -339 -495 -694 -597 -267 124 162 292 158 484 981 640 132 -105 271 634 34 -136 -70
844 -70 -427 -231 -607 -715 -844 -320 730 439 -905 -952 462 1480 837 -461 -258 549 1120 884 260
863 260 -537 -883 320 995 -255 -1737 -1472 352 557 -371 -1214 -533 740 600 384 17 -9 646 1727
882 1727 1115 -849 -1090 851 1605 -88 -1734 -1256 -97 87 198 -348 -1326 -1501 444 1676 302
899 302 -1973 -960 2156 2491 -454 -1189 650 1407 54 -151 42 -487 -1169 232 968 -690 -2274
916 -2274 -1068 2109 1233 -1849 -2050 762 2526 1138 -928 -825 658 1463 1038 68 -1343 -1124 527
933 527 1178 -73 -1777 -1983 -441 944 782 -854 -2201 -432 2500 1837 -1504 -1634 1910 3002 -34
950 -34 -2442 -259 1486 504 -785 40 -57 -1960 -1168 2138 1699 -3001 -3736 2036 4652 -457 -4274
967 -4274 -494 3975 1626 -1412 -509 1605 105 -867 567 1423 -1224 -2637 401 1999 -776 -3524
983 -3524 -1077 2570 1830 -1881 -2178 415 2409 1399 -637 -990 538 1430 1410 -203 -574 -465 -213
1000 -213 248 943 5 -2560 -2072 1549 2964 -1163 -4074 7 3990 1423 -3077 -1274 3033 2018
1016 2018 -1506 -654 2118 77 -1933 81 2510 -625 -4372 -902 3888 1118 -4519 -2942 3166
1031 3166 3196 -2021 -2193 1153 2088 -178 -162 1328 355 -1417 -342 2104 1081 -2362 -1810 1082 1399
1048 1399 -904 -2346 -600 920 1108 9 -1173 -255 1489 1653 -218 -1128 603 1313 517 -110 546
1065 546 -7 -1775 -442 1875 664 -3029 -2702 1970 2628 -1396 -3007 745 2833 -296 -1709 668
1081 668 1926 -549 -1005 1665 1418 -1691 -1854 1876 2051 -2181 -2944 951 2185 -536 -2515 74
1097 74 1447 -93 -773 149 332 -599 62 1764 674 -1372 -685 1390 778 -846 -883 177 -268 -343
1115 -343 -9 -125 -1101 -667 1416 836 -1127 -956 1452 1041 -938 -524 1250 1219 -708 -110 956 -85
1133 -85 -1446 61 1536 -298 -2411 -686 1565 516 -1632 -418 1332 190 -1164 398 1454
1148 1454 -161 -1063 988 1867 -299 -1416 461 1417 -650 -1600 211 982 -749 -1202 276 633 -735
1165 -735 -364 1233 841 -1243 -582 1420 1289 -656 -705 696 760 -891 -343 730 -371 -1112 -225 1181
1183 1181 -372 -1933 -292 984 53 -683 569 1224 79 -616 685 1318 -263 -710 719 655 -1291
1200 -1291 -615 1044 607 -1355 -1315 492 611 -1046 -642 823 239 -889 276 1355 311 -1015 173
1217 173 1017 465 -824 -254 1063 -210 -1603 38 562 -543 -1062 -182 615 -325 -712 404 1127 -286
1235 -286 -794 770 1024 -97 -165 944 794 -448 -261 759 161 -997 -781 704 389 -894 -649 422
1253 422 88 -662 347 656 42 -558 65 1066 501 -546 295 752 -230 -703 243 470 -588 -962 372
1272 372 343 -662 -746 364 396 -489 -63 1064 634 -231 -422 818 605 -228 -132 704 103 -891 -220 423
1292 423 282 -853 -725 318 -143 -469 115 511 135 -380 449 874 310 -64 321 939 205 -149 247
1311 247 209 -473 -734 -159 -53 -337 -727 73 -114 -288 90 523 154 -316 9 419 372 184 -9 219 -254
1332 -254 -216 143 102 -269 -634 141 142 -504 -978 84 441 -165 -360 318 425 188 120 282 425 28 164
1353 164 700 299 -205 -392 -136 227 -197 -580 -359 -166 -191 -52 -178 -179 -19 337 682 331 -56 175 251
1374 251 141 411 96 119 -268 -207 -167 -206 -293 -84 138 -205 -318 -139 255 544 124 -245 73 262 566 317
1396 317 10 -19 -9 143 292 98 -366 -791 102 69 -317 -273 -125 108 311 -227 -87 83 551 260 -162
1417 -162 67 201 308 -179 -161 -62 -514 -479 -64 11 -405 -902 -405 395 264 -638 -294 247 589 393 -144
1438 -144 -71 242 386 -106 157 391 90 -152 74 304 -368 -604 -395 620 421 -709 -367 588 485 13
1458 13 -455 64 729 425 -95 166 422 -161 -256 -231 420 -370 -809 -268 659 112 -1165 -152 359 483
1478 483 -224 -316 404 620 -322 -34 444 677 115 -142 579 99 -418 -505 310 446 -335 -669 -175 502 446
1499 446 -789 -515 398 794 -20 -73 430 89 -108 -72 378 288 -87 -424 -66 601 257 -1188 -310 488
1519 488 149 -793 -330 692 587 -293 -373 546 733 43 55 502 633 -302 -365 410 451 -584 -917 75 496
1540 496 -187 -1019 -275 472 -17 -402 176 468 207 -66 315 506 189 -387 309 523 -291 -343 -146 -21
1560 -21 -229 -612 -384 -233 -73 -60 -272 -668 44 439 530 -78 -8 410 222 -215 -23 237 -471 -623 46
1581 46 486 -360 -658 -83 314 -273 -250 46 676 195 -282 49 430 -65 -267 442 430 -40 -349 308 689
1602 689 -131 -758 -242 17 -244 -322 -324 -192 -193 -184 244 541 -132 -227 637 352 -31 -71 110 253 -22 84 182
1625 182 -81 -161 -22 86 -177 -378 -147 305 44 -365 175 437 158 -171 276 69 -81 -152 225 -17 -327
1646 -327 -135 249 181 -95 -511 210 -29 -465 -166 172 -29 -424 -60 591 333 -302 -127 453 91 -162
1666 -162 19 328 160 -568 -147 -64 -92 -232 -114 -61 -364 -399 225 242 63 9 93 469 106 96 158 570 -104
1689 -104 20 -64 239 -459 -148 65 -164 -481 -152 428 -10 -461 54 352 -122 38 263 452 -103 -135 236
1710 236 302 -268 -660 38 428 -167 -278 -210 -18 -329 -323 -20 379 -326 -180 -159 157 -266 58 448 284 -180
1732 -180 14 533 54 -346 -245 120 52 -229 127 343 48 -471 -70 177 -151 11 212 273 63 -337 413
1753 413 317 -102 -241 149 124 -190 -98 -23 -80 -427 -8 91 93 -560 -222 73 391 -133 154 20 152 110 205
1776 205 241 -61 -178 -8 288 142 95 48 302 -338 -447 104 36 -395 -191 77 35 21 -132 319 100 145
1798 145 80 388 371 -325 -186 120 162 -172 -155 71 -76 96 -124 -158 221 -183 86 158 -137 -102 147 138 346
1821 346 -100 102 -51 -292 -142 339 52 -169 -371 9 44 -382 -56 86 159 -113 -94 334 288 45 132 260
1843 260 243 146 77 350 -39 -199 -17 91 -157 -526 -95 32 -81 -475 -72 95 -263 -97 78 346 395
1864 395 -96 555 448 31 -106 -149 -24 -239 -301 -196 -135 -151 39 213 -73 18 -237 -241 12 -260 136 53 146
1887 146 -54 -29 251 167 -170 0 56 -349 -425 168 -115 17 -496 -244 152 215 5 -1 260 219 -339 48 254
1910 254 61 380 30 37 -144 94 28 261 -25 -333 -214 -79 -17 -79 -108 163 -3 141 -137 -64 137 183 -81
1933 -81 373 29 -74 -92 -33 103 2 -382 -366 -326 114 24 -227 72 407 -54 -110 -83 320 290 63 -16 155
1956 155 50 -222 -40 92 -60 -436 -426 23 202 -365 -472 -28 115 -131 -104 175 133 124 99 135 236 37
1978 37 24 -312 -82 24 52 41 55 -7 -131 -425 231 -238 -186 -104 223 60 -196 43 216 422 103 -15 291
2001 291 232 -2 -9 -45 -208 -144 -156 -329 -41 -64 -335 -176 226 -45 34 114 221 443 194 -28 -38 96 94 -194
2025 -194 27 61 -17 -242 -198 202 111 -275 -606 -284 -58 -197 -113 63 205 102 -24 153 397 -230 -207 48
2047 48 233 94 -108 -124 233 -243 -275 42 12 182 -490 122 298 -170 196 -10 -59 127 95 14 120 -29
2069 -29 -238 252 75 76 74 -49 -229 -175 396 -274 -302 326 170 212 15 77 81 39 -83 158 159 49 -209 326 -24
2094 -24 -187 -281 -15 186 -328 -240 -218 -178 -242 -497 492 53 -95 -149 41 438 154 -238 211 366 185 -599
2116 -599 88 153 -314 55 44 -112 -90 -79 13 -83 -62 -281 59 78 14 57 87 18 185 -26 -11 -12 -37 -159 71
2141 71 -50 110 349 4 28 -96 -87 58 128 -164 93 245 -156 116 157 -223 147 207 47 -153 4 -51 132
2164 132 97 -171 -217 -61 -175 -99 4 152 205 -44 53 184 -13 -18 131 33 135 -62 -182 182 -56 -128 -92
2187 -92 -63 -33 -50 -87 57 -225 219 75 -173 -372 106 -71 130 161 -77 178 40 -215 -25 206 -74 -243
2209 -243 90 299 61 -366 14 -72 -76 -202 -182 131 -78 -262 122 179 -32 204 100 192 -70 -263 -55 -36
2231 -36 -4 1 -75 260 81 46 1 -124 -171 -140 -26 -149 -118 311 268 174 114 102 189 37 298 -118 148 26 140
2256 140 25 -14 -414 -28 -20 184 -63 -59 119 283 53 92 217 307 90 55 233 -5 -51 -85 -44 -33 198 -216
2280 -216 -153 -271 -146 92 142 -79 -345 -172 -64 76 48 30 128 -211 -78 184 170 -38 -35 60 -162 -13 -182
2303 -182 -151 -62 -369 -245 195 -177 -128 -226 304 -14 58 -312 329 112 -308 -163 -6 92 -97 -65 154 -305
2325 -305 -147 175 -114 -185 -278 -64 181 -47 167 48 96 59 -18 279 296 108 179 87 -17 -15 -36 -353 -24 -287
2349 -287 15 44 -1 104 61 153 347 -108 43 77 155 -42 -31 91 -53 22 -110 211 42 -13 -175 -76 34
2372 34 175 68 -14 -97 120 58 -103 -103 147 180 213 138 71 -28 -219 84 -101 130 -349 -251 125 31 -128 -1
2396 -1 -337 -36 -10 -321 350 -23 189 100 113 106 -21 -95 33 98 -149 -109 -207 122 -112 -152 -164 294 -102 -43 -80
2421 -80 -93 -148 -64 225 -72 82 15 58 252 2 -64 -148 105 40 -151 -142 -168 -126 -34 -119 120 31 -79 56 113 320
2447 320 -75 -23 116 252 160 -12 -33 123 -103 -64 -4 44 161 -6 -19 -5 85 -124 -264 361 73 68 -231 -73
2471 -73 -230 -21 95 5 -14 121 -73 -347 -7 300 -22 -142 72 -253 -143 5 -238 335 266 111 165 183
2493 183 -24 -231 88 131 121 156 -160 62 -39 -309 4 -291 -277 57 54 376 71 -171 18 -110 249 452
2515 452 -1 -213 56 68 -164 118 127 122 -36 -181 -43 -24 -134 99 -7 -63 -207 102 188 24 -29 -135 -301
2538 -301 -7 184 -53 132 -57 -115 -161 -182 18 13 -141 -161 173 123 143 249 228 4 96 -98 -60 30 56 218
2562 218 -265 15 145 -200 104 -101 -128 -32 -267 -204 -147 -68 -150 -119 9 114 -40 247 25 77 129 -194 -61
2585 -61 -34 265 -225 -17 221 -264 165 157 -172 -10 -152 -52 -85 -12 -97 50 95 22 -264 39 25 -20 -246 -89
2609 -89 96 122 -174 80 -340 -308 -344 -220 -120 13 -80 -90 239 -177 190 -301 -168 236 -38 87 168 57
2631 57 60 173 134 157 -225 117 -92 -329 115 -33 18 -11 64 200 -233 215 85 -104 72 -43 142 19 148
2654 148 -162 -101 -133 -125 -154 -450 -43 -211 -6 -319 297 255 200 47 129 -28 -7 80 126 -225 138 299 -155 -8
2678 -8 43 -78 -12 -96 -163 -5 -97 2 -79 -57 -145 200 59 -23 -63 -1 7 82 -223 -154 1 -293 -82 80 -12 248
2704 248 -102 -40 129 -374 -144 -24 10 -133 216 279 -40 205 -69 -43 256 -44 -178 -33 62 15 -160 -229
2726 -229 40 -44 -20 50 87 -403 -10 173 200 7 6 107 36 119 182 -7 250 -85 12 -63 -28 -193 -296 230
2750 230 56 -178 4 30 -138 -1 -143 82 14 9 -30 -122 222 168 122 -203 15 -295 158 -61 -351 66 239
2773 239 -55 -172 -101 -157 -124 152 -158 -39 337 -177 361 252 62 2 -124 14 108 -340 48 -69 124 -124
2795 -124 71 205 -162 -134 -171 109 188 103 97 50 11 -154 42 -21 -184 -164 -111 -41 -87 -227 -233 -199 -341 171 128 27
2821 27 -56 68 -139 -50 190 -51 208 -6 -66 -92 28 -113 -120 -99 -35 -100 -120 -216 151 -199 -132 59 -480 118
2845 118 150 -248 96 -34 198 -95 365 172 16 18 -246 130 -74 78 -13 6 -102 175 -77 -190 -146 50
2867 50 -171 -78 -119 115 -21 -224 184 9 81 -159 90 -37 100 -201 -15 242 -14 -19 132 117 198 -229 140
2890 140 286 127 174 -21 147 -139 32 86 -145 102 207 61 -257 -137 287 4 63 -110 229 109 -157
2911 -157 57 40 288 -16 -84 59 188 40 -145 164 75 -152 -164 152 106 -224 -5 -15 109 107 72 52 72 37
2935 37 190 129 54 104 -174 176 10 -125 1 -198 -164 68 -19 -294 -98 48 29 115 -63 128 237 -110 -221
2958 -221 -287 -22 52 -182 -167 465 -60 89 165 37 12 -262 -166 -212 20 -178 86 251 -152 28 -314 43
2980 43 -58 4 -32 -58 -62 -12 135 23 63 40 -214 339 -47 -145 -60 -7 -31 228 95 178 -16 93 -108 79 -261
3005 -261 -39 306 -173 -264 -121 143 24 25 291 8 28 -128 -248 107 -311 -159 234 0 -66 -154 -19 248
3027 248 -156 133 230 36 -117 190 -120 209 55 -100 -43 18 -48 -145 -137 -93 60 107 -172 -78 135 -70 -254
3050 -254 -37 24 248 -132 9 65 31 7 -79 18 -74 -29 -98 -21 105 -212 -390 -270 188 -5 -233 148 238 -226
3074 -226 46 -173 114 -114 96 -244 -166 36 34 108 -4 -4 -27 -48 -318 -111 -128 -16 145 150 190 -156 -109 65
3098 65 -108 201 -118 90 231 71 -11 98 -349 -128 -118 18 -125 7 -410 29 146 -62 -255 142 59
3119 59 8 -77 182 -284 32 -15 152 -84 -372 -130 -168 64 -147 -283 16 147 220 -50 -236 34 112 244
3141 244 -141 229 -261 304 -199 -85 25 46 244 27 45 119 -24 3 -25 95 7 69 238 168 211 -125 158
3164 158 209 233 -139 97 99 -13 -242 -62 -308 -7 -52 -11 -164 25 79 -131 141 103 -18 61 128 2 -41 -235
3188 -235 114 8 -91 120 -74 -82 -67 -44 73 -77 -19 135 2 30 -149 9 -352 -101 -35 294 144 126 235
3211 235 59 92 29 -256 160 -8 -92 -30 106 -246 -140 -47 -54 -82 -166 39 60 -316 94 -145 41 71 29 344
3235 344 -62 -110 -84 -213 -136 227 -98 -54 -156 -198 -83 -30 -71 -146 19 108 -212 -151 -70 68 -148 40 112 89
3259 89 16 138 71 45 -420 71 262 4 182 33 33 97 181 -118 -138 -49 357 121 129 4 232 34 35 6 -150
3284 -150 -97 117 -38 -115 221 99 90 56 -155 -12 50 -3 106 29 133 244 198 79 100 94 326 -7 -135 -120
3308 -120 112 -7 302 -144 -138 -423 -75 71 32 25 -96 23 -124 251 324 29 325 10 103 -119 37 -102
3330 -102 -89 368 -103 115 -96 -13 177 94 -73 170 2 157 140 238 189 145 -38 -184 285 140 -259 -98
3352 -98 1 177 -92 91 -53 204 125 -81 55 35 53 -48 258 120 -200 210 47 208 -132 -217 98 -63
3374 -63 189 -274 -9 -180 40 -45 50 43 -70 72 186 -46 -47 -403 -173 20 -27 69 -128 335 102 -21 -70
3397 -70 60 -6 -134 -122 -320 -33 -54 40 8 -133 8 -19 103 -61 44 330 -72 266 49 -115 278 21
3419 21 -354 100 21 -150 31 -46 89 -28 -58 67 55 26 -87 -334 38 142 15 -117 101 75 -19 164 37
3442 37 183 -134 -329 -96 -110 -120 -136 -252 211 159 -20 -139 -97 -152 211 99 189 46 123 9 -80 -23 104 -193
3466 -193 -85 -328 241 80 -17 51 166 236 -77 127 78 95 -190 160 -43 186 -15 -158 -236 30 -164 -137
3488 -137 -174 -140 78 46 -187 -28 34 222 -259 -40 -184 -65 215 223 144 76 -19 83 -4 -9 -271 17 17 -188 -23
3513 -23 -269 -168 179 26 -114 86 8 92 174 13 181 -77 25 -14 -3 -12 -100 339 -81 -125 -147 -133 -144 -137 -115
3538 -115 42 172 -34 236 178 132 -79 -167 147 183 210 121 126 111 105 1 77 -299 22 -328 -249 -18 -190 -249 93
3563 93 137 -14 -69 8 60 76 2 296 226 -20 162 71 57 231 43 -148 146 -115 -51 -57 8 -101 62 -65 96
3588 96 -80 52 74 39 184 -200 158 -9 -111 108 -201 22 -173 -8 -139 -112 -166 58 -65 -209 -91 -140
3610 -140 23 -146 -181 289 -179 -156 -82 152 -6 -72 -199 330 -363 -247 -98 -115 -13 85 -19 92 407 -47
3632 -47 199 -31 105 321 81 -40 -68 -32 -170 235 -90 62 -2 -114 234 20 -239 109 -59 -203 52
3653 52 53 107 -3 186 -95 -121 123 20 -449 -158 -217 -286 84 -146 -66 132 106 -96 41 79 -304 136 -163
3676 -163 189 21 -20 158 -129 36 -322 293 -13 -76 -232 -105 -127 196 -237 261 -118 14 -126 112 47
3697 47 -54 155 43 296 146 -6 4 -105 -47 33 110 -75 -168 -194 -188 -37 63 257 -200 144 133 -43 25 -239
3721 -239 -40 58 108 103 13 -73 -65 -40 -379 71 101 -104 -103 133 28 -100 84 -221 40 104 1 -41 379 40 141
3746 141 116 112 -11 41 124 -82 -105 69 132 -63 -53 -187 1 -205 -140 76 25 112 -174 3 -106 139 395 -1
3770 -1 107 -40 267 77 6 -164 -210 -107 22 282 -218 87 -197 -61 -104 -82 25 59 0 -43 176 -55 -226
3793 -226 98 306 215 -111 -86 177 -177 -50 365 -14 32 -146 24 -14 58 104 -357 240 80 -124 45 1
3815 1 -84 228 7 -199 -57 16 -16 194 -33 -322 -50 -113 -46 -179 -242 -265 -53 52 195 164 -62 -5 -258 -134
3839 -134 91 48 -39 190 59 -259 -167 -135 164 -71 -225 -83 -151 194 164 17 -25 2 -6 222 211 -214 -4 536
3863 536 -74 205 -301 -153 -168 -29 115 133 106 -128 29 -288 -41 -176 153 -43 13 -26 88 296 30 135
3885 135 -118 -65 206 9 18 -22 -189 -322 30 -121 280 -92 68 -69 -37 107 130 395 -140 -17 147 33
3907 33 76 161 23 -111 -110 -284 -173 -64 132 52 30 76 -232 80 334 -182 -236 -83 120 279 -106 -85 -72 12
3931 12 -453 156 30 -228 15 -113 -186 81 78 -123 91 3 34 8 128 -61 -150 -200 -194 13 58 110 -118 -39 -12
3956 -12 -92 -94 -119 -11 -264 84 190 56 160 -76 -39 56 263 9 34 -47 89 109 -83 10 73 -99 11 303
3980 303 283 -42 -91 56 -162 -176 -301 48 -10 130 169 131 -63 -45 216 251 265 -225 -79 -161 28 -155 -23
4003 -23 -129 112 -223 12 277 -333 -74 287 -249 81 72 163 87 -286 59 136 -31 4 -101 103 -40 -52 -103
4026 -103 -234 -139 -107 -129 4 6 -164 -55 275 -94 25 -81 -237 96 -196 -33 -23 -117 -120 -37 88 9 32 -176
4050 -176 -76 -21 -175 24 -110 84 -28 93 100 146 -111 -33 -254 -462 43 2 83 164 -135 71 -33 37 5
4073 5 285 69 196 6 107 -86 -46 -13 222 -13 -108 34 35 182 164 -47 127 -157 -27 142 -110 69 -98
4096 -98 17 -198 -24 280 -5 230 -84 -38 -83 88 79 82 82 -25 -284 -319 170 -10 -36 -72 -201 -157 95 -239
4120 -239 -34 -246 -234 -238 43 -277 -122 -62 169 -143 65 -111 106 135 -122 -69 -246 45 25 -29 -191 -10 113
4143 113 208 -68 165 -84 -38 142 164 -226 160 -37 -110 228 -178 -92 -322 13 181 74 69 -27 -445 287 -64
4166 -64 56 236 -7 -36 -147 153 117 2 81 125 166 315 83 -52 -5 255 84 -87 -131 -123 -112 -212 -17 -8
4190 -8 102 -203 44 -155 26 -78 -40 207 29 -29 202 158 116 128 -47 71 -198 53 -176 -75 115 -286
4212 -286 -25 -108 -56 -58 75 -138 205 -60 -124 261 -216 -70 288 -230 84 -213 -92 22 -113 -16 -214 150
4234 150 -53 349 -28 -2 62 25 100 -111 101 -49 83 93 -248 -235 -132 -342 -246 13 -127 -38 22 -32 8 43
4258 43 47 -12 -218 -145 184 -49 -94 61 -118 -193 -80 -195 -195 -152 35 139 163 -54 -275 -78 -293 -17 384 -41
4282 -41 -237 198 118 -89 -46 122 -172 -4 154 -268 -214 116 -303 -97 -69 -265 -231 -130 69 -141 2 214
4304 214 100 -135 -26 -255 31 -156 -232 175 -143 -80 40 -140 172 44 -326 -54 111 39 128 -313 -30
4325 -30 121 100 32 57 -101 116 239 -41 53 -7 80 99 -118 88 17 232 -52 -186 93 -129 -17 -218 -235
4348 -235 298 -318 -173 199 -213 -301 -142 149 -1 11 -110 10 30 -297 -219 -4 -16 80 54 64 29 -298 153
4371 153 68 85 5 74 117 98 301 1 -172 -198 86 11 -154 87 30 102 70 121 -77 -82 -202 -131 -44 58 -29 26
4397 26 9 -139 112 609 328 -131 22 -30 49 -270 230 -70 -146 79 -148 18 132 -97 57 42 37 84 201
4420 201 331 159 -18 -155 -137 371 -122 -167 -38 23 -6 64 -114 -43 37 -115 -250 173 30 56 -70 258 -124
4443 -124 -110 154 142 89 249 406 -134 56 53 -36 211 -144 -101 79 1 52 162 -85 136 -135 -10 -258 45
4466 45 32 30 189 -70 -146 -81 230 -87 -206 307 -208 92 -54 -279 63 -10 9 -84 162 -208 162 76 -47
4489 -47 -77 106 118 -99 -346 261 -143 -116 -33 -150 57 155 -67 -64 119 -81 160 -39 -45 268 -50 -179 52
4512 52 201 161 -53 -10 106 -141 106 -71 -110 85 -1 -42 99 50 77 -214 -95 53 89 32 1 -23 253 167
4536 167 -12 -28 28 147 -5 -56 -212 139 -346 79 -240 232 -352 54 154 4 -182 118 -49 210 66
4557 66 -231 -2 7 -211 -46 23 -58 -98 -179 -159 -116 117 248 -86 -11 -58 -218 32 194 -204 -92 73 -28 63
4581 63 108 -27 124 -151 123 35 -182 -69 42 70 -21 -8 -258 226 68 63 -21 54 19 95 -38 100 -114 -100
4605 -100 80 42 -184 302 -299 -157 191 91 100 51 -254 191 99 45 175 -159 175 -41 321 189 -40 -39 98
4628 98 252 44 -30 -118 -77 52 118 -10 55 -36 94 238 -8 238 -289 -236 274 -227 42 257 -46 -180 -77
4651 -77 -138 79 10 326 81 191 -147 -37 49 -194 -86 -31 -19 10 398 172 54 58 -284 -60 75 -226 -162
4674 -162 -186 282 78 43 -162 -282 -84 -270 -220 -24 -7 4 -170 155 -10 191 59 -185 218 108 -113 15
4696 15 36 15 -30 31 195 -9 361 -229 -20 27 -135 115 36 181 -163 235 213 92 25 -166 -13 67 -165
4719 -165 -74 189 110 -223 -227 8 -168 -39 92 -54 279 -46 59 -18 28 265 -15 68 208 56 -226 -256 -86
4742 -86 356 4 249 186 14 -58 61 -87 78 227 -110 188 -106 540 -97 189 18 180 -201 -6 -88
4763 -88 26 -76 -101 -129 -68 -175 -16 62 -49 -38 -15 -26 -16 -42 -166 75 -218 237 -59 93 -68 134 13
4786 13 117 -242 170 -63 -241 -187 -170 -18 199 -212 -115 -81 -125 -167 138 -55 -27 130 -47 -64 23 -184 91
4809 91 108 87 -38 -196 -38 84 -65 208 17 201 61 2 75 120 13 -116 4 -91 82 128 169 60 71
4832 71 -81 79 151 59 -220 239 63 25 -80 62 233 119 283 -232 -22 207 -99 -60 206 126 -102 -125
4854 -125 -91 -91 131 -106 -55 -35 -170 118 111 129 307 -94 250 253 254 -106 -78 -53 -82 -149 -183 19 83 -152 150 166
4880 166 49 -278 197 -58 185 -26 -99 3 -209 56 59 69 -145 51 -16 232 -62 -263 248 10 -90 133
4902 133 -80 -54 -74 9 84 38 155 -245 96 160 -92 2 -216 202 -12 -72 88 -158 -69 -258 174 -184 -135
4925 -135 8 -18 245 -93 -109 108 -132 -18 85 85 -320 99 155 47 -12 -46 -83 -105 -72 -83 -193 -137 27 -243
4949 -243 105 -145 -181 209 210 97 151 20 51 129 93 -101 62 -29 -47 193 237 -54 72 38 -243 -154 -163 41 -104
4974 -104 -253 -114 8 -38 -143 75 46 15 26 141 -50 -99 -3 311 254 -49 14 373 -127 -269 70 77 213
4997 213 35 -38 -72 158 -72 -118 187 84 32 6 -162 -6 -133 -156 -37 -228 0 11 -61 179 -51 163 120
5020 120 -6 282 177 15 99 29 292 22 -121 153 205 -61 -192 108 -130 -4 -211 -85 39 136 -36
5041 -36 1 321 -15 -57 -262 255 93 -57 157 41 -81 250 -251 -194 -109 -182 52 36 195 -69 105 8 -66
5064 -66 -51 167 -157 27 41 -37 -156 -108 112 -48 -99 127 90 -42 -52 -32 -31 13 29 127 -52 70 185 -35 -115
5089 -115 32 102 171 -62 84 -215 -113 125 145 -138 -13 189 -180 -323 -179 -109 429 120 101 30 83 106 -157
5112 -157 65 68 164 18 273 -188 59 113 -54 -109 35 -103 -76 -41 -40 -208 -266 30 -283 42 136 57 93 108 -54
5137 -54 18 -220 75 -136 37 9 -305 56 -41 338 -20 -52 53 23 -150 -69 -14 -143 261 -225 -349 69 210
5160 210 -105 -193 -91 -30 -104 69 89 9 59 -278 -12 63 -227 -16 104 -21 -210 21 69 -100 -74 -154 -115 52
5184 52 37 385 -113 -223 -258 -133 -69 -158 -64 -16 -102 97 -198 -32 10 -298 95 -90 -184 98 -110 321 197
5207 197 -306 236 -23 -39 -24 -151 -407 78 17 -188 79 88 -146 42 -77 151 -118 -246 84 126 195 -54
5229 -54 148 83 -76 -175 24 20 -143 -2 154 77 7 -10 -131 115 -132 -28 -124 341 287 236 62 -118 93 -335
5253 -335 -3 -62 -112 94 19 -149 -97 236 -122 163 -27 169 76 -87 56 -66 58 -113 -198 -64 -184 93
5275 93 241 209 -24 -88 267 131 -153 -250 73 64 -99 88 -73 186 75 100 72 -359 81 376 -219 -8 52
5298 52 -111 52 -57 -173 261 -137 1 -285 -57 80 53 281 -82 -214 -249 52 1 -320 45 98 71 106
5320 106 182 276 170 246 -209 282 58 135 -30 -213 -182 -33 144 388 78 104 87 11 325 54 53 40 334 312
5344 312 25 -74 -40 -158 -214 44 -317 -209 66 -218 -8 100 47 19 22 142 86 -185 -70 -30 1 31 -57 -68
5368 -68 -190 194 -208 -137 -13 -63 -12 -158 77 11 61 -203 112 61 -70 104 -34 -266 37 -199 177 -139
5390 -139 100 -2 -133 33 -111 173 -40 -195 18 -186 -25 -10 -51 133 239 -42 -71 -59 313 127 26
5411 26 14 77 1 -159 -211 -47 -198 -135 -93 93 -278 167 21 -96 -58 127 212 -24 21 16 222 8 -66 62
5435 62 243 -59 48 -95 -152 33 -36 -162 -18 -230 -89 -116 -187 -150 -60 -211 204 104 -228 241 79 1 155
5458 155 -268 -19 26 36 -279 77 -1 -24 -64 -66 -38 -7 5 324 -17 -163 -64 -38 0 160 -290 -123 -79 304 34
5483 34 -107 -86 97 -214 79 -92 -115 2 47 -76 166 -76 12 19 -150 -123 -11 101 57 -47 -71 -92 -125 -45
5507 -45 -121 134 -87 -41 104 141 113 -275 -97 -191 188 -8 -214 9 68 100 75 32 -111 -3 -145 -34 8 -291
5531 -291 -19 104 44 97 -59 -165 77 151 27 -115 9 35 8 -59 -102 67 -38 -66 -112 -141 -314 -152 -85 -94
5555 -94 136 -85 -223 74 -61 289 -145 -162 105 -18 35 -91 -81 15 82 5 59 -45 -301 -126 22 200 42
5578 42 -71 163 -208 -170 -85 169 -138 -128 219 -147 154 76 76 -127 -246 69 -165 9 -2 -12 290 185 -24
5601 -24 220 207 2 -119 -168 -35 -186 -114 104 -182 -298 76 -32 84 282 -46 -179 91 -369 54 -78
5622 -78 81 60 -99 29 -3 -193 -16 -83 124 -316 -61 24 -114 131 -255 -27 94 -150 -239 -71 -43 -37 -101
5645 -101 269 -205 101 173 -95 13 283 73 -167 -83 126 240 -155 20 81 10 110 113 -180 -58 228 141
5667 141 -155 -13 -67 195 -48 -47 -116 29 -141 -33 197 -40 -190 -334 -304 105 15 -54 55 10 55 -82 -62
5690 -62 -37 63 -25 210 30 -10 229 -11 -100 -40 -122 -330 273 26 -102 196 184 -98 72 183 68 66 18 96
5714 96 116 285 339 49 98 63 -306 129 -207 23 207 -116 131 51 -37 250 128 -121 -31 -256 -203 41 -1
5737 -1 99 43 212 -11 228 310 98 -244 -44 -120 160 -127 -26 170 -185 -39 -118 33 -100 -204 4 -219
5759 -219 37 166 -65 364 -90 38 56 -83 -105 240 172 18 379 184 -85 59 206 -89 -100 -170 17 75
5781 75 82 -185 293 125 8 47 -197 72 113 -127 134 -105 -110 24 -57 -234 166 -195 -62 -56 118 43 88 -318
5805 -318 -9 8 92 -167 -60 32 33 -102 75 -204 7 -17 -141 -182 -72 35 308 -15 -92 -157 89 -122 -16
5828 -16 101 -56 334 74 191 -63 -26 47 379 -172 -202 -42 159 -18 -42 -88 -193 -117 -102 235 51 248 39
5851 39 110 96 152 273 -96 56 -18 146 33 -325 282 45 -31 124 -218 -198 35 85 -20 61 41 -151 71
5874 71 -165 -166 52 -74 11 -46 115 -131 146 -106 -71 -208 -102 78 -12 159 -165 27 -104 90 110 -104 -308
5897 -308 -119 13 1 -101 125 -15 -253 -65 221 60 -173 6 145 -230 254 90 -120 95 32 -48 -98
5918 -98 86 80 -47 -98 148 -28 -112 -117 228 -105 -1 -109 23 10 -64 168 -90 101 -32 -81 -96 113 -97 -34
5942 -34 -88 -177 109 60 -288 10 219 -206 158 18 97 -35 22 22 -2 -180 -29 66 139 159 -144 -96 247 123
5966 123 107 -105 -96 115 91 -40 -64 90 17 -201 158 -22 55 93 -194 39 170 141 39 320 -30 -2 -164
5989 -164 172 157 -61 -362 64 -18 -30 75 15 79 44 98 -214 172 25 68 328 219 155 224 -174 156 182 -12
6013 -12 -29 69 40 145 -224 20 -112 117 -137 -9 -5 99 160 219 -143 44 -90 -222 172 -167 -83 75 -82
6036 -82 199 -16 101 37 -27 -109 -96 -84 28 440 -298 105 85 234 -191 -66 -118 6 -18 -227 38 0 -482
6059 -482 -68 -78 22 26 207 -93 -12 -132 -10 -184 197 43 189 152 243 48 -51 -79 -86 -159 238 -74 -227 171
6083 171 -58 -32 -132 -68 4 38 -95 -316 -182 53 51 -143 47 -253 -221 40 -378 130 83 -97 -59 -125 222
6106 222 152 -20 -149 -23 42 -14 -94 138 14 45 60 -65 269 42 -76 124 -213 69 126 24 63 -23 -86
6129 -86 254 -67 -15 -49 167 -18 -43 -260 -65 138 -22 -82 -65 -57 -73 -324 70 11 51 -97 -130 -115 -106 -149 -41
6154 -41 20 32 -323 -22 207 51 2 16 218 8 135 -1 113 151 272 -14 120 -77 -45 131 240 -60
6176 -60 -117 206 -31 143 150 23 82 173 -108 -28 64 -8 -50 -131 -71 40 -98 -36 -139 -93 -46 -107 -48 -20 -116 141
6202 141 172 266 10 -155 57 21 150 -192 134 350 -18 70 184 166 -39 -243 9 -23 -200 268 5 14 -114
6225 -114 -229 113 -140 -141 40 237 -176 -24 52 -2 -174 -127 152 -89 159 -101 -140 -222 -166 -267 138 -145 -73
6248 -73 -19 91 -13 111 -48 -17 106 28 37 146 61 -225 137 136 -73 -73 -183 74 15 61 -122 77 91 -120 139
6273 139 -166 -164 38 248 -183 -162 -13 26 -192 -50 -187 -65 -33 -105 105 -136 -157 32 -96 70 -160 18
6295 18 247 -118 102 100 1 167 -97 -254 -24 36 180 90 59 -204 -102 -121 58 186 -180 -303 -93 149 -347
6318 -347 -86 64 -101 10 34 313 141 -82 -301 28 -37 22 -42 -107 -4 -120 226 -68 44 427 29 38
6340 38 -104 -116 -69 141 -295 8 95 222 -253 -347 155 124 -122 78 -29 -150 -61 -198 202 86 -28 -72 -76
6363 -76 -103 131 71 3 -123 135 155 235 95 66 -119 271 164 -2 -38 185 -278 15 -161 -277 7 217 272
6386 272 -60 84 41 0 -17 -21 -108 76 -154 -18 -113 48 -136 92 -207 -141 -99 -122 -73 -273 61 -1 -186 -16
6410 -16 -13 132 -152 -136 10 -216 52 216 55 -203 257 -99 26 -56 -112 -87 -177 65 -132 12 147 -118 -11
6433 -11 -116 -29 164 -63 220 53 -46 88 -162 -112 228 -122 -28 198 -180 3 384 -2 -218 -75 109 234
6455 234 52 1 0 -29 -51 242 103 -130 299 -120 111 -60 114 -180 184 -200 -123 135 72 245 -268 83
6477 83 -31 -187 -135 41 -112 62 -70 -113 -329 -10 39 106 -42 254 123 -37 110 25 122 268 137 -48
6499 -48 -211 -184 45 43 -30 136 70 -37 264 114 -203 -136 98 -268 -96 26 94 124 -269 56 80 113 68 69 80
6524 80 -34 30 -96 56 197 173 58 4 254 63 105 -7 -75 -160 -158 124 36 147 176 -81 -52 -40 43 173 153
6549 153 -46 -201 186 -27 -119 -183 41 66 124 143 129 286 -217 -68 61 -92 172 161 221 375 4 76 130
6572 130 -181 15 52 115 181 141 201 44 285 -87 43 -106 157 -76 57 -4 -267 242 -95 -10 94 -63
6594 -63 -45 288 200 116 221 8 111 -81 -207 -21 134 0 22 -125 173 190 69 47 14 -170 -29 -403 291
6617 291 -237 -232 40 -98 -5 169 -27 -29 104 -80 -133 -127 -98 -249 88 -63 208 61 76 -63 319 364 405 134
6641 134 -367 -116 -96 -315 -206 280 141 116 -82 -227 -181 89 -21 -52 -279 249 -314 120 108 207 57 22
6663 22 -98 -43 -245 70 313 128 -100 62 -28 125 125 -62 -33 -36 -61 -226 5 -42 22 -191 86 110 5 18
6687 18 -105 -62 -39 -42 111 220 -15 -115 -313 169 -61 -36 38 -128 -62 155 -253 179 164 142 -139 -102 -126 -40
6711 -40 -99 127 -105 -145 205 156 146 221 -228 134 30 -42 250 171 -193 34 89 158 41 -109 91 51 -207 47
6735 47 -38 30 26 -33 182 -144 -13 107 -51 48 -117 44 26 8 102 -22 -120 -175 308 -19 154 -19 -25 -108 157
6760 157 -111 -56 -284 102 43 30 78 114 63 -33 -209 -7 -158 90 -90 -257 20 -110 -243 11 -45 82 57
6783 57 60 -39 -174 105 -105 -3 177 128 91 -186 -15 -3 57 138 80 177 -31 -56 238 59 -90 53 -173 -217
6807 -217 -152 -194 -16 43 36 172 196 11 136 -96 8 -2 -235 -72 180 -111 68 109 38 -9 -159 -16 100
6830 100 -124 290 -66 164 63 -95 -150 97 167 25 -5 -97 97 83 100 -242 35 5 208 -68 169 152 42
6853 42 79 16 71 -40 -136 -182 -31 -281 -165 92 19 18 191 102 -24 159 -82 -55 64 36 -191 -59 103 11
6877 11 -78 -15 -52 -135 -15 -106 -19 -86 81 45 -128 -180 -68 67 217 -256 -73 -245 -27 252 -279 32 33 -142
6901 -142 -164 200 -136 -265 -72 -57 62 228 -126 -7 225 60 -69 -160 1 -34 133 -199 -315 251 -160
6922 -160 36 335 -162 171 4 161 111 -134 206 255 153 164 21 242 -4 60 176 -35 -59 65 -187 -101
6944 -101 147 -161 -21 42 11 -100 -256 -179 -167 -5 -9 -172 -3 -24 198 -85 35 24 50 46 -202 18 101 -131
6968 -131 -165 184 231 194 36 11 21 187 285 -267 -9 -36 104 43 -207 46 91 75 26 14 -136 -148 -67 130 -273
6993 -273 29 100 170 -94 -163 -24 -40 -30 -96 32 -196 20 78 169 101 184 -86 14 201 -86 -182 59 164 97
7017 97 127 -5 52 -184 -77 -46 -153 39 -204 6 65 -35 281 -179 95 -293 -56 92 -47 0 77 -35
7039 -35 4 216 -14 -184 -24 231 116 84 -61 73 35 79 -186 -130 94 163 -41 51 -132 182 -165 -56 89
7062 89 55 108 31 251 -10 36 -76 -67 39 -87 188 -1 -162 -9 -29 43 -157 -99 316 40 272 -91 71
7085 71 66 200 29 -150 119 -208 -13 187 -202 177 201 47 -34 240 190 46 118 68 71 260 -192 156 -32
7108 -32 183 6 46 -210 -127 -55 -103 4 -183 46 -288 18 116 -241 285 -84 -151 -149 -155 113 -6 -44 15 -153
7132 -153 192 70 9 -141 6 176 51 -228 129 -65 219 -247 294 58 395 -21 108 96 -24 -107 -8
7153 -8 92 42 136 228 -269 -297 146 173 259 -7 -252 -291 109 -49 37 -219 -66 -20 -140 -24 94 -27 31 -155
7177 -155 8 -64 246 26 -84 -79 171 -102 89 19 -74 60 164 -160 137 -82 -62 -373 89 86 510 24 -9
7200 -9 108 172 -77 176 171 -51 -28 -102 -12 55 285 -177 -40 -145 72 186 276 21 111 41 -49 76 153 104 107 -11
7226 -11 -169 -417 -247 -49 -145 -103 -186 -7 143 -48 -51 136 77 122 -55 -29 25 34 -47 43 -51 -240 -2 281 -155
7251 -155 -196 53 75 44 8 -101 -20 -15 -174 194 16 41 219 76 179 -84 -35 -104 17 25 97 -79 -203 112
7275 112 155 -57 177 -339 -38 -26 -111 -75 -28 28 497 -111 5 -92 6 108 120 29 164 -129 -291 -32 -71 84
7299 84 -102 22 26 498 339 -101 183 75 92 -26 55 -55 102 -58 -64 79 119 137 -21 12 -83 245 36 157
7323 157 -228 -103 27 158 15 26 155 32 -114 -53 99 -101 -103 133 -189 45 -138 54 112 1 -62 188
7345 188 149 -132 307 -160 24 -301 -17 -87 107 -52 -86 30 -142 -165 -92 -140 125 -186 -273 -137 -26 -97 -68
7368 -68 -11 -70 59 -162 69 202 -2 -129 167 114 -167 -47 -229 -154 -180 28 11 291 225 187 98 228 281 -183
7392 -183 -304 6 27 -124 72 -144 238 39 146 111 115 -106 -159 -110 -132 -206 149 35 -103 -44 3 -148 -182 -118
7416 -118 -60 -125 218 98 15 220 100 119 -55 -27 -39 80 -143 -27 -47 35 -134 -1 -227 -259 -248 46 110 22
7440 22 -5 -80 -68 35 -243 3 51 -169 -186 -82 -4 -36 -270 16 -118 162 -49 123 8 219 63 78 -40
7463 -40 180 -61 -169 -26 -3 127 22 88 -155 219 36 294 -98 -50 1 310 4 -177 56 -76 -17 54
7485 54 -213 152 11 4 143 102 -291 -154 146 51 286 86 122 -154 142 105 128 10 -59 305 -54 -133 -234
7508 -234 216 66 -75 22 179 151 -87 75 -42 -15 -112 -113 47 26 165 169 92 -8 131 213 13 188 -186 -220
7532 -220 -85 -61 -78 -138 268 -11 -48 228 38 -239 -130 -53 -46 194 -15 -107 205 -69 2 117 71 123 -126 -165
7556 -165 10 148 -57 -16 13 84 46 139 105 135 70 -122 126 146 68 181 86 -174 43 121 53 -294 -68 -169
7580 -169 -196 180 128 293 0 -84 -53 -88 40 229 54 -186 111 -108 -218 -56 -105 18 259 -35 83 -135
7602 -135 -22 -8 -231 -97 -314 -100 -40 -105 135 -121 -80 121 -78 -170 -20 -167 -38 -60 -45 -313 -115 -117 -27
7625 -27 -43 -93 -32 70 113 -135 -120 -6 42 171 -41 69 19 233 -215 11 -7 -152 -124 106 -27 -205 313
7648 313 55 -393 -183 174 67 32 106 -314 -98 -25 22 -53 -61 234 14 -81 -69 137 101 29 113 109 7 129 27
7673 27 172 30 25 308 -198 65 -89 -73 83 61 -324 -89 121 48 -207 133 -25 205 -31 -211 -90 302
7695 302 -57 -91 183 167 -215 -228 -34 86 -144 -309 -6 73 339 -3 -145 119 41 -71 61 115 -119 38
7717 38 253 -109 -153 -149 -41 169 139 -48 -81 -61 -67 167 -80 -430 -153 37 -101 -199 56 31 230 148 -35 -23
7741 -23 -61 -220 22 34 -88 -89 -125 -230 -20 81 -138 -44 -60 29 11 280 171 13 -97 -47 72 35 112 -151
7765 -151 -87 3 14 -46 -10 -50 94 -191 82 106 98 47 51 -36 155 9 -193 13 195 -208 213 -70 -216 72
7789 72 -212 -11 -42 132 -47 -7 65 56 175 4 239 -41 72 -118 -516 174 -253 122 21 -35 163 -214
7811 -214 -109 -34 -308 -300 37 145 47 -48 107 82 -246 55 89 -173 -134 -210 -205 -1 -117 110 162 -95 187 38
7835 38 -84 238 76 141 139 -188 56 216 11 82 -74 113 -65 -58 -307 57 345 -159 1 -52 -42 -54 -53 202
7859 202 300 57 -191 -149 172 82 134 -58 -74 29 182 245 116 12 77 -192 -123 -181 -73 -6 -67 35 259 210
7883 210 -34 -20 139 -91 4 -160 31 221 162 110 -99 51 251 85 -128 -113 -51 -120 84 93 -71 137 21
7906 21 -87 -147 -139 -119 12 -31 -107 101 268 -25 29 -270 201 -215 -12 -124 53 -33 108 -146 -12 4 157
7929 157 137 48 118 11 220 52 -184 249 -43 -72 345 49 -52 -137 -50 234 -359 -114 -177 -2 -95 167 90
7952 90 -209 -24 -46 73 -22 175 75 24 -127 129 -169 48 30 0 65 144 26 -239 177 -185 129 -66 0
7975 0 60 159 387 -138 -37 -100 -118 14 8 113 -20 -84 -70 -45 -275 189 -60 -254 39 8 152 -25 62 -102
7999 -102 -355 -78 169 1 43 23 48 208 301 -38 79 -117 -184 315 95 -132 106 165 109 -77 11 12 100 -9
8023 -9 -225 -139 171 63 -67 105 -38 -198 -145 227 -108 -81 -88 128 -146 18 74 -103 37 148 192 -139 46
8046 46 44 260 -92 -181 100 -8 133 78 22 99 -207 -18 60 -18 106 361 -67 -74 -95 120 -121 -19 -128 -180
8070 -180 -52 -30 -16 294 201 -31 -69 -221 -88 66 -155 195 36 -7 -104 118 -111 -385 7 379 203 9
8092 9 88 10 -247 -134 93 185 -133 299 105 -138 -194 -150 -30 12 -182 -21 -259 -25 232 -72 179 -146 308
8115 308 -29 138 -351 -224 234 -86 121 -188 -180 160 228 -35 -309 43 89 156 147 43 125 7 -11 83 -243
8138 -243 18 144 -138 -16 98 -137 139 -152 123 58 -75 146 12 104 -84 -182 324 88 65 -78 95
8159 95 69 130 285 -86 -7 76 43 1 161 -122 -30 -184 87 -138 -16 184 -89 153 -270 318 0 248 -48
8182 -48 -69 87 101 -67 129 -67 -208 118 -51
8191e1
$$ Imaginary data points
##PAGE= N=2
##DATA TABLE= (X++(I..I)), XYDATA
0 0 0 0 0 0 0 0 0 0 0 0 0 -8 8 -8 8 -8 16 -16 17 -24 32 -32 40 -48 56 -65 80 -89 104 -120 137 -156 177 -201
34 -201 226 -256 288 -321 360 -401 449 -497 553 -611 677 -746 826 -909 1003 -1105 1217 -1342
52 -1342 1480 -1632 1802 -1995 2215 -2465 2758 -3102 3513 -4018 4653 -5477 6601 -8223 10792
67 10792 -15482 26825 -116583 -6842 269029 43218 -181188 -110173 97596 84216 -1608
78 -1608 -28505 -31419 -55451 33210 124774 29605 -151910 -89028 130532 144403 -75427 -153902
90 -153902 4277 119134 36383 -61910 -55571 -8081 23841 51258 20344 -62547 -65363 46445
102 46445 90737 -8090 -76457 -8945 50454 13934 -13921 11426 -4995 -45837 518 70917
114 70917 15079 -86858 -45357 73180 55832 -55689 -55083 35171 34834 -27771 -4460 44266
126 44266 -10114 -63771 19369 94579 -2124 -106770 -22762 101794 46284 -79221 -59816
137 -59816 39624 42302 -15687 -17364 1486 -18605 -11839 41957 34222 -45134 -53217 37999 69733
150 69733 -12127 -61097 -3243 45585 13065 -20917 -8304 -1215 -10056 8366 23354 -14379
162 -14379 -42455 4725 46368 1145 -44961 -4964 39161 5045 -28977 7956 33131 -11269
174 -11269 -34508 16701 42365 -11849 -43433 3181 34704 -3277 -26954 3439 11113 -19294
186 -19294 -9955 33408 15217 -45078 -28828 48117 46864 -32855 -50134 19619 49695 1085
198 1085 -32522 -10883 10476 8923 9365 1383 -27018 -26749 22735 42275 -12587 -54084 -8921
211 -8921 49556 27244 -30944 -31260 12173 28320 10426 -6112 -14662 -13700 10604 31042 3366
224 3366 -38298 -21550 30493 28439 -22822 -35325 6641 26960 2306 -15609 -5360 3281 3426
237 3426 10434 9787 -10108 -16288 10564 25312 -1703 -25931 -4839 20761 6918 -16811 -8758
250 -8758 7603 138 -8745 2776 7744 -6902 -9523 9127 11917 -6666 -8777 9883 11705 -6489
264 -6489 -7742 8120 6977 -8094 -5550 7386 2139 -12143 -5250 10177 3296 -13235 -6654 10893
278 10893 6607 -7594 -4264 7544 3996 -3470 3217 8067 -3452 -7897 5650 10148 -5728 -12206
292 -12206 2931 9627 -5119 -12897 270 8524 -300 -7137 -574 3702 468 1454 5230 551
306 551 -5409 1440 11357 3392 -10615 -6014 8963 6912 -7683 -8174 1745 3335 -3499 -3348 551
321 551 -885 -1400 3444 3207 -4266 -3406 7170 8521 -2405 -6957 1951 8034 1172 -6129 -2799 1888
337 1888 70 -2415 -1508 -1665 -3455 -648 3428 239 -4371 -313 5667 2373 -3917 -556 6426 4493
353 4493 -2309 -2819 1578 2326 -330 -880 -2028 -3828 -1986 2156 853 -4130 -4442 1773 4970 430
369 430 -3057 32 3793 2724 308 1072 1030 -104 805 2406 -979 -4984 -1853 3711 1970 -5221
385 -5221 -6702 -382 4087 2061 -1534 -3507 -1681 3449 6017 2641 -3250 -3592 3006 7063 2906
400 2906 -5083 -6005 758 6050 2160 -5297 -8243 -1514 5825 4618 -4717 -8569 86 9069 5655
415 5655 -4848 -7079 1599 9005 6252 -1769 -7160 -4025 4681 8524 431 -10945 -9201 4727
429 4727 11727 352 -13106 -9175 6991 12127 575 -9529 -5237 5438 9097 3815 -3567 -5937
443 -5937 -637 7409 7171 -3942 -11534 -4413 8840 9069 -5829 -15103 -4255 11645 10123 -5608
457 -5608 -12098 -1678 10096 8168 -1197 -6170 -3367 3255 7765 5357 -4228 -10712 -3533 9895
471 9895 10084 -6978 -16156 -3031 13409 7955 -9834 -11928 2717 10922 3870 -4215 -3758 -170
485 -170 2782 6405 5796 -4521 -11542 -1004 14324 8642 -12987 -17546 3373 17668 3687 -15470
499 -15470 -11302 6258 11834 2840 -5471 -5473 -857 5468 9154 3823 -8545 -10127 4823 15538 3372
514 3372 -16024 -13382 8650 16880 -1237 -18310 -9403 10349 12781 -2423 -11166 -4018 5600 7292
528 7292 3856 -1821 -6500 -4327 7357 13538 -12 -17069 -10084 13101 16376 -6886 -20149 -3699
542 -3699 14640 7626 -8903 -9437 1545 5591 3070 2376 -29 -5976 -3778 9326 12301 -4461
556 -4461 -16447 -2962 16424 9848 -12407 -15640 2607 13733 3609 -9503 -8850 536 6722
569 6722 5944 111 -5733 -5965 2651 11362 6427 -7820 -11661 2602 14744 5414 -13118 -12786 5089
584 5089 13649 975 -13016 -8333 5988 8734 -146 -5969 -3244 1371 4721 5676 635 -7249 -5844
599 -5844 7089 12418 -1467 -14277 -5713 10545 9231 -6618 -11713 -529 7215 2708 -3946 -3330
613 -3330 -77 951 2370 3563 -277 -4586 -1279 6396 5692 -3138 -6681 373 6202 1789 -4928
628 -4928 -4525 797 2674 485 -2321 -2823 -985 1575 2636 1883 -573 -2823 -604 4222 4790 -998
644 -998 -4745 -1338 4428 3964 -2628 -5480 -1286 3265 1923 -2168 -3052 -908 628 1773 1378 -1000
660 -1000 -2425 396 4990 3050 -3017 -3644 2482 5341 551 -4735 -3302 1515 2817 -190 -2884
675 -2884 -2694 -470 1787 1311 -758 -2385 -823 2855 3108 285 -1786 -304 2049 2142 -13 -1308
691 -1308 -732 60 514 -390 -1793 -1407 -100 561 -63 -1124 -967 -114 1500 1392 410 -801 -193 1639
709 1639 2092 716 -1403 -712 954 1689 155 -2011 -1641 -434 906 405 -1362 -1984 -625 1604 1430
726 1430 -358 -1157 885 2290 980 -233 -536 785 1754 443 -1294 -1403 -121 1010 -105 -1778
742 -1778 -1878 -369 1452 602 -1326 -1473 433 1931 1425 -379 -581 672 1282 629 -265 -558 304 576
760 576 -369 -1787 -1079 343 488 -697 -1695 -778 601 1237 426 -578 16 1330 1700 515 -324 103
778 103 562 793 88 -721 -606 -268 -277 -964 -996 -262 -246 -273 -851 -954 217 1051 1049 48 -481 456 1101 1066
800 1066 -46 -178 -54 202 4 -578 -989 -306 -509 -864 -414 -181 -23 -185 -42 118 390 669 1142 502
820 502 -301 -57 513 1013 424 -245 -761 -192 -48 -264 -455 -740 -1121 -443 427 515 -167 -133 416 1020 362
841 362 377 665 547 650 -104 -99 -179 128 282 -150 -1465 -1389 74 789 -242 -1482 -811 346 888 789 62
862 62 -208 275 951 1633 177 -1133 -523 999 819 -847 -1605 -618 53 -72 -341 -675 -530 240 953
881 953 181 -966 -565 1581 2329 376 -1058 -242 1041 1034 54 -427 -1059 -861 565 899 -939 -2511
899 -2511 -1070 1819 1446 -1491 -1975 469 1803 602 -313 494 446 63 755 1146 -35 -1587 -385
916 -385 1594 473 -2691 -2309 751 1849 6 -1999 -811 691 1325 751 -231 -817 -130 1408 1782
933 1782 142 -1266 -813 1110 1541 478 -1513 -2013 -146 1691 298 -2773 -2002 1644 2667 -625
949 -625 -2373 -198 2522 1110 -851 349 911 -643 -180 2112 1288 -2710 -3017 1837 3531 -1747
965 -1747 -4858 -499 3460 1181 -2678 -1029 1550 768 -432 1074 1599 -533 -1507 1405 2383 -728
981 -728 -3241 -188 2684 872 -2781 -2849 772 2110 60 -1999 -1303 557 1794 714 -575 -382
997 -382 333 907 948 1037 -84 -1832 -1099 2295 2211 -2066 -3815 338 3604 399 -4137 -1454 2810 1785
1015 1785 -2442 -1064 2397 1078 -1313 441 3184 113 -2967 456 4096 551 -4183 -2525 3445
1030 3445 2417 -3049 -3556 744 2114 -867 -1079 692 346 -1236 193 2141 1219 -1987 -963 2107
1046 2107 2098 -886 -1808 -187 1257 820 -992 -1715 -763 1127 478 -1220 -1405 411 1334 63 -465 600
1064 600 525 -464 412 2054 412 -2430 -1692 2340 2180 -2446 -3250 805 2465 -996 -2801 13 1489
1081 1489 -528 -987 1476 1478 -1649 -1044 2541 2443 -1598 -2252 1669 2586 -1053 -2443 371 1763 -359
1098 -359 -1336 -246 -170 -879 -38 1038 245 -1512 -113 1648 1389 -512 -522 850 453 165 174 135 -740
1117 -740 -711 430 299 -1129 -1171 853 631 -1342 -802 1062 1211 -799 -267 1149 398 -724 442 1761
1135 1761 53 -1911 -135 1935 142 -1893 -718 927 24 -1230 -12 905 -551 -1471 909 1742
1151 1742 -190 -1235 503 1871 -295 -1086 475 1448 -811 -1218 350 834 -1014 -823 634 422
1167 422 -1402 -888 920 736 -1017 -881 1177 1252 -400 32 1144 400 -673 61 998 -294 -1562
1184 -1562 -73 1057 -58 -1156 -279 241 -408 -948 267 910 -424 -540 779 1223 -191 -258 984
1201 984 851 -935 -528 984 551 -1056 -1044 650 -210 -1157 -655 676 158 -1552 -80 1189 342 -1188
1219 -1188 252 1065 365 -745 341 1406 -68 -1386 -51 823 -413 -995 173 377 -881 -1036
1235 -1036 385 750 -768 -743 674 846 -135 -374 922 324 -339 -518 1137 165 -1026 -403 245 -88
1253 -88 -864 -336 360 -455 -1144 -155 1028 -202 -783 139 831 79 -472 708 805 -86 -673 468 568
1272 568 -609 -333 104 246 -750 -582 305 447 -977 -881 542 393 -559 -46 773 225 -266 303 974
1291 974 210 -537 -431 467 40 -651 -292 218 -325 -972 292 433 -259 -336 507 482 52 -286 633 681 -113
1312 -113 -334 258 580 -186 -344 56 -111 -623 -465 309 61 -392 -482 288 125 -126 -245 415 161 274
1332 274 506 322 -102 -131 491 335 -313 -575 205 148 -552 -684 34 225 -258 -612 196 319 175 333 541
1353 541 74 -182 12 700 349 -11 -574 -96 14 -378 -36 -304 -309 -279 11 30 -261 -273 -105 383 207 138
1375 138 390 119 494 -230 335 218 -7 71 229 -295 -613 -226 -18 47 -344 -392 47 -2 -59 85 78 -168
1397 -168 41 508 430 255 306 175 339 378 378 -436 -318 10 -8 -384 -370 -147 135 5 -200 -102 337 429 4
1420 4 -163 346 64 -22 356 456 -5 -119 14 224 31 -560 -697 96 215 -280 -656 -110 116 -58 -10
1441 -10 278 325 -105 -22 435 381 85 -209 64 272 290 -595 -764 28 281 -399 -664 116 325 67 -161 43
1463 43 296 317 -259 124 723 -35 -715 220 702 70 -755 -577 701 259 -694 -820 53 275 -688 -350
1483 -350 351 506 -123 -150 195 532 -180 -121 537 600 -120 -564 -21 533 47 -706 -489 164 204 -121 -284
1504 -284 -110 -12 -3 -162 475 506 240 -440 191 697 10 -439 -5 856 411 -1046 -583 413 520 -704 -651
1525 -651 227 830 -28 -415 394 477 -63 -43 630 753 -560 -279 459 631 -389 -910 -205 239 -285 -650
1545 -650 -125 132 -373 -643 3 341 -211 -280 346 43 152 -173 212 425 236 -108 -296 -124 16 -234
1565 -234 -607 -808 -151 51 -178 -333 49 49 -107 -144 303 518 -38 -114 372 598 -55 -454 151 630 -243
1586 -243 -438 -189 359 -250 -572 -188 163 189 -347 -61 441 146 -389 424 819 112 -405 281 463 -36
1606 -36 -72 -229 195 -307 -609 -58 171 -252 -454 178 75 -334 -279 209 178 -242 255 688 233 60 211
1627 211 281 -57 -199 120 172 -310 -614 -295 150 -176 -362 135 211 -146 5 235 280 -410 175 252 312 -266
1649 -266 -281 446 140 -454 -152 119 -273 -522 -253 83 275 -245 -411 217 65 -210 156 631 211 -451
1669 -451 333 159 -1 -232 32 108 -135 -280 -131 -59 -351 -405 -269 163 -26 -243 119 -58 -215 180 395
1690 395 468 -23 -90 95 265 -126 135 342 -4 -415 -223 -20 -59 -265 128 -79 -103 -111 251 302 -157 -190 72
1713 72 668 162 -219 275 102 -203 -68 370 250 -379 -301 -72 87 -241 -482 -1 295 -349 35 193 282
1734 282 -28 176 415 -53 -286 312 152 -44 -39 249 239 -362 -292 -158 298 -205 -102 63 149 -147 -45 364
1756 364 411 221 -214 39 78 -152 38 214 140 -193 -150 480 -114 -330 -168 135 -197 -54 35 143 -68 -136
1778 -136 -115 352 -64 -51 61 62 -524 -84 114 142 -356 -431 -32 151 -373 -294 -19 200 -210 -132 346 53 -23
1801 -23 96 528 213 38 74 159 -34 -131 -96 345 41 -396 -193 41 -187 -39 -316 164 145 -79 215 61
1823 61 272 -116 -57 -18 -20 207 -45 -159 -249 -260 -190 -34 -253 -382 -172 127 -121 -31 254 194 -81 -163 307 43
1847 43 -134 270 340 118 -352 -92 396 -22 -401 -77 -199 -179 -226 -111 130 -159 -79 -75 430 36 1 446 374
1870 374 -122 58 221 258 58 -154 20 -177 -123 4 -72 -31 -691 -87 316 -113 -274 -110 -2 -60 145 129
1892 129 277 65 45 374 337 -204 -273 81 -131 -120 -193 -24 -88 -400 -244 -167 57 67 -130 -148 332 -164 111
1915 111 469 296 -147 -143 21 36 -19 -156 -167 -207 -64 -14 -140 6 99 95 163 -180 251 247 -102 159 142 296 11
1940 11 -88 -138 -77 -18 -190 36 -145 -71 -137 -199 109 -112 -43 113 332 173 -19 241 141 -64 -317 -239 -56
1963 -56 378 -213 -159 183 51 -62 -115 -31 -95 -156 -39 -86 263 121 28 16 162 55 -464 -150 193 322 -125
1986 -125 48 414 91 -87 -355 -149 202 -241 -220 67 122 -110 -107 0 120 -236 46 244 300 26 -46 -61
2008 -61 -86 -169 -28 -89 -30 -29 -174 -2 -79 -179 -153 124 167 162 164 -71 81 381 146 69 -43 1 156 -23 47 -18
2034 -18 47 -142 -326 -127 239 -62 -363 408 24 -16 -163 97 94 25 -113 223 196 -52 1 121 20 -218 -402
2057 -402 292 111 24 -308 -52 158 -51 -73 -34 8 156 -93 49 139 181 -95 -24 42 -7 29 119 203 -155 87
2081 87 -138 -368 320 46 -371 93 110 64 68 -4 299 347 246 -278 150 441 -180 -56 85 110 -19 -99 -165
2104 -165 -133 -19 -253 -295 103 -267 -377 22 299 -25 -106 -6 -12 222 -107 56 62 -58 -51 -40 -35 -72 -27 155 -76
2129 -76 -224 -78 -70 -73 278 -117 195 154 -137 28 70 -98 62 173 320 -96 191 -42 177 -160 -192 233 -208
2152 -208 -304 -302 343 -67 28 1 389 299 8 -251 304 24 -247 -12 66 -124 -13 -121 26 -72 -132 28 108
2175 108 -36 -155 -10 34 102 115 271 60 -27 -11 -179 267 -91 132 65 -22 -76 -190 72 58 -386 -77 -183
2198 -183 74 -124 98 236 -156 -41 26 216 278 114 -52 109 -89 -204 -100 329 -7 -227 75 177 -339
2219 -339 -160 39 151 242 -51 -259 -107 54 -81 -33 71 150 -165 90 123 -13 -131 27 -59 -383 83 -90
2241 -90 44 -222 -103 -231 150 -15 105 271 58 -88 -1 -41 230 -24 -93 354 136 -98 -106 -80 -75 -196 62
2264 62 80 -75 138 138 26 -139 -43 192 65 120 94 117 165 -120 33 15 -183 -274 74 217 -128 -138 -226 69
2288 69 12 177 -96 319 -186 -235 144 -66 -222 51 265 21 -75 41 110 -52 -34 210 -358 -40 -265 -213
2310 -213 91 189 -101 77 593 49 41 8 247 130 -73 -47 -88 24 -144 115 -44 49 -150 -161 22 -252 34
2333 34 -16 -125 90 13 139 137 -96 -48 182 118 330 208 140 -259 38 -77 -88 -209 -317 -9 76 -46 -126 -32
2357 -32 98 -105 -19 47 -116 93 -34 -34 87 -121 -238 229 -172 -69 -91 -47 -87 -150 -5 -7 -344 -71 -20 -30
2381 -30 -166 -55 46 43 391 -162 76 -83 165 9 -128 304 -196 67 120 116 -131 -34 30 -72 -38 -49 -25 37
2405 37 -38 -228 -133 13 269 19 179 79 6 -28 -349 232 76 -416 260 -192 73 140 1 129 176 164 -8
2428 -8 202 41 161 13 -200 -8 7 163 172 62 100 34 -84 117 -255 -30 -342 -25 -112 -120 -20 137 265
2451 265 -34 -204 -19 105 28 -127 -105 113 133 74 -63 -58 -157 -100 -371 120 97 -81 -88 -1 481 230 -70 100
2475 100 228 365 -43 -76 135 62 -89 -90 55 -313 70 -104 -283 -54 -70 177 -211 -6 40 -167 58 -77
2497 -77 106 40 -122 -62 -84 65 -61 -136 20 -160 -29 -59 -67 -219 -3 -71 225 -69 155 193 152 301 -56 266
2521 266 -57 -231 176 61 -23 248 27 -56 -190 -44 -140 -265 -76 -54 -2 -23 306 193 16 -180 187 -216
2543 -216 235 -43 192 172 -427 -12 147 -36 -52 -285 -89 239 229 -136 26 163 39 -22 -75 91 -81 138
2565 138 135 18 -63 12 10 54 -27 -142 -54 -269 148 154 100 -5 -138 -61 -47 -172 127 -35 -40 13 -148 -49 -147 27
2591 27 -17 -30 32 -300 -112 -195 -41 -347 -36 41 -267 -241 -18 180 43 -48 211 10 -11 -20 133 176 5 67
2615 67 -127 16 29 -155 50 150 2 -250 -107 -16 -47 -32 97 -284 107 407 163 221 135 -82 117 176 101
2638 101 27 3 301 -38 16 -170 -63 -3 -227 -20 -61 -97 -7 296 -91 11 122 366 57 -4 -145 -23 -50
2661 -50 -376 270 93 -361 -24 169 -31 227 -153 -46 -57 -148 97 -121 -56 20 -48 -145 -24 -22 -33 353 264 124
2685 124 -39 -44 -3 -188 -126 145 41 -172 -422 -191 245 -127 113 51 -90 -41 12 115 42 89 58 213 10
2708 10 29 146 -71 -39 8 -26 -50 -134 40 -114 21 67 -169 -10 218 24 29 -37 -71 -1 78 161 45 67 -98
2733 -98 290 -85 40 139 -47 42 -44 18 299 138 -46 178 75 -102 106 80 -108 -241 -64 -217 33 -208
2755 -208 94 64 167 -172 6 91 7 143 184 20 -66 -70 203 106 182 -31 326 116 56 -154 -79 -111 -138 45
2779 45 179 236 170 6 -224 19 55 201 181 -134 12 107 -77 -100 239 5 -76 130 -277 -204 -76 -145 -277
2802 -277 14 -156 117 -2 110 63 216 41 -41 194 -68 192 -11 446 164 -101 42 5 -77 -31 -69 47
2824 47 -133 2 -103 -93 42 13 120 -212 43 35 299 180 -115 -223 192 -71 -30 -162 -110 15 65 -64 -475
2847 -475 101 -206 91 129 -3 -86 327 30 252 -26 18 201 144 -164 157 277 -140 -212 -58 38 -80 -126
2869 -126 241 119 32 12 293 -5 -113 169 116 -191 -165 118 81 52 -103 151 -20 184 1 -120 54 -215
2891 -215 83 1 -98 -128 342 -56 181 -291 168 -201 111 181 -97 -166 57 33 -60 -107 -255 81 -111 140 -171
2914 -171 14 -61 -30 -224 -227 -241 145 -51 -89 225 120 112 -49 120 215 -229 -61 128 -17 -217 -91 -89 -117 40
2938 40 218 92 274 -7 -15 24 232 -253 -136 -59 102 303 26 153 -89 28 -406 162 -250 -264 14 24
2960 24 24 333 84 25 -52 -176 274 -127 255 148 111 119 -417 -201 276 -170 -57 80 -53 -19 -207 39 -19
2983 -19 95 195 -52 55 176 99 52 -30 137 214 -20 -113 -295 -22 59 -146 195 -305 -36 2 -79 -3 -46 -356
3007 -356 -391 35 37 -105 94 107 101 169 95 72 3 -381 -206 -87 235 63 -67 -94 -36 -253 116 -114 -139 30
3031 30 -260 -18 85 247 210 -261 -22 180 -145 -82 -187 -148 55 180 -36 277 4 -47 220 305 114 -190
3053 -190 -210 312 203 -120 -48 -31 -89 -27 28 31 -188 -39 -220 -274 -49 -229 -13 -96 -216 19 -151 -105 -156 275
3077 275 67 -185 292 -113 -39 230 4 65 -39 -86 176 -226 304 -9 -151 -28 115 -18 -254 125 -123
3098 -123 122 101 -133 72 -209 130 63 51 -32 -58 -64 -87 -44 -12 -52 94 -57 7 67 40 73 64 271 -68 41 159
3124 159 54 2 286 3 27 205 39 -19 184 -457 -110 46 1 -80 -62 271 104 1 -78 -114 3 49 100
3147 100 103 -56 -20 -66 39 -26 -255 83 54 71 241 -85 103 -92 -303 60 -264 112 131 -61 199 -19 75
3170 75 -62 -242 50 -112 131 17 -111 -331 205 -27 -305 -389 140 -143 -17 154 147 147 193 -137 228 198 37
3193 37 62 -69 -100 70 216 -93 -132 -162 -154 -4 -90 146 -138 -55 -216 -67 83 120 -107 -193 70 -54 -138 180
3217 180 -193 115 -26 -74 105 46 -145 -186 -15 27 81 -209 92 -15 -101 -118 -29 30 119 -102 -282 -32 -60 428
3241 428 -94 -124 -83 -57 -38 44 -214 -88 -89 98 -66 27 -176 -104 -356 42 201 -149 195 135 -70 116 -36
3264 -36 141 -167 -253 -127 141 -183 146 -64 341 -113 -140 -43 -108 66 -238 2 -29 -103 -154 21 -46 99 -269
3287 -269 -42 42 183 2 150 -230 -79 23 87 65 -47 -241 2 -128 288 -172 188 65 -10 77 215 -26
3309 -26 153 -294 -41 -15 -40 240 -302 109 -133 142 39 35 -9 182 -44 216 -2 79 46 69 -5 83 146 202
3333 202 -94 48 -44 -237 -187 -17 -209 31 -96 200 328 -158 33 -224 112 -166 26 80 -82 -20 -316
3354 -316 136 60 136 373 -123 26 83 -69 -57 -182 169 172 193 79 -14 -39 169 -49 612 386 -30 -267 4
3377 4 -80 331 6 -209 159 149 62 -68 -19 104 53 -28 65 -189 87 14 146 284 47 184 -142 -106 -98 79
3401 79 52 -245 -63 141 1 35 -92 -19 -35 -80 249 84 89 -40 170 121 76 -131 -170 -111 -8 -171 -166 -29 57
3426 57 -4 -6 75 -11 41 -105 232 -168 -119 -101 -137 -35 64 47 18 226 374 -82 -111 -116 -81 -167 22 -348 155 -119
3452 -119 -259 18 231 -223 -165 59 -101 -30 217 27 -80 0 -73 -36 138 -235 -22 -51 42 27 -32 20 116 143
3476 143 46 167 -48 -77 134 323 46 123 5 73 -68 21 139 29 -339 156 -78 -358 -333 129 -262 -136
3498 -136 6 -151 15 -158 20 -29 125 127 52 19 15 115 0 112 104 -339 72 -120 -34 -24 102 13 99 22 -182
3523 -182 62 -42 271 39 103 70 -56 -17 91 298 -65 79 -103 128 -80 -63 -105 -158 -262 -22 -129 -359
3545 -359 198 114 -13 182 189 87 24 63 -489 -109 -17 245 101 -239 -56 212 -57 91 0 -215 64 -133
3567 -133 -46 211 -117 -3 215 -42 199 -32 -131 -19 146 -223 -99 -76 -194 -25 313 74 235 76 -121
3588 -121 221 73 -201 33 -272 139 -48 1 127 -259 -84 143 13 20 41 156 283 65 -5 -90 -2 -96 145
3611 145 -203 -167 -133 78 -131 -8 144 388 4 -190 26 -48 -363 -98 26 226 -166 -126 371 -22 148
3632 148 160 104 -127 35 147 14 18 47 80 146 -2 164 -47 -150 369 353 -83 143 -174 33 -411 -161 -86
3655 -86 -177 272 -370 204 -12 -32 0 -93 55 -62 100 193 10 31 48 194 34 86 1 -8 99 -149 119 -29
3679 -29 -61 -309 -301 -204 -57 86 42 -219 53 -51 84 -47 131 -48 66 172 -91 -37 -48 -69 23 -85 -61 344
3703 344 -73 -40 151 16 -5 -70 -13 -167 178 14 57 36 -102 250 203 168 194 -25 60 11 -121 191 -305 -153
3727 -153 3 -27 -33 152 217 50 -79 90 -20 203 -130 118 -385 -59 -211 -57 189 -75 -25 -429 128 260
3749 260 106 329 -21 -222 139 -13 4 -108 -272 22 60 -12 122 -18 55 20 -123 21 -173 46 -26 -134
3771 -134 61 224 -49 -71 -293 -162 -59 -157 14 49 -102 -177 -25 113 44 -361 -141 -21 -31 46 -84 220
3793 220 1 -133 -267 127 -54 -32 149 -30 71 -91 51 -284 56 221 2 -79 30 -118 -9 106 -103
3814 -103 157 -28 -61 -6 149 177 -134 -92 -202 -56 -68 -61 84 41 -47 -117 32 74 72 24 -26 -202 94 62 187
3839 187 103 -242 -93 100 -35 162 -55 148 -17 -179 147 107 -28 -212 140 73 9 59 13 185 -145 139
3861 139 -49 -51 -229 145 17 -168 -141 120 -12 189 10 305 4 122 -250 95 -169 3 -132 355 304
3882 304 -15 83 -132 36 -164 348 90 -5 114 -47 161 167 -176 73 -199 -109 79 34 -94 11 -245 -169
3904 -169 40 219 163 163 44 -65 -245 82 120 7 109 307 330 138 52 -144 -124 -7 -128 -26 93 -86
3926 -86 149 -166 -169 65 -141 -45 -25 -174 -76 61 185 122 21 98 -165 -69 -152 -41 105 -77 135 114 83 -186
3950 -186 14 -54 -53 -48 -44 -23 313 -128 -83 -158 257 154 27 205 123 129 41 -34 254 155 -82 -7 8 -212 -170 131
3976 131 -150 42 24 164 -144 52 80 111 88 -269 -34 8 -176 -159 -51 43 -123 295 35 22 -44 57 -143
3999 -143 -12 -19 -143 -116 8 220 136 -60 -84 -1 -130 -152 -147 -98 -359 201 -236 -38 131 42 200 139 92 -329
4023 -329 -87 -6 1 -155 -128 -66 -127 -85 -212 64 -62 112 80 -287 -40 -128 45 119 -130 38 45 143 34 -111
4047 -111 57 -50 151 12 -246 -143 -71 136 -5 215 -57 -16 238 -31 -81 106 166 73 -74 54 -52 -4
4069 -4 186 110 -151 227 -71 33 133 118 -65 53 -252 -158 -99 -128 -44 -31 9 -17 63 227 289 308 74 -198 -240
4094 -240 66 -335 -92 -89 -138 104 -156 -169 -63 -51 129 39 256 279 42 132 265 58 -76 -7 -75 -163 60 242
4118 242 -182 -222 -89 19 147 -212 7 -143 -79 178 -139 131 188 163 171 4 239 52 184 -2 -27 -70 0
4141 0 175 -211 -29 -83 -168 -50 4 -68 3 88 -48 -13 22 -53 27 -22 42 -67 148 -27 -264 41 -197 196 157
4166 157 187 266 -63 70 62 -102 19 -125 -167 30 -256 157 50 252 192 -125 154 250 -31 39 -85 52 86
4189 86 152 -156 80 -8 115 -52 157 140 -70 34 101 306 107 -139 182 104 -65 -25 -81 216 -30 -152 -48
4212 -48 -100 -93 -16 -81 77 -206 19 -52 -70 7 231 125 21 59 223 210 -100 127 23 -12 181 -73 -184 -21
4236 -21 -170 50 408 22 49 300 131 322 -156 -64 270 -44 -86 -23 29 -48 -75 -23 -55 164 32 -136 -209 -95
4260 -95 -16 -211 -31 177 45 -14 -136 29 5 23 -198 302 -76 276 52 2 81 -120 28 76 83 -109 39
4283 39 -204 279 -94 -167 -80 -95 -150 193 150 135 14 -329 153 135 -11 136 -20 -82 25 -2 92 -244 -159 190
4307 190 87 79 153 73 -298 309 66 19 17 10 85 95 -78 38 -30 -214 -234 48 94 69 -227 -74 -72 299 -177 31
4333 31 -195 112 212 48 146 219 -107 159 48 93 -140 21 -86 298 -23 153 70 -151 19 55 -47 42
4355 42 21 57 104 -153 -37 -296 273 172 -78 -3 78 -160 -84 -74 5 -135 -33 21 -176 119 -109 -97 118 247
4379 247 76 -372 53 8 33 64 -313 43 149 67 80 190 -183 -341 -275 114 76 17 5 208 37 215 225
4402 225 -62 159 142 -45 -144 1 240 104 94 -95 93 -116 158 -229 -125 104 -66 185 -102 69 -31
4423 -31 68 32 19 70 -105 -17 248 -95 -67 -17 76 81 4 -138 6 3 160 -152 66 -176 -3 -80 264 -118 187
4448 187 354 92 270 15 -137 170 79 291 -265 15 46 25 -145 19 -38 -191 -69 -145 -38 229 -46 -123
4470 -123 75 124 -279 -267 -217 61 54 -297 83 -95 9 -121 30 51 187 -21 40 -139 -58 14 287 51 -120
4493 -120 59 -159 54 30 213 187 131 140 -120 59 -166 -123 -89 150 22 292 22 137 278 -130 95 192 4
4516 4 -108 -164 -112 139 -79 8 78 43 -122 -189 44 65 -356 93 140 -78 23 44 -37 -102 29 136 132 44 -82
4541 -82 -114 -12 317 170 -30 -33 -92 -156 219 -168 -160 -59 -403 12 -168 329 -156 187 -263 0 30 115 27 -33
4565 -33 -156 -59 4 66 42 -43 82 -8 -384 35 -295 164 269 78 -93 172 68 2 -208 48 -29 67 272
4588 272 214 65 82 -91 -78 213 146 -122 136 177 -88 -33 66 154 22 35 -73 150 -56 31 -170 141 94 -1
4612 -1 8 -59 150 276 -74 42 103 -16 -254 -152 -168 -103 -85 -85 288 80 -109 -220 -140 -209 -167 8 -48 -134 26
4637 26 -90 -263 -18 341 233 -15 -256 -6 -65 138 150 -46 72 -237 -140 -235 -131 -108 172 94 2 -80 15
4660 15 -305 -24 73 -113 -348 -127 -71 -95 -172 -154 65 361 -27 15 92 -68 139 -35 153 279 -179 130 142
4683 142 -191 -88 -94 20 -305 62 -36 69 -121 123 146 -37 64 25 223 254 -98 211 170 -75 -246 2
4705 2 40 -152 34 143 2 -92 -164 -112 -34 -87 274 165 -138 287 -35 -53 -36 28 -112 59 103 101 -93 -87 -107 -8
4731 -8 -43 -55 31 77 8 -144 1 -118 233 -41 367 -52 38 92 -342 -157 75 -52 110 -92 -221 60 -66
4754 -66 -27 -255 -129 -76 13 -54 -127 -1 34 199 197 -58 41 34 -208 -48 -95 -98 124 112 -210 191 145 -178 179 176
4780 176 152 -130 160 52 -15 -130 179 51 58 27 -21 -122 114 -199 50 70 2 -12 -118 -40 102 -57 -145 -215
4804 -215 148 -216 3 62 -19 -53 -39 -192 156 222 -55 -169 -48 -126 -52 192 109 -70 -140 -92 -30 76 138 114
4828 114 45 190 218 -231 -50 -19 125 147 395 -70 -311 381 95 18 -163 166 0 -37 -188 -191 148 227 -176
4851 -176 223 17 -251 21 -51 -36 -50 -15 -287 72 -58 56 -71 -247 46 -8 198 317 -38 72 -66 164
4873 164 -69 247 265 60 -203 -263 86 -75 -230 122 -41 107 -11 -46 -100 257 -2 -15 -154 -167 297 -224
4895 -224 -182 334 95 61 -175 51 67 -16 103 -289 106 -168 -52 -198 8 -22 20 -222 -310 49 47 -9 -2 177
4919 177 -93 -72 -114 86 -16 342 136 -136 -90 -36 54 -26 -270 51 -92 197 15 -32 -178 125 11 28 -106
4942 -106 -46 -27 -57 -36 41 -133 -84 -140 68 -147 39 -17 -96 -38 -68 91 16 -28 168 136 -55 352 293 87 115
4967 115 55 -153 -260 48 -71 -83 -234 -103 150 95 170 -60 -27 -37 15 202 -70 -77 26 33 45 -99 73 -26
4991 -26 51 310 -96 -22 226 124 -72 120 120 -30 -245 -59 -72 158 -115 261 -188 -40 -40 -15 70 96 -4 -101
5015 -101 -59 83 -53 -70 75 -69 -140 -169 63 -81 -72 103 85 140 9 -233 -64 86 -135 55 42 -194 260
5038 260 -237 -285 -45 30 -494 -86 -303 49 19 68 114 -298 369 34 65 20 -26 -137 -80 201 34 -111 -119 -223
5062 -223 13 428 42 -123 148 154 36 -115 -151 233 213 45 370 -102 -13 198 50 95 -281 156 -62 20
5084 20 188 -151 121 309 -274 -139 -158 -15 184 220 -63 -79 235 16 164 32 23 -36 -182 -5 123 -28
5106 -28 -111 53 -65 96 -179 57 8 48 -128 -49 43 -242 137 -190 76 -76 41 32 -47 -124 4 -141 -89 -36
5130 -36 182 -258 -165 -84 -121 69 71 33 24 -31 74 -42 -28 -68 6 33 119 133 20 146 31 80 88 -355 230 -130
5156 -130 -267 122 -251 188 -87 57 89 100 314 77 165 -48 -8 18 52 -44 127 -79 74 121 -352 -34 -17
5179 -17 -14 -126 241 252 89 -32 -166 176 175 358 -24 70 24 118 202 -54 119 212 109 164 -253 117 -3 -309
5203 -309 -9 134 173 1 -194 290 -19 55 45 -46 169 -112 4 -22 -181 -91 8 -81 -94 43 71 97 -60 -72
5227 -72 -73 16 37 -132 -45 -158 151 -153 -72 -131 33 124 -35 45 171 136 -156 49 -88 62 -57 22 -156 115
5251 115 -80 161 121 41 173 140 71 -70 -202 -66 23 0 43 8 -45 -101 73 -220 -250 -47 -28 -203 90 73
5275 73 250 -94 -29 -282 247 1 202 64 -166 -79 -292 -77 -81 -203 2 -75 -25 117 -342 143 -28 168
5297 168 122 27 90 139 39 -76 -22 -54 -154 -133 26 104 -128 252 232 -141 -247 -134 -127 236 366 -209 73 57
5321 57 -146 -110 232 -105 -92 -88 211 103 -219 -86 -28 83 194 -89 98 -83 -40 45 72 244 37 44 -41 153
5345 153 396 217 -75 -150 -140 91 -177 -112 -247 172 -39 -99 -61 130 43 -175 73 140 -129 -175 330 239 -49
5368 -49 -186 -51 12 6 373 47 -3 -77 -172 -416 -208 -178 -249 1 207 44 -31 -204 59 172 213 90 131 -26
5392 -26 -248 58 -16 24 -13 -179 -219 -170 84 -154 117 -88 -7 172 -58 -153 161 -29 -8 -71 234 -45 127
5415 127 -90 196 -67 -193 -174 -14 60 9 -181 -127 36 -94 -352 23 101 -112 -210 -153 164 -22 48 58 -44
5438 -44 -66 -9 -44 -286 197 -12 231 40 58 -9 141 372 -102 -221 -147 102 -189 53 -133 -34 231 -252 -147
5461 -147 -149 -109 -160 -111 11 -181 -322 -62 143 -120 -66 -106 101 132 77 42 -118 124 291 116 158 -24 -117 244
5485 244 -110 -67 -169 66 13 -51 -46 191 21 -156 -179 25 94 15 204 62 10 19 120 -123 -70 30 -11 -301
5509 -301 -347 -157 -7 -114 -88 258 43 -70 -76 -154 -156 77 83 68 -24 -219 -5 12 2 -158 83 83 -174 183 -303
5534 -303 -46 -148 56 90 -248 228 142 -110 81 -16 -130 125 -70 220 -152 -20 -95 225 -166 25 -138
5555 -138 -50 -62 119 -67 -79 -354 -278 -63 107 73 17 116 -153 8 -108 -106 -162 92 115 -217 -154 33 -212 140
5579 140 359 -87 -63 68 -80 150 119 25 -193 -68 216 199 -19 -181 -67 228 -185 16 25 12 77 -243 -147
5602 -147 102 83 43 107 -38 229 -148 -40 210 107 -4 -45 -112 120 0 28 100 273 198 54 -276 83 118
5625 118 -56 -9 -111 -72 109 -232 -179 -31 86 95 -184 61 30 -197 205 -54 28 -251 75 -145 -17 -104 -9
5648 -9 247 -21 435 118 19 18 -197 -230 96 38 -47 -129 -33 -14 188 117 -116 24 13 158 -293 39 -36 -136 -15
5673 -15 -373 276 -34 61 73 126 -158 -112 152 -199 71 2 269 -124 -153 -176 34 74 61 -30 -40 -119 245 338 115
5698 115 79 339 119 -92 134 28 -92 -246 -4 137 116 92 31 34 82 42 -140 76 -7 264 -168 38 108
5721 108 -237 49 -152 -152 304 242 -183 74 109 -127 -39 -259 -401 -163 -75 96 71 472 151 118 -10 177 110
5744 110 18 30 -48 6 66 174 -96 -83 16 -108 -278 31 -315 154 -23 -109 77 8 92 -34 12 -8 -2 -87 105
5769 105 -11 -13 107 -96 -364 196 -31 166 -3 203 -45 -370 109 127 -33 -138 135 -76 113 39 -128
5790 -128 44 -110 151 -50 -120 193 -40 -125 157 -208 53 -13 145 92 -8 -14 -307 -204 119 70 -95 -104 -98 -52
5814 -52 -261 -70 -66 -27 297 -220 126 12 -70 -62 -81 -171 -261 409 -163 -129 43 444 -148 107 49 -44 124 -135
5838 -135 -170 -86 -137 4 -228 78 85 62 228 -162 7 -62 136 -87 -160 276 276 143 148 205 -176 -132 102 16 4
5863 4 37 89 -203 -98 -7 -165 145 -264 199 -2 97 105 -294 148 197 -8 146 -68 -274 -49 -63 -55 -112 -23 137
5888 137 240 26 -215 170 -125 194 -18 -114 173 22 -68 81 188 33 77 2 508 -161 13 20 245 -36
5910 -36 -25 -101 -128 178 36 24 155 -129 -218 16 -164 140 125 80 -37 154 28 6 50 -64 -62 -162 156 95
5934 95 133 60 -307 -18 -133 99 -71 -92 -161 27 7 168 -15 -43 -240 142 -88 185 -106 227 126 -137
5956 -137 -42 79 3 -141 252 -100 296 -49 40 42 -263 -212 -119 -121 -134 -213 -118 22 -103 -130 91 151 120 -192 69
5981 69 -33 49 -301 -58 263 339 47 -127 -36 -240 159 235 -1 188 -100 -194 83 -126 94 261 194 -162
6003 -162 -29 126 280 -214 -142 -215 -122 21 -52 -123 -173 109 46 -203 -259 240 222 93 188 96 -79 60 -107 76
6027 76 93 -71 158 -64 268 -105 191 -149 47 101 -158 -288 1 120 -308 -265 124 -150 -153 26 -3 -252
6049 -252 -11 61 -306 -180 82 143 47 30 21 49 93 -78 57 -132 146 73 -327 66 -33 145 -4 125 58 -42
6073 -42 -175 -7 -180 70 51 -37 216 308 151 198 2 -71 -183 -56 278 -209 -181 94 192 -145 -137 -256 -16
6096 -16 71 -7 62 23 21 99 99 -211 -187 127 2 -101 102 107 64 -70 -230 164 34 -143 -230 235 -3 111 -116
6121 -116 231 250 -190 -138 -72 27 -132 -233 -179 -8 51 -108 -98 176 -126 -105 -64 120 120 -3 -44 -31 109 92 81
6146 81 119 199 281 55 240 -159 -44 -103 -115 10 142 86 54 4 18 67 288 8 -130 -81 234 27 205 -106
6170 -106 -3 -41 130 -193 169 -14 -33 -596 -136 93 175 414 -39 128 -31 84 130 -87 341 254 -265 -82
6192 -82 -39 -345 -344 -3 11 -150 -97 -307 32 -14 -204 -198 -37 -74 -42 251 -159 120 -11 162 44 -21 -39 -131 87
6217 87 55 -214 96 78 -152 -230 124 -11 -47 18 163 -364 47 140 -75 182 168 94 282 96 39 -211 -115 -214
6241 -214 -61 -37 -47 -42 -47 252 46 -73 -178 -175 -81 7 30 48 -65 -91 -35 17 103 16 17 -173 -150 -43 187 -118 90
6268 90 -171 77 -56 -34 41 -42 166 198 -111 68 155 313 68 -138 238 -21 -211 -185 129 193 -3 -115 142
6291 142 -162 54 -9 -268 -91 374 -34 -177 139 -160 10 -154 -122 59 37 168 50 232 15 187 58
6312 58 39 151 -81 -31 61 12 165 -398 67 126 36 -46 -87 220 -59 192 -137 195 216 -34 -81 -127 -55 13 -195
6337 -195 116 8 -52 -272 -154 -177 63 -238 -87 30 76 -62 -166 -29 13 -85 -213 152 4 159 299 -112
6359 -112 76 241 -128 -139 -205 -227 -144 211 132 240 -103 212 150 43 -55 169 112 317 -127 33 11 -80 -63 -8
6383 -8 69 23 101 -196 -22 -2 36 -65 214 377 195 -102 -162 -123 78 120 -50 -189 61 -24 43 236 -99 23
6407 23 16 -33 77 -37 -182 -166 -19 -41 26 86 103 109 -119 105 -59 154 -109 111 -161 -57 143 51 -39 155
6431 155 -191 -300 -156 -98 63 -129 55 53 160 -48 -102 113 212 -65 44 -4 89 -134 43 -143 135 236
6453 236 -372 84 -144 50 375 69 45 80 267 -102 117 196 57 -250 107 -117 324 -96 90 -121 -191
6474 -191 60 266 54 -69 56 153 -24 -157 -34 24 402 58 -12 261 -125 88 414 133 -59 22 78 59
6496 59 -47 241 206 75 -52 172 -269 -298 -122 104 -13 141 205 34 -153 95 265 -231 -257 -136 0 -244
6518 -244 122 15 127 -74 27 4 -38 122 78 25 130 87 78 -413 -97 -260 177 35 -83 142 127 149 209
6541 209 -71 56 102 28 -29 6 79 -88 -8 -21 272 -37 -66 -101 -45 93 -390 0 47 167 202 -133 -85 -72 101
6566 101 45 -251 -45 134 143 3 126 120 227 89 -25 172 -41 16 -158 11 120 192 -13 -213 -205 169 -183
6589 -183 38 -67 183 14 153 27 20 -57 65 146 -48 62 -110 169 -37 163 24 -7 -84 -227 -138 45
6611 45 5 202 -4 -160 110 73 43 124 -26 201 89 120 -143 163 -159 -117 106 38 57 0 -10 -128 133 121
6635 121 -77 13 -34 -39 33 -56 70 -33 92 7 270 -159 143 151 101 -263 79 -161 -282 -258 -43 -89 -86 -304 -38
6660 -38 -110 21 33 -210 116 95 142 248 -50 -62 -47 -155 -241 -3 -23 139 -154 -74 -135 8 -116 -82 -79 14 214
6685 214 76 19 -99 181 197 -175 99 99 -164 34 78 -10 55 93 -213 4 264 91 175 98 209 238 -180 38
6709 38 -226 174 -239 51 -92 55 -17 146 94 80 -9 130 -156 81 191 -192 279 50 -3 197 -7 75
6731 75 5 59 197 32 -91 79 145 -137 -27 -82 -148 -72 127 -5 62 -27 -86 -95 -21 184 -207 73 180 -96
6755 -96 137 269 4 -187 124 -126 235 -4 28 20 12 50 -265 -172 -69 0 133 20 -42 204 -34 60 115 48
6779 48 245 124 -58 -52 175 -36 110 -165 77 62 -161 -56 -194 105 198 98 382 -92 125 265 155 -8
6801 -8 -102 126 -217 -208 -35 -201 53 -208 -131 -83 131 -28 -19 139 -196 -40 -99 9 263 -89 29 -154 -79 353
6825 353 116 32 -153 -119 201 -14 87 -15 -105 -63 75 30 -284 467 287 -33 50 99 374 166 -196 -201 -176
6848 -176 106 158 221 43 -91 367 -37 168 30 -211 -63 116 -45 -4 268 -132 251 57 29 -131 -32 -252
6870 -252 -93 -106 -24 -110 -38 -162 -106 79 -125 -86 179 -21 -221 316 -101 -115 130 -107 -181 -132 -113 180 104 -82
6894 -82 -342 -141 312 43 -280 -67 85 -113 189 92 -122 119 -267 -41 61 -94 118 57 87 97 114 114 -145
6917 -145 129 81 -3 -262 125 45 3 146 97 -250 15 70 126 -246 10 -146 -331 50 -78 -180 70 69 101
6940 101 -96 -102 62 -113 76 32 132 -47 -56 13 -121 -73 127 326 150 -168 15 -18 -242 300 57 22 -243
6963 -243 -9 52 136 -137 -11 52 -194 46 39 194 32 146 0 -90 103 268 27 -81 -137 109 -69 73
6985 73 69 -92 75 -37 -249 3 -124 333 150 -107 -169 298 93 -110 -139 -1 -45 -305 -207 -3 51 69 172
7008 172 178 -110 -177 138 27 79 -41 98 -200 -287 83 -21 95 -77 -83 104 -32 130 -59 9 156 96 -28
7031 -28 -116 232 14 -161 50 202 -175 4 -287 240 203 21 146 -221 20 73 139 242 -123 -108 -27 -97 -85
7054 -85 135 -25 283 -58 -5 127 -47 227 67 -212 -65 112 -56 106 -130 -31 2 -37 -195 131 24 56
7076 56 59 -52 -85 -143 -138 30 -227 164 13 52 36 298 -40 -172 -57 -136 -33 89 -8 267 -13 142 -163 33
7100 33 -97 -83 -67 102 -61 -170 -93 94 -33 70 -86 -98 256 1 3 -13 -70 105 46 -180 106 -70 126
7123 126 -40 49 202 117 67 -13 158 -28 120 133 -54 125 140 -177 -191 -135 -344 24 -184 372 6 -8 -66
7146 -66 -126 84 85 -230 -130 212 -192 32 77 -135 -14 46 258 -217 200 -98 -106 210 -170 210 69 -221 -181
7169 -181 -183 -32 -85 -105 41 47 -86 19 -27 -47 211 330 -59 -31 121 76 -181 -22 -244 38 247 -118 -224
7192 -224 112 147 26 179 88 108 -68 17 0 -21 65 -97 -153 -16 11 -158 162 -260 -101 224 80 104 -81
7215 -81 -58 173 -108 -166 40 195 434 -123 60 313 19 49 -241 -37 -115 151 16 -11 2 -21 -91 -227 -28
7238 -28 11 -38 199 152 -86 -81 -173 -35 46 246 114 207 43 -60 -100 -169 -204 -195 83 204 148 -96 80 -264 347
7263 347 -78 -12 283 -197 -89 -55 9 -44 215 -164 181 101 226 -17 -41 182 -206 178 110 -40 -25 -22 95
7286 95 -122 36 -347 48 -115 -62 -102 -49 1 -244 -95 50 119 111 -116 -253 -171 263 -15 -224 32 -177 -377
7309 -377 -108 185 121 -89 131 262 182 -127 46 41 -134 119 6 209 112 -325 47 -262 139 -101 -127 -94
7331 -94 -52 52 72 -14 -53 -32 28 15 60 -39 56 -119 52 239 -164 -24 245 -93 156 59 124 -46 -204 -3
7355 -3 156 -187 -70 -105 -26 -13 119 119 -63 82 -30 233 135 -172 -17 -136 73 10 10 18 39 52 -191 48 -203
7380 -203 22 -53 4 53 -28 42 18 -24 -44 -179 52 96 -34 142 79 -18 194 197 249 -258 -76 -102 139 -358 50
7405 50 156 142 36 46 48 -60 -130 367 51 -34 324 -87 202 -130 45 -45 -10 -34 30 58 -124 105 -181 102
7429 102 78 78 -27 -76 -44 121 8 289 -83 71 -203 -191 48 -18 53 -104 167 128 65 -53 -157 -115 77 -36
7453 -36 -32 -89 -81 50 127 8 117 8 111 127 -54 -238 -201 86 -15 176 -132 -22 102 -12 248 161 32
7476 32 143 58 65 -181 -20 30 424 59 128 -123 83 -7 149 333 88 166 -185 -5 -65 105 -34 -211 257
7499 257 26 -30 190 9 -118 -209 80 -101 57 44 -145 -108 86 -131 32 108 183 49 -127 -85 171 -128
7521 -128 -187 18 60 56 144 -63 -68 127 300 -129 60 221 234 1 92 177 -94 -160 37 -13 -186 -198 16 -144
7545 -144 -21 123 -225 36 190 4 18 117 -79 71 80 -57 174 -11 175 164 197 -197 -79 80 -173 179
7567 179 -107 -69 -42 48 73 -161 231 121 -165 -191 -92 -29 282 23 92 177 -163 31 156 -1 109 277 -255
7590 -255 -62 96 292 -53 -159 74 -140 -155 38 -68 -38 -99 156 139 55 0 179 -390 159 102 291 -178
7612 -178 -340 -31 -77 0 -127 135 -120 -16 -38 -53 47 45 13 -86 68 179 -44 -2 121 51 100 36 -132 -126 5
7637 5 -245 152 -100 -62 57 -130 32 182 127 -242 134 -261 390 -35 -18 199 -48 -192 35 203 147 155 -99
7660 -99 -74 -34 23 0 -174 209 -62 -23 167 -308 49 93 93 182 -42 -178 -171 -82 36 -13 -343 202 75 -189 108
7685 108 -144 -263 167 -86 -144 -277 -25 -90 -70 -350 -71 -27 2 -274 91 130 180 -59 -16 -68 -132 32 -313
7708 -313 60 23 -76 29 117 86 92 38 152 -117 263 251 -201 5 -100 99 -163 -158 5 107 -115 198 115 48
7732 48 155 -40 -78 142 -28 102 118 211 194 2 6 -47 42 158 -316 -86 -154 -133 -29 208 -142 -239 78 -23
7756 -23 -233 -243 98 81 -149 -56 -242 195 162 208 168 438 142 -77 -8 105 -277 -80 146 10 -143 150 120
7779 120 -88 -125 119 -85 0 107 162 10 68 210 -109 -117 263 -1 -178 -22 157 -133 -205 -4 30 -40 178
7802 178 -63 -145 118 78 -190 165 -35 132 47 12 -154 61 63 -232 -364 55 148 106 14 62 -33 264 -9 110
7826 110 33 -9 160 154 -85 -86 252 -85 103 33 72 -140 -81 -1 341 -173 109 -145 -141 108 206 28 77 -129 -167
7851 -167 10 -178 40 -173 -96 -66 196 -79 -298 -319 -190 -116 -129 120 -108 217 10 216 153 29 92 -254
7873 -254 130 -91 -255 -60 -243 -157 -89 105 285 65 -307 10 162 -128 78 -103 173 68 90 237 -244
7894 -244 61 -52 -35 133 -5 26 -8 -4 366 -97 137 -5 -117 -61 -171 -83 -272 87 9 -162 0 59 120
7917 120 10 130 -25 35 9 -26 109 -201 -199 28 -83 -170 188 -90 -184 -75 -90 -105 46 214 71 -143 274
7940 274 -93 43 155 54 -300 150 20 -29 -29 -304 -163 215 -54 27 -242 71 -57 118 -110 -178 -230 -152
7962 -152 -77 264 63 26 87 311 143 -63 -99 -151 -253 -60 47 -200 -196 -146 62 -109 -23 -225 128 -206 -9
7985 -9 -2 -186 -355 174 53 168 -88 62 -113 121 -185 -319 -271 116 104 -122 -52 131 -74 -76 255 142 -145
8008 -145 216 44 -71 112 -182 232 26 -163 84 -123 360 59 214 -221 -400 -8 110 -56 396 43
8028 43 14 83 112 130 -372 49 -257 -189 -163 -234 9 107 50 -160 -60 187 49 67 60 -300 110 -267 -99 -41 -175
8053 -175 -38 127 93 18 -176 -91 -151 110 -33 -146 6 -238 -117 -179 -186 25 24 115 -147 234 245 102 28 -234
8077 -234 9 -34 -4 -12 -87 -15 136 -198 -4 82 -188 -106 -111 99 24 150 -131 -9 -21 69 31 152 -114 73 29
8102 29 36 266 161 192 83 109 330 105 95 -56 -176 96 -92 6 173 -48 25 205 -61 16 90 219 -154
8125 -154 -85 -104 -315 25 -189 109 -442 -26 58 -45 186 -234 -142 211 -178 93 214 79 37 -141 323 -38
8147 -38 -27 88 -191 138 -41 -101 134 73 -199 172 -241 170 104 -139 93 98 24 -100 144 58 -257 70 357
8170 357 -55 27 62 23 -184 -386 -318 -111 0 96 -254 83 159 -87 168 125 23 -113 83 15 -55
8191e5
##END NTUPLES=NMR FID
##END=
