##TITLE=1H_Pr NCS-M
 200.13MHz, CDCl3,
 8 sc
 
 26.3.2025
##JCAMPDX= 6.0         $$ Bruker NMR JCAMP-DX V2.0
##DATA TYPE= NMR FID
##DATA CLASS= NTUPLES
##ORIGIN= UXNMR, Bruker Analytische Messtechnik GmbH
##OWNER= pz
$$ XWIN-NMR		Version 3.5
$$ Wed Mar 26 14:08:10 2025 Russian Standard Time (UT+4h)  she@DPX200
##.OBSERVE FREQUENCY= 200.1313
##.OBSERVE NUCLEUS= ^1H
##.DELAY= (6, 6)
##.ACQUISITION MODE= SIMULTANEOUS
##.ACQUISITION SCHEME= undefined
##.AVERAGES= 8
##.DIGITISER RES= 18
##SPECTROMETER/DATA SYSTEM= spect
##.PULSE SEQUENCE= zg30
##.SOLVENT NAME= CDCl3
##.SHIFT REFERENCE= (INTERNAL, CDCl3, 0, 14.3821)
##AUDIT TRAIL= $$ (NUMBER, WHEN, WHO, WHERE, WHAT)
$$ ##TITLE= Audit trail, XWIN-NMR		Version 3.5
$$ ##JCAMPDX= 5.01
$$ ##ORIGIN= Bruker BioSpin GmbH
$$ ##OWNER= she
$$ F:/spectra/data/she/nmr/H-C/1/audita.txt
$$ ##AUDIT TRAIL=  $$ (NUMBER, WHEN, WHO, WHERE, WHAT)
(   1,<2025-03-26 14:06:57.37 +0400>,<she>,<DPX200>,
      <created by zg, POWCHK disabled, PULCHK disabled
       configuration hash MD5:
       00 E9 B6 7A A2 85 ED C7 34 08 36 98 17 FE 4E 26
       data hash MD5: 16K
       21 A5 1B DD E9 86 E9 40 64 59 40 6F 95 5C FC 06>)
$$ ##END=
$$ 
$$ hash MD5
$$ A6 0E EE 53 5D 51 F0 DB EE CC 7E 42 1A CB E9 D4
##$RELAX= 
##$RELAX= 
##$RELAX= 
##$RELAX= 
##$RELAX= 
##$RELAX= 
$$ Bruker specific parameters
$$ --------------------------
##$DU= <F:/spectra>
##$EXPNO= 1
##$NAME= <H-C>
##$PROCNO= 1
##$TYPE= <nmr>
##$USER= <she>
##$AMP= (0..31)
100 100 100 100 100 100 100 100 100 100 100 100 100 100 100 100 100 100 
100 100 100 100 100 100 100 100 100 100 100 100 100 100 
##$AQSEQ= 0
##$AQ_mod= 1
##$AUNM= <au_zg>
##$AUTOPOS= <>
##$BF1= 200.13
##$BF2= 200.13
##$BF3= 200.13
##$BF4= 200.13
##$BF5= 200.13
##$BF6= 200.13
##$BF7= 200.13
##$BF8= 200.13
##$BYTORDA= 1
##$CFDGTYP= 0
##$CFRGTYP= 5
##$CHEMSTR= <none>
##$CNST= (0..31)
1 1 145 1 1 1 1 1 1 1 1 1 1 1 1 1 1 1 1 1 1 1 1 1 1 1 1 1 1 1 1 1 
##$CPDPRG= <>
##$CPDPRG1= <>
##$CPDPRG2= <>
##$CPDPRG3= <>
##$CPDPRG4= <mlev>
##$CPDPRG5= <mlev>
##$CPDPRG6= <mlev>
##$CPDPRG7= <mlev>
##$CPDPRG8= <mlev>
##$CPDPRGB= <>
##$CPDPRGT= <>
##$D= (0..31)
0 0.7 0 0 0 0 0 0 0 0 0 0.03 0 0 0 0 0 0 0 0 0 0 0 0 0 0 0 0 0 0 0 0 
##$DATE= 1742983616
##$DBL= (0..7)
120 120 120 120 120 120 120 120 
##$DBP= (0..7)
150 150 150 150 150 150 150 150 
##$DBP07= 0
##$DBPNAM0= <>
##$DBPNAM1= <>
##$DBPNAM2= <>
##$DBPNAM3= <>
##$DBPNAM4= <>
##$DBPNAM5= <>
##$DBPNAM6= <>
##$DBPNAM7= <>
##$DBPOAL= (0..7)
0.5 0.5 0.5 0.5 0.5 0.5 0.5 0.5 
##$DBPOFFS= (0..7)
0 0 0 0 0 0 0 0 
##$DE= 6
##$DECBNUC= <off>
##$DECIM= 32
##$DECNUC= <off>
##$DECSTAT= 4
##$DIGMOD= 1
##$DIGTYP= 9
##$DL= (0..7)
0 120 120 120 120 120 120 120 
##$DP= (0..7)
150 150 150 150 150 150 150 150 
##$DP07= 0
##$DPNAME0= <>
##$DPNAME1= <>
##$DPNAME2= <>
##$DPNAME3= <>
##$DPNAME4= <>
##$DPNAME5= <>
##$DPNAME6= <>
##$DPNAME7= <>
##$DPOAL= (0..7)
0.5 0.5 0.5 0.5 0.5 0.5 0.5 0.5 
##$DPOFFS= (0..7)
0 0 0 0 0 0 0 0 
##$DQDMODE= 0
##$DR= 18
##$DS= 0
##$DSLIST= <SSSSSSSSSSSSSSS>
$$ [...]
##$SUBNAM0= <"">
##$SUBNAM1= <"">
##$SUBNAM2= <"">
##$SUBNAM3= <"">
##$SUBNAM4= <"">
##$SUBNAM5= <"">
##$SUBNAM6= <"">
##$SUBNAM7= <"">
##$SUBNAM8= <"">
##$SUBNAM9= <"">
##$SW= 18.0517328524113
##$SWIBOX= (0..15)
0 0 2 0 0 0 0 0 0 0 0 0 0 0 0 0 
##$SW_h= 3612.71676300578
##$TD= 16384
##$TD0= 1
##$TE= 0
##$TE2= 300
##$TE3= 300
##$TEG= 300
##$TL= (0..7)
0 120 120 120 120 120 120 120 
##$TP= (0..7)
150 150 150 150 150 150 150 150 
##$TP07= 0
##$TPNAME0= <>
##$TPNAME1= <>
##$TPNAME2= <>
##$TPNAME3= <>
##$TPNAME4= <>
##$TPNAME5= <>
##$TPNAME6= <>
##$TPNAME7= <>
##$TPOAL= (0..7)
0.5 0.5 0.5 0.5 0.5 0.5 0.5 0.5 
##$TPOFFS= (0..7)
0 0 0 0 0 0 0 0 
##$TUNHIN= 0
##$TUNHOUT= 0
##$TUNXOUT= 0
##$USERA1= <user>
##$USERA2= <user>
##$USERA3= <user>
##$USERA4= <user>
##$USERA5= <user>
##$V9= 5
##$VALIST= <valist>
##$VCLIST= <CCCCCCCCCCCCCCC>
##$VD= 0
##$VDLIST= <DDDDDDDDDDDDDDD>
##$VPLIST= <PPPPPPPPPPPPPPP>
##$VTLIST= <TTTTTTTTTTTTTTT>
##$WBST= 1024
##$WBSW= 4
##$XGAIN= (0..3)
0 0 0 0 
##$XL= 0
##$YL= 0
##$YMAX_a= 196975
##$YMIN_a= -205587
##$ZGOPTNS= <>
##$ZL1= 120
##$ZL2= 120
##$ZL3= 120
##$ZL4= 120
##$ABSF1= 10
##$ABSF2= 0
##$ABSG= 5
##$ABSL= 3
##$ALPHA= 0
##$AQORDER= 0
##$ASSFAC= 0
##$ASSFACI= 0
##$ASSFACX= 0
##$ASSWID= 0
##$AUNMP= <proc_1d>
##$AZFE= 0.1
##$AZFW= 0.1
##$BCFW= 1
##$BC_mod= 2
##$BYTORDP= 1
##$COROFFS= 0
##$CY= -3
##$DATMOD= 1
##$DC= 2
##$DFILT= <>
##$DTYPP= 0
##$F1P= 0
##$F2P= 0
##$FCOR= 0.5
##$FTSIZE= 0
##$FT_mod= 4
##$GAMMA= 1
##$GB= 0.15
##$INTBC= 1
##$INTSCL= 1
##$ISEN= 128
##$LB= 0.25
##$LEV0= 0
##$LPBIN= 0
##$MAXI= 10000
##$MC2= 0
##$MEAN= 0
##$ME_mod= 0
##$MI= 1.114404
##$NCOEF= 0
##$NC_proc= 0
##$NLEV= 6
##$NOISF1= 3.799351
##$NOISF2= 2.8
##$NSP= 1
##$NTH_PI= 0
##$NZP= 0
##$OFFSET= 14.38212
##$PC= 1
##$PHC0= -471.8858
##$PHC1= 15.59221
##$PH_mod= 1
##$PKNL= yes
##$PPARMOD= 0
##$PSCAL= 0
##$PSIGN= 0
##$REVERSE= no
##$SF= 200.129724274929
##$SI= 16384
##$SIGF1= 3
##$SIGF2= 2
##$SINO= 400
##$SIOLD= 16384
##$SREGLST= <1H.CDCl3>
##$SSB= 0
##$STSI= 0
##$STSR= 0
##$SW_p= 3205.1282051282
##$SYMM= 0
##$S_DEV= 0
##$TDeff= 0
##$TDoff= 0
##$TI= <>
##$TILT= no
##$TM1= 0
##$TM2= 0
##$TOPLEV= 0
##$USERP1= <user>
##$USERP2= <user>
##$USERP3= <user>
##$USERP4= <user>
##$USERP5= <user>
##$WDW= 1
##$XDIM= 8192
##$YMAX_p= 0
##$YMIN_p= 0
$$ End of Bruker specific parameters
$$ ---------------------------------
##NTUPLES= NMR FID
##VAR_NAME=  TIME,          FID/REAL,        FID/IMAG
##SYMBOL=    X,             R,               I
##VAR_TYPE=  INDEPENDENT,   DEPENDENT,       DEPENDENT
##VAR_FORM=  AFFN,          ASDF,            ASDF
##VAR_DIM=   8192,          8192,            8192
##UNITS=     SECONDS,       ARBITRARY UNITS, ARBITRARY UNITS
##FACTOR=    0.0002768,     1,               1
##FIRST=     0,             0,               0
##LAST=      2.2672688,     0,               0
##MIN=       0,             -205587,         0
##MAX=       2.2672688,     196975,          0
$$ Real data points
##PAGE= N=1
##DATA TABLE= (X++(R..R)), XYDATA
$$ [...]
1612E09j100M24J571j620j020K141L23j233l94P85j49p82J107O92j907n07J865
$$ 509 -591 -167 1404 -216 -1236 905 1228 -5 -399 386 237 -545 562 1254 -653 -1160 705
1629G05o16j087N90P97n96l05J150r1j602O52J735j067j042J341j38o98M03M74
$$ 705 89 -998 -408 389 -207 -512 638 547 -1055 -403 1332 265 -777 564 426 -272 131 605
1647F05m88j074O91J178j353l05J164m33p63J002J58r93j90J410L57j204k03J154
$$ 605 117 -957 -266 912 -441 -746 418 -15 -778 224 382 -611 -801 609 966 -238 -441 713
1665G13p65l16J229m20j007L99N25k87p13K82L65n75P8J082p78n99J159j46j51
$$ 713 -52 -368 861 441 -566 -167 358 71 -642 -360 5 -570 -492 590 -188 -787 372 226 75
1684G5k96L96J71m85L2P88p25n96R25k99m34K70K29J55o31K42M68q28l07J480
$$ 75 -221 175 346 -139 -107 681 -44 -640 285 -14 -448 -178 51 206 -425 -183 285 -543 -850 630
1704F30m29n20M46K20k54o3Q6L65q08K03Q39j031k52P72k50l84J99K76k38j86
$$ 630 201 -319 127 347 93 30 116 481 -327 -124 715 -316 -568 204 -46 -430 -231 45 -193 -379
1724c79M21N84q67J31M94l99l19N99Q9m40j53L79J63p68K77L45m45k30O65l49
$$ -379 42 626 -241 -110 384 -15 -334 265 354 -86 -239 140 303 -465 -188 157 -288 -518 147 -202
1744b02k61P0O34k97m8K88L83o01Q6O60o22l49N12l92K74k39O1K50o43N8N54l52
$$ -202 -463 -393 241 -56 -104 184 567 -34 52 712 90 -259 253 -139 135 -104 -43 207 -436 -378 176 -176
1766a76j07N49k69j51L04r5J30o9l15M80pl43N97n81j52L90k32k55M93k97J74
$$ -176 -283 266 -3 -154 150 55 185 116 -199 281 274 -69 528 -53 -205 185 -47 -302 191 -106 68
1787F8k88j1K11r3M3K68k17l03N46L2M3m56R9K83L6l85M50m39j90M12l59l1J08
$$ 68 -220 -231 -20 -113 -70 198 -19 -322 224 256 299 -157 -58 225 261 -124 326 -113 -303 109 -250 -281 -173
1810a73J18J56l69m6O66m24q5L66j39j72N33k69J7J29j07K25n94j2L91j19l20
$$ -173 -55 101 -268 -314 352 -72 -157 209 70 -102 431 162 179 308 201 426 -168 -180 211 92 -228
1831b28K67j35Oj00J64R2l80M70K40o20J47M59p5m12L77j00j99j77n6K46k93M8
$$ -228 39 -96 -90 -190 -26 66 -314 156 396 -224 -77 382 307 -105 272 172 -27 -204 -260 -14 -307 -259
1853b59L98l45j82O29k9n01L50m8O5j89J45L32l77j42N20l12l91P87l39k31j42
$$ -259 139 -206 -388 241 212 -289 61 13 78 -111 34 366 -11 -153 367 55 -336 451 112 -119 -261
1874b61Q2k7K3m7N83n55K4M50j0n19L57K51l29r1M65r8n33J62N54o18j70M85q3
$$ -261 -179 -206 -183 -230 353 -202 -178 272 262 -257 100 351 22 -69 396 298 -235 -73 481 -137 -307 178 95
1897I5n94K28J36O1n57L86N24n12K00N06j73m22N16k55k95J56L47Q7p31J19N35
$$ 95 -499 -271 -135 -74 -631 -245 279 -233 -33 473 300 -122 394 139 -156 0 347 434 -297 -178 357
1918C57o02k29P06j14o37M80L9j57j80N11J89m97m1O86l15n40M47L42m94l01N18
$$ 357 -245 -474 232 118 -519 -39 0 -157 -337 174 363 -134 -175 511 196 -344 103 445 -49 -350 168
1939A68j40l97M58K17o81j58O87l41j05N64r8k20k06O20k1p19L76O04o45l08O66
$$ 168 28 -369 89 306 -375 -533 154 -187 -292 272 174 -46 -252 368 347 -372 4 608 -37 -345 321
1960C21o8n21J63L10n0n57K37O32q01P7N63j96m66N33K7j0n63M63M70p41j87O18
$$ 321 253 -268 -105 205 155 -402 -165 467 -334 -257 306 110 -356 177 204 194 -369 94 564 -177 -364 254
1982B54n71P7O58m43m62N3M91J24n89L25O12q58Q3P60k76m64M70N8k48k06M66
$$ 254 -317 -240 418 -25 -487 -434 57 181 -408 -83 529 -329 -246 514 238 -226 244 302 54 -152 314
2003C14J3o95K12N22o69k84Q71M2p18M47q4R1o10N99M61n65k30P09j91l93L04
$$ 314 327 -368 -156 366 -303 -587 284 326 -392 55 -29 62 -548 51 512 -53 -283 426 235 -158 146
2024A46J94m09m22N68P6l09k40P05o55Q0N77m93j34M02K5K74q00L97O28p79k18
$$ 146 340 -69 -491 77 153 -156 -396 309 -346 -266 311 -182 -316 86 111 385 -415 -18 610 -169 -387
2045c87R12n08k09M26R1k94n34N62K34p72L8Q80n82m25O82%m12P4N31O9p90M60
$$ -387 525 17 -192 234 325 31 -503 59 293 -479 -441 439 -143 -568 114 114 -298 -224 307 376 -414 46
2067D6N77j081K79Q03m65q44O53M26p61j40M75P0q87P63N83n81k02Q70m44p10
$$ 46 623 -458 -179 624 159 -685 -32 394 -367 -507 -32 38 -849 -86 497 -84 -286 584 140 -570
2087e70P53J52m36k22O27K83j137J59R11o26n28R93j68q37N31P50n13n13L45M94
$$ -570 183 335 -101 -323 304 587 -550 -391 520 -106 -634 359 191 -646 -115 635 122 -391 -46 448
2107D48n50k7N87k49m34N03q1j87o03O60R2p23M90M67p76l2P63np71K69N33k03
$$ 448 -102 -129 458 209 -225 278 197 10 -593 67 159 -564 -74 393 -383 -415 348 343 -428 -159 374 171
2129A71l85M41J28o40K49L62k30m47O07J42o73L89K3m4o06N65K48l63l56P39n27
$$ 171 -214 227 355 -285 -36 326 96 -351 256 398 -275 114 137 93 -513 52 300 -63 -419 320 -207
2150b07q8L06K69m35q5N30J56p08K12L58m49o9K84q8m93L33n9J54j08j09N21k78
$$ -207 -295 11 280 -155 -240 290 446 -262 -50 308 -141 -210 74 -14 -507 -174 -233 -79 -187 -296 225 -53
2172e3j84M96k98k68K79K7J13p0p6K60m31L21Q8k78q0K6r9J43j13J46M7l20J28
$$ -53 -237 259 -39 -307 -28 -1 112 42 -34 226 -205 116 204 -74 -154 -128 -227 -84 -197 -51 -4 -324 -196
2195a96J27q7Q0K29L5k20L68k59J33j12l19J46o9J27J59l24j6R8J3N8p1Q4K6J43
$$ -196 -69 -156 -76 153 188 -32 336 77 210 98 -221 -75 -144 -17 142 -182 -198 -100 -87 -29 -100 -16 10 153
2219A53j79M34l83M3J67o4k58K41%P1k73j67L77k54J72j60J58l87L32r0j23K07
$$ 153 -26 408 25 68 235 171 -87 154 154 225 -48 -215 162 -92 80 -80 78 -309 23 -67 -190 17
2241A7kK34j59l70O67l53L3K24m24R4J32o1M7j00k05L95l77J76R2l39K86L23l32
$$ 17 15 249 90 -280 387 34 67 291 -133 -39 93 32 79 -21 -226 169 -208 -32 60 -279 7 330 -2
2264bQ0J54l60L60k23M3K62m26L6J69r6j52K67k32J17l25J17K44j83R5K25k98
$$ -2 78 232 -128 232 9 52 314 -112 -76 93 -3 -155 112 -120 -3 -328 -211 33 -150 -55 170 -128
2286a28O0J41k01Q5L12j60J7L9k95K72k04o7L65m79n4K95n7K06k49r8J58n6J26
$$ -128 -68 73 -128 -43 269 109 126 165 -130 142 -62 -129 236 -243 -297 -2 -59 147 -102 -200 -42 -98 28
2309B8n0j12M2K37l8j80K93n5lk71R8J54l24K6K77o1k84K68j4k49M03j03J03k22
$$ 28 -22 -134 -92 145 107 -73 220 165 162 -109 -11 143 -181 -155 122 61 -223 45 31 -218 185 82 185 -37
2333c7j2R0K8k61M65m42J22R2j64Q1j91L00J14k58j19K51p6lK1K60j84N7j8J12
$$ -37 -49 41 69 -192 273 -169 -47 45 -119 -38 -229 71 185 -73 -192 59 -17 -20 1 261 77 134 116 228
2357B28l59J27K23k93LM16k21l08J88M4j66K24k21K20n9j06P9l3n5K82J5j43L8
$$ 228 -131 -4 219 -74 -71 345 124 -184 4 48 -118 106 -115 105 46 -60 19 -14 -69 213 228 85 123
2380A23n1lk5p7J36k51Q2K95k80o8P3N9k15j8K42J31k10j78M37k82k1K26j29p9
$$ 123 72 69 44 -33 103 -148 -66 229 -51 -119 -46 13 -202 -220 22 153 -57 -235 202 -80 -101 125 -4 -83
2404h3L60l30K3j21J30o1J8R8l3j12J92M4L1k84O9M7o7k79L99J27k53J2K73j38
$$ -83 277 -53 -30 -151 -21 -82 -64 34 1 -111 81 125 156 -128 -59 -12 -79 -358 41 168 -85 -73 200 62
2428F2M5pk00Q4L4O2J21n21J64K09P4j24M0Qp0j56K13j79J32k4M43m19j23L83
$$ 62 107 100 -100 -16 18 80 201 -320 -156 53 127 3 43 51 -19 -175 38 -141 -9 -33 410 -9 -132 251
2452B51l91k9L38k31JM6p3K26l11J46K42l64k34L57Q8L0j76K77Rn24K06L22k98
$$ 251 -140 -169 169 -62 -61 -15 -88 138 -173 -27 215 -149 -383 -26 62 92 -84 193 202 -322 -116 206 -92
2475i2mJ63q4o6l2J2m2J52%Q9k21K10N3l56N4M42k7j87j9o0j49L8N5M10o15K02
$$ -92 -96 67 -17 -83 -115 -103 -145 7 7 96 -125 85 138 -218 -164 278 251 64 45 -15 -164 -126 -71 339 -276 -74
2501g4K99j47m21L59j12j75K37L34k87r6J43K54j80r4M9o6k60K03R2j32l25N72
$$ -74 225 78 -343 16 -96 -271 -34 300 13 -83 60 314 134 40 89 23 -237 -34 58 -74 -399 173
2523A73N7m31J5L55m28r4M18Nl99L22K66k19l8J19oj69M9K40l07J75k5k67M1L8
$$ 173 230 -201 -186 169 -259 -353 65 70 -329 -7 259 40 2 121 115 -54 -5 235 -72 103 78 -189 -148 -110
2547a10K54j29k26J91O5r0j62M05q5r0J56jj12k31L07P3m32K71J66m53J52K25
$$ -110 144 15 -211 -20 45 -45 -207 198 113 23 179 178 66 -165 142 215 -217 54 220 -233 -81 144
2569A44r6j35jK23k33l2J08J74m94M21j4j00O8j3M4j00O0M2Pk08J77K44o27L34
$$ 144 48 -87 -88 135 -98 -130 -22 152 -342 79 65 -35 33 20 64 -36 24 66 73 -135 42 286 -341 -7
2593gK40j85j90J32Q9L4j88l0K0J18J03J7j25L3jj09j92K21l1J07j91J40M7j44
$$ -7 233 48 -142 -10 79 113 -75 -105 -85 33 136 153 28 61 60 -49 -241 -20 -51 56 -135 5 52 -92
2617i2r9N6J10kj9L0J4j4J21J05j93p5J58m3k6q1J08j83K33r4k49N7J27Q2K69
$$ -92 -191 -135 -25 -27 -46 -16 -2 -16 105 210 17 -58 100 57 31 -50 58 -125 108 14 -235 -178 -51 31 300
2642C00k39l01K34O1n8O6j33L08k28R8j04j34J55j37j44K31m4J55j17L6J47l75
$$ 300 61 -240 -6 55 -3 63 -70 238 10 108 4 -130 25 -112 -256 -25 -69 86 -31 5 152 -223
2664b23j09O06l36M7K35j46O9n3K1K5p0k38K39j77J10L6j76P3K01k18J31m85N73
$$ -223 -332 274 -62 -15 220 74 143 90 111 136 66 -172 67 -110 0 36 -140 -67 134 -84 47 -438 135
2687A35j72JJ60N0p5l93K73L49j99k09J28J20j53q5J12j0L5%l49K18R3p6r6O3
$$ 135 -37 -36 124 174 99 -294 -21 328 129 -80 48 168 15 -70 42 32 67 67 -282 -64 29 -47 -143 -80
2711h0K77o8j55L0J80k98K00M0Q1k68J58j19J97j01n5K01k67O5J51m89J88K02
$$ -80 197 129 -26 4 184 -114 86 126 207 -61 97 -22 175 74 19 220 -47 18 169 -320 -132 70
2733G0k21J73N3j36o8J41N1m3m2M6m2K08k95J45j13q2J56N1J27k67J39p4r7O2
$$ 70 -151 22 75 -61 -129 12 63 20 -22 24 -18 190 -105 40 -73 -155 1 52 179 -88 51 -23 -120 -58
2757e8pK81r0o3oQ7l26K27J1k58J69m2j8J8l0r3Q2J78K9J2j02N0J35j75n4J55
$$ -58 -65 216 126 63 57 144 -182 45 56 -202 -33 -75 -93 -75 -105 -198 -116 62 91 103 1 51 186 11 -43 112
2783A12k28K82k30K01k36K27j39K6%k4j5j28J34R3j41k2q1K13m5k25M14k10L9
$$ 112 -116 166 -64 137 -99 128 -11 15 15 -9 -24 -152 -18 75 -66 -88 -169 44 -1 -226 188 -22 17
2806A7k07K21Mj97NN5M5K16k15J30k23J74k19L2J25j9K5MP8K8j20J21rP1p7k01
$$ 17 -190 31 35 -162 -157 -102 -57 159 -56 74 -149 25 -194 -162 -37 -56 -31 -27 51 79 -41 80 71 142 65 -136
2832a36K10o8l0j2K6M8l7k10P4K51q3j34P7K2oR9%m4M6k34K98p9n3Q1p8P2k22
$$ -136 74 6 -24 -36 -10 38 1 -209 -135 116 33 -101 -24 -2 -8 91 91 47 93 -141 157 78 25 106 28 100 -122
2859a22J44j12J48j33J1M8j38N5jL26j72k17J19N5l9K67k21j97l1K46Q3j88j0
$$ -122 22 -90 58 -75 -64 -16 -154 -99 -100 226 54 -163 -44 11 -28 239 18 -179 -210 36 119 -69 -79
2882g9J21J70j23p8O6Q7k7j52P9K01l50K34k01j21J27mK00l69J95O9k05K01j72
$$ -79 42 212 89 11 77 164 137 -15 64 265 -85 149 -52 -173 -46 -50 150 -219 -24 45 -160 41 -131
2905a31J13oM7k3o7L21j73k01K43o1L47l67o5n8j4J32m2n7R4j79J19K94j88j46
$$ -131 -18 -24 23 0 -67 254 81 -120 123 62 409 42 -23 -81 -95 37 -5 -62 32 -147 -28 266 78 -68
2929f8K02k38j0J76j77k2J30L0Oj03M3J30k33L09j05p6J83J00n21P9M01j97M8
$$ -68 134 -104 -114 62 -115 -137 -7 23 29 -74 -31 99 -134 175 70 -6 177 277 -244 -165 236 39 87
2952H7rL2k56L9O3M4l1O0k14O4j9R7J5K39j85j13k5P1R7n8N4k32K10K09k89J02
$$ 87 78 110 -146 -107 -44 0 -31 29 -185 -121 -140 -43 -28 211 26 -87 -112 -41 56 -2 52 -180 30 239 -50 52
2978E2n0j76p0J40L30j37p3L9r7J6J75o5Q4l15L09j45L6j41K16j24n0J93j43o
$$ 52 2 -174 -244 -104 226 89 16 55 -42 -26 149 84 168 -147 162 17 53 -88 128 4 -46 147 4 -2
3002bj16j04K87o4n8J59k55K22r6k4j07R4l3J78J50j38o1m2o4J60N0j97qM1M9
$$ -2 -118 -222 65 1 -57 102 -153 69 -27 -51 -158 -64 -97 81 231 93 32 -10 -74 86 136 -61 -69 -28 21
3027B1m1k8j8Q1K27k82K4J10j53K56l91L29k48J79j92K65j14O4k68K21j53J26
$$ 21 -20 -48 -66 15 242 -40 -16 94 -59 197 -194 135 -113 66 -126 139 25 89 -179 42 -111 15
3049A5J48k5j40J33pn2k27K37K7J5j33j16K68j82j6M4j33J08K07J3j99j06O3j30
$$ 15 163 138 -2 131 124 72 -155 82 109 124 -9 -125 143 -39 -55 -11 -144 -36 171 184 -15 -121 -58 -188
3073a88N6P2J28j53K33j87J47j49J51k44J14j35P3p2K46k28LJ18j46K04O0J16
$$ -188 -132 -60 68 -85 148 -39 108 -41 110 -134 -20 -155 -82 -154 92 -136 -133 -15 -161 43 103 219
3095B19j93r8J82j07M1m0P3l04J79k2J36j13M6pO6O4Jj09J39l48J00PK05j40k10
$$ 219 26 -72 110 3 44 4 77 -227 -48 -70 66 -47 -1 -8 58 122 123 14 153 -195 -95 -88 117 -23 -233
3120b33K37J15n6j02J37j38L25l27l8MJ69n3j04O0k2o2J83Nj53Q8k9Q2j14J81
$$ -233 4 119 63 -39 98 -40 285 -42 -80 -76 93 40 -64 -4 -26 -88 95 100 -53 35 6 88 -26 155
3144A55k71m9K36j58O4P6r3j26J27k0J69j41L31k71r9M0j3m6O2j60J67Kj1q4L20
$$ 155 -116 -165 71 -87 -23 53 -40 -166 -39 -59 110 -31 300 29 -70 -30 -43 -89 -27 -187 -20 -18 -29 -113 207
3169B07j89K9lL6j40j39J93n2p0J37j99q7L86L7j72n8Q4r3n7J17K33k59K37nj48
$$ 207 18 47 44 80 -60 -199 -6 -58 -128 9 -190 -277 109 146 -26 -84 0 -93 -150 -33 200 -59 178 173 25
3194B5OR5J3j64J87o8j99Q4k9nJ6p1R1K6o8J40Kr5j5J03k39L03j04m4N5j6j94
$$ 25 31 126 139 -25 162 94 -105 -21 -50 -55 -39 -110 -19 7 -61 79 81 -14 -29 74 -165 138 34 -10 45 29 -165
3221a65K70q2j9J57m9j75J56k18J13J69j19j72Q3J38j21O2N3j54j71K83j81J7
$$ -165 105 23 4 161 112 -63 93 -125 -12 157 38 -134 -51 87 -34 28 81 -73 -244 39 -142 -125
3243a25J41J27j35l1J25j7l7l8K04m7k22K83k36j00l4j07J77M1k90K00J94m5j1
$$ -125 16 143 8 -23 102 85 48 10 214 167 -55 228 -8 -108 -142 -249 -72 -31 -321 -121 73 28 17
3266A7J72l26nJ86r2M1j36K29p2J34q4j27K81l02K74k15q9J42j8K9q7j9J30k23
$$ 17 189 -137 -142 44 -48 -7 -143 86 14 148 64 -63 218 -84 190 -25 -114 28 10 39 -48 -67 63 -160
3290a60RJ35p8O8n0J5Q2j39N2O8j15K09Q0m7K1r4r9K43j64R2J9j51o2Q4L4M3j33
$$ -160 -151 -16 -94 -26 -76 -61 21 -118 -66 2 -113 96 176 129 150 56 -43 200 36 128 147 -4 -66 18 52 95 -38
3317c8m7Q1k3Q8J72l75K6J12J37j33J69k38j10K68j17RO5J93k60J06k23r4R5J51
$$ -38 -85 -4 -27 61 233 -142 -116 -4 133 0 169 -69 -179 89 -28 -19 46 239 -21 85 -138 -232 -137 14
3341A4l7j46K60j92J29k3k04K48j12J30n3J21r8j01L9M0m4J94p8j53M8k6Q0o6
$$ 14 -23 -169 91 -101 28 5 -199 49 -63 67 14 135 37 -64 -25 15 -29 165 87 -66 -18 -44 36 -30
3365c0r1n7L38k05n0L7J49OJ1j99J13j30J11k6R0k7p5J41k46J84J56l55R0P0k4
$$ -30 -121 -178 160 -45 -95 -58 91 97 108 -91 22 -108 3 -23 67 40 -35 106 -140 44 200 -155 -65 5 -19
3390a9J3L5o6j11J55k7J34p9J20k23O9p5J19Kp7J7j49J77K9L4j78P6J08o9O9K5
$$ -19 -6 29 -37 -148 7 -20 114 35 155 -68 1 -74 45 47 -30 -13 -162 15 44 78 -100 -24 84 15 84 109
3416A09p8K53k21O3k22K40j61j34mJ36n8N2J59j65l5J63j39L1l34K84M0q0J29
$$ 109 31 284 63 126 -96 144 -17 -151 -155 -19 -77 -25 134 -31 -66 97 -42 -11 -345 -61 -21 -101 28
3439B8KL1J0p2J97k31j05R6J70jj54Q1j32LK16M2j73J12k30J43J17l16M09j47
$$ 28 30 61 71 -1 196 -35 -140 -44 126 125 -29 52 -80 -77 139 181 8 120 -110 33 150 -166 243 96
3463I6J24N1j19k71Q7Q9k00J52J8J30j72k7K29j35j91J02J44m9R5m3j8j88J40
$$ 96 220 271 152 -119 -32 57 -143 9 27 157 -15 -42 187 52 -139 -37 107 58 153 110 92 -96 44
3486D4K2j25R4j55J86j30QJ97m56K74J2L25l09J97k32l4L5J13k1j14J40j12J55
$$ 44 66 -59 35 -120 66 -64 -56 141 -315 -41 -29 296 -13 184 -48 -82 -47 66 45 -69 71 -41 114
3509A14j01r4p3JM8K91l6l34N8L43k05n1qo1lJ72j74O1J83r3j02J28N0l28K17
$$ 114 13 -81 -154 -153 -105 186 150 -184 -126 217 12 -39 -47 -108 -111 61 -113 -52 131 38 -64 64 114 -214 3
3534Cj38RJ01N8m1J04K9j43o5L3q1p3N6Q2K11j21k6j1K29k10j12M5J23j07j24
$$ 3 -135 -126 -25 33 -8 96 125 -18 -83 -50 -131 -204 -148 -66 145 24 -2 -13 216 6 -106 -61 62 -45 -169
3559a69J57Qm9J37J8r5Q4j58K82l60J4L9J95p8J15l02K27M2L8l04K83j10j48O7
$$ -169 -12 -4 -53 84 102 7 91 -67 215 -145 -131 -92 103 25 140 -162 65 107 145 -159 124 14 -134 -67
3583f7J42r8k35M27j67j14J14j45M7R4M8j8J19n2k10L35l38K65k15J53j9j1m9
$$ -67 75 -23 -258 169 2 -112 2 -143 -96 -2 46 28 147 95 -115 220 -118 147 -68 85 66 55 6
3606FJ00k9m4M1j6j54J36l2p2Q7k32Q9J16J97j90l4K37j34j79J01K5j15R7J82
$$ 6 106 77 33 74 58 -96 40 8 -64 23 -209 -120 -4 193 3 -31 206 72 -107 -6 19 -96 1 183
3630A83k00N3J08l11J88j13o7M9N1K19k38j1P8j21L30l70K12k52L5J0J72k70J96
$$ 183 -17 36 144 -167 21 -92 -159 -110 -59 160 -78 -89 -11 -132 198 -172 40 -212 -177 -167 5 -265 -69
3653f9Q7l2P3j97L03j42J3J37l47K2K72j51k8j1L90l00rJ21J87k53K8j09n6j01
$$ -69 18 -14 59 -138 165 23 36 173 -174 -152 120 -31 -59 -70 320 20 11 132 319 66 94 -15 -71 -172
3677a72j2K25J7j83K64m29J78M50n27K95o0o4m5N6mj40J65o3O4j97J24j4J44o6
$$ -172 -184 41 58 -125 139 -290 -112 338 -189 106 46 -18 -63 -7 -11 -151 14 -49 15 -182 -58 -72 72 6
3701Fk7o7K47j92j54k0K71K28k09M1j03k74J31O6J5j54J58O2K2N0j57PK76j34
$$ 6 -21 -88 159 -33 -187 -207 64 292 83 124 21 -253 -122 -56 -41 -195 -37 25 47 97 -60 -53 223 89
3725H9k59J48P2J16j43j07mn9K7K92j72r4L12k44j03J10N8o5k35K72j38L2K7J6
$$ 89 -170 -22 50 166 23 -84 -88 -147 -120 172 0 -94 218 -26 -129 -19 39 -26 -261 11 -127 -95 -68 -52
3749e2Q8k06K38j08K76j21j35J66j39N3m3j03J01mn3N8j98%L01k69J79J77l76
$$ -52 36 -170 68 -40 236 115 -20 146 7 60 17 -86 15 11 -42 16 -182 -182 119 -150 29 206 -170
3772a70L2K48q8j96J49J9j12L1K49j38K2n4J32o4J5Q9j29m9om3J26j8j71q1L25
$$ -170 -138 110 22 -174 -25 -6 -118 -87 162 24 46 -8 124 60 75 164 35 -14 -20 -63 63 45 -126 -207 118
3797A18r0j29K2J5J12J6K6r2k4L51n6l09p6K37k19J33j57J59Q6j75nK8k7J90l0
$$ 118 28 -101 -79 -64 48 64 90 -2 -26 325 269 -40 -116 121 -98 35 -122 37 123 -52 -57 -29 -56 134 104
3822A04p1rj13J8J95k01K60o3j8p4o7J40n1j08J15j07k53N13k27j17j3K00K6Q4
$$ 104 33 24 -89 -71 124 -77 183 120 102 28 -39 101 50 -58 57 -50 -303 210 -17 -134 -147 53 79 163
3846A63k00O1m7K81k52o5J12q3p8L6%K93k96N8j22L0J56j35J1N3j82K24o1J7M7
$$ 163 -37 24 -23 258 6 -59 53 -30 -108 -72 -72 221 -75 -17 -139 -109 47 -88 -77 -24 -206 18 -43 -26 21
3871B1k0p0K96k09j04J25j71J49j01j12L59J27l15J44j42p8J38m4Q4j83J49j53
$$ 21 1 -69 227 18 -86 39 -132 17 -84 -196 163 290 -25 119 -23 -101 37 -7 77 -106 43 -110
3893a10M2P9j24J03j36J3K30j32K8j45K13k94M8O9N8j76L01k5J8j8p6K68l68j5
$$ -110 -68 11 -113 -10 -146 -133 97 -35 -7 -152 61 -233 -185 -116 -58 -234 67 42 60 42 -34 234 -134 -149
3917a49M32j99rj8j2q4M7j60mP8O4N8k17N8M07k92k58K86l5RQ9m7j12K45k61J47
$$ -149 283 84 75 57 45 -39 8 -152 -156 -78 -14 44 -173 -115 292 0 -258 28 -7 2 91 44 -68 177 -84 63
3943F3L1k96J22nM5J11j37M5K5j09K76m7j12P0k8j71L48j25k56J37O3N0k54N4
$$ 63 94 -202 -80 -85 -40 71 -66 -21 4 -105 171 124 12 82 54 -117 231 106 -150 -13 50 100 -154 -100
3967a00R9j47J23N9N8j36K67k88%J06j62J86q5j5J42r2k90J65R7J04j39Oq7K27
$$ -100 -1 -148 -25 34 92 -44 223 -65 -65 41 -121 65 -20 -35 107 15 -275 -110 -13 91 -48 -42 -129 98
3991I8p5L2J8j68J66j97Q1O4M1J03r8k03N0J59j55J08J67MJK5k17J64j79jJ4K3
$$ 98 23 55 73 -95 71 -126 -45 19 60 163 65 -138 -88 71 -84 24 191 195 196 221 4 168 -11 -12 2 25
4017B5j28j30K13J60K6p0J16j24p3J68q6N0k92K7J25k15RJ61j29K9R8k1j12K76
$$ 25 -103 -233 -20 140 166 96 212 88 15 183 97 147 -145 -118 7 -208 -199 -38 -167 -138 -40 -61 -173 103
4041A03k30J89j67J17J9j4j13J76OL7l1o4p8K2K6k0L0j4jq0K4q0K07j2q4j67M11
$$ 103 -127 62 -105 12 31 17 -96 80 86 123 92 28 -50 -28 -2 -22 8 -6 -7 -87 -63 -143 64 52 -32 -199 212
4068B12k58k46K38p5K55q9l8pl8J3p7J88j05K44m13M06j02j2o1j17l0j62P4J02
$$ 212 -46 -292 -54 -129 126 37 -1 -8 -46 -33 -110 78 -27 217 -196 210 108 96 35 -82 -112 -274 -200 -98
4092i8L3J8nJ53j48R7j64N8L19j03j29j42J89j61R5l1J20j45K12k84J69l3P6J52
$$ -98 -65 -47 -52 101 -47 50 -114 -56 263 160 31 -111 78 -83 12 -19 101 -44 168 -116 53 20 96 248
4116B48k41J9o6l9K44j02k7rj79O5J85j9q2J21o7J58j32j94K43j23j12J63j1r2
$$ 248 7 26 -40 -79 165 63 36 27 -152 -87 98 79 -3 118 51 209 77 -117 126 3 -109 54 43 -49
4140d9n3J04J30j21Q9J3k33J17N8j03o3L8N1r6L1R9j39K29j96K02j48J07j18K95
$$ -49 -102 2 132 11 100 113 -120 -3 55 -48 -111 -73 -22 -118 -87 12 -127 102 -94 108 -40 67 -51 244
4164B44k58L8j55O5p8nK90k31J4j54J18r6J92k5j29J26K93j95R9l6RR3j86j73
$$ 244 -14 24 -131 -66 -144 -149 141 -90 -76 -230 -112 -208 -16 -41 -170 -44 249 54 153 117 126 219 33 -140
4188a40JJ63j53K32Lk3Nq1Q4j27k24L25o9l4J69J11k91J19O8l3j35j1k7R7K45
$$ -140 -139 24 -129 103 106 83 88 7 91 -36 -260 65 -4 -38 131 242 -49 70 138 105 -30 -41 -68 29 274
4213B74m50R2K36l6q7j25J54o6o7n3L2N2R1L8j06p1J56K5j84K77j56J35r1J0O
$$ 274 -176 -84 152 116 29 -96 58 -8 -75 -128 -96 -44 47 85 -21 -92 64 89 -95 182 26 161 70 80 86
4238H6k83K51R4j82j07L10l65K87k7p7Kr0L2O9n2Rj6j52K39J11j65J28j53J4K4
$$ 86 -197 54 148 -34 -141 169 -196 91 64 -13 -11 -101 -69 0 -52 -43 -59 -211 28 139 -26 102 -51 -37 -13
4263a3pk5L5N8k1N3j00O0P7j56J93k80K7J1m7L24j72J6K6M9r5Qj91N3J01k19K63
$$ -13 -20 -45 -10 48 27 80 -20 40 117 -39 154 -126 -99 -88 -135 189 17 33 59 108 13 21 -170 -117 -16 -235 28
4290B8j11L1r4K6J90K7j15OK6r2O5P5k42l3J04n4Q8m1m3K1N7j13K33K6k42K06
$$ 28 -83 -52 -146 -120 70 97 -18 -12 14 -78 -13 62 -180 -213 -109 -163 -75 -116 -159 -138 -81 -194 39 65 -177 29
4316B9J3j54M44l53J09j11J18m6j65J76j5j75J97j34l0L19k33J58j85n4K08n1
$$ 29 42 -112 332 -21 88 -23 95 49 -116 60 45 -130 67 -67 -97 222 -11 147 -38 -92 116 65
4338F5o8r6L76k00L8l9j23K55k10k7Q2q1J02j83k0J85qj98J34NNj0l6pq9k0K98
$$ 65 -3 -99 277 77 115 76 -47 208 -2 -29 53 -28 74 -109 -129 56 48 -150 -16 -11 -6 -16 -52 -59 -148 -168 130
4365A30r3p7J45p0n3N5Q4j23J70k86J60q6K10n1j31N5K8j44J12l2k3k10J75N2
$$ 130 37 -40 105 35 -18 37 121 -2 168 -118 42 -44 166 115 -16 39 67 -77 35 3 -20 -230 -55 -3
4389cO1K12j42k98J39l4N2K04m13J64P5q4J54j68J04o4k3J05J33j76r1l5K16L6
$$ -3 58 270 128 -170 -31 -65 -13 191 -222 -58 17 -67 87 -81 23 -41 -64 41 174 -2 -93 -128 88 124
4413A24j64Pm6k3N2O8p9m3j7J36j13J57r0oR1m9q2J86q1r1P4o7l0R2k12J80J00
$$ 124 -40 -33 -79 -102 -50 18 -61 -104 -121 15 -98 59 -31 -37 54 5 -77 109 28 -63 11 -56 -86 6 -206 -26 74
4440G4j48N6k61J10J86J14lj94K2J58k58L25j31j1K3K0J48n1n7J02k59P7J40k77
$$ 74 -74 -18 -279 -169 17 131 128 -66 -44 114 -144 181 50 39 62 82 230 179 122 224 -35 42 182 -95
4464i5j43J96K39l02J14pj0q0o5J73j16K06j72J12m0O4oj13N2q2k7O6L1J4n4k4
$$ -95 -238 -42 197 -105 9 2 -8 -88 -153 20 -96 110 -62 50 10 74 68 -45 7 -75 -102 -36 -5 9 -45 -69
4490f9J14k33J67P3k73L2L15q8m5m9l4K40j87J04N1l08O9J89q4R5kj83K4J26k01
$$ -69 45 -188 -21 52 -221 -189 126 38 -7 -56 -90 150 -37 67 118 -190 -121 68 -16 79 77 -106 -82 44 -157
4515a57J84J71k59J55j68J00j93K74j9J22k49K56j92k3mN2m6J3K3p3K3R8j49j0
$$ -157 27 198 -61 94 -74 26 -167 107 88 210 -39 217 25 2 -2 50 4 17 40 -33 -10 88 -61 -71
4539g1l2J32j08N4L30k74L2O7J1j57q1J59p4Q8k20O2n1J85k47K28Q8j39j67L84
$$ -71 -103 29 -79 -25 305 31 63 130 141 -16 -97 62 -12 76 -144 -82 -133 52 -195 33 121 -18 -185 199
4563A99J2l53K12n8j81M16n36L83q5l0o8j24J61j14Q2R5n1n6J53J25j38r9o6J54
$$ 199 211 -142 70 12 -169 247 -289 94 9 -21 -89 -213 -52 -166 -84 11 -40 -96 57 182 44 -55 -121 33
4587C3J3Mj13J03k7q2J76l53L03j93J15OK9J41k39j1P8o6j00J09K31o2p8m9j9
$$ 33 46 50 -63 40 13 -69 107 -246 57 -136 -21 -15 14 155 -84 -95 -17 -83 -183 -74 157 95 17 -32 -51
4612e1L10l47o3J85np8J12j42K09k11q3J29J69Nj35n7L6P9j71K65j79n5j18J92
$$ -51 259 -88 -151 34 29 -49 63 -79 130 -81 -164 -35 134 139 4 -53 -17 62 -109 156 -23 -78 -196 -4
4636dj21J76J04l09R8L1o5L2J40o4L9k3N8m2p1P0N9l3p6R9j1j51o7J48M9k24Q3
$$ -4 -125 51 155 -154 -56 -25 -90 -58 82 18 57 34 92 50 -21 49 108 75 -1 98 87 -64 -131 17 66 -158 -75
4663g5K05j13N6l1K5J44k12J36k79M1L02j64k69K95j45J11Nk62J16P9q7j23K19
$$ -75 130 17 73 42 67 211 -1 135 -144 -103 199 35 -234 61 -84 27 32 -230 -114 -35 -122 -245 -26
4686b6m1J48Mk02J34M3n3j23mK35J36l52R4K42m8J5p1k46M85k71j38L0m3o6J73
$$ -26 -67 81 85 -117 17 60 7 -116 -120 115 251 -101 -7 235 187 202 131 -115 370 99 -39 -9 -52 -118 55
4711E5j8j6n2K08o5j15J56o2p3K59k18q3J1r1R9M7J1M1j59P9J9m7j40J17K6L6
$$ 55 37 21 -31 177 112 -3 153 91 18 277 59 -24 -13 -104 -5 42 53 94 -65 14 33 -14 -154 -37 -11 25
4737B5p1Q4k2Q7j99N9J83j45m3%J04%Nj43M4K62l04J81l4q7J96ol01LL93k43M3
$$ 25 -46 38 16 103 -96 -37 146 1 -42 -42 62 62 67 -76 -32 230 -74 107 73 -14 182 176 -125 -122 271 28 71
4764G1o4K4L6Q6j4j46L9j88K77j26j1M3j53o1O2R9r0L88k60k9n3J98o5l6k5J29
$$ 71 7 31 67 153 139 -7 32 -156 121 -5 -16 27 -126 -187 -125 -26 -116 272 12 -17 -70 128 63 27 2 131
4790A31k50J35j04K31q2k12J27Q0R7j28l3p6J57m2q6p4J45MR5r5J32m1j08k5r7
$$ 131 -119 16 -88 143 61 -151 -24 56 153 25 -8 -84 73 31 -55 -129 16 20 115 20 152 111 3 -22 -119
4815a19K25j8J55j65p8j17J89PR6j25L6j31L8j34K00q9J00j09N2J11J6j3j50k4
$$ -119 106 88 243 78 0 -117 72 79 175 50 86 -45 -7 -141 59 -30 70 -39 13 124 140 127 -23 -47
4839d7J45k26o4L14k37J67k24M37k31l6q1K29j82J24l37K51Q7k21K41k06N6P8
$$ -47 98 -128 -192 122 -115 52 -172 265 34 -2 -83 146 -36 88 -249 2 89 -132 109 -97 -41 37
4861C7j21N8l4o1K00k01r6J25J36m5PP8p4j16J35L45k81K09l27K3l37L98k13K80
$$ 37 -84 -26 -60 -121 79 -122 -218 -93 43 -2 5 83 9 -107 28 373 92 301 -26 -3 -340 58 -155 125
4885A25M3l07K74j44j77L14j47J65j03j60PJ63m9J79k22K3K25j68Q1m2k69J63
$$ 125 168 -139 135 -9 -186 128 -19 146 43 -117 -110 53 4 183 -39 -16 209 41 122 80 -189 -26
4907b6K1j41q0o0L17l15K45M3r5K67l80J21R7K05j40L6P8j97O7k04R0J18k36K40
$$ -26 -5 -146 -226 -286 31 -284 -39 4 -91 176 -204 -83 14 219 79 115 193 -4 63 -141 -51 67 -169 71
4931G1R0k34r9J50j63K36j33R4p0K15k20J65L2k69K95j31j39K80j83l0l0J35p6
$$ 71 161 -73 -172 -22 -185 51 -82 12 -58 157 -63 102 134 -135 160 29 -110 170 -13 -43 -73 62 -14
4954a4p1r4K79Q3j47L7L1m4k12J67j21K35l12K05M3j86P3J94j5m12L92k67J30
$$ -14 -85 -179 100 183 36 73 104 60 -152 15 -106 129 -183 22 65 -121 -48 146 131 -281 111 -156 -26
4977b6J1L8P8j72R9j9k01J67K84j98K44l14Q5K1l6j16R3P6k92L67l11MK03j83
$$ -26 -15 23 101 -71 28 9 -192 -25 259 61 305 -9 76 97 61 -55 38 114 -178 189 -122 -118 85 -98
5001i8J0N7o2J92l7L5q0J1J09k3j97K8J67l06J46J24QM7j13j22L46k98o2J7K11
$$ -98 -88 -31 -93 99 62 97 17 28 137 114 -83 -55 112 -194 -48 76 84 131 18 -104 242 -56 -118 -101 110
5026A10j33O9j2k1j62Q6K4r9J67K5r4l8Q1j29L66k53j3k24K11P3J08p3k00K03
$$ 110 -23 46 34 13 -149 -63 -39 -138 29 54 -40 -78 3 -126 240 -13 -26 -250 -39 34 142 69 -131 72
5050G2j8l9R4L9l11J9K31O8k1m8J25l01j79J80J00k03Q5j8k8K42j81J18J56k56
$$ 72 54 15 109 148 -163 -144 87 155 134 86 211 -90 -269 -89 11 -192 -107 -125 -153 89 -92 26 182 -74
5074g4Q6m8JM6L0J07q7l2O0R1k03j40L30k94P8J1K78j49k00J14J03j33LK03j94
$$ -74 12 -36 -35 11 41 148 61 29 89 180 -23 -163 167 -127 -49 -38 240 91 -109 5 108 -25 -22 181 -13
5099a3J38p2R7j26n0RJ39r4q3L9J05rj14R2q7J3K1m7J6k6r8L22k30k3L1K82k83
$$ -13 125 53 150 24 -26 -17 122 28 -55 -16 89 80 -34 58 -29 -16 5 -42 -26 -52 -150 172 -58 -81 -50 232 -51
5126e1R1Q1k34K02m9j86J02K94l9r7k57o1L77j46m4n8jJ30J8q7J48j89j50J50
$$ -51 40 121 -113 89 40 -146 -44 250 211 114 -143 -204 173 27 -17 -75 -76 54 72 -15 133 -56 -206 -56
5150e6J84l34K04j36O2J33j35L9J45n7j12k9jJ13m5Q0O9l08K93j50N8M7j0p3K8
$$ -56 128 -206 -2 -138 -76 57 -78 -39 106 49 -63 -92 -93 20 -25 55 124 -184 109 -41 17 64 54 -19 9
5175IR6mr8J7M1L2o5k3p1O4pm7p9K4K3K93k41J80l00L42ll68J97Q2k48J15K6k9
$$ 9 105 101 3 20 61 93 28 5 -66 -2 -9 -56 -135 -111 -88 205 -36 144 -156 186 183 -185 12 94 -154 -39 -13 -42
5203d2M8n8K12r0J67l71Q7J54j06q2j6O1N8K5O6j6J6j91M4J47J02j81N0p1J50
$$ -42 6 -52 160 70 237 -134 -47 107 1 -81 -97 -36 22 47 113 97 113 -78 -34 113 215 34 84 13 163
5228A63k68N3J61q0qjppK4n3J16K9k54L66o0k63O6j2j24K38J22j55q4m2l2K96
$$ 163 -105 -52 109 29 21 20 13 6 30 -23 93 122 -132 234 174 -89 -23 -35 -159 79 201 46 -38 -80 -112 184
5254A84o2k79Q3J31q5K8J22j77J68j33m5p4J15j60J39R9k83L43j68j89L32K9k71
$$ 184 122 -157 -74 57 -28 0 122 -55 113 -20 -65 -139 -24 -184 -45 54 -229 114 -54 -243 89 118 -153
5277a53J44q6j3m2J66j29K15k98J44l9R5N7k70J37J37K0k45K08K6n8O7j65J26
$$ -153 -9 -95 -108 -150 16 -113 102 -196 -52 -91 4 61 -209 -72 65 85 -160 48 74 16 83 -82 44
5300D4k21p8J36J11p0R9o3K9k77M85k73j6m4J38p7k3J1q9J64Q8Mj12M7k08K15
$$ 44 -177 -255 -119 -8 -78 21 -42 -13 -290 195 -78 -94 -138 0 -77 -100 -89 -178 -14 74 78 -34 13 -195 20
5325B0R0o2R7j97J49k24K2J30j86K20o0O2J07l38J61J09j22O0k4rOJ75J07n56
$$ 20 110 48 145 -52 97 -127 -105 25 -161 59 -1 61 168 -170 -9 100 -22 38 14 5 11 186 293 -263
5349b63K26Q1p6Q7j45J53m1J9k78J15j76K82Q3j66k6M7o1N5L37l24J13o6O9r8
$$ -263 -37 44 -32 55 -90 63 22 41 -237 -122 -298 -16 67 -99 -125 -78 -139 -84 253 -71 42 -24 45 -53
5373e3o6J58p5l2J11q4r0J2LL14l12J55P3k33R9q4R1R5j54J61m2pJQ7k68O7K4
$$ -53 -119 39 -36 -68 43 -41 -131 -119 -116 198 -114 41 114 -119 -20 -104 -13 82 -72 89 47 40 41 128 -140 -73 -49
5400d9K9o2Q9P8j82Q5N9J6R6j54J50O8j74M4o2K79l74P3J3o5J08n9q6j31K95l07
$$ -49 -20 -82 7 85 -97 -12 47 63 159 5 155 223 49 93 31 310 -64 9 22 -43 65 6 -80 -211 84 -223
5426b23mK29j03J37rr5K30j63J11j29k1j78L14j61k7J54O4q6r4j78J99Q5k61J16
$$ -223 -227 2 -101 36 27 -68 162 -1 110 -19 -40 -218 96 -65 -92 62 126 40 -54 -232 -33 52 -209 -93
5450i3j9OJ54J33k44J30j02k1o5K1L56l28K5J5j1r5J25r5K67j07k31M9K01j95
$$ -93 -112 -106 48 181 -63 67 -35 -56 -121 -100 256 -72 -47 -32 -43 -138 -13 -108 159 52 -179 -130 71 -124
5474a24J07M15j72K10m20Q2r4N1OJj99J26M2P8j03R4j60N3k8L3J58k10N6j70m3
$$ -124 -17 398 226 436 16 98 4 55 61 62 -137 -11 31 109 6 100 -60 -7 -35 -2 156 -54 2 -168 -211
5499b11L75N3rNm6j18j1J2r7L7j94L21Qm11J90K03J3j37R8k20L58k02k12N09l22
$$ -211 164 217 208 213 167 49 38 50 -47 -10 -204 117 125 -286 -96 107 120 -17 81 -139 219 17 -195 314 -8
5524hmJ37l33R6J52P9j34J6K45q8k69Q3j35J95J6n6K35j28r5k0l7l6PR7J12k90
$$ -8 -12 125 -208 -112 40 119 -15 1 246 158 -111 -28 -163 32 48 -8 227 99 4 -16 -53 -89 -82 15 127 -163
5550a63J76o4oq6L05k16J30k37J18N7j3J5j31L10j4r1p1n6j5M38m20J37l16K88
$$ -163 13 -51 -57 -143 162 -54 76 -161 -43 14 1 16 -115 195 181 90 19 -37 -52 386 -34 103 -213 75
5574G5O4j16k03J37n3K1J49j40K17p7j86OJ71j56L4J61k30L16l29J51J5L0J00
$$ 75 139 23 -180 -43 -96 -75 74 -66 151 74 -112 -106 65 -91 -57 104 -126 190 -139 12 27 57 157
5597A57n5j11J34k68R8N0K9Mj59L0k1O7Q0N0k92K51j40p3L28o1k69K68j9j86P1
$$ 157 102 -9 125 -143 -45 5 34 38 -121 -91 -112 -45 35 85 -207 44 -96 -169 159 98 -171 97 78 -108 -37
5622c7nN5o1J08l0o1K5j16J22j25Q8J55j37J08R1j00Q7j79M8m6n6K96j38Qj3j85
$$ -37 -42 13 -48 60 30 -31 -6 -122 0 -125 -37 118 -19 89 180 80 167 -12 36 -10 -66 230 92 100 87 -98
5648i8P0l5K48l99J79k4j48J51pk4J75j73J66r0K57k39p1J11pk4l63J95J72K33
$$ -98 -28 -63 185 -214 -35 -59 -207 -56 -63 -87 88 -85 81 -9 248 9 -62 49 42 18 -345 -150 22 255
5672B55k32P8j3k60K16k05J35J24q0nP3O4k10J06l85L67o8N4j5o4j54J94N3K4
$$ 255 23 101 88 -172 44 -161 -26 98 18 13 86 150 -60 46 -339 28 -40 14 -1 -65 -219 -25 28 52
5696E2j85K07j67J0J92k67K05p4P2pK5j5j31kJ01j85K14k7j5j59J59L5K5j71k8
$$ 52 -133 74 -93 -83 109 -158 47 -27 45 38 63 48 -83 -85 16 -169 45 18 3 -156 3 38 63 -108 -136
5721a36J60J37m08L54j32Q0R0k2r7M0Q4n1K3j87m2J4K8J32j9o7J09j61j65J76
$$ -136 24 161 -247 107 -25 55 145 123 26 66 150 99 122 -65 -107 -93 -65 67 48 -19 90 -71 -236 -60
5745f0KK04l07KK76J5m4l11K48k5K2N7j31j5j12L27J04k59lL9Q4K7k4j7j16P4
$$ -60 -58 146 -161 -159 117 132 88 -223 25 0 22 79 -52 -67 -179 148 252 -7 -10 29 113 140 116 99 -17 57
5771E7J0k04J83J33m0k9j05k8j06K04k61K7K82l12L06p6o0r2k0K38j25N7j75J35
$$ 57 67 -137 46 179 139 110 5 -23 -129 75 -186 -159 123 -189 117 41 -19 -111 -131 107 -18 39 -136 -1
5795akN2K59k67j7J9P6o0Jkn1j94J90J31j88L5j20O6P5K2m1J60k55J28j61J82
$$ -1 -3 49 308 41 24 43 119 59 60 58 7 -187 3 134 -54 -19 -139 -73 2 24 -17 143 -112 16 -145 37
5821C7M7j32J37j98N4K8k8K7k59N46p6j45J83j91j8K83o1l55M3N3RN8J08l57K13
$$ 37 84 -48 89 -109 -55 -27 -55 -28 -287 259 183 38 221 30 12 295 234 -121 -78 -25 -16 42 150 -207 6
5846FJ73k96j76J42L85l73K38k90M22k84k0M9R2O5l33K42q8Q9J2J07m16J16K49
$$ 6 179 -117 -293 -151 234 -139 99 -191 231 -53 -73 -24 68 133 -200 42 -46 43 55 162 -254 -138 111
5869A11K9k01o5k2j7J25J9p8J69k15K61m52M43j8r6k41K07L5j54pK81k09K48j53
$$ 111 140 -61 -126 -148 -165 -40 -21 -99 70 -145 116 -336 107 89 -7 -248 -41 -6 -160 -167 114 -95 153 0
5893@j41K47r9j93K52J41l76p6L11k8j16r5J31K1k4m9K09J9p7J82l29%j68K71
$$ 0 -141 106 7 -186 66 207 -169 -245 66 38 -78 -173 -42 -21 -45 -94 115 134 57 239 -90 -90 -258 13
5917A3j59J34j56J50P2m8R9k05JJ92n8oj20m7n5N1J61j96J53O1k6j7R6j59k02
$$ 13 -146 -12 -168 -18 54 6 105 -100 -99 93 35 29 -91 -138 -193 -142 19 -177 -24 37 11 -6 90 -69 -271
5942b71K05m3k2J23mJ47j43P5p2l5J97m12R5J39J87o8k30K78l4j85k5M8k9K44
$$ -271 -66 -109 -131 -8 -12 135 -8 67 -5 -40 157 -255 -160 -21 166 98 -132 146 112 -73 -98 -50 -79 165
5966A65k08J5n5J76L7k96K79k39K81j06n7K14k02Q0j39J29k52K91k81M55J06p17
$$ 165 -43 -28 -83 93 130 -166 113 -126 155 49 -8 206 4 84 -55 74 -178 113 -168 287 393 -324
5988c24K58n2J75j85J30M6p9R8o0q1j8k9M2K2k7J72j97J85k74J35J53j57L2M7
$$ -324 -66 -118 57 -128 2 48 -31 67 7 -74 -92 -121 -79 -57 -84 88 -109 76 -198 -63 90 -67 -35 12
6012A2O5Kj00J48K6n8q1J52k38Q0L7l6n6Q0l02L96j81j7Q9q0l9J47j59p5M06q8
$$ 12 77 79 -21 127 153 95 14 166 -72 8 45 9 -47 33 -269 127 -54 -71 18 -62 -101 46 -113 -188 218 130
6038A30m22M29Q2m40K27k29M09k52J46j23J37p8J37m3J59k76P4j71J07q9J76R
$$ 130 -292 137 219 -221 6 -223 186 -66 80 -43 94 16 153 110 269 -7 67 -104 3 -86 90 99
6060I9j80P1J14l7L0O4k50K4p6J83j48P9K16k94L1o5Q4J42L6k35K16n9J14k36
$$ 99 -81 -10 104 67 97 161 -89 -65 -141 42 -106 -27 189 -105 -74 -139 -55 87 123 -112 104 45 159 -77
6084g7m1K06j22O2O1j57J07O4Rk95K04K8q8j45J54k0J09o6r0J64r7R8K3k69K29
$$ -77 -118 88 -34 28 89 -68 39 103 112 -183 21 49 -39 -184 -30 -50 59 -7 -97 67 -30 68 91 -178 51
6109E1pL3M9j92n0K24P5j16N2L9j68Qj47K5j8M8K26p9N7R0j04l1j40J19mq2L9
$$ 51 44 77 126 -66 -116 108 183 67 119 158 -10 -2 -149 -124 -142 -94 132 53 110 200 96 65 -75 44 40 -42 -3
6136ck4k14J48K28k12L6K5MM2k01MK6J88K5k93K88J1k08M9K24j01n3N8j07J41
$$ -3 -27 -241 -93 135 -77 -41 -16 -12 30 -171 -167 -141 47 72 -221 67 78 -130 -81 143 42 -11 47 -60 81
6161H1j17k2Q2J40l11J47J22p5J41k53k6K45j39NJ4q5R3N5j21J54n5l12L02j28
$$ 81 -36 -58 24 164 -147 0 122 47 188 -65 -91 154 15 20 34 -51 42 97 -24 130 75 -237 65 -63
6185f3R0j45K01N8j50J03M2j54J2p3O4J30l0j31R2j18K6J73j31N7m0R8l12K90
$$ -63 27 -118 83 141 -9 94 136 -18 -6 -79 -15 115 85 -46 46 -72 -46 127 -4 53 13 111 -201 89
6209H9j9j29K72j71N0l8p2K67j91p2m0R2j05J52q2L6q9P4jJ96k51m6N3J00o1P0
$$ 89 70 -59 213 42 92 54 -18 249 58 -14 -54 38 -67 85 3 39 -50 24 23 219 -32 -78 -25 75 14 84
6235H4k94K72J27k29l1K31j65J89l12N0P4N2k21j27J89J18j02o9K60j65J73l3
$$ 84 -210 62 189 -40 -71 160 -5 184 -128 -78 -4 48 -173 -300 -111 7 -95 -164 96 -69 104 71
6257G1l1J36l63J89m1q5J50L3j66J56k92K48K4k8Mo3J34j14p0L03j60L9p7l9q8
$$ 71 40 176 -187 2 -39 -124 26 59 -107 49 -243 5 29 1 5 -58 76 -38 -108 195 35 74 -3 -42 -130
6282a30k5J71L1k04K72k56J99J71l14j37K66K3j57K81k78J70Q1r1oq8j52J82J18
$$ -130 -155 16 47 -157 115 -141 58 229 -85 -222 44 67 -90 191 -87 83 164 73 67 -21 -173 9 127
6305A27p0k01K89L9j12k3L3k08K18j90K07k72K80J12k52K2m9j7L4K9K5k44J95
$$ 127 57 -144 145 184 72 49 82 -126 92 -98 109 -163 117 229 -23 -1 -50 -67 -33 -4 21 -223 -28
6328b8N4N7j15O1N2J50l49P2l8j19k8J14J72j82J04l1j65O0K25m8j41R0N7J96
$$ -28 26 83 -32 29 81 231 -118 -46 -84 -203 -231 -117 55 -127 -23 -54 -219 -159 66 18 -123 -33 24 220
6352B20L8l24p8j34J98m3K06k50J32l9J21j90Q6J28q0j6j2K37o2j05N3J11k01
$$ 220 258 -66 -144 -278 -80 -123 83 -167 -35 -74 47 -143 -57 71 -9 -25 -37 200 138 33 86 197 -4
6375dJ96J09k51j07j30Q1J55j08J43p7k82O1J72p2J77j07J02j98M6R8K7Q2k38
$$ -4 192 301 50 -57 -187 -106 49 -59 84 7 -275 -214 -42 -114 63 -44 58 -140 -94 4 31 113 -125
6398a25kJ14j61O9o3J24L9J2n0O4PK4Q1j25m3m0L2m2j58K49N4l9J10k39K58k08
$$ -125 -127 -13 -174 -105 -168 -44 -5 7 -43 21 28 52 133 8 -35 -75 -43 -85 -243 6 60 21 131 -108 150 -58
6424e8K25k32j6L8k8k68L78J31l22K30N3j0j36J3MQ5j39q3K74o1mJ28j02Mpl6
$$ -58 167 -65 -81 -43 -71 -339 39 170 -152 78 131 121 -15 -2 2 87 -52 -135 139 78 74 202 100 104 97 61
6450F1o9N5J6n2k00Q5j8J98n9J6P7r2pRO9j16J69o9q4j80M7R7J24m8J05j88l5
$$ 61 -8 47 63 11 -189 -104 -122 76 17 33 110 18 11 20 89 -27 142 73 -11 -191 -144 -47 77 29 134 -54 -89
6477h9O5m2K59k58n1q8K67J3j65K0K34o2k33K55j81L6K03j71q7j4Q2mJ88j56p2
$$ -89 -24 -66 193 -65 -116 -204 63 76 -89 -69 165 103 -130 125 -56 -20 183 12 -75 -89 -7 -11 177 21 -51
6502e1P1J77j35k4kj37p1K36r1j84L05j25j02J07k21L43j52N9M9r7m3M36k46l1
$$ -51 20 197 62 38 36 -101 -172 64 -27 -211 94 -31 -133 -26 -247 96 -56 3 52 -45 -88 348 102 71
6526G1k52M1J45K12k79j21L21j88J45q7R8j59J39j29J70j86P%K51n0k6k96P2Q2
$$ 71 -181 -140 5 217 -62 -183 138 -50 95 8 106 -53 86 -43 127 -59 -52 -52 199 149 123 -173 -101 -19
6550a9J67l61J49R2r0R4j00K36j34K4Pp2N4l0K03k43L15j90M4k02J68r8j17K83
$$ -19 148 -213 -64 28 -62 32 -68 168 34 58 65 -7 47 17 220 -23 292 102 146 -56 112 14 -103 180
6574A80N6k35j74O2J00R8l51j4M78k72r2K47j94K04M2k45J61o5j00J32R0J0l7
$$ 180 236 1 -173 -111 -11 87 -264 -278 200 -72 -164 83 -111 93 135 -110 51 -14 -114 18 108 118 81
6597H1q8n4J67J35j77Jj89J49j32M1J97m7M2k60J54qp7rNJ36J20l82L7J6K70r7
$$ 81 -7 -61 106 241 64 65 -124 25 -107 -66 131 84 126 -134 20 12 -65 -74 -69 67 187 -195 -158 -142 128 31
6623C1M6o1k40M25k58O3L8j2r5q6Q9j9n4K26r3j21%KN2J55o4N2j37lO0J03m7L
$$ 31 77 16 -224 201 -57 6 44 32 -63 -149 -60 -79 -133 93 0 -121 -121 -119 -67 88 24 76 -61 -64 -4 99 52 55
6651E5j24M2o6K54j95j15J46K57l66l3O8m0O0K23n6k13J20j6O5j13k6K71j89j62
$$ 55 -69 -27 -93 161 -34 -149 -3 254 -112 -145 -77 -117 -57 166 110 -103 17 1 66 -47 -73 198 9 -153
6675a53K27j99P4N5L1j17J37j25K51j04KJ2K7j48j7j06J11j21L32j44k04L31j51
$$ -153 74 -125 -51 4 35 -82 55 -70 181 77 79 91 118 -30 -47 -153 -42 -163 169 25 -179 152 1
6698Ak60L05p2M3J0J7n5j4J02j62J19j61K68m1j19J01j42j02M40l38PJ90Pj03
$$ 1 -259 46 -26 17 27 44 -11 -25 77 -85 34 -127 141 100 -19 82 -60 -162 278 -60 -53 137 144 41
6722D1n0J66j00K0P4k35J27o7K50l58K9R7k1O3J57m4k54k2K36ml79L80k26K93
$$ 41 -9 157 57 77 151 -84 43 -24 226 -132 -103 -6 -27 36 193 149 -105 -127 109 105 -274 106 -120 173
6746A73q9Rj2k33N8K34k25k4L4N5P6j68J5J1L6J75j47j0j73L12q0k4J6L3j61O9
$$ 173 84 93 81 -152 -94 140 -85 -109 -75 -20 56 -112 -97 -86 -50 125 -22 -32 -205 107 27 3 19 52 -109 -40
6772d0o4J80J03k41%m9J07k21M1K08j4r1k4l7L67j60j36Q5j65L02j73J29J72l68
$$ -40 -104 76 179 -62 -62 -111 -4 -225 -184 24 10 -81 -105 -142 225 65 -71 14 -151 151 -22 107 279 -89
6796h9Q8J35J29k57On4J1J6k3K83l18K72l21J44K1o0r8Q3rPJ30j96K6o4K42K8
$$ -89 -1 134 263 6 12 -42 -31 -15 -38 245 -73 199 -122 22 43 -17 -115 -32 -41 -34 96 -100 -74 -138 104 132
6822A32k74Q4j63J90rk1N1p3J34j72L1jJ98j00mk23K35k72K55po5j34J42k34L99
$$ 132 -142 -58 -221 -31 -40 -61 -10 -83 51 -121 -90 -91 107 7 3 -220 15 -257 -2 -9 -74 -208 -66 -300 99
6847I9r6P4n0K4K17j50q5M8k93O9O5O5Q3n3P3k56N1L2j5L07k10P1j18M9J15j46
$$ 99 3 77 27 51 268 118 33 81 -212 -143 -78 -13 70 17 90 -166 -115 -83 -98 209 -1 70 -48 1 116 -30
6873c0j2Q2j20P5n7P5O9m8Oq8n7J71j20J53r8J73j59j28K5J65j37N9M7q9k55K01
$$ -30 -42 40 -80 -5 -62 13 82 34 40 -48 -105 66 -54 99 1 174 15 -113 -88 77 -60 -1 46 -43 -298 -97
6899i7K28j10m3L3q1R3J86j35k9O4o5o1j5J18q5j74P0J66j21J26j92J41j16R1
$$ -97 131 21 -22 11 -70 23 209 74 45 109 44 -17 -32 86 1 -173 -103 63 -58 68 -124 17 -99 -8
6923hM3j14K26p6J14k02J66l9O9j87K22l54J22K0r6%j08J84j7N4J9N2j31m6J94
$$ -8 35 -79 147 71 185 -17 149 110 179 -8 214 -140 -18 2 -94 -94 -202 -18 -35 19 38 90 -41 -87 107
6948A07l39K97K7p0j37K49k19J18n6J32j73m0j14K14k11J44J51n4j64j3j0K28
$$ 107 -232 65 92 22 -115 134 -85 33 -23 109 -64 -104 -218 -4 -215 -71 80 26 -138 -151 -161 67
6970F7j74M5r4l2L11l8K60j60k01J6J1r0J63J27r2r2J34k10J23j06K0l6l4J68
$$ 67 -107 -62 -156 -188 123 85 345 185 -16 0 11 -79 84 211 119 27 161 -49 74 -32 -12 -48 -82 86
6994H6J09j14k36K01K3o3J9MM5r4p9M0l9JP3K1J20l24L77k06l7J64j75J3J73k52
$$ 86 195 81 -155 46 69 6 25 29 74 -20 -99 -59 -98 -97 -24 -3 117 -207 170 -36 -73 91 -84 -71 102 -150
7020a50K62j09J0J13j52J86j35Q7j40p5K56j41r5K68l78J43m6j13lK43J01j15
$$ -150 112 3 13 126 -26 160 25 112 -28 -103 153 12 -83 185 -193 -50 -96 -209 -212 31 132 17
7042A7P5m5q6J78k78J30j84J68N2j22J81P9m0l5j11L6j8R2m7j18L65l84K43q5
$$ 17 92 47 -39 139 -139 -9 -193 -25 27 -95 86 165 125 90 -21 15 -3 89 42 -76 289 -95 148 63
7066F3Q0j00L0k36J65l4q1R0J1J21o3j30R5o9Q6jo4R6k93K67k81K20N4nj01K62
$$ 63 143 43 73 -163 2 -32 -113 -23 -12 109 46 -84 11 -58 28 27 -37 59 -234 33 -248 -28 26 21 -80 182
7092A82j58K4J06O8j45j86j64K28k9L9J9K36k02k6p4J79r7O6J08j35j47K83j69
$$ 182 24 48 154 222 77 -109 -273 -45 -74 -35 -16 220 18 -8 -82 97 0 66 174 39 -108 175 6
7115FN7m3K1K99k81R2l19L8Q8J51n2O0j59j31K68r9q6P1J9o9J42j10N4n1n5P6
$$ 6 63 20 41 340 59 151 -168 -130 -42 109 57 117 -42 -173 95 -4 -90 -19 0 -69 73 -37 17 -34 -89 -13
7141a3O0M1O4k41L34m83K98j31m9M5J69j25j20Q9q5m2K06j4j3K29k01k00K40r7
$$ -13 47 88 152 -89 245 -238 60 -71 -120 -75 94 -31 -151 -62 -147 -189 17 3 -10 219 18 -182 58 -39
7165c9kJ29j69m9L06l16K72j1n5j05j53J97nj7o6m6j0J58M0m13K72Q9J22j13P
$$ -39 -41 88 -81 -130 176 -140 132 121 66 -39 -192 5 0 -17 -83 -129 -139 19 59 -354 -82 7 129 16 23
7190B3j25J31N8r2J58k04J54p9j03O2k1J34j39l9l1mK1R7k7q3J80J83m12j1K82
$$ 23 -102 29 87 -5 153 -51 103 24 -79 -17 -38 96 -43 -82 -113 -117 -96 1 -26 -109 71 254 -158 -169 113
7215A13n8o7n3J67k66L38j29m0J54j24L6j71m5K64k31K18j41l02L93M5m1k58K49
$$ 113 55 -12 -65 102 -164 174 45 5 159 35 71 -100 -145 119 -112 106 -35 -337 56 101 60 -198 51
7238E1p7P1j31k6J33q3J29o0k61K23J14L1j28JR5J27r5l2j5m9j7L1k98J06J66
$$ 51 -26 45 -86 -112 21 -62 67 7 -254 -31 83 114 -14 -13 82 209 114 82 67 18 1 32 -266 -160 6
7263Fj0LN2J54j17k04J2J86j98J36J81k20K8M5J50k83J6k9P4M9r9L18j67%j27
$$ 6 -4 -1 51 205 88 -116 -104 82 -116 20 201 -19 9 54 204 -79 -63 -92 -18 31 -68 250 83 83 -44
7288d4N0q2Q1M4ok04K38N1m8O1p0j8o9J20L3k23P8j15J93m6j15J99r2N4j13J17
$$ -44 6 -76 5 49 43 -161 77 128 80 141 71 53 -16 104 137 -86 -8 -123 70 24 -91 108 16 70 -43 74
7314G4Nr3PK7k2K08k55q2K35l2j58Q3m6L17k36J51j51j79J08J6M6J28j11l0l2
$$ 74 79 -14 -7 20 -2 206 -49 -131 104 72 -86 -3 -49 268 32 183 32 -147 -39 -23 23 151 40 10 -22
7339b2N7j7j2J5k19K50OJ87l07J07L2m1q9m2k69J86k10L08K1J9P0qk50M6K47K0
$$ -22 35 18 6 21 -198 52 58 245 -62 45 77 36 -53 -95 -364 -178 -388 -80 -59 -40 30 22 -228 -182 65 85
7365H5j14OR1O3k2l3k30K40j65k7N5J15m2j00J01qJ6J4N1k37K44j36K5p4pO0r
$$ 85 -29 -23 68 131 109 76 -154 86 -79 -106 -51 64 22 -78 23 15 31 45 96 -141 103 -33 -8 -82 -89 -29 -38
7392c8q1Kl5J53j76J91K28j95j11J24N2l34k5K37p3N2L68m65KJ01l2k13L66j88
$$ -38 -119 -117 -152 1 -175 16 244 49 -62 62 114 -220 -245 -8 -81 -29 339 -126 -124 -23 -55 -268 98 -90
7416i0J94n6o1k0qK1J08n1R1n0j21olR3j37K26l8m8j18J5K53k85q8K38jk0j53
$$ -90 104 48 -13 -33 -41 -20 88 37 128 78 -43 -49 -52 41 -96 130 92 44 -74 -59 194 -91 -179 59 58 38 -115
7443a15JK10J14j97p3M1N5j33N9j30K25m9J78j50J10l4k22K15k86J82j28L7L7
$$ -115 -114 96 210 13 -60 -19 36 -97 -38 -168 57 8 186 36 146 112 -110 105 -181 1 -127 -90 -53
7466e3J57p0k90L65J4j2j90N5j54K37P1J0k83J97R0m5j21k44K65p3L04j19mo1
$$ -53 104 34 -256 109 123 111 -79 -24 -178 59 130 140 -143 54 144 99 -22 -266 -1 -74 230 111 107 46
7490D6J03P4k94K12n9N9k36j25L73j07j82LK04j77J88k86L08j04j34J35M9k32
$$ 46 149 223 -71 141 82 141 -95 -220 153 46 -136 -133 71 -106 82 -204 104 0 -134 1 50 -182
7512a82J79j05J23N2r9J09p3l8j99K97J1j50k4L4J8K7j0J34M7k31J08O9k98J58
$$ -182 -3 -108 15 67 -32 77 4 -34 -233 64 75 -75 -99 -65 -47 -20 -30 104 151 -80 28 97 -201 -43
7536d3J6M4N3p8J12j27L3J3J6m6n6j5j0m6n3L23j77R6M9n9j03n6J02L4p6Q8L1
$$ -43 -27 17 70 -8 104 -23 10 23 39 -7 -63 -78 -88 -134 -187 136 -41 55 104 45 -58 -114 -12 22 -54 34 65
7563F5j72J33J22j40j75K54J2j29l6N3P3l6j19J91m2n5N9J56j78j90O4Q4%J71
$$ 65 -107 26 148 8 -167 87 99 -30 -66 -13 60 24 -95 96 54 -1 58 214 36 -154 -90 -6 -6 165
7587A65r8j51K23K9j95m0R0J4N8l41K51j1l2L1p1K41k9j33J24l82M23l82J94J3
$$ 165 67 -84 139 168 -27 -67 23 37 95 -246 5 -6 -38 -7 -78 163 134 1 125 -257 166 -216 -22 -9
7611ik11K54n4K32k35K71l04J93j86N4Q8P4Mj09k34O7K04k39J71m9O1l3R7J0l65
$$ -9 -220 34 -20 212 -23 248 -56 137 -49 5 93 167 171 62 -172 -105 99 -140 31 -18 43 10 107 117 -248
7636b48K75J22N7k5k19J32K1j07l1j68K16o1o0l31K29M7o4K76k11L21k03P4o3
$$ -248 27 149 206 181 -38 94 115 8 -23 -191 25 -36 -96 -427 -198 -151 -215 61 -150 171 -32 42 -21
7659b1K57m38J01J21N4J24l31J67J14k54M9m8j35M05k91O8n5K25j91L6r4J18n7
$$ -21 236 -202 -101 20 74 198 -133 34 148 -106 -57 -105 -240 165 -126 -58 -113 112 -79 -43 -137 -19 -76
7682g6K86l3j47m4j06K3rK50o6M7p8p8O4j27J99j86J51J07k88L06k73Q4O9q0N4
$$ -76 210 177 30 -14 -120 -97 -106 144 78 125 47 -31 33 -94 105 -81 70 177 -111 195 -78 6 75 -5 49
7707D9J54n62M25m2j08J45q2j5P6J69O2m33L16l16J61J40j21l2p0J7J28q4k5n7
$$ 49 203 -359 66 24 -84 61 -21 -36 40 209 271 -162 154 -162 -1 139 18 -14 -84 -67 61 -23 -48 -105
7731a05J10M9k40J83N7Q2j39Q2l29M00r8pM7k12m2L78l26m8J83p0J53q8K61j53
$$ -105 5 54 -186 -3 54 136 -3 79 -250 150 52 45 92 -120 -162 216 -110 -158 25 -45 108 20 281 128
7755A28Jj11J86l09O3Q2j54J08M2M1J68l01K13l15L41k28R9R4j72M7R7j9j11P0
$$ 128 129 18 204 -105 -42 40 -114 -6 36 77 245 -56 157 -158 183 -45 54 148 -24 23 120 101 -10 60
7779F0L9j9j91K14k24N6Q8K2M9O4j25j08L0Q5k32L07o9p6K12j36k7Lj05J02j0
$$ 60 99 80 -111 103 -121 -65 23 45 94 158 33 -75 -45 40 -192 115 46 -30 182 46 19 22 -83 19 9
7804IN7k51P7J30N1k17L27k49n1O5o9j4J12m2o9K48k08O9L08k99j52p5L30m0m
$$ 9 66 -185 -108 22 73 -144 183 -66 -117 -52 -121 -135 -23 -65 -134 114 -94 -25 283 -16 -168 -243 87 47 43
7829D3j45O1j01J12o4J64j52J4J92j76K01j90J88j71m4R0j20K04J2k78q2K52R7
$$ 43 -102 -41 -142 -30 -94 70 -82 -68 124 -52 149 -41 147 -24 -68 22 -98 106 118 -160 -242 10 107
7852A07k08k48N70l9l03J26R0j53M1n1J1Q5j90P0KK8Q7P3j05k4O0J35k61j36L31
$$ 107 -101 -349 221 182 -121 5 95 -58 -17 -68 -57 28 -162 -92 -90 -62 25 98 -7 -31 29 164 -97 -233 98
7877I8J2j60L2n4j84L28r0N9j50P6O8J53k35K3j57K4J13l2J6J05K4j13j38J40
$$ 98 110 -50 -18 -72 -256 72 -18 41 -109 -33 35 188 -47 -24 -181 -157 -44 -76 -60 45 69 -44 -182 -42
7901d2q4J73K4j88J82j81L03j20k46L89r3m6r4ORO8j93j14K59R6p0k5p2N0K17
$$ -42 -126 47 71 -117 65 -116 187 67 -179 210 117 71 -23 -17 -8 60 -133 -247 12 108 38 13 -59 -9 208
7926B08j07o4l0l2r8mR1L3O4K52k15p5oJ3R1j75N2Q2N8r8j26O4q3J33k58J70J26
$$ 208 101 37 7 -25 -123 -127 -36 -3 61 313 98 23 17 30 121 -54 -2 80 138 40 -86 -22 -105 28 -230 -60 66
7953F6k09J72J3J51j86j07r0L08k90J53J43j70K58k60J83j25p0O8M7J6j05J17
$$ 66 -143 29 42 193 7 -100 -190 118 -172 -19 124 -46 212 -48 135 10 -60 8 55 71 -34 83
7975H3j58k8J55o3J17Q9k65Nk3P0Q6J93l39Q1J6J21j62P5r2J51j71J88j45J05
$$ 83 -75 -103 52 -11 106 195 -70 -65 -88 -18 68 261 -78 3 19 140 -22 53 -39 112 -59 129 -16 89
7999H9p1j97J51J0R3k7J00k17P0n2N3n8PO5J31l53K55J2j23j60L5K24J69m9k1
$$ 89 18 -179 -28 -18 75 48 148 -69 1 -51 2 -56 -49 16 147 -206 49 61 -62 -222 -187 37 206 157 136
8024A36q7On1%J63k36r1K61j27n1J38r9K01k54J29j5J71l08J64j8n7J65l66K68
$$ 136 49 55 4 4 167 -69 -160 101 -26 -77 61 -38 163 -91 38 23 194 -114 50 32 -25 140 -226 42
8048D2q6L9P2K0l15K22j15J24O8j09n2J08R3l19K24j05Q5K38k30P0J01m0l08J23
$$ 42 -44 -5 67 87 -228 -6 -121 3 71 -38 -90 18 111 -208 16 -89 -4 234 4 74 175 135 -173 -50
8072e0r2K24k61L42j39m1j30J31J17j29k4P7j32mQ7l9P8Q1j11p4J50l9J01j41
$$ -50 -142 82 -179 163 24 -17 -147 -16 101 -28 -52 25 -107 -111 -24 -63 15 96 -15 -89 61 22 123 -18
8096a8r0K01O9k74R4K22j21k2m8k26J83J74k13K28p8p0j0j26N2P1m2J31k22n7
$$ -18 -108 93 162 -112 -18 204 83 61 13 -213 -30 144 -69 159 81 11 1 -125 -73 -2 -44 87 -135 -192
8120a92K05j79J38O9r3m8K17ql8q0J08j46J03K3Q4k66N0k1J05O0m2n5M6q9L8q1
$$ -192 13 -166 -28 41 -52 -100 117 109 71 -9 99 -47 56 79 163 -103 -53 -74 31 91 49 -6 40 -49 -11 -92
8146i2J50Lq9J6J65j05j03R0j26p4N8K91j63m7J24k2l9K14m03m3K32Q9p6O3k63
$$ -92 58 61 -28 -12 153 48 -55 35 -91 -165 -107 184 21 -26 98 76 37 251 -152 -195 37 126 50 113 -150
8171a50L48j75n8j30L20l86L25lj38NJ71p1O9k6j92K71j04j19K2j00
$$ -150 198 23 -35 -165 155 -231 94 91 -47 -42 129 58 127 101 -91 180 76 -43 -21 -121
8191a21
$$ Imaginary data points
##PAGE= N=2
##DATA TABLE= (X++(I..I)), XYDATA
0@%%%%%%%%%%%qJ6j6J6j6K4l2L8m6N6o4P2q8J04j24J48j70J94k24K57k96L39l83
$$ 0 0 0 0 0 0 0 0 0 0 0 0 -8 8 -8 8 -8 16 -16 22 -24 32 -32 40 -48 56 -68 80 -90 104 -120 137 -159 180 -203
34b03M33m89N49o15O89p70Q58r54J058j172J298j436J585j747J928k126K340k576
$$ -203 230 -259 290 -325 364 -406 452 -502 556 -616 682 -754 831 -916 1012 -1114 1226 -1350
52a350K838l129L455l821M236m708N255n896O657p581Q724j0190J2150j4909J9110
$$ -1350 1488 -1641 1814 -2007 2229 -2479 2776 -3120 3537 -4044 4680 -5510 6640 -8269 10841
67A0841k6374M2387j42092Q4813K27400k11530p8616R8844k53q3405J38169M1409
$$ 10841 -15533 26854 -115238 -30425 196975 -14555 -93171 5673 5420 -77985 60184 101593
79A01593j73265n2441J94687J8563j27587K1801L5026o9335L4657J16418o5868
$$ 101593 -71672 -124113 70574 89137 -38450 -16649 18377 -50958 -16301 100117 34249
90C4249j46671O8557J29049m3951q0169N1628j8161n3664Q8027P1926j07941q1443
$$ 34249 -112422 -43865 85184 41233 -38936 12692 -5469 -59133 28894 100820 -7121 -88564
102h8564J00878O1346p3185k2970N3876m1734m2357J04272K5376j24834l1681
$$ -88564 12314 73660 475 -22495 31381 -10353 -52710 51562 76938 -47896 -79577
113g9577J14356K1587q3581O630M9156n3596l1342J12413J7866j30102j9558J05860
$$ -79577 34779 56366 -27215 -20585 28571 -25025 -56367 56046 73912 -56190 -75748 30112
125C0112K3021o3563j288J3543l3062J8343P0790m3997q7096N4074O1029m3831
$$ 30112 53133 -10430 -11718 1825 -31237 -12894 57896 13899 -73197 -19123 41906 -1925
137a925k2438L8525j8741m0656N2851M6327o9499m3905P8856K0318n8505J4682
$$ -1925 -24363 14162 -4579 -45235 7616 53943 -15556 -59461 19395 39713 -18792 -4110
149d110L0507m4716j5722O9440P758p9468m358P7516j1650n9315L3597K5320m5388
$$ -4110 26397 -18319 -34041 35399 43157 -36311 -40669 36847 25197 -34118 -521 24799 -20589
162b0589k96N3857j2077n2616K1819M6395k9772l2226M2202M157m3977J8865L7929
$$ -20589 -20885 32972 20895 -31721 -9902 36493 6721 -25505 16697 20854 -23123 -4258 33671
175C3671k6433l3105K2309J7778k0253P48K3540k5630k5537M4991J5916m4101
$$ 33671 7238 -25867 -3558 14220 -6033 -5285 18255 -7375 -32912 12079 27995 -16106
187a6106m714L4440m602k3838J7625J7292l1108r708M2538n365m2301J6760K6317
$$ -16106 -20820 13620 9018 -14820 2805 20097 -11011 -20719 21819 16454 -25847 -9087 17230
200A7230k1146j1215K4238j187l1145P571L7908j3953l3557K1542J8461j7195
$$ 17230 -3916 -15131 9107 7920 -23225 -15654 22254 8301 -25256 -3714 14747 -2448
212b448k168J2772o880j0237J3212J1552j8360j1549K2565J615j9457Q421Q010
$$ -2448 -4616 8156 1276 -8961 4251 15803 -2557 -14106 8459 10074 -9383 -962 7048
225G048j3098k685J4230K618j3354j798J4033n035q733J6096k82j8247P411J5385
$$ 7048 -6050 -8735 5495 8113 -5241 -7039 6994 1959 -6774 9322 9040 -9207 -1796 13589
239A3589p215j2943M153J0578p879p648J3580l353j5686J1552J0279j1881o501
$$ 13589 6374 -6569 -2416 8162 283 -7365 6215 2862 -12824 -1272 9007 -2874 -9375
252i375R010N519q221j932J2238m163j2494J1918O827j1419j215M907n06j258
$$ -9375 -365 5154 -3067 -4999 7239 3076 -9418 2500 9327 -2092 -3307 1600 1094 -164
266a64j08O01m743j403J0382l944r937Q459L401n913K454L188k532j447K632N130
$$ -164 -272 329 -4414 -5817 4565 621 -9316 -857 2544 -3369 -915 2273 -259 -1706 926 6056
282F056n166m639Q867j222p843N587J657n493j76K097J763k971l165N690l4m063
$$ 6056 890 -3749 5118 3896 -3947 1640 3297 -2196 -2372 -275 1488 -1483 -4648 1042 1008 -3055
298c055M761p01k767M308R5j662J053k114K207J109l531R47j066o40L198m405
$$ -3055 1706 1005 -1762 2546 2641 979 2032 -82 2125 3234 -297 650 -416 -1056 2142 -2263
314b263j380M912k983j328L161j321K98K83k42M037l086j617M620j854j001K047
$$ -2263 -3643 1269 -1714 -3042 119 -1202 -904 -621 -863 3174 88 -1529 3091 1237 236 2283
330B283k904N21J161k905K118r35k638K632m77q38J260k047K358K243l518J889
$$ 2283 -621 -100 1061 -1844 274 -661 -3299 -667 -1144 -1982 -722 -2769 -411 1832 -1686 203
346B03J882k248K386j22k373K357j095m02O32k399J424j13k893L398o85m013M148
$$ 203 2085 -163 2223 2101 -272 2085 990 588 1220 -1179 245 132 -2761 637 -48 -4061 87
363H7N45k889K336J122r03m63J15M706l311m569O737J30o353L290J853m304o39
$$ 87 632 -2257 79 1201 298 -165 -50 4656 1345 -3224 3513 3643 -2710 580 2433 -1871 -2510
380b510K772J981n215k568Q200j810o198O439J820o407K416N286j957m792J914
$$ -2510 262 2243 -2972 -5540 2660 850 -5348 1091 2911 -3496 -1080 4206 2249 -2543 -629
395f29O192m972m283Q169k351q786O811N081p554l298O268K009p103J55J0263
$$ -629 5563 591 -3692 4477 2126 -6660 151 5232 -2322 -5620 648 2657 -4446 -4291 5972
410E972n467q435J1531L446j1074K196Q154m105o656N769O508j0733n046J4452
$$ 5972 505 -7930 3601 7047 -4027 -1831 6323 2218 -4438 1331 7839 -2894 -7940 6512
424F512j443j3684O622P310r237k457J0633M79j1728K309J4117p045j1109J2851
$$ 6512 5069 -8615 -1993 5317 -3920 -6377 4256 4735 -6993 -4684 9433 2388 -8721 4130
438D130L831j3688L359J2016p411j1328R321R856j3762o303J6542k941j5481J1888
$$ 4130 7961 -5727 -2368 9648 2237 -9091 230 10086 -3676 -9979 6563 3622 -11859 29
452B9J0339j5408n282J6020J306j5853N621J7050j3551j3077K0410M021k1604
$$ 29 10368 -5040 -10322 5698 7004 -8849 -3228 13822 271 -12806 7604 11625 -9979
465i979M470J6933j0989j2602J6086Q230k2359k764K4423n907j9640J5077J0382
$$ -9979 -5509 11424 435 -12167 3919 12149 -10210 -12974 11449 5542 -14098 979 11361
478A1361j9486M44K0847o790k0485J1982J8766j8184j1070K3148j877k2747J2011
$$ 11361 -8125 -7681 13166 6376 -14109 -2127 16639 -1545 -12615 10533 8656 -14091 -2080
491b080J6779j9041j1472K0773O881k0828J303J8965j2916j3328K2886N366k3807
$$ -2080 14699 -4342 -15814 4959 11840 -8988 -7685 11280 -1636 -14964 7922 13288 -10519
504a0519K972K0493p942j5819J2619J1043k0103m106K4336n325k3235J1481J5881
$$ -10519 -7547 12946 5004 -10815 1804 12847 -7256 -11362 12974 7649 -15586 -4105 11776
517A1776j3847p332J4867r92j7940Q847K2600j4340j9025J7377Q087j6914M410
$$ 11776 -2071 -9403 5464 4472 -13468 -4621 17979 3639 -15386 1991 10078 -6836 -2426
530b426J5750j2605j5642J7441J4182k2281r741K3012q99j8564J2087J0583j9078
$$ -2426 13324 719 -14923 2518 16700 -5581 -15322 7690 6791 -11773 314 10897 -8181
543h181m199K3040J244k3392L125J9662r956r841J9235j416k3885R081K1222j3128
$$ -8181 -12380 10660 11904 -11488 -8363 11299 1343 -8498 10737 9321 -14564 -5483 15739 2611
557B611j6804J5010J0891j7958k096J9248j0353j7567J9763J2506k0529n520J7625
$$ 2611 -14193 817 11708 -6250 -8346 10902 549 -17018 2745 15251 -5278 -10798 6827
570F827r33j3755R842J1152j9560p636K4749K075k1531L378J2486r578o131J4152
$$ 6827 5894 -7861 1981 13133 -6427 -14063 10686 12761 -8770 -5392 7094 -2484 -8615 5537
584E537K455j8811J037K1442n448j6823R637P276j1340K074J3228o160j4916R115
$$ 5537 7992 -10819 -9782 11660 6212 -10611 -974 6302 -5038 -2964 10264 4104 -10812 -1697
598a697J5316j2797j1794J4237J774j3072Q555R853j4677r421J6907Q475j7013
$$ -1697 13619 822 -10972 3265 5039 -8033 522 10375 -4302 -13723 3184 11659 -5354
611e354l829J6111m258j0723J3519M169j8010J091J7909l607j6524O186J2642
$$ -5354 -9183 6928 2670 -8053 5466 9635 -8375 -7284 10625 7018 -9506 -3320 9322
624I322j1103m981J5253n308j7982J1410J5449j0700j0058R348L716j0492M449
$$ 9322 -1781 -6762 8491 3183 -14799 -3389 12060 1360 -8698 650 4366 -6126 -1677
637a677J2849j1686j1122J6105N858j4755K42J0258n063p903Q970N122j3520k452
$$ -1677 11172 -514 -11636 4469 10327 -4428 -4186 6072 1009 -6894 2076 7198 -6322 -8774
651h774J6539j923j4017N444O988q017J21J0808j795j3017L544J3642o873r631
$$ -8774 7765 5842 -8175 -2731 4257 -3760 -3639 7169 5374 -7643 -4099 9543 2670 -6961
665f961R371K374r340L662P762q081p271Q892P349j0430m886J0295j157o648P986
$$ -6961 2410 4784 -4556 -894 6868 -1213 -8484 408 7757 -2673 -7559 2736 1579 -5069 2917
680B917L228j0852j436J0544J279p929O03O500n907l433R872j822j0737M755P981
$$ 2917 6145 -4707 -6143 4401 5680 -2249 -1646 4854 -1053 -4486 5386 3564 -7173 -2418 5563
695E563n154n381M609L088o477J207Q154n184o962Q319L922p277l38M540j270
$$ 5563 409 -4972 -363 2725 -3752 -2545 5609 425 -6537 1782 5704 -1573 -1911 2629 1359
710A359m134L390M201o166l696P358J29o054K242K468k675m55L422O79m602K66
$$ 1359 -2775 615 4816 -1350 -5046 2312 2441 -3613 -1371 1097 -1578 -2033 1389 2068 -2534 -2268
726b268O022k015m219L754J054l391J455K313k382k487J321L153l084j978L777
$$ -2268 3754 1739 -2480 1274 2328 -1063 392 2705 323 -2164 -843 2310 -774 -2752 1025
741A025r19l382L726J030k704l76K032J381j967q05L389j467k394K990k00k701
$$ 1025 106 -3276 450 1480 -1224 -1600 432 1813 -154 -959 2430 963 -1431 1559 1359 -1342
757a342J007J120l89j329m64K185j010j819K452j95j693J706L30q76P00j95P76
$$ -1342 -335 785 396 -933 -1397 788 -222 -2041 411 216 -1477 229 559 -317 383 188 964
774I64m58q20J824p55j792J886l62j408Q20l18kk02p29J225l13j032K110k19j570
$$ 964 506 -314 1510 755 -1037 849 487 -921 -101 -419 -421 -623 -1352 -127 -440 -1472 638 419 -1151
793a151J689M40o78L51l93J029m65j450J442k93j634J500k78j317Q37j47JJ47
$$ -1151 538 978 300 651 258 1287 822 -628 814 521 -1113 387 109 -1208 -371 -518 -517 -370
811c70o77J365j50r68J680k17j185J556k57q09J018o66pr0o67R66o34j345J982
$$ -370 -1047 318 168 -800 880 663 -522 1034 777 -32 986 320 313 223 -444 522 -112 -1457 525
830E25p74j119J592o76nM83k61Q91l47p96J590k93j368J849p51j053Q22j19l51
$$ 525 -249 -1368 224 -452 -457 26 -235 656 309 -487 1103 810 -558 1291 540 -513 309 190 -161
849a61k87n07Q34r8j429J978m98j370J969J17p49O46l21O61l10o10J725j001j800
$$ -161 -448 -955 -121 -219 -1648 330 -168 -1538 431 548 -201 445 124 785 475 -135 1590 589 -1211
868a211K298q0j674N51L14q16k38K59J102j104j645L083M2k243J739N54j432O94
$$ -1211 1087 1007 -667 -116 198 -618 -856 -597 505 -599 -2244 839 881 -1362 377 931 -501 193
886A93R85L62k240K8K711j425k393K666l10k874J786J864j907j751J714K175j980
$$ 193 1178 1540 -700 -672 2039 614 -1779 887 577 -2297 -511 1353 -554 -2305 -591 1584 -396
903c96r16L097j624k313L898J164l690m53K609J83k494M04K178l021j326M923
$$ -396 -1312 1785 161 -2152 1746 2910 -780 -1233 1376 1559 -935 -531 1647 -1374 -2700 2223
919B223p36m844J878L255j942j263J868P48l166R59N225l100m458M407J533l361
$$ 2223 1487 -3357 -1479 1776 -166 -1429 439 1187 -1979 -1020 4205 1105 -3353 1054 2587 -774
935g74L71K153j558k747K737K903m634k431N420J26l770K376J583l586p02M816
$$ -774 -403 1750 192 -2555 182 3085 -1549 -3980 1440 1566 -2204 172 1755 -1831 -2533 2283
951B283J101n166m37N726k320l730M589k2n446K021M984k690m875K775L935m074
$$ 2283 3384 -1782 -2219 3507 1187 -2543 2046 2024 -3422 -1401 3583 893 -3982 -1207 2728 -1346
967a346j110M909k478m624N770L622n787j973M466J166m170J060M036m902k388
$$ -1346 -2456 2453 -25 -4649 1121 4743 -1044 -3017 1449 2615 -1555 -495 3541 -1361 -3749
982c749P060j5p082J051M703j444l059L178J481m997J83P411k851o576M344M004
$$ -3749 3311 3296 -3786 -2735 1968 524 -2535 643 2124 -2873 -2690 4721 1870 -4706 -362 3642
998C642l934p36L734j446n047L190O010n657n110O154J594m963K343L101m479
$$ 3642 -292 -1028 2706 1260 -3787 -597 5413 -244 -5354 800 2394 -2569 -226 2875 -1604
1013a604l141O181L207o736j321O977j977n045N470J832p061L28P342j459p121
$$ -1604 -4745 1436 4643 -2093 -3414 3563 1586 -3459 2011 3843 -3218 -2890 4452 2993 -4128
1028d128K017N917m779k461O620k001p060N085O195n601l862N246J614n534J656
$$ -4128 -2111 3806 -973 -3434 3186 1185 -5875 -790 5405 -196 -4058 1188 2802 -2732 -1076
1043a076O016n636m118P949J735p872j01N293j646l318L880K127o584o18P870
$$ -1076 4940 -696 -4814 3135 4870 -3002 -3103 2190 544 -2774 1106 3233 -3351 -3969 3901
1058C901j670o251L381L232l618k37M507j149n438J984N913l947m084M664J007
$$ 3901 2231 -4020 -639 2593 -1025 -1262 3245 2096 -3342 -1358 4555 608 -3476 1188 2195
1073B195m163J484K878k995l577L732M100m246k328N163o37m433L291K459l985
$$ 2195 -1968 -484 2394 -601 -4178 -446 3654 -592 -2920 2243 1606 -2827 464 2923 -1062
1088a062j420M781J281n292m86N155k662l602M802O37n529J039N177j433m479
$$ -1062 -2482 2299 3580 -1712 -2198 2957 295 -3307 1495 2132 -3397 -2358 2819 1386 -3093
1103c093K111L503l970q20N811j685n305L975L560m697k077M025N68m169J392
$$ -3093 -982 2521 -1449 -2269 3542 1857 -3448 527 4087 -610 -2687 1338 1906 -2263 -871
1118h71M446m383l641N814R38m883J232L635k377k509L628J853m295q28N080j392
$$ -871 3575 -808 -4449 1365 2303 -2580 -1348 2287 -90 -2599 1029 2882 -1413 -2241 2839 1447
1134A447m296L770J956m031l46K763o18l413J640L797l091k206L981k49l582K036
$$ 1447 -2849 921 2877 -1154 -1500 1263 645 -2768 -1128 2669 -422 -2628 1353 1104 -2478 -442
1150d42K645k149j755K711J490l195r21L958j595l267L117J380l239k44K671k43
$$ -442 2203 54 -1701 1010 2500 -695 -1616 2342 747 -2520 597 1977 -1262 -1506 1165 922
1166I22k892R27K855k573j452L939k34l370J874J561j547j086J945P65k590M3
$$ 922 -1970 -1043 1812 -761 -2213 1726 1492 -1878 -4 1557 10 -1076 869 1634 -956 -913
1182i13K469j403k225K417N74k379N93J661n21j841J074J830j783j009L018q16
$$ -913 1556 153 -2072 345 919 -1460 -867 794 273 -1568 -494 1336 -447 -1456 1562 746
1198G46j946J599R26j440m76J228Q7j574O0J972j256j542K040K83j995M58J257
$$ 746 -1200 399 1325 -115 -591 637 724 -850 -790 1182 -74 -1616 424 707 -1288 -830 427
1215D27l73q98N05J647j194j046K182m82j657J144P23j293k97O66L87j359N2J733
$$ 427 54 -844 -339 1308 114 -932 1250 768 -889 255 978 -315 -612 54 441 -918 -866 867
1233H67j143j216J884Q7j310R00K83m89k63P31O94r04l41J302p12j245J348j47
$$ 867 -276 -1492 392 479 -831 69 352 -137 -400 331 1025 121 -220 1082 370 -875 473 326
1251C26q42K26M94k34m62q5Q00n73n42J177m16n02J074j48MJ83o53P69l04n11
$$ 326 -516 -290 204 -30 -492 -577 223 -350 -892 285 -131 -633 441 293 297 480 -173 596 292 -219
1271b19R41n92q45R08m80k35L67j17J69j18m03Q27q7o90R53N1o99O68QJj47k38
$$ -219 722 130 -715 193 -287 -522 -155 -272 -103 -221 -624 203 116 -574 379 430 -269 399 407 408 261 23
1293B3M83j85p33O37k62p79P63p1l94K21%K33J52o13Q47j06o39R94k00m70M64
$$ 23 506 321 -412 225 -37 -816 -53 -124 -518 -297 -297 -64 88 -525 322 216 -423 571 371 -99 365
1314C65J9n23J28K22J13m53p86J159m38n80Q78k20m57N83K1L5J17j80N20m22l68
$$ 365 384 -139 -11 211 324 -129 -915 244 -194 -774 104 -116 -573 10 31 66 183 3 523 101 -267
1335b67J010l75n32M67j87o07L03O5L23o81l35J072m25p03J196q0o62P05J52j39
$$ -267 743 368 -164 303 116 -491 -188 -123 200 -481 -816 256 -169 -872 324 244 -418 287 439 300
1355C00k78pP60m39n41Q86k96j090R42J8p50K17n9K44k92r5R60n61o94J259j06
$$ 300 22 15 775 336 -205 681 385 -705 237 255 -495 -278 -337 -93 -385 -480 480 -81 -775 484 378
1376C78o32O39K91n62k62M19M67r44n13J440m43j326J156Q3r73N18L21P2q05L60
$$ 378 -254 385 676 114 -148 271 738 -206 -719 721 278 -1048 108 191 -782 -264 57 129 -676 -316
1396c16J370r17q97J383J16j121P27M99j074j62N54N67j301l85J631o83j195J499
$$ -316 1054 137 -760 623 739 -382 345 844 -230 -392 162 729 -572 -957 674 -9 -1204 295
1414B95k2j345O42J160k35r18J48J252r13n45J688n05j956J573P84j252n19Q65
$$ 295 273 -1072 -430 730 495 -423 -275 977 64 -481 1207 702 -1254 319 1103 -149 -668 197
1432A97J31j356N43J455j239j473K296K97j638M91R45l45p54R91P51j927m21K430
$$ 197 328 -1028 -485 970 -269 -1742 554 851 -787 -296 649 304 -450 541 1292 -635 -1056 1374
1450A374l62j903Q95M33j478L97J480l79j872N01K414j437j259J703J23j736J287
$$ 1374 1012 -891 4 437 -1041 -644 836 457 -1415 -914 1500 63 -1196 507 630 -1106 181
1467A81J147j134j162J114J108j655n25J778r27j284J897M53k138j02J502L91
$$ 181 1328 194 -968 146 1254 -401 -926 852 -75 -1359 538 991 -1147 -1249 253 644
1483F44j107M0J219j118m73K421l70k612O96J695m94j282O80P96j261k75K026
$$ 644 -463 -423 796 -322 -795 1626 1256 -1356 -660 1035 541 -741 -61 735 -526 -801 1225
1500A225j114k470K301J303j314p79J249l41j046J337J881k257j820K737M69k162
$$ 1225 111 -2359 -58 1245 -69 -848 401 60 -986 351 2232 -25 -1845 892 1361 -801
1516h01P05P24j126p49K107L87k720n2K787q21j959J668M38j992J205K046j105
$$ -801 -96 628 -498 -1247 860 1247 -1473 -1525 1262 441 -1518 150 588 -1404 -199 1847 742
1533G42k226J103J897j453o37J730r84j540J766J114k480n57J625M40j078k13
$$ 742 -1484 -381 1516 63 -574 1156 172 -1368 398 1512 -968 -1525 100 540 -538 -751
1549g51J621j481q07K713j70k229M74J439j49p66L75N48j314j69K126q80k233
$$ -751 870 -611 -1418 1295 1125 -1104 -630 809 660 -106 269 817 -497 -666 1460 580 -1653
1566a653J122J297q88n06Q31k10j187R35J905j167k054J890R81j670L27R47j042
$$ -1653 -531 766 -122 -628 203 -7 -1194 -259 1646 479 -1575 315 1296 -374 -47 900 -142
1583a42q80J637R81j730j388K266l00j920J474M88j673L88J866j71j971M06J519
$$ -142 -1022 615 1596 -134 -1522 744 444 -1476 -2 486 -1187 -799 1067 896 -1075 -669 850
1600H50q85o69J750l07j788J265J228j425j473J175J087j029k98J299j161j379
$$ 850 -35 -704 1046 739 -1049 216 1444 19 -1454 -279 808 -221 -519 780 -381 -1760
1616a760K141R80k250l8J214L35q40O02P14j463p22K112k9j834N53J072r25n15
$$ -1760 381 1361 -889 -927 287 622 -218 384 1098 -365 -1087 1025 996 -838 -285 787 -138 -653
1634f53R85K4j414L82J811q05j311J126L17j011M61P29n96n81N81J041j141p83
$$ -653 332 356 -1058 -676 1135 330 -981 145 462 -549 -88 641 45 -536 45 1086 -55 -838
1652h38J610m64j257R48L43q87j49R42L09j345J39J205n35o23J196L89j643O28
$$ -838 772 308 -949 -1 342 -545 -694 248 557 -788 -649 556 21 -602 594 983 -660 -32
1670c2O32k87p14K04P80o97n10J190o36r86R31N43p15k48N71J89l27l5Q68m72
$$ -32 600 313 -401 -197 583 -114 -624 566 -70 -1056 -125 418 -297 -545 26 215 -112 -147 721 249
1690B49r03J010J9n82J89N57l80n73J71N66n24m73R51j48j015R08L71q32K56L44
$$ 249 -654 356 375 -207 -18 539 159 -414 -243 323 -201 -674 277 129 -886 22 393 -439 -183 161
1710A61Q8l31j53P20k14p20P82m8m10K70J67m38p9j15O35p65k72R19k31m62O89
$$ 161 249 -82 -235 485 271 -449 333 285 -125 145 312 -126 -205 -320 315 -450 -722 197 -34 -496 193
1731A93Q6m52J07L32O2k12j9L19l52l74N64j20p72O90j51k82K58K4J73k23k15
$$ 193 279 -173 -66 266 328 116 97 416 64 -310 254 134 -638 52 -99 -381 -123 -99 74 -149 -364
1752c64O87l36l82P38j44o4l1R1O1j63m61N71k18l19M30j71k31K57k27jJ63k55
$$ -364 323 -13 -395 343 199 135 104 195 256 93 -368 203 -15 -334 96 -75 -306 -49 -276 -277 -114 -369
1774c69N59k00j06M65l75k15N70j23k81K32j30j35K56l95M94k37n09M95J9m67
$$ -369 190 -10 -116 349 -26 -241 329 206 -75 157 27 -108 148 -247 247 10 -499 -4 15 -452
1794d52M51j2Mq8J9M88l42l49O21n7m76K31J15r7k4NJ0k52j02L92o1l88N54j54
$$ -452 -1 -13 -9 -97 -78 410 68 -281 340 283 -193 38 153 56 32 37 47 -205 -307 85 24 -364 190 36
1818C6m33N07k11OJ37j7L48Nm88M52j41m47M63M1n07L38j75L1k44l12J020n22
$$ 36 -397 110 -101 -95 42 25 373 378 -110 342 201 -246 217 258 -249 89 -86 -55 -299 -611 409 -113
1840a13j97M67R8n98N34mk52K87r0K76m53k55O24j12m97N78k65n29M08L5j62J22
$$ -113 -310 157 255 -343 191 187 -65 222 132 408 -45 -300 324 212 -285 293 28 -501 -93 -58 -220 -98
1862i8L8J53j13l75O62J15o03L80K8k7M3q9J48n55J43N96n58m23O88Nn69M73J15
$$ -98 -60 93 -20 -395 267 382 -221 159 187 160 203 114 262 -293 -150 446 -112 -535 153 158 -411 62 177
1885A77k41k76K35K46k15j05O92o4q48Q65%p37J81L10j0l83j20N35l42l89O50
$$ 177 -64 -340 -105 141 -74 -179 513 449 -399 466 466 -271 -90 220 210 -173 -293 242 -100 -489 161
1906A61l2p30N33L70k84l33M34K04l70n2P91n51p74J027k11o18K99M30l79l25
$$ 161 129 -601 -68 302 18 -315 119 323 -47 -99 692 141 -633 394 183 -435 -136 294 -85 -410
1926d10K67M66n63l14J074k11q40O22M58o34nL42N9m63J76P60o41p15P00M2p59
$$ -410 -143 323 -240 -554 520 309 -531 91 549 -85 -90 252 311 -152 24 784 143 -572 128 170 -589
1947e89O03P4j36m02N46P4k98k72Q41o13m58Q95l2k30j62M75K5o80O4N83m58l88
$$ -589 14 88 -48 -450 96 170 -128 -400 441 -172 -630 265 233 3 -159 316 341 -339 -275 308 -150 -538
1969e38O25j09m11M28K39m26j85N44j23l97J47M93k36l54O03k4o45K89J16j7l52
$$ -538 87 -22 -433 -5 234 -192 -377 167 44 -353 -206 287 51 -303 300 276 -369 -80 36 19 -333
1990c33K47M68p65j90P06m3n71M28L87o98J72J19L78m88J71O25l21o19N51K92
$$ -333 -86 382 -383 -573 133 90 -481 -53 334 -364 -192 -73 305 -183 -12 613 292 -327 224 516
2010E16q84J16L51j67j17l1L84m35l85J016l67l51N43jl48J43L33j50l75k9P03
$$ 516 -368 -252 99 -68 -185 -216 168 -267 -652 364 -3 -354 189 188 -160 -17 316 166 -209 -238 465
2031D65m58l14O92n4p54N34R4l35k04J19M83k93n65Q96j8n71L93L91o45j13K81
$$ 465 7 -307 385 331 -423 111 205 -130 -334 -215 268 -25 -590 306 288 -283 110 501 -144 -257 24
2052B4L74n09l7O71m31p18O23L60q57M05L17J32n74j09P57o11k96J033k9j166
$$ 24 398 -111 -148 523 92 -626 -3 357 -500 -95 222 354 -220 -329 428 -183 -479 554 525 -641
2072f41P44M24l43m85K97K85r50M21P68n95p07Q90K47r94L01O67m99l27Q84L95
$$ -641 103 527 184 -301 -4 281 -669 -248 520 -75 -782 108 355 -639 -338 329 -170 -497 387 782
2092G82r82r6P39j68o79O47Q9p38K17M25K5q22K40O94m59m67P51r0p82P28L97
$$ 782 -200 -296 443 275 -404 243 332 -406 -189 236 261 -561 -321 373 -86 -553 198 108 -674 54 451
2113D51o48j48O17K92p01l4N19n20l79P39L10r50N0N97L9o51L29K44m49K7N81
$$ 451 -197 -345 272 564 -137 -171 348 -172 -551 188 498 -452 -402 195 234 -417 -88 156 -293 -266 315
2134C15j51n71O99K16o02n8L97l9m59N24L48p29l04N87o0l57J27N9j09J63R8m5
$$ 315 164 -407 292 508 -94 -152 245 206 -253 271 619 -110 -414 173 113 -244 -117 -58 -167 -4 94 49
2156D9j53k52Q19n17j28M88p4j56m7K22k35p3K1N0Jk45P31o22j02L83j87l0n6
$$ 49 -104 -356 463 -54 -182 306 232 76 29 251 16 -57 -36 14 15 -230 501 -121 -223 160 -27 -57 -113
2179a13j4M75m11K78J62k98l8J2Qk86L29M7k07m6k9J20O8k63J56K45m29K97n4
$$ -113 -127 348 -63 215 377 79 41 53 61 -225 104 151 -56 -102 -131 -11 57 -206 -50 195 -234 63 9
2202Ip9J43k21L13j37k7J69m3j67L3J60j31j16K2K5J7k54K67l1k85M63n1r9k9
$$ 9 -70 73 -148 165 28 1 170 127 -40 -7 153 22 -94 -72 -47 -30 -284 -17 -48 -333 130 79 -20 -49
2226d9O7K51r4k62L75k81j86L13k7j70N3Jm3j25jK7O9p8K34Q5l29J52J41J2q1
$$ -49 18 269 175 -87 288 7 -179 134 107 -63 -10 -9 -52 -177 -178 -151 -82 -160 74 159 -170 -18 123 135 54
2251E4j18J41m2j46J94p0j70K59p0m30M51J0k11K36j09J61n5j16L05k17j46M31
$$ 54 -64 77 35 -111 83 13 -157 102 32 -398 53 63 -148 88 -21 140 85 -31 274 57 -89 342
2273C42k72L2r8J27k05l7q3L16k89M3R5j50L0O5K98k98J13P7q0k3Q7M07o40l0
$$ 342 70 102 4 131 -74 -111 -194 122 -167 -124 -29 -179 -149 -84 214 -84 29 106 26 3 90 497 -143 -173
2297a73J94J3O4l7q4j83K83j94O2L4k27K27j27k88L48L3N5L16k90J42k43J48k5
$$ -173 21 34 98 61 -23 -206 77 -117 -55 -21 -248 -21 -148 -436 -88 -55 0 316 26 168 -75 73 48
2320D8J78l96J71K22l28j13K31k26J60p1nJ06p7L89m76K0J08K34Qj64K26k29K0
$$ 48 226 -170 1 223 -105 -218 13 -213 -53 -124 -129 -23 -100 289 -187 -167 -59 175 183 19 245 16 36
2343C6M5j1j61Q1J05k57M3K65j14j52L6k7kR0J56M4M6l84K81q5j01K98k80J01
$$ 36 81 70 -91 -10 95 -162 -119 146 32 -120 -84 -111 -113 -23 133 177 223 -161 120 35 -66 232 -48 53
2367E3k86J48J12p9J5L74k37l04J84q5o2R8J06j25J07R2J27j88l94L10M1l0K63
$$ 53 -233 -85 27 -52 -37 337 100 -204 -20 -105 -167 -69 37 -88 19 111 238 50 -344 -34 7 -23 240
2390B40j90n8k9j77L64j98m0K14l11j36L02J69k51K8J05p3q4J22J73k39j54L59
$$ 240 50 -8 -37 -214 150 -48 -88 126 -185 -321 -19 150 -101 -73 32 -41 -125 -3 170 -69 -223 136
2412A36k99K17o9J14k0j63NL4K04k69L49k38j84L30j9l11L10j27r0M4K98l98N0
$$ 136 -163 54 -15 99 79 -84 -79 -45 159 -110 239 1 -183 147 128 -183 127 0 -90 -46 252 -146 -96
2435i6J9K45k20k42K76j6J12j59N3kn5q1L55j46j2Km7n8P9M1j43J42j80L29k23
$$ -96 -77 168 -52 -294 -18 -34 78 -81 -28 -30 -85 -166 189 43 31 33 -14 -72 7 48 -95 47 -133 196 -27
2460b7j82M84m17k58K84J92k35p1M73k71j91M2N30n19nL13n9m22L89J62k46k43
$$ -27 -209 275 -142 -400 -116 76 -159 -230 243 -28 -219 -177 353 -166 -171 142 83 -339 50 212 -34 -277
2482b77J27M33n43K85N9K0m38N25M5l42K53Q7k35j64L06O5k76QM17k72o3JK23
$$ -277 -150 283 -260 25 84 104 -334 191 236 -106 147 234 -1 -165 141 206 -70 -62 355 83 20 21 244
2505B44m25PL98k34j74K60K20m47k13N71k92l8l5M49l99j16K66L4j34r3M16l38
$$ 244 -181 -174 224 -10 -184 76 296 -151 -364 207 -85 -123 -158 291 -108 -224 42 76 -58 -151 265 -73
2527g3J25n0L3l46K61K1m5n1J5K36j31k95O29j79j73J50n6l5q4M7J66k90l0M10
$$ -73 52 2 35 -311 -50 -29 -74 -125 -110 126 -5 -300 329 150 -23 127 71 36 -48 -1 165 -125 -155 255
2551B55l69j2K41j62m8K68j19p0o0J08j5k15KQ6K09k73K21J36j0n5j0p0j67K15
$$ 255 -114 -126 115 -47 -95 173 54 -16 -76 32 17 -198 -196 -110 99 -174 47 183 173 118 108 38 -129 86
2575H6j05j21k05M85n5j65k17L11J55j96Q0l8j60K16J94k64l2K98n18K54J9J1
$$ 86 -19 -140 -345 140 85 -80 -297 14 169 -27 53 15 -145 71 265 1 -31 267 -251 3 22 33
2597C3Rk14Q2P4o5J06k3j00nJ8LJ16N3j56J51J47m10J28r8j29J41K25r1k04K25
$$ 33 42 -172 -90 -16 -81 25 2 -98 -103 -85 -82 34 87 -69 82 229 -181 -53 -151 -280 -139 86 -5 -209 16
2622A6q6o2J33k7p3J04L8N7n8l6L9j39J26qM5j56j33J72j48l8K06Q6p2l7M1Q2
$$ 16 -70 -132 1 -26 -99 5 43 100 42 6 45 -94 32 24 69 -87 -220 -48 -196 -234 -28 58 -14 -51 -10 72
2648G2j08j17M76j81j60k64K71L3Rm7J66j39k06L17j62j63K35J25p7K0j40Lj49
$$ 72 -36 -153 323 142 -18 -282 -11 22 31 -16 150 11 -195 122 -40 -203 32 157 80 100 -40 -37 -186
2671a86L36n5M8j85K73p4k19J15k69L42p3K0j92L0n4L44k80j95M28K4l17J58j03
$$ -186 150 95 143 -42 231 157 -62 53 -216 126 53 73 -119 -89 -143 201 -79 -274 154 178 -139 19 -84
2694h4j61J47M2n3j05L42J31k15m5j27K49n43N58n4j01j86K68l22K27k14J66p
$$ -84 -245 -98 -56 -109 -214 128 259 44 -1 -128 121 -422 136 82 -19 -205 63 -259 -32 -246 -80 -87
2716h7J40jM3q4k60L25l6j69J04J47n6j27m7J44j08J40N6l15L53q3j4R6k46N3
$$ -87 53 52 95 11 -249 76 40 -129 -25 122 66 -61 -108 36 -72 68 124 -191 162 79 65 161 -85 -32
2740c2M0L4l6m5j34K69J48j22k23n1K45k79J66J59q4j07J31k02j27K29J26j54
$$ -32 8 42 6 -39 -173 96 244 122 -101 -152 93 -186 -20 139 55 -52 79 -123 -250 -21 105 -49
2762d9O2K17k58j25P7K31j21j75K90k34j1J74q5J21l21K28K09k87R8N1M9j45J45
$$ -49 13 230 -28 -153 -76 155 34 -141 149 -85 -96 78 -7 114 -207 21 230 -57 41 92 141 -4 141
2785A41j1k24K9J42J01j70l8N7r2J65j77O1J8j38J68k9L6k17K24k9k12J35J9J28
$$ 141 130 -94 -65 77 178 8 -30 27 -65 100 -77 -16 2 -136 32 3 39 -178 46 17 -195 -60 -41 87
2809H7L7j36J09j20LM3J84j55r2k3j43J15J85k78J85K9O5nk74K53k95K54m5j10
$$ 87 124 -12 97 -23 -20 23 207 52 -40 -63 -206 -91 94 -184 1 30 95 90 -184 69 -226 28 -17 -127
2833a27lK29o7m2J64j06K2m4j76M3R0J32k82J15j46K19Q6j25J54m3L9j31p9J20
$$ -127 -130 99 32 -10 154 48 70 26 -150 -107 -17 115 -167 -52 -198 21 107 -18 136 93 132 1 -78 42
2857D2n8J63n6ql25M3L04j69n2N5J3j86M31j09p4R2k13J20K5l4l1K1M7m5r0L08
$$ 42 -16 147 91 83 -242 -199 105 -64 -116 -61 -48 -234 197 88 14 106 -107 13 38 4 -27 -6 41 -4 -94 214
2883B14j25O2n9n4j93O2M09n20J99L9J34j51m8J26j15K12m5n5Nk03K19q4N2m6
$$ 214 89 151 92 38 -155 -93 316 -204 -5 34 168 17 -31 95 -20 192 147 92 97 -106 113 29 81 35
2907C5j1j83K48L1l68O3J12J85J29l23q3J59j48K15l01K33J48j11M5j45K71j33
$$ 35 24 -159 89 120 -248 -185 -73 112 241 -82 -165 -6 -154 61 -240 -7 141 30 75 -70 201 68
2929F8J16m44M32j62P2J5l84J96J88l3j94J71j33L7n2K45n5j11J0R6r9j74J45
$$ 68 184 -260 172 10 82 97 -287 -91 97 64 -130 41 -92 -55 -107 138 83 -28 -18 78 -21 -195 -50
2952e0j16K17j10r9J7K88L0m12L31j53j4K57o7k01J80j54J06n1o9J3l9K22j4j22
$$ -50 -166 51 -59 -158 -141 147 177 -235 96 -57 -71 186 119 -82 98 -56 50 -1 -70 -57 -96 126 112 -10
2976a0M0m6K7j66J16K68j60l29K15K34k45O3RJ18j80J12m3m2rR8k26J24j12K56
$$ -10 30 -16 11 -155 -39 229 69 -260 -45 189 -56 7 16 134 -46 66 23 -19 -28 70 -156 -32 -144 112
3000A12k08K9Q7k19P4J82q8L4J09k00J67j01J46j01q8QR3j27J82k17R3J9N8k55
$$ 112 -96 -67 20 -199 -125 57 -31 3 112 -88 79 -22 124 23 -65 -57 36 -91 91 -126 -33 -14 44 -211
3024b11J83J76k72M8L42j60k02J57j64K56p1l21K73k60J23J90k18O2J30O9j51
$$ -211 -28 148 -124 -76 266 106 -96 61 -103 153 82 -239 34 -226 -103 87 -131 -69 61 130 -21
3045b1J74l63j2L15J17l25J62j07J52j89l7L60J9j91J4j3j86O3N5r7Ql4J26lp5
$$ -21 153 -210 -222 93 210 -115 47 -60 92 -97 -134 226 245 54 68 55 -131 -68 -13 -110 -102 -136 -10 -13 -88
3070h8K00Q3k62j3l4j46K33j48J81M6k31K45Jk31J3j2K84j91O0l4L8m4O0K03k51
$$ -88 112 195 -67 -80 -114 -260 -27 -175 6 52 -179 66 67 -164 -151 -163 121 -70 -10 -44 -6 -50 10 213 -38
3095c8J56p7L7R0n8j4r5j64J95j39J76j41M9j63J58L7J58k49q2K79j32J41j82
$$ -38 118 41 78 168 110 96 1 -163 32 -107 69 -72 -23 -186 -28 9 167 -82 -164 115 -17 124 -58
3118e8Q7o5O0j90L5L18k04j74N0K35r1J75k51L08n37M29k66K21r1M4l4J58l12
$$ -58 29 -36 24 -166 -131 187 -17 -191 -141 94 3 178 -73 235 -302 127 -139 82 -9 35 1 159 -153
3141a53J48R4kj00J47ok64J57K45k92N7k3L75l47r6K20k6k88N0l5J8J96N4j81
$$ -153 -5 89 87 -13 134 128 -136 21 266 -26 31 8 383 36 -60 160 134 -154 -104 -139 -121 75 129 -52
3165e2M4J98k22R6k11J06O1P2j49J79r0Q7k4j14M1m0k9k5j2J03k46K93q3o5K38
$$ -52 -8 190 -32 64 -147 -41 20 92 -57 122 32 119 95 -19 22 -18 -47 -72 -84 19 -227 66 -17 -82 156
3190A56k21k8K02K8k46J57o3p7r4J08K2q3L64l49K22q6l3n6j33J97N2k46J40p9
$$ 156 -65 -93 109 137 -109 48 -15 -92 -186 -78 -56 -139 225 -124 98 12 -21 -77 -210 -13 39 -207 -67 -146
3214a46M24l59j73L6K89l6J5j37RL2m1J88k27L9R5K6j89R4J19J28k67L0j27R6
$$ -146 278 -81 -254 -218 71 35 50 -87 -78 -46 -87 101 -126 -87 8 34 -155 -61 58 186 -81 -51 -178 -82
3238h2J17j28L4k19J60J34p9J71k21L03j77J28j02K25o23M74q0O3j46R7j57k0
$$ -82 35 -93 -59 -278 -118 16 -63 108 -113 190 13 141 39 264 -359 115 35 98 -48 49 -108 -128
3260a28K68j87K69o0k0o7M9j76j76K44k96L51r9j43J23k08K45RMP0k53R5J34j21
$$ -128 140 -47 222 162 142 75 124 -52 -228 16 -280 71 -28 -171 -48 -256 -11 -2 2 72 -181 -86 48 -73
3284g3j3l4J6pJ35K0o3l4J12j90p1N2J44J15k58K57l3p9q0N9q2P5j22J28K5kL7
$$ -73 -86 -120 -104 -111 24 44 -19 -53 59 -131 -202 -150 -6 109 -149 108 75 -4 -84 -25 -107 -32 -154 -26 -1 -3 34
3311C4j00J5J15K6q5j77k7K60M9k30J71K8j31J28k24r8K31O9j90K24l33J77K61
$$ 34 -66 -51 64 90 5 -172 -199 61 110 -120 51 79 -52 76 -148 -246 -15 54 -136 88 -245 -68 193
3334A93j01qr4K1O9l94P7L55k89K27j5M4o4k53J64J2R7m9o5R6J1l2l6j2L5J13
$$ 193 92 84 -10 11 80 -314 -237 118 -171 56 41 85 21 -232 -68 -56 41 -8 -73 23 34 2 -34 -46 -11 102
3360A02j3q3jN2M7j73R8O4j63J31j47J51ql3K17l20P4n7R7j21Q4k2o4J40j67J0
$$ 102 89 6 5 57 104 -69 29 93 -70 61 -86 65 57 24 241 -79 -5 -62 35 -86 -2 -24 -88 52 -115 -105
3386a05l3j0J34J12p4k23J24K10j64R3j91J03J6j46k7N5K11j9L6m4j76p8J3J33
$$ -105 -138 -148 -14 98 24 -199 -75 135 -29 64 -127 -24 -8 -154 -181 -126 85 66 102 58 -118 -196 -183 -50
3410e0K20r6pj3q5pJ32m4j09j06K20R9k14J53R6kk49Q5O1j48j69J27kl5Q3O1j53
$$ -50 170 74 67 54 -31 -38 94 50 -59 -165 55 154 -60 93 189 187 -62 23 84 -64 -233 -106 -108 -143 -60 1 -152
3437a52j11L13m1PL7J27k30n1Q2j52QJK50M1o0J08l99L24j04J75k29j94L90k11
$$ -152 -263 50 9 16 53 180 -50 -101 -19 -171 -163 -162 88 129 69 177 -222 102 -2 173 -56 -250 140 -71
3461g1j48M3K35j22N6N1M5J19j94j5N1j97K32j8J6k14J36J26J3j29kmj12p0J94
$$ -71 -219 -176 59 -63 -7 44 89 208 14 -1 50 -147 85 67 83 -131 5 131 144 15 13 9 -103 -173 21
3486B1k44K03N2k56J69p7P7j47P3K68l31J62K20j01j73K12p3p9j05J79l3j17K58
$$ 21 -223 -20 32 -224 -55 -132 -55 -202 -129 139 -192 -30 190 89 -84 128 55 -24 -129 50 17 -100 158
3509A58k82Q3O0j52J53j79Q7n1J02k7j3Q6J14j02O0J49j93j3M7l72K03j13J30
$$ 158 -124 -41 19 -133 20 -159 -72 -123 -21 -48 -61 25 139 37 97 246 53 40 87 -285 -82 -195 -65
3532f5J83j09R5j35P3k8l7J26k47J82J62j00Kj79r5r0K65q1J00j91J47J82L2k39
$$ -65 118 9 104 -31 42 14 -23 103 -144 38 200 100 102 -77 -172 -262 3 -78 22 -169 -22 160 192 -47
3556d7j38L04J03l27J64J4J24j15O1J77k59p7j04J77n0l3L0j66M40l52J16j35
$$ -47 -185 119 222 -105 59 73 197 82 143 320 61 -16 -120 57 7 -26 4 -162 278 -74 42 -93
3578i3M7J68q6J66m48L05m8pQ3j13r6K69j22J5m3L0j52R1J67p3P3k86K67r7Q5
$$ -93 -46 122 36 202 -246 59 11 4 87 -26 -122 147 25 40 -3 27 -125 -34 133 60 133 -153 114 17 102
3603A02j24N0j45l7P5R6l6j54K57j93J05O5k3J20j51Op0k1O6j23L81l48L1N8j69
$$ 102 -22 28 -117 -154 -79 17 -19 -173 84 -109 -4 61 38 158 7 13 -57 -78 -12 -135 246 -102 -71 -13 -182
3628a82K38n3p1J27J1J12j57j3j21J60k05k7j59M95j60p9O3q0j16Q3L9J53N5j73
$$ -182 56 3 -68 59 70 182 25 12 -109 51 -154 -181 -340 155 -5 -84 -21 -101 -217 -134 -95 58 113 -60
3652f0J33nN3k32J79k1j64J98k17K68k07O1o2J80q6M8l1j9j42k7J82R6r8J17m8
$$ -60 73 68 121 -111 68 47 -117 81 -136 132 -75 -14 -76 104 18 66 35 16 -126 -153 29 125 27 144 96
3677I6j67P3l8M6O1m4K0r3r3K12R8k92J35o0Q5j90K0K1NK09L6Ok71K67j93m2m7
$$ 96 -71 2 -36 10 71 27 47 -46 -139 73 171 -121 14 -46 39 -151 -131 -110 -105 104 140 146 -125 142 -51 -93 -140
3704a40K54m3L18m09j65J11L4J47j74J08m2k7n2j2j2K48j2k97K01J71m35L54k45
$$ -140 114 71 389 -20 -185 -74 -40 107 -67 41 -1 -28 -80 -92 -104 144 132 -165 36 207 -228 126 -119
3727a19K13j09k10K50j19J05l9p1J06L1M8j8j38MN8M0o5J43j10l5q6j29K63k9
$$ -119 94 -15 -225 25 -94 11 -28 -99 7 38 86 68 -70 -66 -8 32 -33 110 0 -35 -121 -250 13 -16
3751a6J6O8o8r6q9M18l07r2J51m8J98j80Rk92O51j69k64J75J9j06j49L05k06n
$$ -16 0 68 0 -96 -185 233 -74 -166 -15 -63 135 -45 -36 -328 323 154 -110 65 84 -22 -171 134 -72 -77
3775g7J15j71J99M5P3k52J71j89Q3j90K52j28M5O4k48J74k0R0l0j4q1J02J37k43
$$ -77 38 -133 66 111 184 -68 103 -86 -3 -193 59 -69 -24 40 -208 -34 -54 36 6 -8 -89 13 150 -93
3799i3J1J7lL5l4m0K28k10J44Nj56N0J6J93j95J57k46K60l2j29j6Lk61K47n8R6
$$ -93 -82 -65 -68 -33 -67 -107 121 -89 55 60 -96 -46 -30 163 -32 125 -121 139 107 -22 -38 -35 -296 -49 -107 -11
3825a1J14q4n5O3O1j58J6N5M7k34K47k08j0K31Jk38L61j57r8pJ49r8j20k6J13
$$ -11 103 19 -36 27 88 -70 -54 1 48 -186 61 -147 -157 74 75 -163 198 41 -57 -64 85 -13 -133 -159 -46
3850d6K9qN2M2j40M00k42j91J33j26j5j11K23jL3j84J72m2j02O8J96j45N7n1P4
$$ -46 -17 -25 27 69 -71 329 87 -104 29 -97 -112 -223 0 -1 32 -152 20 -22 -124 -56 140 -5 52 1 75
3875G5j42o2L25j09k62K28j70K9J05q9J59M4j98j10K47Oj75P1k1P7k24J76j4n0
$$ 75 -67 -129 196 87 -175 53 -117 -88 17 -72 87 131 -67 -177 70 76 -99 -28 -49 28 -196 -20 -34 -84
3899h4Q4M0Q4j14O8k99L95j97q1J65p2Pj5J50j03J05P5l08j17K40n9op0P0j6J71
$$ -84 0 40 124 10 78 -221 174 -23 -104 61 -11 -4 -19 131 28 133 208 -100 -217 23 -36 -42 -112 -42 -58 113
3925A13J19k08p6j00m8R3m9j31L73o2K42k79OK3NK1o6ol8K50Q2l08o6J01l5J47
$$ 113 232 24 -52 -152 -200 -107 -156 -287 86 24 266 -13 -7 16 21 42 -24 -30 -68 182 264 -44 -110 -9 -44 103
3951A03j07M5jL4r1q2J64k02K88j61j22Q1J96j15N9j71J90J41j56j93J45kj92
$$ 103 -4 41 40 74 -17 -99 65 -137 151 -10 -132 -51 145 30 89 -82 108 249 93 -100 45 43 -149
3974a49L27o9j70J75krQj79J4L2q3M9J96Q2m10J78Q0J31m1m12L22j80N4J69j75
$$ -149 178 109 -61 114 112 103 111 -68 -54 -22 -105 -56 140 222 -188 -10 70 201 160 -252 70 -110 -56 113 -62
3999f2p2O9O1j29K85j39M2Q0j68J11r0J02j50J06k5j28J56k53K70j63J82o8j17
$$ -62 -134 -65 -4 -133 152 13 55 135 -33 78 -12 90 -60 46 21 -107 49 -204 66 -97 85 17 -100
4022a00N6N5r3Q6k18K87j86l4M23l45m9kJ61P6k2n2j77K07J2p5J1M2j28J02j04
$$ -100 -44 11 -82 4 -214 73 -113 -147 276 -69 -118 -120 41 117 95 43 -134 73 85 10 21 63 -65 37 -67
4047f7O5N3j38J16j15J42J35k82J75r6pk7j4J5L0j00K26j64Nj25j4J54l3j5J03
$$ -67 -2 51 -87 29 -86 56 191 -91 84 -12 -19 -46 -60 -45 -15 -115 111 -53 -48 -173 -187 -33 -66 -81 22
4072B2M1k7L1j91K24R0j86J08J41o5l68K12J38q6j8j63p2L64k57Q3l1J55n4k38
$$ 22 63 36 67 -124 100 190 4 112 253 188 -180 32 170 84 66 -97 -169 195 -62 21 -10 145 91 -147
4096a47K08K3p7J53n3M5k70K45j08J43k19l6R6n5o6J44J66j3k05j14P7R6oOK26
$$ -147 61 84 7 160 107 152 -118 127 19 162 -57 -93 3 -52 -118 26 192 179 -26 -140 -63 33 27 33 259
4121B59l32Lm0R0k22L69o6o5%j40M5J69l36L90q7J36j55j69J70m7K4q2K11j35
$$ 259 -73 -70 -110 -20 -242 127 61 -4 -4 -144 -99 70 -266 124 37 173 18 -151 19 -28 -4 -86 125 -10
4145a0N6J3k0j45q2P0J08j10J47k14J48n3N7J93j61J9Q1j57q7K05N3k67J96j62
$$ -10 46 59 39 -106 -188 -118 -10 -120 27 -187 -39 -92 -35 158 -3 16 97 -60 -147 58 111 -156 40 -122
4169a22M8J28q9p0M13k96K1NM1M5l3J5l28L00l4o8J18j11j3j27R4j3L3K23n9P0
$$ -122 -74 54 -35 -105 308 12 33 38 79 124 91 106 -222 78 44 -24 94 -17 -30 -157 -63 -76 -43 180 121 191
4195A91l63QJ59j31J72L2ol6pj15J28J11k21J08k6M4j12J87j28J65l01L17j90
$$ 191 -172 -164 -5 -136 36 68 62 26 19 -96 32 143 -78 30 4 48 -64 123 -5 160 -141 176 -14
4218a4O8n5k05J80q5K28k77K68r3J41k39p5L87k53j30K19r5m1Q3j60J38O8j16
$$ -14 54 -1 -206 -26 -111 117 -160 108 15 156 -83 -158 229 -24 -154 65 -30 -71 12 -148 -10 58 -58
4241e8J88k50K11o0n1l6l7l1O3L4k4O7J02k34J29J07k1k8Q8k04o3pJ37J37l19
$$ -58 130 -120 91 31 -20 -56 -93 -124 -61 -27 -51 16 118 -116 13 120 99 71 159 -45 -108 -115 22 159 -160
4266a60J6N1J72j99K8J12j18J76j13lN4P4J17m3J22m35m4L8K42j84L40j03n5q7
$$ -160 -144 -93 79 -120 -92 20 -98 78 -35 -38 16 90 207 164 286 -149 -193 -155 87 -97 243 140 85 -2
4290bkJ53l28P9P8K2r3K73q6J4j62R6nk08J83j05K7N5k6R0k19J88K03l18j40Q8
$$ -2 -4 149 -179 -100 -22 0 -93 180 94 108 -54 42 37 -171 12 -93 -66 -11 -37 53 -166 22 225 -93 -233 -145
4316a45J75Q1q2RL02p5k33No8J69k33K38jj59J57k60J55L9Lp1M6mo2o7J93k10
$$ -145 30 111 29 38 340 265 32 37 -31 138 -95 143 142 -17 140 -120 35 74 77 6 52 48 -14 -81 112 -98
4342i8K88j15l7p9K42k97L24k91J76j09k9R5j1l7J62k39M1O0j53J28q1O1J1J08
$$ -98 190 75 38 -41 201 -96 228 -63 113 4 -25 70 59 22 184 -55 -14 46 -107 21 -60 1 12 120
4366A20k17L8J36j57J23Q6j23Ok42J58R9q6k0R5j23q3J24N2J02k27K98j18q7J22
$$ 120 -97 -59 77 -80 43 129 6 12 -230 -72 27 -59 -79 16 -107 -190 -66 -14 88 -139 159 41 -46 76
4390G6n7n1J23j41k2L69k18j27LO4j23Pl2K57k62p0J91Q2j05j69K06K3k1r9J05
$$ 76 19 -32 91 -50 -72 297 79 -48 -45 19 -104 -97 -129 128 -134 -204 -13 69 -36 -205 1 24 3 -96 9
4415Ir1j9nJ87K2J22k04L7mk35L16l74J48R5k5j46K44N0m6k0j85J00J9L5j8m7
$$ 9 -82 -101 -106 81 103 225 21 58 54 -181 135 -239 -91 4 -21 -167 77 127 81 61 -124 -24 -5 30 12 -35
4441c5K3J37p3j57K40k23j3L8j30J09L2m3J37J33j12j83O0O4r0J77k46O5K10m2
$$ -35 -12 125 52 -105 135 -88 -101 -63 -193 -84 -52 -95 42 175 63 -120 -60 4 -86 91 -155 -90 120 78
4465G8k08N5j39J44O3P9j98K07kj97K05N6N2j91lk5j46J4K15k57K59j12N0J66
$$ 78 -130 -75 -214 -70 -7 72 -126 81 79 -118 87 143 195 4 1 -24 -170 -156 59 -198 61 -51 -1 165
4489A65k96O4L4m0R6J94k56lP0j97K12j82L16j45RQ3j38R3j21R5j76r7K19m0J07
$$ 165 -131 -67 -33 -73 23 217 -39 -42 28 -169 43 -139 177 32 41 124 -14 79 -42 53 -123 -220 -1 -41 66
4514F6k2p4m0j8K73j01J19l84L34j94M1jj6M0N6J8o8Jj46K52k78J58K6j34n5K02
$$ 66 44 -30 -70 -88 185 84 203 -181 153 -41 0 -1 -17 23 79 97 29 30 -116 136 -142 16 42 -92 -147 55
4540E5N7k12K14j99qo0M86n58K32l3N0j3j51J68l00K82p0J60N7k1j20o7j20L10
$$ 55 112 -100 114 -85 -93 -153 333 -225 7 -26 24 11 -140 28 -272 10 -60 100 157 136 16 -51 -171 139
4564A39J8l8m7m9P2j29k28L24l3q2Q0k5K4k21K25pp4k1N7m1k1L03m6k82K1q1J35
$$ 139 157 119 72 23 95 -34 -262 62 29 -53 27 2 26 -195 30 23 -51 -72 -15 -56 -77 226 180 -102 -81 -162 -27
4591b7j15K62P0k92J4j74J08J94M6k18J31kP6r7j55N23j17l10N9o7O3J22k84J68
$$ -27 -142 120 190 -102 -88 -262 -154 40 86 -132 -1 -3 73 -24 -179 344 227 -83 -24 -91 -28 94 -190 -22
4615b2j58K42j60J55j2N7j74m1k6K48M4o2j05J94l64K83j31j8J3J12j23Q0n8J46
$$ -22 -180 62 -98 57 45 102 -72 -113 -139 109 153 91 -14 180 -184 99 -32 -50 -37 75 -48 32 -26 120
4639A20l00L45j0k67Q6l1O6j1MJ84l43J73q9K9nK7j60K08j46L0K17q1l5J18r3
$$ 120 -180 165 155 -112 -26 -57 9 -2 2 186 -157 16 -73 -44 -49 -22 -182 26 -120 -90 127 46 11 129 36
4664C6j23L1j57J64j5qk00K11P5k3o6K91k08K7K08j73m1j56J51rl3p2L3J96j20
$$ 36 -87 -56 -213 -49 -64 -72 -272 -61 14 -9 -75 216 8 35 243 70 29 -127 24 15 -18 -90 -57 139 19
4689A9M1j60j1q0J43n1j25J45p1J02J33j72K41r8q1J69K23n39K14kK5j84O9j83
$$ 19 60 -100 -111 -191 -48 -99 -224 -79 -150 -48 85 -87 154 56 -25 144 367 -172 42 40 65 -119 -50 -233
4713b33K47pL6j76J51Mj12J82j96j8J12j52q0L85k30M5J52j11j27L01j27j96K4
$$ -233 14 7 43 -133 18 22 -90 92 -104 -122 -10 -162 -242 143 -87 -42 110 -1 -128 173 46 -150 -126
4736a26K49j64o6K29J51k74J07J28l77R0J20K7p8J25j98J3o1L8K27j62M9l2k15
$$ -126 123 -41 -107 122 273 -1 106 234 -143 -53 67 94 16 141 -57 -44 -105 -67 160 -2 47 15 -200
4759b00o7L47Mj28j99J61K21k81N35n06J05J13j59J3K15j91j06Q7j20J94Ll7q2
$$ -200 -267 80 84 -44 -243 -82 139 -142 393 -113 -8 105 -54 -41 174 -17 -123 -36 -156 38 41 4 -78
4782g8J14J29k49J70k9k11J53J30J41k53P5m9p8K02m39K36P1l24K34j32L15j85
$$ -78 36 165 -84 86 57 -154 -1 129 270 17 92 43 -35 167 -272 -36 35 -289 -55 -187 128 -57
4804e7n6K1J33k37J55J82n7K9O8j48q2J5J52j0j55r7K15j6k68J95j61K84r0J08
$$ -57 -113 -92 41 -196 -41 141 84 113 181 33 -49 -34 118 108 -47 -144 71 55 -213 -18 -179 105 15 123
4828A23r9J69N6n20J30K37r4J22n0m2l5l0P1k1M3N1o7o9M6k6J69j90j00J50r1
$$ 123 24 193 249 -271 -141 96 2 124 74 32 -3 -33 38 17 60 111 44 -25 21 -5 164 -26 -126 24 -67
4853f7nK13j06l5J16L4k4p8p3Q9m9j1p7r0J9N2J95o9k36J62j02J73q0K05o3k58
$$ -67 -72 141 35 0 116 150 126 48 -25 64 15 4 -73 -163 -144 -92 103 34 -202 -40 -142 31 -49 156 93 -165
4879a65L6J46k29K64R5j78J61k3k23J78k78K20J28j68J90j93K8J74l24K02Q9l13
$$ -165 -129 17 -212 52 147 -31 130 107 -116 62 -216 4 132 -36 154 -39 -11 163 -161 41 130 -183
4901a83K43O7J06l97J28R1P5q6n7P4o2r6J38m7k9p1M3j9n8K05Q6j05l8k7J5J41
$$ -183 60 127 233 -164 -36 55 130 44 -13 61 -1 -97 41 -6 -35 -106 -63 -82 -140 65 151 46 8 -19 -4 137
4927A37k05J28j22J68J6j90L8J9n0P0Q0j07q0J43k15o1M55k57J28j50J46O1P5
$$ 137 -68 60 -62 106 122 -68 -30 -11 -61 9 89 -18 -98 45 -170 -231 224 -33 95 -55 91 152 227
4950B27k0k27J33P4j07j68L4l8J46j20j28L09k69J66j64J80r9J70J07k78L5J26
$$ 227 207 -20 113 187 80 -88 -54 -92 54 -66 -194 115 -154 12 -152 28 -71 99 206 -72 -37 89
4972H9k80K78j3k01q7K88N2o2j07O7J17j12j15N4j20L76l63J36jK27l75J16K4
$$ 89 -191 87 74 -127 -214 74 126 64 -43 24 141 29 -86 -32 -152 224 -139 -3 -4 223 -152 -36 -12
4995a2Q2o3K5L7n1j18J35k44K49l5p1J99k19j13J18N0Lk7MK95k38l7k1J07Q5n9
$$ -12 70 7 32 69 18 -100 35 -209 40 5 -66 133 -86 -199 -81 -31 -28 -55 -51 244 6 -31 -52 55 140 81
5021H1R2o7k37P2m6J52l4r4J39r2K09k22Q9N9j42O9J14j80J39k14K66k66P8j65
$$ 81 173 106 -131 -59 -105 47 13 -81 58 -34 175 -47 42 101 -41 28 142 -38 101 -113 153 -113 -35 -200
5045b00J78j31M13j31n8K3j22M8k91M08j83J2o9j14J44j59J82J12j07J27m0k43
$$ -200 -22 -153 260 129 71 94 -28 20 -271 137 -46 -34 -103 -217 -73 -232 -50 62 -45 82 42 -201
5067b01m4J62nN8J53k55J02j04j36K59Rj24J94j82J38k70L58o6k88K25J0k9rQ8
$$ -201 -245 -83 -88 -30 123 -132 -30 -134 -270 -11 -2 -126 68 -114 24 -246 112 46 -242 -17 -7 -36 -45 43
5091D3p2k0q9J48Q8o0L8M4r0k13L37k62Q4o5M8K6pj06J83l0Q0J58o4k77K15k59
$$ 43 -29 -49 -138 10 98 38 76 120 30 -183 154 -108 -24 -89 -41 -15 -22 -128 55 25 105 263 199 -78 137 -122
5117a22L6K52j89j47K22j61N9J59k13P4M3QL0j76j0O6j67M07j88q8M2N4K9J37
$$ -122 -86 166 -23 -170 52 -109 -50 109 -104 -30 13 21 51 -125 -135 -69 -236 171 -17 -105 -63 -9 20 157
5141A57k84K50k11M7L28k83N0R0j17p4L13k84j37L69j29j96J27j47L2K31j32J02
$$ 157 -127 123 -88 -41 287 4 54 144 27 -47 266 -18 -155 214 85 -111 16 -131 -99 132 0 102
5163A02k99J68j25J05P6R1l62K11O2o5J50K64j29j62J24k25O7k29K75j41K7j11
$$ 102 -197 -29 -154 -49 27 118 -244 -33 29 -36 114 378 249 87 211 -14 53 -176 99 -42 -15 -126
5185a26n2J59J83m8m5o3P7j9L8r7p7K0K52k76L06j95J3k5m6j42K72k6p4Q4n9j00
$$ -126 -178 -19 164 116 71 8 85 66 104 7 -70 -50 202 -74 232 37 50 25 -21 -163 109 83 9 93 34 -66
5211f6J32R3j03Q3j13J80p8J70j64r2pJ1L9j51K17p3j47J97j56l0K8J10j65P2
$$ -66 66 159 56 139 26 206 128 298 134 42 35 46 85 -66 151 78 -69 128 -28 -58 -30 80 -85 -13
5235a3j07K0J25n4J31J02j71k36J6L43n9j27l5Q4l0p9j24K36q1J49j07N6j4n8
$$ -13 -120 -100 25 -29 102 204 33 -203 -187 156 97 -30 -65 19 -11 -90 -214 22 -59 90 -17 39 25 -33
5259c3P5m0Q8j74J29O6m3K34l88N5q6l3K56r3M3k09J12K08k55n2J76P9QK6k06
$$ -33 42 2 90 -84 45 111 68 302 -86 -31 -117 -150 106 13 56 -153 -41 167 -88 -140 36 115 123 149 -57
5284e7L6L9L4j38J17j12N9r3p1J48RP9j7j27K94q3n9P9j57M5K5j17J25P5o5j64
$$ -57 -21 18 52 -86 31 -81 -22 -115 -186 -38 -29 50 33 -94 200 117 58 137 -20 25 50 -67 58 133 68 -96
5310i6j66L27Q3j82J57k43J07n4J60mk61J59J1J70j16O7k32J98j15J89k03K22
$$ -96 -262 65 148 -34 123 -120 -13 -67 93 89 -172 -13 -2 168 52 119 -113 85 -30 159 -44 178
5332A78j78lj82J49JJ5J36k63R7n7J9J62r2k23J46K98j96j55Q1l8K34m1m39K13
$$ 178 0 -3 -185 -36 -35 -20 116 -147 -50 -107 -88 74 -18 -241 -95 203 7 -148 -67 -105 129 88 -351 -138
5356a38J76j20J96k14J22k34J61J2J00N7l1O0j98N4K25n1K5j17j53o1l9L3j6J75
$$ -138 38 -82 114 -100 22 -212 -51 -39 61 118 87 147 -51 3 228 177 202 85 -68 -129 -168 -135 -151 24
5380B4m8j45J53P7j19J22J22k14L12l14j59J86j11K25k66R8R3pJ5O9R4k47K16
$$ 24 -24 -169 -16 61 -58 64 186 -28 284 -30 -189 -3 -114 111 -155 -57 36 29 44 113 207 -40 176
5403A76l71K86j58K0J9J2J16k13K08j64O2N2lk9j03j15K61j14K62j72q5Q0n8j20
$$ 176 -195 91 -67 -47 -28 -16 100 -113 95 -69 -7 45 42 13 -90 -205 56 -58 204 32 -53 27 -31 -151
5427a51J64j99J92J09k21K35m6pk33J26J28j21J51n7r2J34m00M29j85N3Q6k33
$$ -151 13 -186 6 115 -106 129 83 76 -157 -31 97 -24 127 70 -22 112 -288 141 -44 9 95 -138
5449a38K32j88J4J44J72k66Q2j7K12k58J28K52k98j11K31l00R5k62J91M%j42J67
$$ -138 94 -94 -80 64 236 -30 52 35 247 -11 117 369 71 -40 191 -109 -14 -276 -85 -81 -81 -223 -56
5472e6M7p2J24p1o9K55l42M4K18n9j20N3O3o8J72j89J54M8k11OJ3j07L12N9k61
$$ -56 -9 -81 43 -28 -97 158 -184 -140 78 19 -101 -48 15 -53 119 -70 84 132 -79 -73 -60 -167 145 204 -57
5497e7J51j30%j27K79m2j77K00M7k55L64q1l8J2k40J38p8k62K75j0k55o2N10j88
$$ -57 94 -36 -36 -163 116 74 -103 97 144 -111 253 172 134 146 -94 44 -34 -296 -21 -31 -286 -348 162 -26
5521b6r2K09j73o3K18Mj34r6J65O4j92J99j72j21L70q1j27P4r1lR6q5N0m4j81
$$ -26 -118 91 -82 -145 73 77 -57 -153 12 76 -116 83 -89 -210 160 79 -48 26 -65 -68 28 -57 -7 -51 -232
5546b32J98O9k7q4J52j32k8OK44k13j11J33j26K30p3O8k40N4K43l42K95l47K45
$$ -232 -34 35 8 -76 76 -56 -84 -78 166 -47 -158 -25 -151 79 6 74 -166 -112 131 -211 84 -263 -18
5569a8L0OL5r5j72J17J45Pk10P1K0k9N1m6L9j27J57j13P7K67j86k38L24K54j48
$$ -18 12 18 53 -42 -214 -97 48 55 -155 -84 -64 -93 -42 -88 -49 -176 -19 -132 -55 212 26 -212 112 366 218
5594B18l44n0J40J9J21k35J32k43L47k55P4m0L06j90l9J1M5K08l16J97j88N9L8
$$ 218 -126 -176 -36 -17 104 -131 1 -242 105 -150 -76 -116 190 0 -39 -28 17 225 -91 106 -82 -23 15
5617A5L6j33L10k28K29l93K15K5j6J4r1N6J11k39M8J04j70J02K0M1p3K40j29k03
$$ 15 51 -82 228 0 229 -164 51 76 60 74 -17 39 150 -89 -41 63 -107 -5 15 56 -17 223 94 -109
5641a09J85k33L3N34l71j17p5J30m5n1K30j70n0K71k29K40j94J63k1k53K8r4K21
$$ -109 76 -157 -124 410 39 -78 -153 -23 -68 -119 111 -59 -109 162 -67 173 -21 142 121 -132 -104 -198 23
5664B3R1j01o1l9JP1j0J73j69J01k01J73k7J20j69j3J05k61L09l49J65kK03j06
$$ 23 114 13 -48 -87 -86 -15 -25 148 -21 80 -121 52 25 145 -24 -37 68 -193 116 -233 -68 -70 133 27
5688B7N4j01J77j34k60K25j30K8L7q8LQ2J22o1K04l12J01J49q4o3j49J80l9K4
$$ 27 81 -20 157 23 -237 -12 -142 -114 -77 -165 -162 -80 42 -19 185 -127 -26 123 39 -24 -173 7 -32 -8
5712hm1K39k94J98j08j59N2QK36l20K42m2j17k5oJ08K53l5k07P1j58lO8R2k85
$$ -8 -49 190 -104 94 -14 -173 -121 -113 123 -197 45 3 -114 -139 -145 -37 216 181 -26 45 -113 -116 -48 44 -241
5737b41J51K1Q9j35J88l9j29p1J24P0o2J3J4k1j27K83k26O8r5J05J53J36k01j86
$$ -241 -90 -69 20 -115 73 34 -95 -166 -42 28 -34 -21 -7 -28 -155 128 -98 -30 -125 -20 133 269 68 -118
5761a18J77j04J09r1m0q9Q7N1J99k9j58P0q2r5O4J04j52N5K16N5l00K25k09K1
$$ -118 59 -45 64 -27 -67 -156 -69 -18 181 152 -6 64 -18 -113 -49 55 -97 -42 174 229 -71 154 -55 -34
5785c4l1K4L4j96M02k73K10j96o7o8o6J43J09r7J53j55J00J46l34J86k6P7L5N4
$$ -34 -65 -41 -7 -203 199 -74 136 -60 -127 -195 -261 -118 -9 -106 47 -108 -8 138 -196 -10 -36 41 76 130
5809A30l93K50J11J3j98J60O6J7r5L2o8J20n2%o7r2j01J25O2j97j7K48M0j4l6
$$ 130 -263 -13 98 111 -87 73 139 156 61 93 25 145 93 93 26 -66 -167 -42 20 -177 -194 54 94 80 44
5834D4j31R2p0L4JJ28N0q1j36K5J67k13J0K16l51L06l70J82J44j82O8m6pJ18o7
$$ 44 -87 5 -65 -31 -30 98 148 67 -69 -44 123 -90 -80 136 -215 91 -279 -97 47 -135 -67 -113 -120 -2 -69
5859f9l4Q5J01l1O2j58P0q3J02m5p3J39m1k09K07J48k62J14nK36j57lkq3M4o8
$$ -69 -103 -18 83 52 114 -44 26 -57 45 0 -73 66 25 -184 23 171 -91 23 18 254 97 94 92 9 53 -15
5885a5J07J08j84K66j05R6n21K47J11j60J44j41j21L50j08L1j86J80j18J14k50
$$ -15 92 200 16 282 177 273 -248 -1 110 -50 94 -47 -168 182 74 105 -81 99 -19 95 -155
5906a55J17K17k16o5j11J00k1J35J03N2q1j23o0J24L0p6r2J42r1J90k12K93k96
$$ -155 -38 179 -37 -102 -213 -113 -134 1 104 156 75 -48 -108 16 46 -30 -122 20 -71 119 -93 200 -96
5929i6q0J09K2j1L3kj26J65J02k71K98j43m0m8J2J26j80K49m08J19K73k7j36O8
$$ -96 -176 -67 -45 -56 -23 -25 -151 14 116 -155 143 0 -40 -88 -76 50 -130 119 -289 -170 103 76 -60 8
5953Hj53K01k6l0j56J05J10r1Q0J77l08K31Q0O1m38J26p2Q8k2j37K15m1K9p5J96
$$ 8 -145 56 30 0 -156 -51 59 -32 48 225 -83 148 228 289 -149 -23 -95 -7 -29 -166 49 8 37 -38 158
$$ [...]
8191b67
##END NTUPLES=NMR FID
##END=
