##TITLE=1H_Pr NCS-KOH
 200.13MHz,CDCl3,
 8 sc
 
 8.7.2025
##JCAMPDX= 6.0         $$ Bruker NMR JCAMP-DX V2.0
##DATA TYPE= NMR FID
##DATA CLASS= NTUPLES
##ORIGIN= UXNMR, Bruker Analytische Messtechnik GmbH
##OWNER= pz
$$ XWIN-NMR		Version 3.5
$$ Tue Jul  8 16:09:15 2025 Russian Standard Time (UT+4h)  she@DPX200
##.OBSERVE FREQUENCY= 200.1313
##.OBSERVE NUCLEUS= ^1H
##.DELAY= (6, 6)
##.ACQUISITION MODE= SIMULTANEOUS
##.ACQUISITION SCHEME= undefined
##.AVERAGES= 8
##.DIGITISER RES= 18
##SPECTROMETER/DATA SYSTEM= spect
##.PULSE SEQUENCE= zg30
##.SOLVENT NAME= CDCl3
##.SHIFT REFERENCE= (INTERNAL, CDCl3, 0, 14.3821)
##AUDIT TRAIL= $$ (NUMBER, WHEN, WHO, WHERE, WHAT)
$$ ##TITLE= Audit trail, XWIN-NMR		Version 3.5
$$ ##JCAMPDX= 5.01
$$ ##ORIGIN= Bruker BioSpin GmbH
$$ ##OWNER= she
$$ F:/spectra/data/she/nmr/H-C/1/audita.txt
$$ ##AUDIT TRAIL=  $$ (NUMBER, WHEN, WHO, WHERE, WHAT)
(   1,<2025-07-08 16:08:20.06 +0400>,<she>,<DPX200>,
      <created by zg, POWCHK disabled, PULCHK disabled
       configuration hash MD5:
       00 E9 B6 7A A2 85 ED C7 34 08 36 98 17 FE 4E 26
       data hash MD5: 16K
       DD A2 4C 9F 67 9B 80 79 93 28 65 57 E0 DC 8D 89>)
$$ ##END=
$$ 
$$ hash MD5
$$ E4 74 CC 13 60 29 31 E6 88 50 38 6F 08 C8 3B E9
##$RELAX= 
##$RELAX= 
##$RELAX= 
##$RELAX= 
##$RELAX= 
##$RELAX= 
$$ Bruker specific parameters
$$ --------------------------
##$DU= <F:/spectra>
##$EXPNO= 1
##$NAME= <H-C>
##$PROCNO= 1
##$TYPE= <nmr>
##$USER= <she>
##$AMP= (0..31)
100 100 100 100 100 100 100 100 100 100 100 100 100 100 100 100 100 100 
100 100 100 100 100 100 100 100 100 100 100 100 100 100 
##$AQSEQ= 0
##$AQ_mod= 1
##$AUNM= <au_zg>
##$AUTOPOS= <>
##$BF1= 200.13
##$BF2= 200.13
##$BF3= 200.13
##$BF4= 200.13
##$BF5= 200.13
##$BF6= 200.13
##$BF7= 200.13
##$BF8= 200.13
##$BYTORDA= 1
##$CFDGTYP= 0
##$CFRGTYP= 5
##$CHEMSTR= <none>
##$CNST= (0..31)
1 1 145 1 1 1 1 1 1 1 1 1 1 1 1 1 1 1 1 1 1 1 1 1 1 1 1 1 1 1 1 1 
##$CPDPRG= <>
##$CPDPRG1= <>
##$CPDPRG2= <>
##$CPDPRG3= <>
##$CPDPRG4= <mlev>
##$CPDPRG5= <mlev>
##$CPDPRG6= <mlev>
##$CPDPRG7= <mlev>
##$CPDPRG8= <mlev>
##$CPDPRGB= <>
##$CPDPRGT= <>
##$D= (0..31)
0 0.7 0 0 0 0 0 0 0 0 0 0.03 0 0 0 0 0 0 0 0 0 0 0 0 0 0 0 0 0 0 0 0 
##$DATE= 1751976499
##$DBL= (0..7)
120 120 120 120 120 120 120 120 
##$DBP= (0..7)
150 150 150 150 150 150 150 150 
##$DBP07= 0
##$DBPNAM0= <>
##$DBPNAM1= <>
##$DBPNAM2= <>
##$DBPNAM3= <>
##$DBPNAM4= <>
##$DBPNAM5= <>
##$DBPNAM6= <>
##$DBPNAM7= <>
##$DBPOAL= (0..7)
0.5 0.5 0.5 0.5 0.5 0.5 0.5 0.5 
##$DBPOFFS= (0..7)
0 0 0 0 0 0 0 0 
##$DE= 6
##$DECBNUC= <off>
##$DECIM= 32
##$DECNUC= <off>
##$DECSTAT= 4
##$DIGMOD= 1
##$DIGTYP= 9
##$DL= (0..7)
0 120 120 120 120 120 120 120 
##$DP= (0..7)
150 150 150 150 150 150 150 150 
##$DP07= 0
##$DPNAME0= <>
##$DPNAME1= <>
##$DPNAME2= <>
##$DPNAME3= <>
##$DPNAME4= <>
##$DPNAME5= <>
##$DPNAME6= <>
##$DPNAME7= <>
##$DPOAL= (0..7)
0.5 0.5 0.5 0.5 0.5 0.5 0.5 0.5 
##$DPOFFS= (0..7)
0 0 0 0 0 0 0 0 
##$DQDMODE= 0
##$DR= 18
##$DS= 0
##$DSLIST= <SSSSSSSSSSSSSSS>
$$ [...]
##$SUBNAM0= <"">
##$SUBNAM1= <"">
##$SUBNAM2= <"">
##$SUBNAM3= <"">
##$SUBNAM4= <"">
##$SUBNAM5= <"">
##$SUBNAM6= <"">
##$SUBNAM7= <"">
##$SUBNAM8= <"">
##$SUBNAM9= <"">
##$SW= 18.0517328524113
##$SWIBOX= (0..15)
0 0 2 0 0 0 0 0 0 0 0 0 0 0 0 0 
##$SW_h= 3612.71676300578
##$TD= 16384
##$TD0= 1
##$TE= 0
##$TE2= 300
##$TE3= 300
##$TEG= 300
##$TL= (0..7)
0 120 120 120 120 120 120 120 
##$TP= (0..7)
150 150 150 150 150 150 150 150 
##$TP07= 0
##$TPNAME0= <>
##$TPNAME1= <>
##$TPNAME2= <>
##$TPNAME3= <>
##$TPNAME4= <>
##$TPNAME5= <>
##$TPNAME6= <>
##$TPNAME7= <>
##$TPOAL= (0..7)
0.5 0.5 0.5 0.5 0.5 0.5 0.5 0.5 
##$TPOFFS= (0..7)
0 0 0 0 0 0 0 0 
##$TUNHIN= 0
##$TUNHOUT= 0
##$TUNXOUT= 0
##$USERA1= <user>
##$USERA2= <user>
##$USERA3= <user>
##$USERA4= <user>
##$USERA5= <user>
##$V9= 5
##$VALIST= <valist>
##$VCLIST= <CCCCCCCCCCCCCCC>
##$VD= 0
##$VDLIST= <DDDDDDDDDDDDDDD>
##$VPLIST= <PPPPPPPPPPPPPPP>
##$VTLIST= <TTTTTTTTTTTTTTT>
##$WBST= 1024
##$WBSW= 4
##$XGAIN= (0..3)
0 0 0 0 
##$XL= 0
##$YL= 0
##$YMAX_a= 63969
##$YMIN_a= -49761
##$ZGOPTNS= <>
##$ZL1= 120
##$ZL2= 120
##$ZL3= 120
##$ZL4= 120
##$ABSF1= 10
##$ABSF2= 0
##$ABSG= 5
##$ABSL= 3
##$ALPHA= 0
##$AQORDER= 0
##$ASSFAC= 0
##$ASSFACI= 0
##$ASSFACX= 0
##$ASSWID= 0
##$AUNMP= <proc_1d>
##$AZFE= 0.1
##$AZFW= 0.1
##$BCFW= 1
##$BC_mod= 2
##$BYTORDP= 1
##$COROFFS= 0
##$CY= -3
##$DATMOD= 1
##$DC= 2
##$DFILT= <>
##$DTYPP= 0
##$F1P= 0
##$F2P= 0
##$FCOR= 0.5
##$FTSIZE= 0
##$FT_mod= 4
##$GAMMA= 1
##$GB= 0.15
##$INTBC= 1
##$INTSCL= 1
##$ISEN= 128
##$LB= 0.25
##$LEV0= 0
##$LPBIN= 0
##$MAXI= 10000
##$MC2= 0
##$MEAN= 0
##$ME_mod= 0
##$MI= 1.114404
##$NCOEF= 0
##$NC_proc= 0
##$NLEV= 6
##$NOISF1= 3.799351
##$NOISF2= 2.8
##$NSP= 1
##$NTH_PI= 0
##$NZP= 0
##$OFFSET= 14.38212
##$PC= 1
##$PHC0= -1375.248
##$PHC1= 39.79247
##$PH_mod= 1
##$PKNL= yes
##$PPARMOD= 0
##$PSCAL= 0
##$PSIGN= 0
##$REVERSE= no
##$SF= 200.129724274929
##$SI= 16384
##$SIGF1= 3
##$SIGF2= 2
##$SINO= 400
##$SIOLD= 16384
##$SREGLST= <1H.CDCl3>
##$SSB= 0
##$STSI= 0
##$STSR= 0
##$SW_p= 3205.1282051282
##$SYMM= 0
##$S_DEV= 0
##$TDeff= 0
##$TDoff= 0
##$TI= <>
##$TILT= no
##$TM1= 0
##$TM2= 0
##$TOPLEV= 0
##$USERP1= <user>
##$USERP2= <user>
##$USERP3= <user>
##$USERP4= <user>
##$USERP5= <user>
##$WDW= 1
##$XDIM= 8192
##$YMAX_p= 0
##$YMIN_p= 0
$$ End of Bruker specific parameters
$$ ---------------------------------
##NTUPLES= NMR FID
##VAR_NAME=  TIME,          FID/REAL,        FID/IMAG
##SYMBOL=    X,             R,               I
##VAR_TYPE=  INDEPENDENT,   DEPENDENT,       DEPENDENT
##VAR_FORM=  AFFN,          ASDF,            ASDF
##VAR_DIM=   8192,          8192,            8192
##UNITS=     SECONDS,       ARBITRARY UNITS, ARBITRARY UNITS
##FACTOR=    0.0002768,     1,               1
##FIRST=     0,             0,               0
##LAST=      2.2672688,     0,               0
##MIN=       0,             -49761,          0
##MAX=       2.2672688,     63969,           0
$$ Real data points
##PAGE= N=1
##DATA TABLE= (X++(R..R)), XYDATA
0@%%%%%%%%%%%%%%%%%%%%%%%%%%%%%%%%%%%%JkMoPqJ0j2J3j4J5j6J8k0K1k3K5
53A3k9L3l5L6l9M3m4M4m4M4l7J8K1j13L59j235R535N5399k7221o8422p280L3248
75e706K5853j1106j3159J649J70k575O057M744l965l990Q36K053j193j248K283
90G03J222j251j033l63K36L88M87N18n16j237L92R96k84n05J08L66k10k69N37
109B85kr63J78J239k4j176o23P54R95j62r12M1N13K9j88j11l4R3L37O4n56n04
131g27P10P81k30q07n09N74O76l41l83K11k3k36N7L87L00k16o60j60O02L24k59
152G1k39k9J34J51p1q2K00J61l58k09K85J00n3k15N5K03o7j32J08O5q0j02M8J87
176A31r7j08l1J15K4q1PP6O2j00o8J9R9J40j42j22l1J54L2j8j27J37n3l7Q8n2
$$ plain form
0 0 0 0 0 0 0 0 0 0 0 0 0 0 0 0 0 0 0 0 0 0 0 0 0 0 0 0 0 0 0 0 0 0 0 0 0 0 1 -1 3 -3 4 -4 6 -6 7 -7 8 -8 10 -10 11 -12 13
53 13 -16 17 -18 18 -21 22 -22 22 -22 22 -15 3 24 -89 270 -965 8570 63969 36748 -31674 -38954 -5706
75 -5706 20147 9041 -4118 -2469 -2299 -4874 1183 5927 1962 -2028 -1192 861 -332 -1580 703
90 703 1925 674 -359 -722 -486 -98 389 907 391 -846 -454 542 258 -247 -139 227 17 -252 285
109 285 283 -680 -502 737 713 -463 -1086 -332 663 501 -411 -370 143 172 -16 -127 -161 -68 269 333 -223 -727
131 -727 -17 764 534 -273 -782 -208 468 127 -256 -45 -68 -304 -247 140 440 224 -436 -596 6 330 71
152 71 -168 -197 -63 88 17 -65 135 296 -62 -271 14 114 61 -154 -99 104 37 -95 13 78 -2 -104 -56 131
176 131 34 -74 -105 10 34 -47 -40 36 98 -2 -70 -51 48 188 46 -76 -107 47 79 61 -66 71 18 -19 69 17
202A7mn4l9K4QL1n2N3j7M4ll3K7J0p1J09n9J2K7j7N1o2m6N4J8n0K0J4j2K8m9J5
234frJ9p1N7M6m8M0m8Kk7N2K2m1j8K1J3k3l3L9j6L2K1j0l5K5l4j4K7Q8j31Q0k3
266cn4QK6M5j0k1L8k5lM2J3m2k3Qk7O7r1M7P1l1m7O4m3m4J5J5qM5m6L5L0m6J6
299B1oOm7l2Q3l1p3Q8LJ2K4k8J6j1l9%J7K7k6K9Oo2qO7r7M9N7p8M8Ko1P2k6o4
333f2O6K5mpl0M6j1n6K6L8l6J3L6o0j5M4k7N5l5k2JMj9Q2p5O6k4l6J3p8O1P0r1
366d2P4jq5O5p7P6m8O9n0l9P6ll3J1k0L1K4n1R6n3k5m3M0L6Km1L0Lm1L8l6m5O4
399BmJ7o4O4k8K0j6kK2p2M7m9P3kpnK4oK5q3l7J33n8NK2qj0m3kL9k2oJ6K9k8O
435hK9j8L6%o3K2l1M8J1n4L3Nj6N0o9J2k4jM4m0j7M2N7o6nL1J5Nn4j9K5j5K6j7
$$ plain form
202 17 13 -41 -80 -56 -48 -17 -69 -16 -33 11 8 -25 2 12 -59 50 -9 3 30 13 64 2 -44 10 28 -22 -2 12 0 28 -21 -6
234 -6 -15 4 -67 -10 36 -12 28 -20 -18 -45 7 29 -12 -30 -9 4 -19 -52 -13 -29 3 24 14 -21 4 -30 -44 -17 71 -60 20 -3
266 -3 -57 -49 -23 22 12 -9 29 4 1 43 56 14 -9 -1 -28 39 -52 -5 66 35 -12 52 9 -35 -20 -5 -13 32 -14 21 51 5 21
299 21 15 21 -26 -58 25 -6 -79 9 12 24 48 20 36 25 -14 -14 3 30 4 33 39 -23 -31 36 -61 -12 45 -33 15 17 -44 28 2 -62
333 -62 4 29 25 18 -12 34 23 -33 -7 31 -5 8 44 -16 -31 13 -14 41 6 -16 -15 -11 -30 52 -23 43 19 -17 -4 -82 -21 49 -42
366 -42 32 31 -54 11 -66 10 -38 31 -19 -58 18 15 -18 -7 -27 4 28 -23 73 20 -5 -48 -8 28 30 -11 19 22 -19 19 -17 -62 2
399 2 -2 15 -49 15 -13 7 -9 -11 11 -61 -14 -63 10 8 1 -4 20 14 39 -44 -81 52 -6 -1 21 13 3 -40 -42 -3 -25 -31 -15 14 -14 -8
435 -8 21 3 39 39 -24 -2 -33 15 26 -28 5 10 -6 44 -25 -13 -37 -38 6 -34 -51 -9 48 -18 -23 8 23 28 -26 -45 -20 -35 -9 -26
469b6nP2j18M6M7pL1l1j1nM4n4L1m1rO3k2l2j3L3P7l3m6mJ7j4k7O4n0M6p3O4k2
502hRo9J14j6J2r9J3P4qo3J0O6l3r2R7j6Qj3K9k2j4RL1m6OK8L0m6on4K0M5qL0
536A8q9P2k4J8nj1l6nO0k5j9M5M5o5nn3N0M3J2q8P1POOk0K1m0M7j5J8l9R7n6n9
570a8L6m4j1L0J9m1M1K6q4M2j6M3mpm3L8l9O4j15R2rKk3jl0R3rn0J1j8P0j3K3
603E5q2N8L1j00L5j7PJ1L2J1m2J8l3k0L7K1Mr6R0l5j3M0%j3JMl3M4j9J0K0j8j5
636gk9L6m3k4O2K2j1J7o1L1%L1m3j0j4M9K0n4M8k1NK7j1k2k7K3kk5K3Pl9O4k9
669gk4K0J3lm9N8k2j2NJ4j2K6NL5q5N7k5j5K4j0L1l5k2l0K7M2M3q7K6L2q6J4M0
702a2k4L4j2l7L7rk0K4L5k6mK5k7J13r6pjJ1jL0N8n4L7k3o0M4p8Q6j7j5J5J0j3
$$ plain form
469 -26 -31 41 -77 -31 16 9 40 9 -2 -7 37 -17 14 -27 -36 27 5 -27 -40 -7 70 37 -9 -13 4 -10 -37 27 -23 23 -50 14 -8
502 -8 1 -68 46 30 42 -57 -44 30 22 -41 -31 35 2 -90 7 -9 -1 -14 15 -7 -21 -12 19 -27 -21 7 37 -9 -15 -69 -49 -4 -12 18
536 18 -71 1 -23 -5 -10 -21 -57 -62 -2 -27 -46 -1 44 -21 -26 -79 -29 14 26 -62 9 16 22 28 8 29 -11 36 21 39 0 97 41 -18
570 -18 18 -26 -37 -7 12 -29 12 38 -46 -4 -20 23 19 12 -31 7 -32 32 -83 9 0 2 -21 -22 -52 41 32 -18 -7 -25 45 32 55
603 55 -27 31 62 -38 -3 -20 -13 -2 30 41 -1 17 -16 -36 1 22 26 -70 20 -15 -28 12 12 -1 0 4 -29 15 -4 6 26 8 -7
636 -7 -36 0 -43 -67 -5 17 6 23 -38 -7 -7 24 -19 -29 -43 6 26 -28 20 -1 4 31 20 -2 -29 -6 -8 -33 -10 -3 -42 22 -7
669 -7 -31 -11 2 -1 -50 8 -14 -26 -21 -7 -19 7 12 47 -38 19 -6 -21 3 -7 24 -11 -33 -63 -36 6 49 -38 -12 20 -66 -52 -12
702 -12 -36 -2 -14 -51 -14 -23 -43 -19 16 -10 -14 11 -16 97 1 -6 -7 4 3 33 91 37 74 51 -9 35 -43 43 26 11 26 36 23
735B3n0J5Rl9J4K7l5M8k5l0M3J2N0l8j0j7J2l4l5Q5m3n0N3%j3%K1J7m0P8qr8P8
768B0k0k1O6n8O0o0JJ6j0k3M2l3mK8N4o3l8N4%K1j01rM1L4j3%j6L4m8rR1l6KJ7
802A9LK1o5P6p7k2L1J7n2L4k2K1L6n4jM5nl6M5k9l4N3m0L1K4j4P7j09k1J2P3k9
834Hk9j8K0K6l0L9Ql1QOj2p3Q4n4L9L0K2J8o2Oml6O8Ok6k7M5j1Pm3LO8n4m4M8
869ENK5m7l6N0j2KJ2K4m2k2J4Q5p4k4M7K8j4M7q9qL7L0n3Nj3LM8k3mm3P1o7L5
903Bk4J9OrRM4o5k5O3J9l0l7Jk5K5j9O2k9k2L8l0qM6K3o4M3K0k9j2j5M1j4j0j5
937b1K0K6m4JK6M4r0Q5l8K7m5O1qj8j2J8q9R3k3p3M2j9M3m7N3p1M7k0L8K7K3o9
969a3j0RO1m0m3lK2k6J5P4n4J6K1n1N8k0m1J9M8p6O3j2k5k0Q0j8l5j7M9j1k4m7
$$ plain form
735 23 -27 -12 -3 -42 -28 -1 -36 12 -13 -43 0 12 62 24 14 -3 9 -25 -60 25 -18 -68 -15 -15 -28 -28 -7 10 -30 48 40 -58 20
768 20 0 -21 45 -13 47 -13 -12 4 -6 -29 13 -20 -24 4 58 -5 -43 11 11 32 -69 -78 -37 -3 -16 -16 -32 2 -46 -55 36 0 2 19
802 19 22 43 -22 54 -23 -45 -14 3 -49 -15 -37 -16 20 -34 -35 10 5 -31 14 -15 -49 4 -36 -5 19 5 82 -27 -48 -36 37 8
834 8 -21 -39 -19 7 -23 16 24 -7 1 7 -5 -78 6 -48 -9 21 43 61 -1 5 1 -35 33 39 13 -14 31 20 27 -16 -13 55 1 -43 5
869 5 10 35 -12 -48 2 -10 -8 4 28 -14 -36 -22 63 -11 -35 12 40 26 73 -16 -24 13 43 -10 -5 -18 -15 33 10 6 -37 34 -33 2
903 2 -22 -3 3 -6 3 47 -18 -43 20 39 9 -28 -27 -52 -27 -46 16 -13 -35 3 -27 -35 11 34 -30 13 33 4 -8 -23 18 4 -6 -21
937 -21 -1 25 -19 -18 8 52 -38 47 9 36 -9 52 44 26 14 32 -57 36 13 -60 -18 -37 6 -41 12 -59 -12 -32 6 33 56 -13
969 -13 -23 -14 47 7 -36 -39 -17 -43 -28 46 -8 8 29 -22 36 16 -25 -6 42 -34 29 17 -8 -28 52 34 -1 -18 31 20 -4 -51
1001e1Q3q7N8j0J7OrL2n7L1m4j5N9j2n7O6k7l6P3l6j8j3L6jJ5k0ON2m4L4nm4%
1034a8J3K4L4l1k5L8m1j7L1l7QM4m0J6Op0P0Jn5M9m6RQj6L5nK7rJ8l6K5J0o6P5
1068B9lom5J3k0M8m0L8ql2K9l7J3L1Mj4j2j%l1K8Mj3LL8p7K8J7N4l3J1K1j7rj2
1103aj0M1l4l1O9r9N2K9l0K3J4%p3R6p7M6mK1m5rM8l5J8K5m2nM2l4j3j5L2K6q
1136A7K4j4n4nRK0k0nO8j5o7M4m6MO9m8jJ3K8J1n5J2k5K4jj4J8pk8J6MM7o4%j
1171d2M1L7j1l9M7k3k0L3k3L1K2l4n8O1r0O9j3oJ1RM5o6jM7o1J0J02j30k1P5k4
1202b2K3lL1n1J9Qk1JO3n7l4OPJ1J6K2l2L4l6Ml4jJ1K0M3J3m2m4L8nj1NO9n1j5
1237a5L2J0m6K2o5O1k3qN8j3J4p3L9Kj1k2K0k6O2l0JL2mp9P5l0J7mKL5l4N0l5
$$ plain form
1001 -51 32 -55 3 -7 10 16 7 39 -18 13 -31 -46 13 1 -56 10 -17 -53 20 -16 -34 -47 -11 -12 3 -17 -11 41 -3 31 26 -18 -18
1034 -18 -5 19 53 22 -3 35 -6 -23 8 -29 -21 23 -17 -1 5 -65 5 6 -49 0 -46 -37 -29 -45 -10 -15 12 3 21 -15 10 20 -46 29
1068 29 26 20 -25 -12 -32 16 -24 14 6 -26 3 -34 -21 10 14 0 -12 -13 -13 -44 -16 -12 -25 -22 16 -61 -33 -16 38 5 16 37 20 11 -1
1103 -1 -11 30 -4 -35 34 -65 -13 16 -14 9 23 23 -50 46 -31 15 11 32 -13 -22 26 -9 9 34 -8 -13 29 -5 -18 -33 -1 25 17
1136 17 41 27 -27 -32 -23 -3 -23 -28 40 25 -42 2 -44 -40 29 -19 -20 -7 21 32 -23 -11 -36 -12 -13 -27 -9 -16 -44 -28 -24 23 -41 -41 -42
1171 -42 -1 36 25 -14 33 10 -10 23 0 31 53 19 -39 22 -68 1 -12 -18 -7 2 47 -19 -20 27 -34 -24 78 -52 -73 2 -22
1202 -22 1 -2 29 -22 -3 5 -16 -15 48 -9 -43 -37 -30 -19 -3 19 -13 21 -15 -11 -45 -46 -35 -15 28 41 -1 -45 -7 -12 -23 -18 51 0 -15
1237 -15 17 27 -19 3 -62 -1 -24 -32 26 13 27 -46 -7 -5 -16 -38 -18 -44 18 -12 -11 21 17 -62 13 -17 0 -4 -2 33 -1 49 14
1270A4nM3m3Oj6mj4K2rJ0l5m5J13l4J7j3J0k6N1o8K8rk2K1M9n3OK1p7Q9p4K0m
1303c1k9N9J6j7MrN5q6K4J6j9PK4M1Pl0n0J3J8q1R7K0m3J4k5N0ln8Nj9rK4Kj0
1337b3pK4j2j7N0j9j3qNQJ0k5K5L8l2M0n4NJ3j6L1j9NqKl2K6Rk5M0jk0J1l9R0
1372F2l3mm3K8rj2K5k9N0r4LQ8qm9N1j1j4k8K3j6M6n4MM5k9k1j12J27K7J5J4o0
1404a8LJL8K1r3R8q5Q2m2l6O4n1j9N5k1L4l2K1j9l4rk4O4k6L6jk4M1k6j1K0K0
1436B7jl2N7m4J5j5NJ0J7k8L5l2J6j5%K3k7o7N6rRj8J6O6r1L5m7M1rk8m0M6J6
1469a3NnN9o3k7O1l5L2M8o5j2M7n6jO3q5N6j7j2L3J2j3oJ5p1R2o8NP4n4J3mj0
1502bJ6JnQ0j15M0m0J1N0n9M1j01R7J2r4M1KJK8l3J7ok4R6k8J7j7m1M6q8J10o6
$$ plain form
1270 14 9 52 9 15 -1 -5 -19 3 -6 4 -31 -76 37 3 20 7 17 -9 42 -26 2 -7 -29 -8 41 -12 -6 15 -62 27 -47 -27 -31
1303 -31 -60 -1 15 -2 2 -7 48 -38 -14 2 -17 -10 14 55 62 32 -18 -5 13 -68 29 49 6 20 -5 45 42 -16 -11 -30 -39 -15 -13 -23
1337 -23 -30 -6 -18 -35 15 -4 -17 -25 -20 -12 -2 -27 -2 36 4 44 -10 -5 8 -8 23 4 9 1 3 -29 -3 6 -19 21 20 0 11 -28 62
1372 62 29 25 -18 10 1 -11 14 -15 35 -59 -56 32 24 -25 26 15 1 -27 -4 -20 26 -28 -24 21 -8 -29 -141 -14 13 28 42 -18
1404 -18 -15 -14 24 45 -48 50 -35 47 5 -31 33 -18 -37 18 -3 31 -1 20 1 -33 -42 -66 -2 -28 8 7 -17 24 -2 -13 7 27
1436 27 26 -6 51 7 22 7 12 22 39 11 46 14 30 15 15 38 11 -56 0 -9 0 -18 -2 64 -27 8 -39 2 -7 -35 -75 -29 -13
1469 -13 -8 -13 46 -17 -44 17 -18 14 62 -3 -15 32 -24 -25 38 -47 9 -8 -20 13 25 12 6 21 -50 42 -26 -21 53 -1 12 8 -2
1502 -2 14 15 10 90 -25 15 -25 -14 36 -23 18 -83 14 26 -68 -27 -25 -24 4 -29 -12 -18 -42 54 26 43 26 -15 31 -57 53 -13
1534a3N8k9pJ4ql1M5rkp3K3rj0QJkK9o7O5qj9M0l7J00j00O3p6P1M4m1mk9N7m2
1568Bl9M5Nj4kj5k5M1n3K9Q0m3J2l0k0N0JK4m8m5O4mrjOl3k1K7O2j34Q3jqMl5
1603d5J22j26N3M6q9Q9l9o3N9l7M9Rl5l2K6kP8j3m5j8O8j7l8N6p3L2j2j6M5n6
1633b4K3N2j7l8n1M5k3L1L5l9m0J4O8j25M4L7L7n7%N8L0l5m4J2j1kM1LJ0m0P8
1664G2n5L6r8K8qK3OJ1l7rj7J8N7l6J3l5J03l7l5j0J0nrL6k5MrO6q1M4j1oM2m9
1698cN2nj11L9M8k4L3m9M7k2k7M7j8j5K6Oo5O8j0rk8J7nl7K2L8l2L7L1o0K9m9
1730b9Q2m6j2N1m0n9Q0m2O3k8j8l5K5J0l7M1K7q9P0l6k4N5qK6k3P6r2K0m4nO2
1761B1l8j0j2m4J27o8m7J01m2PL6l5L5m1J8j4J0Pk6N5n6L1n3L8K0m9J5jJ5QpJ3
$$ plain form
1534 -13 45 16 9 23 15 -16 29 20 18 -55 -32 -41 -51 -43 -42 -44 -15 -82 -17 -25 -44 -4 -41 59 -41 22 -54 17 61 20 16 -13 44 2
1568 2 -37 8 13 -1 -3 -18 -43 -2 -55 -26 54 11 23 -7 -27 23 24 48 0 -45 19 15 6 5 11 -22 -43 -16 46 -88 -5 -6 -14 -10 -45
1603 -45 77 -49 4 50 -39 50 11 -52 7 -30 19 28 -7 -39 -13 -15 63 50 5 -13 55 38 0 56 -17 15 3 -13 32 -24
1633 -24 -1 51 34 -4 -55 -10 -33 -2 33 -6 -46 -32 36 -89 -45 -8 29 -28 -28 30 60 25 -19 -7 -18 -20 21 24 34 -6 72
1664 72 17 53 -45 -17 -25 -2 4 15 -22 -31 -48 -30 27 -9 4 -31 72 35 0 -10 0 -5 -14 22 -3 1 -8 58 -23 21 10 4 46 -3
1698 -3 49 44 -67 -28 20 -4 29 -20 27 5 -22 25 7 -8 18 24 -41 27 17 8 -20 -3 -8 -45 -23 15 -17 20 51 -9 20 -29
1730 -29 53 7 -5 46 6 -53 27 -15 48 20 2 -33 -8 2 -35 6 33 -56 14 -22 -46 9 1 27 4 80 -12 8 -36 -41 21
1761 21 -17 -27 -39 -83 44 -24 -71 30 -12 -5 31 -4 31 -10 8 -6 4 11 -15 40 -16 15 -38 0 20 -29 -14 -15 0 8 1 14
1793A4n5K6J8n3kO4L4m6L9j9j05O2jL8Qk3l7O7n1L6Ko8O2n0M2%L1l3kk4j4Kj9
1826e7O2j7rK3kM5o4J5m4M0M2m6L2o3N0J6n0N1m1m3j7N6RJ4k5L2pj2MPJK4l0k0
1860b4J9%mNm0R1j9p6L7O4j8m4L0m4k1M8OQj1P%lM4o1m4M2L9k9Mj8J0M4l0oL2
1895C8m6j2L3l6L6pj0oPJ2L7n6Nk8O2on2M1N4m7K1q5P1p0J5L0o0O6k4N8p7J1J8
1928gK1k7KKjl4K0K2l7l1O3kL5k0M6o9QNO3n1j8J7j2M1o3N3k3l1N1o1K4M7j4j6
1962CJ3K7n8N4o9M8nJ1m3J1K8q6O5J5Qn3JJ02p7K1Lk4M9l8J0j2L7p6K9LJ1L4q
1995C4l8N0l8lqL8l2J2j7%J9m9qO6k0LpJ4nm2K9j8j6N6J8Lo6J0L4m1M3k1r%P5
2030F6Pm5j5l7K3L2J4l6L5q3j7M2O5p9N5Nm6l4M7M2p0rJ06j30K7L8K5m8K9k5P2
$$ plain form
1793 14 -41 -15 3 -50 -52 12 46 0 39 20 -85 -23 -24 14 22 -1 -38 29 -22 14 16 -52 10 -40 2 2 33 0 -2 -26 -40 -38 -57
1826 -57 5 -12 -21 2 0 45 -19 -4 -48 -8 34 -12 20 -43 7 23 -27 24 -17 -60 -77 -21 -12 2 -23 9 2 -10 -6 1 2 26 -4 -24
1860 -24 -5 -5 -9 -4 -44 47 28 -48 -11 53 35 -9 21 -23 -44 4 10 18 7 14 14 11 55 -6 -50 -8 31 2 6 -12 -2 42 12 6 38
1895 38 -8 -20 13 -23 13 6 -4 -10 -3 9 46 -10 -5 -33 29 23 -29 12 66 19 40 -45 26 -44 -29 1 -59 7 -17 41 -36 -25 -7
1928 -7 14 -13 -11 -9 -10 -44 -24 -2 -39 -70 -7 -9 26 6 52 -17 -9 -4 59 8 -10 7 -5 36 -27 26 3 -28 23 -38 -14 33 19 3
1962 3 16 43 -15 39 -30 18 13 24 -19 -8 20 -66 -1 14 22 -31 -30 72 -5 16 19 -5 44 6 16 4 41 -35 -6 -3 8 42 34
1995 34 -4 46 8 5 -3 35 3 15 -2 -2 17 -32 -40 26 6 9 2 16 11 -31 -2 -20 -36 20 38 41 -25 -15 19 -22 21 0 -9 -9 66
2030 66 73 28 13 -24 -1 31 45 9 44 -39 -56 -14 51 -28 27 32 -14 -48 -1 41 -29 -38 68 -62 -35 3 28 -20 9 -16 56
2061E6k8j8r0O7K5k3n2PR3r3K9J3k0N1m6j0P6p7K6J1oL0m7k4L2J1lP8j0KJ9j40
2093f1M6j3J9M4k9o1N8k9K5K4m0J3rk5J6J5kl5M6j8K4rm0J00j44R8lM0m5j7P4
2124F2q0L5n2N3n3O6K5m6l9O0r2N7K0m0m7M8N4n0qM%l6P8pm5L8n1P0l8M6p3O4
2156B3m4J1OKj6j9M5j9j6N1j7J4k1K9j1j7l3J5k0M6k0M0Lj8M8n1J5l8j9NJ3m0
2188e3N6o4O3J2j7N1%o9L1k1K9J6k6Q0j07K5k5JJ4M0%nj03P9J8m4J8M5l0k7K6
2219A3K3k8l3nK4l6L4NnPKQ4j17O2j1om7L5J9ol0J1K9Ql6NJ2J7Jj5l4K5O6n9j
2254A3nk7j2L7K4Qr6P9k3K8J4m7k0rl9O1K6n3K3j8pL2N8q4L5L8l4k4J3k3Q0k5
2286B3n2K9OK7L7p7K7m3K4K4J2k2n7P8k4p6Q4Qj1n9KO9o8J8RJL8j9K2o9L4L4o2
$$ plain form
2061 56 28 10 -80 -13 12 -11 -63 -56 37 -56 -27 -14 -34 17 -29 -39 37 -40 -14 -3 -9 21 -26 -50 -18 -7 -10 68 58 60 79 -61
2093 -61 -15 -28 -9 35 6 -55 3 -26 -1 23 -17 -4 -13 -38 -22 -7 -9 -44 2 -16 8 -1 -41 59 -85 13 10 50 5 -12 62
2124 62 -18 17 -35 18 -35 31 56 10 -29 31 -61 -4 16 -24 -71 -23 31 -19 -27 -23 -23 -59 19 12 -33 5 -46 24 -14 32 -41 23
2156 23 -21 -10 -4 -2 -18 -37 8 -11 -27 24 7 21 0 29 18 1 -32 -17 -37 9 -11 29 32 14 62 11 26 -12 -31 -26 -13 -53
2188 -53 3 -61 2 14 -3 48 48 -21 10 -11 18 34 8 88 -19 6 -19 -18 -4 36 36 31 -72 7 25 -19 -1 44 14 -13 13
2219 13 36 8 -25 -30 -6 -42 -8 -3 -8 -1 1 85 -32 30 19 13 -34 1 20 14 -16 -5 24 32 -4 1 13 30 31 16 -18 7 73 14 13
2254 13 8 -19 -31 6 30 38 -58 21 -2 26 40 -7 -27 -36 -75 -14 12 -41 -18 -36 -43 -11 47 -37 -2 36 2 -22 -9 -32 48 23
2286 23 -29 0 6 33 70 -7 20 -23 1 25 37 15 -42 36 12 -64 20 28 17 -42 -40 29 -39 -21 -12 -11 27 8 30 -39 -5 29 -33
2319c3l1K7J7M0n9O0ML3pr7L5K2j9lO8n9k5K7j1K2Ol7N3q2R1n1j2j7K3J8Nj8k7
2352c7N1n3J7Pj6O5j9%ol3L1J%j2j1L9j2k2M5l7J7o9M1J0j2M6j15P0N7k3o1O1
2384B0m4mN5k3L4l7Mrm1j3J06o8m0L4P6l2J6q4M7OM8p4K3j0k3K5M7l8j7L7Mk0
2416Elk6N4o1O6ll2k7J6P%L6m5qpN2l4K7l9J7k7J8pL4K7n3l3K5KL8k0L5m1L0j1
2451A2k5J7L7m7oJ7lJ9J1n3LN4j1o8P2o2N1n4k5M0L1l9l1M6l8P3n7J1J2K4Qk1
2483bj0nkk6M0J5K1o9K0K2L2j2lk7M0Qn8LmQ0m8j3j1MM3m4j3L5n4N2m8M8M3q2
2517b5M5k6O4l6j0n3N1rlJ9l3K7L4n8K1QQl7J1qJ3OkN7j20Q4m3J9K6k0pl1O7j7
2551B2l4M3j9k6L7k3j2l9N0L3m8L9K9m6n3K3K4ooK3jnj4J9Nn5PO2k3k7O3o0L6
$$ plain form
2319 -33 -64 -37 -20 20 -39 21 25 58 51 -46 -11 11 -8 -11 57 -2 -27 0 -11 11 17 -20 33 -49 42 -9 -21 -38 -15 3 8 -10 -37
2352 -37 14 -39 -22 -15 -31 34 15 15 9 -24 7 8 8 -4 -15 24 12 -10 35 -2 15 -54 -13 -3 -15 31 -84 -14 43 20 -41 20
2384 20 -24 -28 27 4 38 1 5 -4 -45 -58 48 -20 -60 -26 50 18 34 -50 -3 3 51 -23 0 -10 -33 -8 39 1 -16 21 25 5
2416 5 2 -24 30 -31 35 32 0 -27 -11 -4 -4 32 -13 -21 -28 24 -10 17 -22 -5 -32 -14 -21 13 40 -13 -46 -21 -19 19 -1 34 -7 23 12
2451 12 -13 4 41 -6 -12 5 2 21 32 -21 -18 36 25 -43 29 -33 18 -36 -61 -21 10 -29 -60 -14 -52 21 -36 -25 -13 11 19 -2
2483 -2 -12 -17 -19 -45 -5 10 31 -38 -18 4 36 24 21 -6 34 42 -16 -13 -17 63 15 2 -9 -5 38 -6 -19 16 -38 14 -34 14 57 -25
2517 -25 20 -6 58 22 12 -41 10 1 -2 17 -16 11 45 -13 8 16 24 -13 -2 -10 3 9 7 64 -56 28 -15 4 30 10 3 -28 39 22
2551 22 -12 31 12 -14 23 0 -12 -51 -1 32 -16 23 52 6 -47 -24 0 -6 -12 11 10 5 -9 10 15 -40 -33 29 6 -21 42 -18 18
2584A8Rl3QJ6n1ML2L9p3Q0o5M0k0m9oK3J7l6O5Mn5l1O9k1l5Q7L6m3qlm8N2k8k0
2618b6qQ1j9o1O6k5ll9K8JRj6O1p7K7J3KoJ3m5m1M2P3k9o7N9j7j6k4L7J1jJ4n6
2652c9OL2j8J7l6Q1n2j1L5q2M8N1m6LL9l6K0j9jMQkk2PkK4l6M8n0K0kJ0j0Q3n5
2687A7j03L2QM4Pk5K3K6j3L8p5PL0OJ0l3K6Qj11J02l9M0o8K0j0N6l4oj3m1J24
2718E3p6P8p1k3O2k3j4%Pk9K7N2k6ol8K8rk2J9K3k9KJ0n5Q8o0R8p1K8n9L4n5K6
2751c1L1pqk4KJJ6j6P6j3p9Q3p0O6n6J2j2nL4m6JN1j3m9Q7Ln6l1K1N5L6m5lj3
2785bJ9n3O3n4K4j1J4n1J0N7j0J8l3M7k5J0J4k2Nk0l9nO1rL7m4qK5Nj5n6K7l7
2818e8Q6p5K0L5j8j5J9l7O1l9L5jl3J1N4m6j3J6kk5j8K1L7l0j4N6o2J7J1l1M0
$$ plain form
2584 18 27 -6 2 18 -33 -29 3 42 -31 49 -16 24 4 -45 -51 -28 -11 -47 18 22 -33 -64 5 -16 -51 36 72 29 21 18 -30 22 -6 -26
2618 -26 -34 47 28 -33 33 8 5 -34 -6 -5 4 -12 49 -28 -1 12 14 8 21 -24 -65 -23 50 21 -46 13 -4 -20 -44 -7 4 3 17 -39
2652 -39 -33 -1 -19 -2 -38 43 -9 -20 15 -67 -19 32 -14 -11 28 -8 12 -7 -8 -4 4 2 -20 -13 -15 9 -27 21 -29 -9 -11 -1 -11 72 17
2687 17 -86 -54 -46 -2 5 -20 3 29 16 54 -21 -14 16 22 32 -1 25 33 -78 24 -15 25 -43 -23 -33 23 -11 -17 -30 -71 53
2718 53 -23 55 -16 -39 23 0 -14 -14 -7 -36 -9 43 17 11 -27 1 -8 -30 -11 12 -17 -15 -5 -60 28 -32 66 -5 23 -36 -2 -57 -31
2751 -31 0 -7 -15 -39 -37 -36 -20 -36 40 27 -52 31 -39 27 -29 -17 -29 -34 0 -46 -45 6 -7 -56 31 34 -22 -53 -32 23 59 14 11 -2
2785 -2 17 -36 27 -27 -3 -14 0 -51 -41 16 6 24 -9 38 13 23 37 15 20 0 -39 -44 17 8 45 1 -7 18 23 8 -48 -21 -58
2818 -58 28 -47 -27 8 -10 -25 -6 -43 18 -21 14 13 -20 -9 45 -1 -14 2 0 -25 -43 -22 15 -15 -29 27 -35 -18 -7 -38 2
2849BM7l5p3M3L9m3M1n5O3q8J08n9K8m5J5p2N3L9RK1r5P1r5Q5pl1J1M8JJ1k2J8
2881C3m1J9j4J4k4k5N2l2nJ2k6J8JJK9n2j2JK5K4l8O4n7O0m9Ml4j8P8ol1L4l6
2914c1P1l0K5p3M1j3qm5P6k4J8j9L7l7M7m0j6J1J4kp5N5J2m4L7JJ6l3N7j05P0
2945gK2l6J7k7RJ7pJ6k1L1l7M2m0M3l6JO4m2jj3J1L7l9qMk2O4o7J6L7Nm6k1L4
2979@J5l7L6n0Q5n4K3p4P3k5l0M5n0J5J8j1k1J9j0j5P9Rm1Q1q8J1J9QKm0K7J5
3011C4j9m4J1J7kk2j6Q6r6L9k2J15n8n4P8p1L1pk6L9Pj1l1p9R9J4Mk1l7jQ0o5
3043b8L4L0q5K3k2O6j4Mj0J6M9j8n2k3J6K7j7N9o1KrKJ0qM1q0m7O4L5Rl5O1k9
3076A0l0K5k9J4kM1n7N0j9RQk2L9m4l1K5N0Lo8L5o7N9k9L5JK7k4mn2K8J5n6M6
$$ plain form
2849 2 49 14 -59 -16 23 -20 21 -34 29 -59 49 -10 18 -27 -12 -84 -31 8 17 38 -57 14 -81 4 -3 -34 -23 25 26 37 15 33
2881 33 -8 11 -3 11 -13 -38 14 -18 -23 -11 -37 -19 -18 -17 12 -40 -52 -51 -26 -2 -40 24 -33 27 -22 -18 -52 -70 8 2 -29 5 -31
2914 -31 40 10 35 -38 3 -10 -18 -63 13 -11 7 -12 25 -12 35 -5 -21 -10 4 2 -73 -18 -6 -50 -13 -12 4 -29 28 -77 -7
2945 -7 15 -21 -4 -31 -22 -5 -12 4 -17 14 -23 19 -21 22 -14 -13 51 9 8 -5 6 43 4 -4 0 -22 42 -25 -9 28 33 -13 -34 0
2979 0 15 -22 14 -36 49 -5 18 -56 17 -8 -38 7 -43 -28 -10 -21 -42 -23 -33 -48 31 40 -1 80 -8 3 22 30 32 -8 19 34
3011 34 15 -29 -18 -1 -3 -25 -41 45 -51 -12 -34 81 23 -31 47 -24 7 0 -26 13 20 9 -22 -101 -2 12 16 -5 -42 -43 37 -28
3043 -28 6 36 -49 -26 -48 18 4 8 -2 14 63 45 -7 -30 -14 13 -4 55 -6 -4 -13 -11 -1 -9 32 -48 -95 -31 4 13 -22 39 10
3076 10 -20 5 -24 -10 -12 29 -28 22 3 12 20 -2 37 -7 -38 -13 37 40 -28 7 -60 -1 -30 5 6 33 9 5 -47 -19 -4 -60 -14
3109a4K4ml2M1KK3k7L9p5l4O6K7o8O5k1Rpk6J5M5l6n2M8MK8l3K4j8L8Om2l1L0
3142A4k7k0K0K3J0l2j5K3pJ6n4M8m7O4J6J1o0QJ2k1N3l9J1l1QO1j2l2%O9q9%M2
3175B3m6N0k4N9j7o5J4L0pKn5k9N2N1o9J6j4L5j5k1LK7L0l6o6Q6K1o7P6o1L6p1
3207e2N9k3J1KM2l6Jj9j7M8K2N5p4l0Jl2R1q5OM5k1Qn6lQ0l8oL7L5k3m4j8j1N
3241d0M3RpPRj5o2M6P1n4m0Rj2L4pl8RQ6lk5Lqj0K2J0K1m0l5k2J1lJ7K8k2M1m4
3277a1Rl3K8Lk2k5pL8J3L3l1j5j5L3k3nL4j4K4pM9j4k6j2q%k6K0J6l7J9J4N4l9
3311A7q8R4p%N9j07O3j1q5J09j3o7O7l9noM5o4KQ5m8m1N9Kl2K1j4K6n9M0k5mq
3344c4L6m3L5J9o1K7Jj5NR0m4j8Rk7K1l0PK5k4K1J3m4RK5PnJ3j5m0R8j5n3N1p4
$$ plain form
3109 -14 10 6 -26 15 17 40 13 52 -23 -57 9 36 -32 33 12 21 14 -12 3 48 12 -40 8 12 40 7 31 13 51 57 15 -16 14
3142 14 -13 -33 -13 10 20 -12 -27 -4 -11 5 -49 -1 -48 16 32 43 -17 -9 3 -18 35 -4 7 -24 -16 45 33 1 1 70 -19 -19 23
3175 23 -23 27 3 62 45 -20 -6 24 17 19 -36 -65 -13 38 -31 -15 -29 6 -9 -30 -27 0 30 -6 -72 14 35 -32 44 -17 19 -52
3207 -52 7 -16 -5 -3 39 3 4 -15 -32 16 38 93 19 -11 -10 -42 49 -36 -30 15 -6 2 -54 -57 23 -15 -21 16 51 28 -16 -34 -45 -40
3241 -40 3 12 5 12 21 6 -56 -10 61 7 -33 -24 -36 -2 -9 -47 -38 48 45 20 23 15 5 27 37 58 18 -17 -39 -28 -31 -14 14 -8 33 -11
3277 -11 -2 -35 -7 -4 -26 -51 -58 -20 -7 26 -5 -20 -35 -2 -25 -30 4 -10 14 7 56 42 16 4 -4 -4 -30 -10 6 -31 -12 2 56 17
3311 17 -71 23 16 16 75 -32 31 20 -65 44 31 -36 31 -8 -13 -19 26 -38 -36 49 1 -40 19 21 -11 10 -4 22 -37 3 -22 -26 -34
3344 -34 2 -41 -6 13 -48 -21 -20 -35 -30 60 16 -2 7 -20 1 -29 -22 3 -21 0 13 -31 -22 3 10 5 18 3 -37 61 46 -7 44 -30
3378c0j4Q7L3j13N0m1M8j4kj8nN4m5J8j3J3n8K3J3O0l6L8k8Nm9O3j3r6O5L9n2
3409a8J7j5K2l3rM1mj1jJ6m2M3j7J8Rn3L4lk1K2j3M4J9m6J9p1L7LN8l6l9j4Q1
3442C7m8k2M4j2mj8L9l1K0j1J6l3P1j2k4l6L2J3J0k5l5k5L5N0L9r9L8J2j7L7j2
3473B9o3R6m8l1L6n7M4k3J6J3Lj8L1j06L9R1k9k0m9M3k1K8K9j9Rn8J7j4P2m2r
3504a1k8Q9l7n8O3L3j9k9M8j9k3L6ml2l9M9L8k0n6jJN8m4O3o9K2n5L5l7K7qK2
3536eK9k8Lk1k1J6K5m2M3J8m1L0K0Kr6J01j2j1j3K0m2O5lk6k5j6L7m7N0K4n2j7
3568c5N5p1Q1k4K2o8J4J2j4M5j2O6p4KMj7L9K8m8L5l9K0l5J9k9K7o0P3J8K1pk6
3600B2n4MoL1R4j46N1j8l2L5j7K7MpJ08p5ml1N0n7K1k4kJ6LJ7j9L4J1k6M2q7K1
$$ plain form
3378 -30 -44 43 76 -37 13 -28 20 6 4 -14 -19 35 -10 8 -5 8 -50 -27 -14 46 10 48 20 25 -24 39 26 -70 -5 34 -18
3409 -18 -1 -16 6 -27 -36 5 1 -10 -11 5 -37 6 -11 7 16 -37 -3 -6 -27 -5 -18 26 45 -1 18 -53 -16 -13 45 9 -30 -44 37
3442 37 -11 -33 11 -1 -5 -23 16 -15 5 -6 10 -23 48 36 12 -24 8 21 31 6 -29 -54 -19 31 70 -29 9 21 4 41 29
3473 29 -34 62 14 -17 19 -38 6 -17 -1 12 15 -3 28 -78 -39 52 23 3 -46 -3 -24 4 33 14 23 -35 -18 -32 40 -2 -11
3504 -11 -39 50 13 -45 18 51 32 3 51 32 9 45 41 9 -30 19 57 37 -19 -20 -19 39 -5 58 -11 11 -44 -9 -46 -19 -27 -5
3536 -5 24 -4 -1 -22 -43 -27 -2 -44 -1 17 -24 6 26 28 -68 33 21 10 -3 17 -25 40 37 11 -14 -30 7 -40 10 34 -18 -35
3568 -35 20 -51 30 6 28 -40 -26 -14 -28 17 5 71 -3 -1 3 -14 25 53 5 40 1 21 -14 5 -24 3 -57 16 34 55 48 22
3600 22 -32 -28 -34 -3 91 -55 -4 -22 -54 -19 -36 -9 -5 -12 96 21 17 -14 36 -21 0 -24 -26 -10 -7 10 -9 25 36 10 52 -35 -14
3633a4L4rj1K6j1L3l0o1Q4l1L0p3N1n0M9k2K2Lj9m2K7ql7L5M0ok2l0M2l5K6L5
3665B6o3L4J3nk0k7M5N8o8N4o8J8j8J2J1L6l0J4n7O2m1J6k7QpO9m1mK7l5pK4m2
3698c3K5Nk1QLj8N2n8M8rK2n9J3N6k5JL6n8l8M8%k6j9Q5m5j5P5p9K9Nl0L7o2O9
3732B2m2NL6Qm0J0K2Kp7L3L3qj7J3n2JR5m4jj1QJ4m3N2j4p7Q6j7L7q4M8K3m2M4
3766B3o2L3L5l1J6lJ7pj4j0p2N4j2M4L0l2k6K1j4pn1J10Lo7N5o5L5lm2J6L0k1
3798a7jj1Q0j23M6Q5m9k6k8R2n3J0qk0OJ9J4l7K8Ql6K7m4MM6j8j6M8k3Pl7L9m
3831Hj5J2L1km8K8k9o4K7O6%N0p6n1P2kll2oj9J6P3j13J00j0o5P1k8L3p4O9J6
3863C5n3J0nK5j6k9N0k7L4r4P6k9lK8k5l4L6K2n6J10o0k6j1O2J6l9M8n8K9k2j9
$$ plain form
3633 -14 20 11 0 26 15 48 18 -43 41 10 40 -33 18 -32 17 -5 17 20 1 -41 -14 -22 -59 -24 16 10 -12 -42 0 -35 -9 26
3665 26 -37 -3 10 5 -15 -42 3 61 -7 47 -21 -3 -21 -9 2 38 8 22 -35 27 -14 2 -25 -17 -24 45 4 0 27 -8 -15 9 -33
3698 -33 -8 -3 -24 -16 -13 -31 21 -37 11 2 24 -35 -22 34 9 10 46 -12 -50 -2 -2 -28 -47 38 -7 -22 53 -26 3 8 -22 15 -47 22
3732 22 -20 -15 21 29 -11 -1 21 23 -54 -21 12 4 -13 0 -52 -51 44 0 -1 -12 -4 10 -33 19 5 -72 14 -3 34 -50 -2 21 -21 23
3766 23 -39 -6 29 -2 14 11 28 21 7 -3 -75 -21 -33 11 41 9 -17 4 -10 -17 -68 42 45 -22 33 -32 3 0 -42 -26 4 -17
3798 -17 -18 -29 51 -72 -26 59 10 -16 -44 48 -5 5 -3 -23 -17 2 16 -21 7 15 -21 6 -38 -34 12 -6 -22 26 3 10 -27 12 8
3831 8 -7 5 36 34 -14 14 -15 -79 -52 14 14 64 -12 -63 9 7 4 -28 -34 -53 -37 36 -77 23 13 -52 19 -9 24 -50 19 35
3863 35 -18 -8 -13 12 -4 -33 17 -10 24 -70 6 -23 -26 2 -23 -57 -21 1 -55 55 -5 -31 -42 20 36 -3 45 -13 16 -6 -25
3894b5l5Q9lm6k7j4M7N0k9J5qj1ok2P7p8j5J4mM4l6J9Oj4Lk0J5J6L6m1K5J8J0
3927E0pn3L5k0j3o4L8L9o1J24j05j0P6q3J07n0k8M0K4m1K5k3M7n2N6m7On0K7j3
3957b6J4N8p4k6K8k2J4J2PMJ7k6l2M6k0J13k2j8Pn9Qk3O8Kk2L3o7o3P7l7K7j1
3989a3L4k4M9m7Oj8l0O8Nm1j7L7rql9K9L6l8K5m0O9j6Nm0QM5j9kk7K3J8m1O8p6
4023b0M5M3p9nO8j3n2m3K5J7j1N6J0j05N1P2j01O0qJ2%k3n7M5J7rL9k9n6Q0jj5
4055A3nM3n8nPJ9RNjl8LjK6j1n1P7K8p9K4L4o6M1j8JK2k5l3M4l3rmL1o9Q3L7m0
4091An0R2mm9PKJ1j5J9J5jL7n1N4n7K3l2J1l3L7Rj3rj7jj7oQ0j5j00L1M7m5M1
4125Bk8L1l0J6K5l2P1o4k0O9m3M8ko2%L7j8J1Qr5Q9J0l6K5l1nK7J4o9L2K5%Qq
$$ plain form
3894 -25 -60 29 26 -20 -47 -61 -14 36 7 22 14 3 -3 -25 52 -26 -41 -27 -31 13 -23 -4 2 -12 -9 -29 -14 2 38 -3 22 40 50
3927 50 43 -10 25 5 -8 -72 -34 5 -56 68 -37 -47 29 -54 53 3 -25 15 39 -2 23 0 47 -5 51 4 10 -40 -13 -26
3957 -26 -12 46 -28 -54 -26 -48 -34 -22 -15 -11 6 -20 -52 -6 -26 87 65 47 54 -5 3 -20 48 50 28 61 -6 -69 8 -29 -2 -13
3989 -13 21 -3 46 -1 5 -13 -43 25 30 -11 -28 9 0 -8 -47 -18 18 -20 5 -35 34 18 23 -17 -9 36 17 15 -12 11 29 -12 56 -20
4023 -20 25 68 -11 -16 52 39 -13 -56 -31 -14 -25 31 41 -64 -13 59 -42 18 10 22 22 -1 -58 -13 4 -5 34 5 -51 29 28 13
4055 13 8 51 -7 -12 -5 14 23 28 27 -11 -8 -9 17 6 -45 32 60 -19 5 39 -27 14 -4 -3 19 -6 -39 5 -28 -37 -41 -10 -79 4 41 1
4091 1 -49 43 39 -10 -3 -1 10 -5 14 29 28 65 14 68 11 34 2 13 -20 17 26 13 4 -13 -14 -31 -37 43 28 -72 -41 6 -39 2
4125 2 -26 5 -25 -9 16 -16 55 -9 -29 40 -3 45 43 -19 -19 18 0 11 19 -76 13 23 -13 12 -19 -24 3 17 -52 -20 5 5 13 5
4159Ek5N0k2n9M3jj4N8l0l1K6j1L5%k9l5J4M0K8p8M2J7M1p4Kj8N9k6J8oK5k5Q
4192B7o4N0oo0N8M5%o6j2K4L0jk0l3K3O3n1M1n8k7J7P3l4j6k8j9M3K6L0n4m8L2
4224a5j8N8n5K6J7J0J8K0p1k0K3j7J6j5K9%j4JL8J5l2l4k3N7K4k2j3K2k3lm5o
4256e2N3m2L4QK9k9kL2J1j1Mj3q7Q0j4L3j6k8jk9Q8k8m0O7k9l5QJ4j5O6p4pK8
4289Cl8J0J6n7L4L0l4k3O5j4%Q5p7k7N6p3L1qP0n7M9rLn4l9J16r7jrO5j6K8q5
4322e7Q4Nk9j3L5l9J6L4p0L5l3J7lm6M7OM9m1J4j6j3K3L2l6qQL0pm0j4qP5l2k5
4356b0J5m2O7m5L6l5JK1Qol8L2nJ6j1pP5n9j6j8M9J6l7k5O6o2J6jk3O2jK3j16
4389f4P4K1l5nJM6K7m6NnL1n0Kk5K8J6m0mQK4m6M7m8Q1o1J2pm8R0mOl8M0o2PK1
$$ plain form
4159 5 -20 30 8 -51 -8 -9 -23 35 5 -26 0 -11 24 24 -5 -40 -26 14 42 -36 6 23 64 -10 -8 -26 33 7 25 19 44 19 27
4192 27 -37 13 7 -53 5 50 50 -16 -28 -4 26 25 5 -28 -5 58 7 48 -10 -37 -20 53 19 3 -25 -44 -1 25 55 1 -47 -15
4224 -15 -33 25 -30 -4 13 23 41 61 -10 -30 -7 -24 -8 -23 6 6 -8 -7 31 46 14 -20 -43 14 38 16 3 25 2 -1 -46 -52
4256 -52 1 -41 -7 1 30 1 -1 31 42 31 35 22 -65 15 1 34 18 -10 -11 -40 48 20 -20 47 18 -17 -9 5 -10 56 -18 -25 3
4289 3 -35 -25 -9 -66 -32 -2 -36 -59 6 -8 -8 77 0 -27 29 -44 -13 -21 49 -8 41 32 35 -19 -58 58 -39 -40 -49 16 0 28 -57
4322 -57 27 32 3 -10 25 -14 2 36 -34 1 -32 -15 -18 -64 -17 -11 38 -3 11 -5 -18 5 37 1 -7 1 31 24 -16 -30 -38 37 5 -20
4356 -20 -5 -47 20 -25 11 -24 -23 -2 6 0 -38 -6 -11 5 -6 -13 62 3 -13 -31 18 34 -3 -28 38 -24 -8 -9 -32 30 29 52 -64
4389 -64 10 31 -4 -9 -8 38 65 19 24 19 50 0 2 -23 5 21 -19 -23 -15 9 -37 10 -38 43 -18 -6 -13 -61 29 25 31 -7 33 -29 -22 -1
4425aJ5J8Qk2J7L8p1j5l8N9Qj6K9k5k0L1j5l2J9k8O5oOo3O4k5j8K0K5q1L7nL0
4458Hj3m6j9L3M5n6M6j2j4L7Nl1N4l9J3nl7Q1o8P8qo2J7Op1J01o1K2N1m6J2m6
4490b5mN8OpJo4L3J0lLnm7P3q8K2Q5n6K9J4mp4R1o2K2PnRn6L7N8l3Mk8K9k2L9
4526D7n9k0P2m8N1o3L7j0k1L3J5n3kl0O4ko3LN4m5j0N1l3L4qK9j6j8PJ3rm5K5
4559b0K9M2j05R2J3o3K8l8K2K4m7M1j5J3m4nR1j7n4P0n3k3mLL5j4K2n6Qj7L7N
4591@o0M4L0mO0m3opl3O4j8nj3qK0j3n5N6L2k6J0p0M7L0j7k1L6m0M9n1%J8k1N2
4625C7n5K7m5J5M2l1k8K6L5l9M8l9ON1K7q4lk7M0k6J7LJ6k2M2k3k3O5p3L3l1L5
4657A6j3j7O0k5K7k7k9j8LJ1K6n9L8nk7L1L1m3J1l1M9J9k0J5j6L3m6J9kl6J3m1
$$ plain form
4425 -1 14 32 40 18 35 73 2 -13 -51 8 16 0 29 4 -16 15 0 -32 -13 -41 24 18 24 -39 25 0 -18 2 27 -54 -17 -22 8
4458 8 -5 -51 -70 -37 8 -48 -2 -14 -28 9 14 -17 37 -2 11 6 -31 50 -18 60 52 -10 7 13 -58 43 -18 4 55 9 21 -25
4490 -25 -29 29 35 28 29 -35 -2 8 5 8 3 -44 29 -59 -37 48 -8 21 35 31 -43 48 -14 8 15 10 19 -37 0 58 25 29 1 30 8 47
4526 47 -12 -32 40 -8 43 -20 17 7 -14 19 34 -19 -21 -51 13 11 -52 -49 5 -40 -50 1 -32 2 -6 23 7 -11 -4 9 0 -45 -20
4559 -20 9 51 -54 38 51 -12 16 -22 0 24 -23 18 3 16 -28 -33 58 41 -13 57 4 -19 -23 -20 15 1 23 -33 -25 -42 -5 0
4591 0 -60 -16 14 10 70 27 21 14 -19 45 27 22 9 1 21 8 -47 9 41 15 25 -45 2 32 15 -6 30 -10 39 -12 -12 6 -15 37
4625 37 -18 9 -36 -21 21 -10 -38 -12 23 -16 32 -7 -1 50 77 -7 -10 -37 3 -23 -6 -3 13 -9 33 10 -13 52 -21 12 -19 16
4657 16 3 -14 46 21 48 21 -8 -26 -23 -12 14 -45 -7 -12 -39 -8 23 -20 -9 -40 9 28 8 23 7 40 -6 13 11 -25 -12 -53
4689e3Q0k5K5n3K4L2L7k6j1k9l0J7L9n9JL7J3j4NJ6l8lN7j5k5K3n4M2ml3N7no2
4722c4J2PK0nKnL2n3Q6n1K0l0k8L2J4k9N4m1K8l6l9L7N0j7p5QM1KJ5M4l8l1j0
4755a8M9k5Mn0rRL9j2ql2J1PK4J5j1kM2k1j9K2pj2P%N0o7L9kJ6k4o7M0L5k5Kj1
4791a1J7K5J3m8l0K7J4jk7J2l3Q0m5rK3O4p6l8M7j2M9n2pm2Q6rNj3l9M2RQk1J4
4825B2J1l6j9M0j1l5L6j4N6o8OJ8j1M5j9k5J8l2PJ6Qmp2J19o6lK4nj7J5k7J10
4857H7k9n2m6M1L1%j8rK2J3l0Mk1RL3o2l1J1M7M5l9p1L2L5K1p3N6J1j3m4L4N0
4889D4l3k9P6k9n3J1K0j9j7N5k1K4m5K3J7o0N6K9o2K1Nnj2L0k2l3LL0Qk2k1%O
4922b5M0k5p3P3K2N2m2j9k6k8P2j4Npj5J6k0L9j2M0o8j2J0j6qN4mMK2k0j6Mk9
$$ plain form
4689 -53 27 2 27 -26 -2 30 67 41 30 1 -29 -12 27 -32 -31 6 19 5 10 26 -12 -15 42 27 2 25 -29 13 9 -24 33 28 -34
4722 -34 -22 -15 5 0 2 -3 29 -24 62 11 31 1 -27 5 19 -10 44 3 31 -5 -44 -7 43 26 -49 -41 0 2 17 61 23 -8 -18
4755 -18 31 6 10 -40 -49 -40 -1 -13 -21 -53 -42 -35 -11 4 -7 -9 33 12 -7 15 8 -4 3 3 53 -14 25 23 39 15 -52 -12 23 -2 0 -11
4791 -11 6 31 44 -4 -34 -7 7 6 -21 -9 -42 38 -7 -16 7 71 -5 -43 4 -8 41 -11 -18 -60 26 17 22 9 -30 12 21 29 8 22
4825 22 33 -3 -22 18 7 -28 8 -6 50 -18 -12 6 -5 40 21 -4 14 -18 -11 5 13 9 -63 56 -10 -13 11 6 -11 4 -23 87
4857 87 58 6 -40 1 32 32 14 5 27 40 10 14 -7 2 35 -27 -58 -47 0 45 6 -65 -33 2 23 -50 6 17 4 -40 -6 44
4889 44 11 -18 58 29 -24 -13 7 -12 -29 26 5 29 -16 7 24 -36 20 49 -13 8 13 8 -4 26 4 -29 -26 4 12 -10 -31 -31 -25
4922 -25 15 -10 -83 -10 12 64 22 3 -23 -51 21 7 12 5 -10 6 -14 25 13 53 -15 -27 -17 -33 -41 13 9 13 35 15 -1 3 -26
4955b6Q6n9L3m2J7o1O1JJ8o1J0J4mK3Q8r2Mn1M9n5Q2qo3L3K8j8m3O7J7m6K%K3
4988B7n2NPQ6j8rq5L3J2KK1qk6N0n8j8M5k4J0m0M%LK1K5M2l5n1M5j2pj6L8j9l
5023e%l2N6jRl8k4O2k3rk0J2K2PJ1k3pj6P3m7l0L2n3RmOpM3l3LJM4j8j3oO0l9
5060Bk9L7L3j2l0K4l2j2N2Pm1O4o9j7mL5j0J5poL2k6kKJ0l0L7Lo3J6l0M3MJK9
5095B6Pm4Pk6J0J8j8L5j5LJ7J6J4k6J0r5M3L2j3Kl5k9R2k1k9K7L9l6l0L0m9%O4
5128B6k1m1O4k6Kl0L7No8NP3m9K3L1J1j2l4N3m9N9ll9n2N5oj1j1K0Mj3K2o5P3
5161C3n1m4M1J2L3Jn9J3N6l6j5j6l6P2k0j4L6L9ml6rJ6J2k9O3o3j6j5J1J3Lk6
5193c5M9j2M9m0nO1n4J9n0J8k0m0Q0j5j5J7K2m7ok5rK2N9q0KQ6mJ0m8K4k8pj8
$$ plain form
4955 -26 60 1 34 -8 9 -52 9 10 28 -33 -23 -9 -13 10 98 6 10 -41 8 -47 35 27 -36 -3 25 7 -36 31 48 2 4 4 27
4988 27 -25 -20 -13 73 55 46 -39 -6 6 8 29 21 -5 45 -13 -31 14 -10 0 -40 -36 -36 -33 -12 13 55 20 -31 14 2 -5 -21 17 -2 -5
5023 -5 -5 -37 19 18 27 -11 -35 27 4 -5 -25 -13 9 16 27 4 -3 -19 54 7 -23 9 -44 -35 -39 -33 -40 3 -30 -27 -26 18 0 -13 -19 41 2
5060 2 -27 10 43 31 1 25 -7 -19 33 40 -1 63 -6 -23 -27 8 -2 13 6 0 32 6 4 6 16 -14 23 26 -37 -21 -51 -8 -4 -3 26
5095 26 33 -11 -4 -30 -20 -2 -20 15 0 3 20 36 50 24 34 -61 -18 14 1 3 -32 -61 31 10 -19 8 47 11 -19 11 -38 -38 26
5128 26 5 -36 28 2 4 -26 11 16 -52 -47 26 -23 0 31 42 30 -4 49 0 59 56 17 -35 20 14 3 -8 12 16 3 25 -40 33
5161 33 -18 -62 -21 -9 24 25 -34 -21 35 -1 -16 -32 -68 4 -16 -30 6 45 41 5 -4 12 24 -5 58 -5 -21 -36 -25 -12 -9 -35
5193 -35 14 2 51 11 6 67 13 32 -18 0 -20 -60 20 5 -10 7 29 -18 -24 -49 -58 -36 23 -57 -55 31 27 37 -11 13 -15 -22 -40
5226d0O8o7ML8L1j3Km0L3K5j0q5L1K0J3o9O9k8Om8J8M3L6k6l0Q0j31J06m2L5n0
5257b1L5k9OOl6M7J1Jl5m9O5J9k6k5J5K6J6k9O8n4k3%N2k3m0QOP5j16NP0J0p9
5290d4K8K1Pm2M6l7mJ9M7m8k5O1o0P1r6LN1j0Qj9N1q2N0L8m6m6L2jMj2K8Km6N0
5324aJ0Ok1L1jMk7J5o1j8J0N2M2k4km7O7p7O1l5k1M8%rn3L0L0J0n0P7m8k1jL8
5358A4j0J4k2oJ2L1J5q2M5J7l0k2O0Rj8n0j3M6J0Op2K1O0l9k0J9j7lL9J4j9m8
5390c9K8K6L0o2N1l4J0JoQl5K1j7O9k1Ko3J9k3PL0K7n3l4J08J1l9m9N0rn2L1q
5423a5j6OOLJ4k1L1n0N5j1j2j04Q5O0k7qnK6n4N9L9l5j3j1L8pl2J7m0K6j5KM5
5456C6l8j6R8q6L4j05R9l1L4j6M0l0Rj2j5N4r1N7Ko0L4j7L9k9m2M3j0J8Lj8J1
$$ plain form
5226 -40 28 -39 -35 3 34 21 23 -17 16 41 31 -54 -23 -3 10 -59 10 -18 -12 -60 -42 1 37 11 -19 61 -70 36 -6 29 -21
5257 -21 14 -15 -9 -3 -39 8 19 20 -15 -64 1 20 -6 -31 -16 10 26 -3 65 11 -12 -12 40 17 -23 -15 -9 66 -50 -45 25 35 -44
5290 -44 -16 5 12 -30 16 -21 -25 -6 41 -7 -32 29 -31 40 -56 -53 -2 -12 -4 -23 28 -54 -4 34 -12 -58 -26 -27 -23 -35 -7 -5 -51 -1
5324 -1 9 15 -6 25 24 28 1 16 -45 -63 -53 -1 41 17 15 -32 35 -42 19 -16 -37 11 11 2 -51 -21 9 19 -31 46 -2 -23 -24 14
5358 14 4 18 -4 -10 2 33 48 -34 11 28 -2 -24 36 45 27 -23 -36 10 20 26 -46 -25 35 -4 -24 -5 -22 -25 14 28 9 -39
5390 -39 -11 15 45 -17 34 0 10 11 5 13 -22 -1 -18 51 30 32 -31 -12 -35 -28 2 29 -24 -58 50 61 22 -27 23 14 -38 -7 -15
5423 -15 -31 -25 -19 -16 -2 -23 8 -42 13 2 -10 -114 -29 31 4 -4 -9 17 -37 22 61 26 13 2 40 33 1 18 -22 4 -11 -9 36
5456 36 -2 -18 80 -6 28 -77 22 -9 25 9 49 19 28 16 1 55 -36 21 23 -37 -3 -20 19 -10 -52 -9 -19 -1 2 -16 -5
5487eL7L1m7j1%K4l7l6OL5pK1pJ5k3r7J22oJ1mm5rK8jn6M2K4J7j6o1nP4pMo9J0
5523d8RR6m1J1l7l1O1lPKl1kj6N6l7j7nQO7o0Ll2Q5j9m5j3k3P8l9kM4m4J2K9n5
5558c2M2oj6J8Kj4j3J1j3rl5M0lN5J6j21N1J08o3mLK2J9n6%%K0m1M2p9P9l3p5
5591h5Q3j6J1%k2QK2j1Jj9P1o3L4Nj9j9l1J2L0K9k6m1P2l4N4J0o4J3K8M4o6K4
5623C5p8L6N6o2K0No4Lj0RN4k9P0n7kK3l0Pk5K7j0k1Q6m3M6j7k1j0j0J1o3M9%
5656a5J0l5Q1k7j3j5J2P3n9J2m8M8m8QJ8LrN2o8KK1k6pJ3P0q1L7l1j1O0l6K8n
5689A4n1l0M0M4nJ2J7q7LN2Jp8J47p4L4l6J2L4q1L5k7O1o1pJ5j2R9q4Lj3K2n9
5721f0j9N1L8l2j4J3oMJ1k3M6L5n2m0R9r1O2l4L3o7N8m9O8n5j3P2l2L3m5J9j6
$$ plain form
5487 -5 32 63 16 5 5 29 -8 -44 -38 -3 -10 11 4 19 -4 -101 21 15 26 22 -23 -32 -4 -5 -61 -19 5 22 6 -55 -60 14 7 11 -58 -48
5523 -48 -39 57 16 27 -10 -41 20 17 24 26 -5 -7 -23 33 -4 -21 -26 -18 49 -11 -8 -40 45 26 -19 -32 -55 23 -16 -18 26 -18 -6 23 -32
5558 -32 10 4 -12 6 8 -6 -19 -8 -21 -30 -65 -25 -28 27 43 -78 -27 81 18 14 17 39 58 2 2 2 22 -19 23 -56 23 -10 -85
5591 -85 -2 -18 -7 -7 -29 -21 1 -10 -9 -28 43 -20 14 19 0 -19 -50 -38 -8 21 -5 -46 26 -8 46 56 -8 5 33 77 11 35
5623 35 -43 -7 49 -13 7 12 -52 -49 -59 -50 4 -25 45 -12 -14 9 -21 -14 -39 -12 -22 -43 43 0 46 29 8 -2 -12 -1 -64 -15 -15
5656 -15 -5 -40 41 14 1 -14 -2 71 12 24 -24 24 -24 -16 2 5 -4 48 -20 -18 3 -23 -30 -17 53 -28 9 -22 -33 27 -9 19 14
5689 14 -37 -67 -27 17 12 24 41 -46 -43 9 10 -68 79 5 39 3 15 49 -32 3 -24 37 -24 -31 -16 -28 71 -13 -10 -23 -1 -60
5721 -60 -79 -28 10 -22 -36 -23 -29 -25 -14 -37 9 44 -8 -48 51 -40 22 -12 21 -46 12 -37 31 -24 -37 35 3 36 -9 10 -6
5752fk0J1J0K8j9Oo4Q1j1m4J3K5p3L9n9J04J8m1qk5R5j11N3j4P4m6K8k6qJ0J3
5783C3k6K5q1L1l6N0K4o5M7J4l9M1l5O1k1n7R5n5K0n9pN7j3k5j8K7jM8o5N5o0
5814c5J4N6p7K3k6M8j0j5N6k2k7n4R6K5n7pK1j1k5O6l5j5j8M6qJ3m5j7JK7J4l3
5846c1qJ2M0Jm3L5j1M5l0n1K8oj0L1k5L2K3oOlp1Q0m5j7MK8O9j03jnN6k8J9m1
5880b6PM7l7k2J9L2m1m4O5K3q2K0j8N6m0L0M3l1N2q6L4Pk6N9jq3K3J3Kk6K2l2
5912d1Q4j06jQ6Nm7oO6q4P3n2Q9k3m6K3J1l%n9L0qk6N4l5J4k6K0L8j2m0QK3N0
5945E9r6O9n6K0lNnj0L0m1O0K2rj31P9J1L0Jn6%L1P9j16QK7l2qN9m8k9M8j7kK8
5979Gl5M6n5M4j3Km7O1M6q1M3l1k7M3P6m9o1L2Qk4l4R5q0M4J8p7K1M7l3k9L1M9
$$ plain form
5752 -6 -26 -15 -5 23 4 10 -54 27 16 -28 -15 10 -63 -24 -83 21 39 -2 -10 -35 60 -51 2 -12 62 16 44 18 10 20 33
5783 33 7 32 -49 -18 -54 -4 20 -45 2 16 -23 18 -17 44 23 -34 61 6 26 -33 -40 17 4 -21 -39 -12 -13 35 -30 25 -35
5814 -35 -21 35 -42 -19 -45 3 -7 -22 34 12 -15 -69 27 52 -5 -12 9 -2 -27 39 4 -11 -29 17 9 22 -23 -40 -39 -12 2 -31
5846 -31 -39 -27 13 14 -29 6 -5 40 10 -41 -13 -19 -29 2 -23 9 32 26 32 29 -42 38 -7 -24 -20 8 77 -26 -27 -32 24 -4 15 -26
5880 -26 -19 28 -9 -31 -12 20 -21 -65 0 23 -59 -39 -57 -1 -41 -11 32 1 53 -33 1 8 -18 41 40 -43 -20 -7 -5 -31 -9 -41
5912 -41 43 -63 -64 22 27 -20 -26 40 -44 29 -23 66 43 -3 20 31 28 28 -31 -1 -9 -35 19 -16 -2 -28 -8 30 18 -22 -14 9 59
5945 59 -37 32 -24 -4 -7 -2 -7 -17 13 -28 32 54 45 -86 -7 4 34 35 -21 -21 10 89 -27 -19 8 -24 -32 27 -21 -50 -2 -19 -21 7
5979 7 -28 18 -37 7 -6 -4 -51 10 56 -25 18 -13 -40 3 79 30 -31 1 9 -15 -49 46 -34 10 28 -49 -28 19 -14 -43 -12 37
6011C7l9N2j04M2J5r4R1Rl4L7l5lj2O0n5j7N3mKk2MM9J4l1k2L1K1o7N5m3k9O5
6043B6l9rO1n7l5O5J%K9n7J7oorJ0l0P2l7Pl1L0Lo5M5L0K4jn5M9l2mk3j6M9J0
6078A6Mpj7K4k3l4P9m0J8K4k0m0jJ7j6Nj2ml1Q9l6k6j8Q0J5j33P7l7jL2L7K3q3
6111c9K7L7l9j5K9K4k6l2K9J2LK4NJ3m9M8n5nL1lo6M1NM7l8J1j5m6Q7k0m9L4n0
6144d0J5K5j7N8q0L0K2p2J10p8n4J21n8l9R4r2N9k9PQ2n3LJ2kk1k6J2rqj4Q5l6
6176Gk6J22r5k3m2L2K5l6M0pLk1K5J3l3M5q2L6j2M9o7P4kk1m6O4Rq2R2q6N6j4
6208cnKl7R1j19N2N0j8j5J0j2m7K3K8J9Jqo9R2q1l5R7m5M6p0N5n2R3n1j0N2k1
6240A3m7M1Ll9J0k7jP7n1J8M4j03M9J8L6p3nJ02q0N8p0J9j8kK5oLn5L2JN1m4J0
$$ plain form
6011 37 -2 50 -54 -12 3 -91 0 9 -25 12 -23 -26 -38 22 -33 -50 3 -1 1 -21 -17 32 46 15 -7 24 45 -22 33 -10 -39 26
6043 26 -13 -22 39 -18 -53 12 13 13 42 -15 2 -4 -10 -19 -9 -39 33 -4 3 -28 2 5 -60 -15 15 39 38 -17 32 0 -4 -27 -43 6 16
6078 16 20 13 -4 20 -3 -37 42 2 20 44 24 -16 -17 0 -16 -11 -23 -27 -58 31 -5 -31 -49 31 46 -87 -10 -47 -48 -16 21 44 -39
6111 -39 -12 25 -14 -29 0 24 -2 -34 -5 7 10 34 39 52 3 51 -4 -9 22 19 -47 -6 -1 46 8 19 4 -42 45 25 -24 10 -40
6144 -40 -25 0 -17 41 -39 -9 13 -59 51 -27 -81 40 -18 -57 37 -55 4 -25 -18 64 11 14 26 24 3 -23 -11 -20 -28 -42 43 7
6176 7 -19 103 8 -15 -57 -25 0 -36 4 -3 0 -21 4 17 -16 29 -53 -17 -29 20 -47 27 25 4 -42 22 31 -51 41 -45 11 -3
6208 -3 -8 -6 -43 48 -71 -19 31 13 -2 8 -4 -51 -28 0 19 20 12 -57 35 -46 -81 16 -29 17 -53 2 -50 43 -8 -18 34 13
6240 13 -34 7 10 -29 -19 -46 -47 30 -21 -3 41 -62 -13 5 41 -32 -37 65 -15 43 -27 -8 -26 -28 -3 -9 -6 -61 -29 -28 23 -21 -11
6273a1kn5N3kM5l3K3k3L2j9kJ0J1l8qj5L4O4j19J43j16Q6o9N4l8J3l4qP5j01N8
6304Hj6Ml4j0O7j0OOk3K0l0L4l3L2mo0NO1L4k3Qn5Ml8M4k6Q4n9N2o7K2L6j4j6
6338IoL1K1j3k6n1N8jl4J0j3J3n0N2j6J1J9Op0M8j4K3m8L0J6Kprj9m9O3M8k4j8
6372hJK4k8QPL0L6p6Mj5M1p5O2l1L3pN1l2m1M3j04O2QJl2O7nl7l0l3O5K8L6o6
6406a3J5pL2k5k0QM9k6k4Rj8kM5k4k9M3krkj3N0q2M5M4m5k7J4L3oK0j1r3N2J5
6440dlk1P5m5k6J7kK7j3N5o4L2q3O9l3K5KK7o6rM4J0j2j9J9l0lK4j3O1QJ0o3J2
6474Hj9l4R4o5P6p7O7j17L8LJ5l9P6o1n0R7m0R2q3mN7K0l6m1M8m0K6Lk4K3k9j4
6506c0P8n0K3nl4N6l8l1O0nn1K0L6K1l7p3M6l4j0N2O%k5m1O7k4k6K7LK1Pl8J07
$$ plain form
6273 -11 -13 -68 -15 -17 28 -5 18 -5 27 8 6 16 27 -11 -19 -34 0 64 -55 88 -28 58 -11 43 5 18 -16 -24 51 -50 8
6304 8 -8 -4 -38 -48 19 9 15 21 -2 18 -12 22 -11 21 17 -43 -38 23 57 34 42 -13 -9 -47 -3 -29 55 -4 48 -19 3 39 25 9
6338 9 3 34 55 42 16 -35 23 22 -12 -2 -15 -2 -52 0 -16 -5 14 20 -50 -2 -16 7 -41 -11 5 7 0 -9 -28 -77 -14 34 10 -8
6372 -8 -7 17 -11 -3 4 34 70 -6 -2 -17 24 -51 11 -20 13 6 57 25 -16 27 -77 -15 -7 -6 -38 29 24 -13 -43 -76 -11 17 53 -13
6406 -13 2 -5 27 2 -18 -10 39 13 -11 -2 -20 -22 23 -1 -30 13 11 2 0 -13 37 -45 0 44 -1 -28 -14 19 13 33 22 -71 -19 -4
6440 -4 -7 -28 47 2 -24 -7 -9 18 5 60 -4 28 -55 14 -19 6 8 35 -31 -40 4 14 2 -17 2 -28 -31 -7 -20 41 49 59 -4 8
6474 8 -11 -45 49 -16 60 -17 50 -67 -29 -26 -11 -50 26 -35 -85 12 -28 64 -19 -23 34 54 18 -23 25 -15 11 14 -10 13 -16 -30
6506 -30 48 -2 21 16 -18 38 0 -31 29 24 -27 -7 29 50 13 -60 -14 -48 -58 -6 0 0 -25 -66 1 -23 -49 -22 -19 2 9 -29 78
6539G8p6J4M8q4J4J2K1l6j7M7l8j0M2k0K1k4M1j2J4L9o4m9k9P3j5j1L4j8l3j4
6569e2L2M3j21Q1LO9o8k1L7lq0R5L1o7J8L4m5L6j8m2M7Nk0M1qK5m4L2k2j7l8J5
6601b2K9KJ7l1k5L3k1J2pj5QRK7p2Q4qj8oM4k0m9P7m8J5pJ7p7N0rK0L5o7lRmK
6637a9L5j1J7n9Q8pm7j5K8o8P1K7p0J9k5L8N2Pn1l7J5P1q2L2k2k5J7J7n6M3K6
6668Ij4N0o1L3n1O0k8L3J1k4o2J6M2pl2j2K0pK5j4K4l0n1J9O2P%k2M1k3l2M8k8
6701Bj0j4M9oqlk6l1P0n9P3j4Kj4mJ6l6j4N5m8K2jM4n6Q8k6l0k6l6lP3o9qJ07
6735E9p9O5m4l3M4nj4M3jn4jK5ML3m3J2K1o5O8j5o0M6qK4N0j03M5m1j4N8j4K3
6767B6k5j1l1Q4J5m9j8L5J0k2o8J07q0J8J3k1rO2j9m9NoN5j7m0M6K2l6J1j1L7
$$ plain form
6539 78 2 16 64 -20 -6 6 27 -9 -26 21 -17 -27 15 -5 16 -8 33 21 35 74 10 -39 -68 5 -10 -21 13 -5 -38 -52
6569 -52 -20 23 -98 -17 -14 55 -13 -34 3 0 -80 15 46 -21 -3 31 -14 22 4 -38 9 14 -6 35 27 52 8 40 18 1 -37 -22
6601 -22 7 9 26 -5 -30 3 -18 -6 -13 -28 -20 -11 16 -56 28 20 2 -4 40 20 -29 48 0 15 8 25 -52 -2 -11 9 44 -23 -26 -17 -21 -19
6637 -19 16 5 22 -37 51 44 -3 -18 10 -58 13 40 -30 -11 -36 2 54 61 10 -27 -12 59 -23 9 -13 -38 -21 -4 -60 -17 9
6668 9 -5 45 -16 17 -34 26 -2 31 42 18 -44 -28 14 7 -25 -37 -17 -24 1 -13 11 -19 -70 -51 11 18 18 -4 37 14 -18 30 2
6701 2 -8 -22 27 21 13 10 -16 -47 23 -36 37 23 25 11 7 23 -13 -27 28 -20 2 1 45 -11 77 51 21 -5 -41 -44 29 -40 -48 59
6735 59 -20 45 1 -32 12 7 -7 36 35 -19 -20 5 9 42 -1 11 32 -33 35 20 -40 6 -2 22 72 -31 14 -27 -41 17 3 26
6767 26 1 -10 -41 43 58 9 -9 26 36 14 -54 53 -27 -9 4 -17 -26 36 17 -32 -27 -33 22 5 -35 11 33 -3 8 -3 34
6798C4k7j4K0O1j07L5m2M4Nl5j3N2J6l2llO2q8K3oM8k5kmpK1r4J4Q8nn4M4K3n4
6832b5%K2k5M5j5k9k8L8N0l3M3K0o1oPjj3M0Jn8M2L3k4N3r9RN4p3pQ6o8Q0k2o3
6866b7Po7O9K8K3k6pJ3Ko0QK5M8l4oN6n5Q7q8k5Q1j8k1J0J7p2N2K6o7k%L9k5j3
6900b2L3k7L4mmj5JQRo1J01l5k2M5prj5L2l0j5R0j00M3m6K6Pj1l3L1M1r0K7J1
6933gQ3k2k8L0o2rL8oo9O0j0L9j6l2l2L3L8l2J1L4l3M4k5J2p5L2L1m2J3oMk9K
6966c1P4m5K1j6j2Q5o2n9M7J2n2L6N3p6m0R8r2O3k5k5L9qJ4k6J1N1m3k8M5j2j
6997dj4qMJ5l3Q8L2r1k3M1j7L4K6r0N9P0o5L9k0l1n3N2l1rJ0L0J7l8P3p9M6o8
7029c8K1L4J1l0njJ0j1j4M7m7L1qj1K7J0m2J2Nk4K5K7LJ1m5M9j6k5j7N9o9J7l4
$$ plain form
6798 34 7 -7 13 74 -33 2 -40 4 9 -26 -39 13 29 -3 -6 -9 53 -35 -12 -18 30 5 3 -1 -8 13 -81 -67 21 16 -38 6 29 -25
6832 -25 -25 -3 -28 17 2 -27 -55 -17 33 0 43 63 2 -4 3 2 -11 29 30 -28 14 47 23 76 -23 -14 40 -33 -40 46 -22 58 36 -27
6866 -27 -20 -87 -18 10 33 7 0 13 15 -45 -37 -12 36 2 -4 52 -3 84 -4 -29 52 34 13 23 40 -32 20 46 -21 -23 -23 16 -9 -22
6900 -22 11 -16 18 14 10 -5 -4 4 13 -48 53 18 -4 41 34 25 10 42 12 -3 87 -13 30 -16 10 17 6 -27 4 45 -45 -18 -7
6933 -7 76 54 26 56 -6 -15 23 17 -52 8 -2 37 21 -11 -43 -10 28 -4 7 41 8 52 27 39 -36 -4 27 -15 -2 -8 -4 -33 -31
6966 -31 43 -2 19 3 -9 76 14 -45 2 14 -38 -2 51 -25 -65 33 -59 4 -21 -46 -7 -15 -1 -27 -16 35 -8 -36 9 -3 -4
6997 -4 -18 -26 -22 -7 -40 48 80 -11 -34 7 -10 24 50 -40 19 89 24 63 43 12 -41 11 -20 -29 -19 11 28 -10 63 -16 30 -38
7029 -38 -17 17 28 -2 -7 -8 2 -9 -23 24 -23 8 0 -11 16 26 -16 -4 1 -23 2 29 32 43 -2 47 31 6 -11 48 -21 -4 -38
7062c8J2k6O7k5K3L9q1nM9k3n0R7m4j7O3m8k9RM5qj3L9k0l5L5LL7o5L6J7o4l7
7094e7L9OO2k5l9LoN4o2O3o2N5l3j2j3L9l2j0N1J3o0j2L7n0K5M6o3J7L1l8N1J7
7126C5n4L4J0K7k8m2N1k2oj4j8K7K1j8K4l1J9L1q7L3J2m6M2Qk6J0M3l8L1K9j24
7157f7P0j3mm7J5N4k6O2q1O7l6Qo3P2kl4K9j7M9o9K1M8J7o1N6l1q8M7N0m4K8n5
7189d5Q1m7m2N5kK0Nk8M0q5PL0K1J4j8%j5K4l2K6m6N6m3J2J6rM2Nn0k4M1L1m0
7222@QpM6k7kNkk2J6J4j06P2jL5j6l1M0n7m7O3M1oK8n8qJ9j4M8j9j3K4m9K9O3
7256F6l1j4jJ6l5jK3k3j0J5K1o2K4J1J3RK6l1K8o7J6j3k5K2J1Nj0N2k7m0K5k4
7288c1K6pPqk0L7L4m5K0k1NL3p3N6n0jM3K0J1j0m3qM4%n3O8l3L8j1o1J2K6m1M3
$$ plain form
7062 -38 -26 -52 15 -10 13 52 -29 -34 15 -8 -58 39 -5 -22 41 -7 -36 -27 18 10 -3 36 16 -19 16 19 56 -9 27 44 -20 -57
7094 -57 -18 -12 50 25 -14 -11 -17 37 -25 38 -24 31 -2 -14 -27 12 -20 -30 21 34 -26 -38 -1 -51 -26 20 -43 -26 5 -33 18 35
7126 35 -19 15 25 52 24 -18 33 11 5 -9 -27 0 21 3 27 -4 15 46 -41 -8 4 -42 0 8 -18 -8 35 -3 28 57 -67
7157 -67 3 -10 -14 -61 -46 8 -18 44 -37 30 -6 2 -61 11 9 -25 4 -13 36 -33 -12 36 53 -8 48 17 -71 -24 26 -18 10 -45
7189 -45 36 -11 -53 2 0 20 25 -3 37 -48 -41 -11 10 24 6 6 -9 15 -17 9 -37 19 -24 -12 4 -5 37 42 -8 -32 9 40 0
7222 0 8 1 47 20 18 23 21 -1 15 29 -77 -5 -6 29 13 -18 22 -35 -82 -19 22 16 44 -14 -22 -3 -17 31 12 -1 23 -26 3 66
7256 66 35 21 20 36 1 0 23 0 -10 5 26 -36 -12 -1 12 21 47 16 44 -23 -7 -20 -45 -23 -12 -7 -17 35 8 -32 -7 -31
7288 -31 -5 -12 -5 -13 -33 4 38 -7 13 -8 -3 30 -43 13 -37 -38 5 25 36 26 -17 -25 19 19 -34 34 1 39 28 -33 -21 5 -36 7
7322GK7p3J3JR7r3k8L5O3n4L5k7rn7P2Pm7l7M4J5pO5p9O7nn4J9l1RlnL9l4L7m
7357ENLL5l6Kj8n5%J02l1j1j2L4o1lM0k7M0n5kK4L2k0J5k7k6l0P8j2N8p8K8mJ6
7391Ikj5L3l9L2J0o6O8m2l8M8oJ2k7M2r6O1J4k0jj2J9pPJ7k1J15l3n4nj6J5kq
7425hj8Ol2K9M8l8mn7M2J9L9pl2j7K2P0q2k4L5lK2m5O4Mk9j9QK7k3%j1K5k6M3
7459B8k5m3k3L6j7M2K5k9k6J2rL4K4j1j0k7P7j01K7LQJN3m3m5L3J1l8NJ8K6K2
7491C8k2kK5r6N6j1qL6m2jJ9J9p6N1m0N9k8K3j2m7M8J6J2n3J3P4n6O3o8k0N1j4
7523GJ0oq0Q8p3K8L4P8o8l8M6j7K8j0K0j2K7no1Qj1k3j1L1J4kl6R2o4mMN6Ok4
7557C2j8j8qM0l7j0O5n8M5lJk6KK0q9O4KLJl8j3N9RJ2j5l5k9M5k3jnL4m2M6kj1
$$ plain form
7322 7 34 -39 -26 -25 72 -21 -49 -14 49 -5 30 3 -6 -63 9 16 -31 -68 -24 -9 -16 49 -30 37 32 -22 -3 -34 -25 -28 -33 6 -28 9 5
7357 5 10 13 48 12 14 -4 -59 -59 43 12 1 -11 23 -38 -41 -1 -28 12 -43 -45 -21 11 -9 6 -21 -47 -77 1 -11 47 -31 -3 -7 9
7391 9 7 -8 25 -14 18 28 -38 30 -12 -50 -2 -8 4 -23 19 -77 -16 -2 -22 -23 -35 -16 -23 -16 1 -20 95 62 8 3 -13 2 0 -8
7425 -8 -26 -20 -52 -23 25 -13 -17 -74 -32 -13 26 19 -13 -30 -8 62 -20 -44 -9 -12 10 -35 29 33 4 -15 -7 20 -3 -3 -14 11 -15 28
7459 28 3 -40 -63 -27 -44 -2 23 -6 -32 -20 -29 5 29 18 8 -19 58 -43 -16 -13 -5 -4 49 6 -39 -6 5 -33 -28 -10 16 38
7491 38 16 14 39 -57 -1 -12 -20 16 -26 -27 -8 11 -65 -14 -54 5 -23 0 -12 -59 -11 5 17 -36 -23 51 -5 58 -10 -30 21 7
7523 7 17 11 -69 19 -54 -26 8 86 18 -20 26 9 37 27 47 35 62 57 -4 4 -7 -30 -41 -10 4 2 -34 58 -6 -10 -6 50 56 32
7557 32 14 -4 -12 28 -9 -19 46 -12 33 30 31 5 7 27 -62 2 4 7 8 -30 -43 16 25 37 22 -13 -42 3 -20 -21 -26 8 -34 12 10 -1
7593ak2k0L8m0K1N2r6J08k1pjk5QnK4k6N3n7N3rl9k2OJ3L2Nl1l1M6K1n5M4pl7
7627b8QM8Qj07M2K4l0O3k1n8L3M5l6L8J3m3M0l7MN0n5n3P1Rk8QM2o0Lj4O0m7o1
7660f9N5K2m9R0Nop4N3m8k0P4m8J4LoJ8k6l1nJ8K8K8j8J0JJ2lp4J00l8L4p0k0
7693d0K9j8N4j5L7o6J8M8n0j9M3o0RL7l3L9j9j7K9n3N5n1J3L5l0%J1L7jk0j6R
7725eJ9K6j0m3M2nJ9m3m1pJ20j12M3N8j0p9K8L0o6j0M2l4k7L0K0L2m3M4l6K6K8
7756C6p4M3k8J7M2j0JJ5n6%L5l3N9l3n8jO5j5OM2p8j8Q6o0mK4j0l1J7K1K5n3j3
7789d1L3rQj8qQ2o5N7m9nK8n4N3J4m2Q1q7M4n5L8l3QL1k1jM1m1pl6M5j3Pl2R8
7823E1q3qMrM1J8Kj4n0PL9PL4j9l9J11q3m8L8J6k4k0N6o3L4J5k2nMM0m5L6j9K5
$$ plain form
7593 -1 -23 -43 -5 -45 -24 28 -68 40 19 12 11 -14 -6 -11 13 -13 40 -17 36 27 -12 -34 -28 -15 17 22 -9 -40 6 27 -28 16 9 -28
7627 -28 -20 28 36 -71 -29 -5 -35 28 7 -51 -18 27 -9 29 42 -1 39 2 6 56 1 -52 19 28 0 8 50 -10 -7 -21 39 -8 -69
7660 -69 -14 8 -41 49 54 48 -26 27 -21 -41 33 -15 -1 2 -4 14 -12 -43 -48 -30 -2 26 8 18 19 31 28 -46 54 16 50 -20 -40
7693 -40 -11 -29 25 10 47 -19 -1 47 -3 -22 21 -39 -30 7 -26 13 -6 -23 6 -47 8 -43 -30 5 -25 -25 -14 23 22 2 -14 -5
7725 -5 14 40 30 -13 29 24 43 0 -41 -48 72 -40 3 61 51 -28 0 30 -36 -46 -4 -38 -65 -35 -15 17 -26 18 -18 8 36
7756 36 -38 5 -23 -6 36 26 27 42 -14 -14 21 -12 47 14 -44 -45 20 5 11 53 -25 -43 43 -17 -21 3 -7 -38 -21 0 25 -28 -41
7789 -41 -8 -17 -9 -27 -35 47 -18 39 -10 -15 13 -41 12 26 -16 65 -22 22 -33 5 -28 -20 11 -10 -11 30 -11 -18 -54 -9 -22 -15 -47 51
7823 51 -32 -40 -36 -45 -4 14 16 2 -48 -41 -2 5 39 20 -19 92 9 -39 -1 15 -9 -29 27 -36 -2 13 -9 -14 -10 30 -15 21 2 27
7857B7n7K3J7j3l9L3lJ0k5l4N9k6Rk0l9P8j5%M2n9j1O6m8J9J2l2K5lM0n6O8m4
7889DrL2p6R3m9n9N2k9J22j17rN9J4k5k0K9K1mKp5K9%K2po0NL3N3%p7j6P5nk0
7923a2K5n3O4J4k7n0M6jj9k5O8m8K4k1K5l0L7k7K9l7J1P9r1jL7l6K3n0L4J6K9
7954C3qo8K9lj5N2Po3L9n3M4L0j8k8L1m5OQK2M0n8pNoK0M4l5j8MpK2k7P3m8MK4
7990C0L9m9k6k2K2j3kJ5j0J5J4m1k6M4l3LP6J6m0on9O5k1J5N2p6N6l7k4J8lk7
8022c5N5K9Qk3l4m0M4%pKK8K8p2J4L8m3k0R5r4L4n3L6j3L7l2J2j5N0l3l0J3OP2
8055E7j00K6J0K3n1LJ5L1N0o6j2L0K3r0P2Lk7k0J6nQj1o%J8j7K3Mn0K0J8K8pk6
8089a0K7K1p0RRN5n2J9K4n3K0J5Qn5M9l1M6J3o3K5N2k5o4O2l8m0P8ojl6%L0J8
$$ plain form
7857 27 -30 -7 10 -3 -42 -9 -12 -2 -27 -61 -2 -28 -19 -39 -78 0 -15 -15 27 -32 -43 23 -25 -6 6 -26 -1 -4 36 -20 48 4
7889 4 -5 27 -49 44 -5 -64 -12 -41 81 -36 -45 14 28 3 -17 12 33 29 31 -44 -15 -15 7 0 -60 -55 -22 31 31 -46 -62 13 8 -12
7923 -12 13 -40 24 38 11 -39 7 6 -13 -38 30 -18 6 -15 10 -20 17 -10 19 -18 -7 72 -19 -20 17 -19 4 -46 -12 4 33
7954 33 25 -43 -14 -17 -32 20 27 -36 3 -50 -6 24 6 -22 9 -36 -30 -22 0 40 -18 -25 -20 -26 -6 38 3 -15 -11 -18 4 -23 50 2 6 30
7990 30 69 20 -6 -28 -6 -19 -21 -6 -16 -1 13 -28 -54 -10 -43 -40 36 52 12 6 -53 12 -9 6 58 -18 38 1 -23 -5 -8 -35
8022 -35 20 49 57 34 0 -40 4 4 -3 -1 27 55 -17 -3 35 -8 -28 67 -27 7 -46 -10 -23 14 -18 -6 -21 29 -4 -34 -21 -15 57
8055 57 -43 -17 -7 16 -35 -32 -17 14 64 -2 -14 16 39 -51 21 24 -3 -23 -7 -12 -4 -15 -21 -21 -3 -20 3 7 -43 -23 -5 23 16 -10
8089 -10 17 38 -32 -23 -14 41 -11 8 32 -21 -1 14 22 -33 16 -15 31 44 -19 6 58 33 -31 31 -7 -47 31 25 24 -12 -12 18 36
8122C6m4rrk3O1j9M4o4L1K0Mk1o2R4l5qL8o7O6Ml4Lk2M0qj9m3k4O5j2j9L1j9Q5
8156F1l8k2JK0m3QL0o8N9L0k0l6%k9K1rK4L9J0j8o4L2L0K6J4o6Qk3M3j7k9O4m3
8189eQk8
$$ plain form
8122 36 -8 -17 -26 -49 12 -7 37 -27 4 24 28 7 -55 39 4 -4 34 -33 33 37 3 6 -16 24 16 -3 -46 -70 -5 -17 -36 -5 -24 61
8156 61 23 1 2 22 -21 -13 17 -51 8 38 18 -18 -18 -47 -26 -35 -11 28 38 20 -44 -12 18 44 58 -8 0 -23 20 3 -26 38 -5
8189 -5 3 -25
8191b5
$$ Imaginary data points
##PAGE= N=2
##DATA TABLE= (X++(I..I)), XYDATA
0@%%%%%%%%%%%%%%%%qJ6j6J6j6J6k4L2l2M0m8M9n7P1p9Q8j04J20j36J52j68J84
38I6k07K32k57K88l20L53l92M33m76N25n79O40p06P78q57R45j042J151j279J422
58G48j586J780k010K290k637L081l677M524n824Q103j3267M7363k930q5719J4024
73c5737M4962K3987k5400j7436P39R958m250P263J978m014o095K857J888kk389
88a691K754N18j195j829R57J08R87l23L33r01p79L34J454n12n07O7N05l71j55
107b46K00K46p30K21J090j53j223l20Q86Q30m53j057R8P98Rk69p1R5J30J20J9
128B20m95k86P05O08l75r05q6Q23O16n33n26O4K06k45J09L38J75l37n05P4O59
149C04J96m13m25M3K88P9j61o6K05Q8k57j33K87J77j77j85J5K22k3k15R6J17n9
$$ plain form
0 0 0 0 0 0 0 0 0 0 0 0 0 0 0 0 0 0 -8 8 -8 8 -8 8 -16 16 -16 24 -24 25 -32 39 -40 48 -56 64 -72 80 -88 96
38 96 -111 121 -136 152 -168 185 -207 226 -250 275 -304 336 -370 408 -449 496 -546 605 -674 748
58 748 -838 942 -1068 1222 -1415 1666 -2011 2513 -3311 4792 -8475 38888 35958 -49761 -35737
73 -35737 9225 33212 7812 -9624 -8885 1073 -3177 4086 6064 2050 -4045 -1188 700 698 -1691
88 -1691 1063 1581 386 -1443 -486 -378 609 286 619 -282 -1061 -727 727 215 -292 -225 280 -91 -246
107 -246 -46 200 -530 -309 781 628 -595 -915 -29 801 348 -709 -611 187 196 -73 -144 -49 81 201 220
128 220 -275 -561 144 752 377 -528 -614 209 825 292 -234 -170 36 -209 -100 238 413 76 -429 -355 304
149 304 500 87 -338 -295 -7 72 -89 -155 50 138 -119 -252 35 212 35 -150 -135 87 64 -151 -55 62 3
172Cj17P1J53n0p8k1P7n7Jk5J02j0n6k3L3Q2M6p9j73J16J02K4j13n2O8o2O2kJ3
201C5l2r2N0N0M5j2m9k1J9M9l6L3k0j1L1j04Q0m7K2J2N9q4j8M5m1M5n6M3NJ3K6
232C9k2L4m6l4m6P6k3JP3k8n9lJ7M0L6Km4j6jL5n6mN1m2K1J3nk2M4k2k9K9l0M3
266B2QLl0pL1r8R6j9j1k3j0O2m6K9j4K7l2L4Lqo3L5JK2J8qk6qo9R2j7j5J6KRl8
302c2Kk2O1m0M0L0r3pN0J9K6l7mK6Lk5MK9LNj9r2J08O3j70J30j0k2J3%k2nrLk9
337b3J2J7l1K0O2r1L1J8L0n8nN2j3Qon2nQN0k4j0M3n7jL4Q2n7m9k2M3L1m3j2m2
371f0N7K4Rk2o2PL3K5J1k5K6k1k2M4n3K0n3M8L6Mj4j1omK1k4JK9j6k5j3Q9j23
404g0J05m9J0j6j5K6k9R0k3o6K4Rl9M6k2Pj2L2k5K9QK2p5lO0k4km5K3M0o4O0j8
$$ plain form
172 3 -114 -43 110 60 -18 -39 38 -19 -18 -43 59 49 -7 -30 3 85 131 52 -121 -5 97 121 8 -44 24 -38 24 22 35
201 35 3 -89 -39 11 56 44 -5 -26 -7 42 6 39 19 8 39 -65 15 -32 -10 2 61 -23 -41 4 -37 8 -48 -5 0 13 39
232 39 17 51 5 -29 -75 1 -22 -21 52 24 -35 -38 -21 19 55 57 13 -3 -4 31 -25 -29 22 -20 1 14 9 -13 31 9 -20 9 -21 22
266 22 30 33 3 -4 27 -71 25 6 -5 -28 -38 24 -22 7 -7 20 -12 22 25 17 -46 -11 -10 12 30 22 -4 -12 -81 11 -6 -21 -5 -3 6 -32
302 -32 -30 -52 9 -31 9 39 -54 -61 -11 8 34 -3 -7 19 22 -3 1 30 33 38 19 -73 35 98 -72 58 48 26 39 39 17 12 3 6 -23
337 -23 -11 6 -25 -5 57 -34 -3 15 45 -13 -18 34 21 29 23 -29 -34 -26 24 0 -10 33 -24 -25 9 91 34 -15 -37 6 37 -6 -18 -60
371 -60 -3 21 30 8 -54 -47 -14 11 22 -3 23 2 -20 24 -29 -9 -62 -14 22 26 12 1 -5 -9 12 -12 -11 18 2 -23 -36 53 -70
404 -70 35 -14 -4 -20 -35 -9 -38 52 29 -37 -13 -4 -43 3 -19 -12 -24 8 -17 12 20 42 -33 -36 24 0 -2 -47 -24 16 -48 12 -6
437frJ6j5pN5J2Lo0J9l6OJl5J4M9m4j2Q1p4LN0j7L5o1K4J5rj8L9jk8M3o8k9R7
472C3n4Q3m5Njj5LK1m9Pl6N7n7KQ0m3N0r1k9P2k2J1Q8Rp0q5M8N4j3l0L2j7L5o6
506c3L5Ol6M6j7K5l1m8P3j7j9j2j2%mJ30m3rk6p1Q3p0M6l9K1L9l7M5r6Q4L7l8
538A2K7m1m6M2kKn0qL1L3K6m7K9pkkJ2k1L2o6Q3n9K6l3P5r3MO0n2R6l2o6j2J04
572E5n1k2M3m9%L0J1k3n2O2j9M0k8l0rmJ7O8l9m7P8n2K3l4O0o3K6kl3lM1O3o6
605iK6KK4m0l4K3ROk7j6LJ5K8K6o3J0k4K7j6J5q0N8j9L6LOL3l2j9N7J2pk5lJ4
640A9K1o9N4j8k7K1l4K0PJ8l0L%J3n2M5k3M8m4K7R%o6J08k3n8M1l9j8M7rmM5o4
674c2L4k7N8p1lP8k8o0P8j0ol7P0l9K8m0J9Qn4L4L6pL6m0m5L9kNj7J5j6j8J5N
$$ plain form
437 -6 -15 1 -14 -21 34 46 49 -11 8 -28 -22 -21 -56 -42 7 -37 -49 32 -42 -39 11 -6 29 -32 -8 7 -2 -20 19 18 -10 33 -35 -64 33
472 33 -21 62 17 22 21 6 9 30 -19 -12 -48 9 -48 -46 34 -9 41 -50 -79 -7 -29 -18 70 79 9 -76 -28 26 13 -17 15 -2 33 -33
506 -33 2 8 -28 18 1 26 -5 -53 20 3 -16 -28 -40 -40 -44 86 43 34 8 -63 20 -50 -4 -43 -22 17 -20 25 -71 13 50 12
538 12 39 -2 -48 -6 -8 -6 -56 -64 -33 0 26 -21 8 1 -1 -3 9 -12 20 -46 37 -22 4 -29 46 -47 -43 17 -35 61 29 -37 -49 55
572 55 4 -18 25 -24 -24 6 17 -6 -58 4 -15 25 -3 -33 -42 -46 -29 39 0 -47 31 -21 2 -32 28 -35 -9 -11 -44 -47 -6 57 -9
605 -9 17 19 43 3 -31 -8 1 7 -20 -36 -33 -18 10 36 -27 -17 -41 -14 -30 -15 -95 -37 -56 -20 -17 -11 22 -10 -29 28 40 33 8 5 19
640 19 40 -29 25 7 -20 1 -33 -13 -6 12 -18 -15 -15 -2 -54 -9 -32 16 -28 -1 8 8 -58 50 27 -31 10 -29 -47 0 -9 -13 32 -32
674 -32 2 -25 33 -38 -41 37 9 -51 27 17 11 -26 44 5 33 -7 12 20 -34 0 36 29 65 25 -20 19 17 22 5 20 4 -14 1 6
708FK3Kk1j4j0M7o0m4J25j07L8pl4O2j0%j2OJK7Jj1j2K1K9Nm9K1K0p9P5q2M4o8
742f7Q4l8K6m5Q5j5l8L3n9lN8J5m7J6Jp3O7L9m8K1l1L5QJ2K2m2l3L%M1n0o2J08
775B3l9jK9o5M0N4J0q8J5N2J1o5l6N1Mj1O0n2N4n0l7K5Pk3pO0j8l1l5M7L5m2M1
808A8j4Nk2rl4K0K4J2K3l7L5l2M7Kj2n1J8L6K7k5nl7pK9rn5O7L4J6rr7K1L3M8
842F0j2n0k7j1L7L6m0j%j1M2k7k1P8rk6j7L5m6J1K6j1m0N1p1P9k5p0J02l8L0j3
874B1j2J6K4m1k2M2l1mo4O2O7op0oM7kj5no9N7mk2M7M8l2m5l3P8m7k4O8k0QK9
908D0qj7L2o7L4l7N7J0l0l1J3M2m7m3KM1j2l2O5j8j5M4j4L7n3O3q1P7J5k1l7l9
940c0j1O1l3J3J5m5L1J6j8Q%OoN7n4RJ0rool0rJ3JJ7O5l5j2l1L6%J9o9J7L3J3
$$ plain form
708 6 29 31 10 -4 -14 33 -27 -71 54 -53 -15 -22 -56 6 -4 -4 -16 -10 -9 18 19 8 -4 17 46 51 2 23 43 -36 39 -43 1 -67
742 -67 17 -21 5 -40 45 30 -8 25 -34 -37 21 36 -11 5 6 -67 0 39 -9 12 -19 16 24 36 58 16 -17 -14 -14 27 -23 -85 23
775 23 -16 -17 12 -53 -13 41 51 -37 -22 30 41 -24 -60 -9 -5 -16 44 -8 46 -4 -41 -16 -9 -32 -39 21 3 -28 -63 -16 19 -23 18
808 18 4 9 -13 -22 -56 -36 -12 0 23 -14 21 -11 36 38 26 -25 -7 29 56 31 26 -11 -18 11 2 -53 14 48 64 55 -42 -21 12 60
842 60 48 -2 -29 -40 -3 33 -7 -8 -8 -19 23 -4 -25 53 44 18 1 36 -10 1 27 16 -24 27 -44 35 10 -60 42 4 34 21
874 21 9 25 49 8 -14 28 -3 -7 -71 -9 58 52 -18 -24 23 21 6 1 -68 -11 -15 -37 10 58 26 -19 -52 26 -21 -45 23 3 11 40
908 40 32 15 47 -20 14 -23 34 44 14 -17 -4 38 -9 -52 -50 -9 -21 -53 12 -6 -21 23 9 46 -7 56 -25 52 67 46 9 -30
940 -30 -41 20 -13 0 15 -30 1 17 -1 7 7 13 7 64 10 19 29 20 14 8 -22 -31 -18 -17 0 65 30 18 -13 23 23 42 -27 -10 23 36
976C6n4K2KPl3%K2q6O0N3p6J9K4oQJ5k7L0n3N0qM5n1%M1l4O4o3J4l4K2l5j6k3
1010f5lJ9K5K9k9K3n3J01j9m1J5j1L6j5L7l0j6l3PM8l1L7p3M7%j2L1J5p7K8K6
1041A6k6rK3j3J9K5l8j6N0o2N0lpL9p4J9M2l1j4rj8P8p0mON5NoJ8j8o2L6lM2n6
1076a6j7J1M1m5PP1o6j7k0J1lL9K5J9k0l5ok7N5j4k9OJ4l0M8OJ3k9J4j1k1M5m8
1109b9K4L7l5MJ4l6k8R2l5pML5o0L7J3j02L3P6rp0P2m8k8Q2r8M2j2P5k5lMm1r
1142c1k4L7N2m1K0j2M1j0p5M8l7JL6K6j9k3Qj8M8Po1%M8Mn5N7k2k0pJ6pj9L8k5
1176a9M0Kl8j4N1P%l2RM6k6P2r0l4NK4k1J1L5j5K5n4j3KM4n0J01j18L6J5m1K5
1208a5K6n3L8k3J4J2k5MkO2n6NOj3J8K6Lj4j5L8qO5j23K3Ol5oM0L0r0Q8J1m4J9
$$ plain form
976 36 -18 4 6 13 -20 -20 2 -84 -24 29 -47 -28 -4 -10 -2 13 -14 16 -37 13 5 50 -1 -1 40 6 70 7 21 -13 9 -26 -42 -65
1010 -65 -68 -49 -24 5 -24 -1 -54 47 28 -13 2 -9 27 12 49 19 3 -30 -23 25 -6 31 -42 5 5 -7 24 39 -38 -10 16
1041 16 -10 -19 4 -9 10 35 -3 -19 31 -31 19 16 9 48 -26 -7 35 4 -10 -19 -37 41 -29 -33 -27 28 33 27 45 27 -35 1 -2 40 -16
1076 -16 -33 -22 19 -26 -19 52 -14 -31 -51 -40 -43 -4 21 40 20 -15 -21 -48 7 -7 -36 -30 -16 -46 2 8 21 -8 6 -5 -26 19 -29
1109 -29 -5 32 -3 1 15 -21 -49 43 8 1 5 40 -20 17 30 -72 -39 37 28 -42 30 -18 -46 36 -62 -20 -32 43 18 15 19 -22 -31
1142 -31 -55 -18 34 -7 13 1 42 32 -43 5 -32 -31 5 31 12 -11 -3 -21 27 34 -27 -27 21 25 -30 27 5 -15 -22 -6 -13 -32 6 -19
1176 -19 21 23 -15 -29 22 29 29 -3 6 52 26 98 8 -26 -21 3 -18 -7 28 13 38 -16 -29 -27 17 -33 68 -50 -14 1 -40 -15
1208 -15 11 -42 -4 -27 -13 -1 -26 -22 -24 38 -18 -13 -7 -20 -2 24 27 13 -2 36 28 93 -30 -7 -1 -36 -42 -2 28 -62 26 37 -7 12
1242A2k6N5n2kJ5kn0R3m4K7j6mL2k5j8K8K6j13O5pm1M0J9kl0O3p8L9L3j0j0OO
1275B9Mj4j6K9n1M7l7N3q3L8PK2l3k2N0n2ON3o5K7j3P6m8n6R5m2k5N6l8Ql5N6
1307B6qj6m1L8J8j4j7J6j8K9k6l8P0l7k7N7ONn8M0Pj8M3o3K5oQk0K0Mpj2M7K0
1341E3n7k9o%K3K4lJ4k8o7J02Rn0K8K9q1L8OK7m7J4J2J2k1m5O4l9L6ml4K2n5L5
1374a8PK0M4j29O4j4j6L0J2M9q3N1m4N8k9n4P9k6n8M3K8k3J9K2l1m7K4mK7l4O4
1405C1%m4K3kl5K8l9J9M1Npo3P0j9K8m0l4J9m7R8o3J7pLJJ7k8J8L4o1M3Rk3K2
1439A4L5m8j4jo9K5K9K4K1l5k6N5j3l1N1N5q4k9P6rk0k9L6J8m6rP8o1PM7lq8M0
1472dL8m2R3j17N3jMj5N3q7pP4n0J1J3L0j4k6Rj0K8o1K3j2N7l9L6n5N4k0j9Mn1
$$ plain form
1242 12 -14 41 -11 -13 2 0 -50 43 -1 26 10 6 38 13 -5 23 49 -64 1 -6 -47 -7 12 10 -20 43 -35 4 37 27 17 23 29
1275 29 33 19 3 32 -19 28 -9 44 -39 -1 6 28 -5 -27 23 -29 -23 30 -35 -8 -21 55 7 -49 46 4 -21 35 -3 5 -30 26
1307 26 18 2 -39 -1 17 3 -14 2 -16 13 -13 -51 19 -18 -45 12 18 23 -35 5 12 -6 37 -26 -1 -7 1 -19 1 5 -2 -14 33 53
1341 53 -4 -33 -39 -39 -16 8 5 19 -9 -76 26 35 -15 13 42 -39 -1 5 32 -15 -1 11 23 2 -43 21 -18 18 14 -20 2 -53 -18
1374 -18 -11 9 53 -76 -12 -26 -42 -12 0 49 -34 17 -27 31 2 -52 27 1 -57 -14 14 -9 10 32 1 -46 -22 -26 1 -33 31
1405 31 31 -13 10 8 -27 1 -38 -19 22 27 20 -43 27 8 36 -4 -38 -19 -66 32 -31 -14 -21 -18 -17 0 -28 -10 24 -37 6 15 -8 14
1439 14 49 1 -13 -14 -83 -58 -29 -5 16 -19 -45 10 -3 -34 17 72 -12 -41 35 26 6 -23 13 31 -15 -24 54 -7 0 47 44 -44 -4
1472 -4 34 -8 85 -32 21 20 24 9 62 -25 -32 42 -8 3 16 46 32 6 15 5 33 -28 -5 -17 40 1 37 -18 36 16 -3 1 -50
1505e0L4K4L0n0J0o4K1M1J5j0j2k8RO3m2j4P6k0n7K2JJ1N0m6OKok1j5K7N6k5J3
1538E1q0K8Ll7J7K5k6n8Q5j2j0K8mj5M7p1N1j4j1rL8m0M9j00J07m5J0K4j04K2
1568e1L0J5jKL3o0K1J9l0L5m2L3rk0JMN9l8m1L8n5N4k8LO4p9j4L7QJ4j1Nj9K1
1602bj7J0J4o2rP8RJ2k5K3k5l1O3l8k0M0nJ0o5K7M6ll0Qj8QN9m2J8jkj6J9n6k4
1637d7L5j3K3p0P6jK6j9L3q2J36q8J0kqj4J6j8m8O9N9p9lK4Lj7rnJ8Pkl5K7p0
1671f8L0N5m8QN2m5nnrL2j0j5L3rmK8J8p4J7mL9K4o3l4L8Oj4K5M7k8j4L3j2q0
1705e6L9L8m7O1l2j2Q6j06K4JPm2N7J1l3L2o1O5l6J2j4RPlj3k1nLO0M2r1K3lK4
1739B6Lrm4j2K2Kj5j6N5M7l7om8K0j0l9Q7k2J5Ll7K1K3L4k3j00O3K3o5J6KK7o
$$ plain form
1505 -50 -16 8 38 -12 -2 -66 -45 -4 11 1 -11 -39 -30 33 -9 -23 53 33 -24 -2 -1 10 60 14 20 22 16 -5 -20 7 63 38 51
1538 51 -29 -1 2 -35 -18 7 -19 -77 8 -4 -14 14 10 -5 42 -29 22 8 -3 -12 26 -14 35 -65 42 -3 7 31 -73 -51
1568 -51 -21 -6 -7 -5 28 -32 -11 8 -22 13 -29 4 -5 -25 -24 -20 39 1 -40 -2 -57 -3 -31 -28 36 -43 -57 -20 -12 2 -9 -4 -23 -2
1602 -2 -19 -9 5 -57 -66 12 21 33 8 31 6 -25 38 0 -20 20 15 25 -40 -13 33 30 0 8 -10 -2 57 15 33 32 30 14 33 -23 -47
1637 -47 -12 -25 -2 -72 4 3 29 10 43 -39 97 9 19 17 9 -5 11 -7 -55 14 73 -6 -9 15 18 1 -8 -13 5 12 10 -25 2 -68
1671 -68 -38 17 -31 -23 29 -16 -21 -26 -35 -3 -13 -28 5 -4 -8 20 38 -36 -19 -23 16 40 -23 -57 -19 -13 -27 -2 45 17 3 36 24 -56
1705 -56 -17 21 -26 35 3 -9 77 -29 -5 -4 3 -39 18 29 -4 28 -33 32 -4 8 -6 3 10 7 -6 -27 -32 -29 31 73 -18 5 2 26
1739 26 29 20 -24 -36 -14 -12 -27 -43 12 59 22 16 -32 -12 -22 -61 26 4 19 22 -15 6 29 63 40 -60 3 26 -39 -23 -21 6 0
1772@pK4%o1M4j1jJ2K0K2n3m2Q8k1p0P6j9mRl3pkL8k2j3M0p0L9P8p6O2l6pk4J9
1807hPK3l3j4N1q7pj2N4L2J4j0j0N3%l2n2N2l1J2J3J5j15R4j0k8O4n7J6L3j8l7
1839b8kOKQ5q6K1j8J2K%N5J4j16N7J6J5j8kk1L0K6m8L7m9J6l8L1k0PJ3jJ1k0l9
1873e0N0M4k6p2O0j0Ln1M9Pk7PJ9j9PK0k9K5k8PL9j6j5J4pk4Qj7LKK8K3Rj8JM1
1909E7o0N1J5p1L7p0P0k6nM3k2om7k5O4O7p8l2J1qpL8K7l2JL7M2q1L5j02R4m0
1941b3J3J1K6JJM0n3K6k2l8jJ0pK4k3OQN1m9j2k2M9k0k0K8l9L5o4M9o3O7m6M8
1974ij3j5O9o1L6m1L8oj3LmK2n8J6m3M9K8m0J1J16r0k5M8o1K0KM2J8q3P7j8j0
2006EpLk6J2k8O4L4Nj20N1J0mL7k0J0j6k8J2m0M1N9p1M6p8O2nJ1Jl0N2l5j01O9
$$ plain form
1772 0 -7 17 17 -44 0 -11 -12 0 20 42 -11 -53 35 14 -56 20 1 -3 6 -27 -34 -36 2 -20 -33 7 -63 -24 54 -22 40 4 -3 -27 -8
1807 -8 -1 22 -11 -25 26 -61 -68 -80 -26 6 20 10 0 53 53 21 -31 21 -10 2 15 30 -85 9 -1 -29 35 -22 -6 27 9 -28
1839 -28 -30 -24 -22 63 -23 -2 -20 -8 -6 -6 49 63 -53 4 20 35 17 15 -6 24 50 2 39 -10 6 -32 -1 -21 -14 -1 -2 9 -11 -50
1873 -50 0 44 18 -54 6 -4 -1 -52 -3 4 -23 -16 3 -16 -9 11 -18 7 -21 -14 25 9 -6 8 1 -23 -15 -32 -29 -27 1 24 33 15 16 57
1909 57 -3 48 63 -8 29 -41 29 3 -2 41 19 13 -34 -59 5 72 -6 -38 -27 -35 -42 -4 23 -9 -8 29 71 -10 25 -77 17 -23
1941 -23 -10 1 27 28 29 69 16 42 20 -18 -19 -9 -16 8 -15 -9 -1 50 1 -11 -33 16 -4 -24 4 -35 0 -64 -15 -78 -11 -57 -9
1974 -9 -22 -37 32 -29 7 -34 4 -2 -15 -12 -16 6 -52 -36 -79 -30 -2 -42 -31 85 -5 -30 18 -43 -23 -21 21 39 -44 33 15 5
2006 5 -2 1 -25 -13 -41 23 57 62 -58 -7 3 -1 36 16 26 10 -18 -6 -46 -5 54 -17 29 -49 13 8 19 20 -10 42 7 -94 -25
2039b5J0J4J2P3r3K0J0j4K4l7N3l1o5L8MQjPk8qJ2j1J9lJ1L0n3K1J1n2O4l9mO1
2073C8l2PK2k9m8k8M7L7q0J26k6n7Q4m3KJ5Qq1RL0L5q3L3k7j1N9J1l3l1L6k6O3
2105B7o2J23o7K0m9J9Mm1nJ3N8l0L8k8k3L1n1o5J05j8Q1o2j3k5M8K4m0J0k3JM4
2136D4j6j8k5J5nj0Qj4o2P4k0P2l9%m5nM1Kj4K6j1J7qj6j3M2pJ1n7N7j4jl5NK5
2171Dnj5l8P1%m7QPk2M7J8kk7K0j0mMk5j9Q2o1K9%j1O9j20jQ4p7R6n0k3n7Q1l5
2206b9NL6k0J4j9k7P7k4l0K4p7N0jL0j9J9k8%J1qk4K1M6j9Jj6L9o9J0K8J4p8L1
2239c2N3m5j0O5k9K2n7J2MK5%K0m8O3ko1M7ll1m3M5K3l5pM5m6OP7n7KmJ2rL3l1
2274DK4k7j3L9r4R2n4O5N3j17L2L8p0RJ4J0j4K3K0m6j5J6N9k7l9l7M2L6j8Rk1
$$ plain form
2039 -25 -15 -1 11 84 -9 11 21 7 31 -6 47 16 -49 -11 -7 1 0 7 -21 -29 -17 -28 -9 -12 -1 29 -24 -3 8 -44 20 -19 -23 38
2073 38 6 13 35 6 -42 -70 -23 14 -66 60 34 -23 61 18 20 35 43 -38 -29 1 36 -47 -14 -41 -52 7 18 -15 -46 -10 -36 27
2105 27 -35 88 21 41 -8 11 15 -26 -31 -18 40 10 48 20 -3 28 -23 -88 17 -1 80 18 5 -20 28 52 12 22 -1 0 44
2136 44 28 10 -15 0 -5 -15 -7 -21 -83 -9 -29 43 4 4 -41 -46 -5 -3 -17 9 -2 15 7 -9 -22 20 13 24 -33 24 10 9 -26 -21 4
2171 4 -1 -16 -54 17 17 -30 -22 -15 -37 10 28 26 -1 19 9 5 9 -16 -35 47 -14 15 15 4 73 -47 -48 36 -41 55 5 -18 -75 6 -29
2206 -29 -24 12 -8 6 -13 -40 37 13 -17 7 -70 -20 -21 9 -10 9 -19 -19 -8 -16 -40 -19 27 8 9 -7 32 -37 -27 1 15 -63 -32
2239 -32 21 -24 -34 31 2 24 -33 -21 -17 8 8 28 -20 43 41 -20 27 24 -7 -50 -5 18 -17 -24 21 -25 -19 58 1 3 -1 11 2 35 4
2274 4 28 1 -12 27 -67 25 -29 36 89 -28 4 42 -28 -19 -5 5 -9 14 34 -12 -27 -11 48 21 -18 -55 -13 23 5 14 -7
2305gnN0j6l0O6oo8L9p5L9LN0Ln2k0Q2o6J0oQJ1m5O8k0k0j0MNj4Q8r4K3j6J1O
2340dK4lk4kJ2K1l9j6k2M1J5ML6l1J0O3p5k4L0m9K3K3j6nl3K3M8l2j1N0q2K7J4
2373dJ0k9M1kn5J17r9N6pm9MO1q3J0M7l2M4q9R2m3RM2n0MNNJ4q0O4M9n6Mk4j5
2407c9rR7m4k4l8P1M6q1M6k2m6M2qm6N7N2n7rN3k5L6j6p0L3Qm7P2k7k2N3pn1Q6
2440F4J0m9K6p0O7l9J0K2nj2o1K1oOK3K3k6j1j5M8K2l9k3N2m2ppK2j8N4j8K3j09
2473f4R3o1Pk2K5L1p6O9kj4k5K2J5L2lp3M6J5k7J5j2K5J8j3qj0j8O9m3Jk5oL6
2506A7m0J5n0L0L4j0QK7o9J3J3K4j9o3R7q5Q7n4l6O0QJ9l1L8j2m1lQ7r5J3J6K4
2538B2kJ3n1J3k4j2K9O0j9p2P6K0m0OJ3J4J8n9k9lK5P9j09N6n6M3K0o4K7J4K9
$$ plain form
2305 -7 -12 38 22 -8 58 52 -16 23 -52 -13 -10 40 43 -9 -29 53 -13 -3 -9 -1 10 -35 33 13 -7 -17 -13 -8 -22 66 -28 -5 -21 -10 -4
2340 -4 20 17 -7 -9 3 24 -15 -31 -53 -12 3 7 43 12 22 85 10 -14 16 -33 -10 13 -3 -8 -41 -18 30 -2 -13 37 -45 -18 -4
2373 -4 6 -23 18 16 -39 78 -21 35 28 -21 -17 44 -39 -29 18 -14 30 -59 33 -10 -1 41 -9 -5 0 5 19 -61 3 52 -4 0 -24 -39
2407 -39 -48 49 5 -19 -57 14 60 -21 25 3 -43 -1 -9 -55 2 54 -3 -12 41 16 52 36 -34 -1 7 -40 32 5 -17 36 29 -22 64
2440 64 74 25 51 -19 48 9 19 41 36 24 -37 -16 -22 -16 7 30 4 -7 -22 26 48 9 -14 38 -4 -11 -18 4 -14 40 22 45 -64
2473 -64 29 -32 -25 -47 -22 9 -67 2 0 -14 -39 -17 -2 30 27 -46 0 15 -12 3 -9 16 34 21 13 3 -15 54 11 12 -13 -19 17
2506 17 -23 -8 -58 -28 6 -4 4 31 -38 -25 -12 12 -7 -70 27 -58 29 -25 -61 -1 7 26 -5 33 21 -20 -23 64 -31 -18 -2 22
2538 22 20 33 -18 -5 -29 -41 -12 48 29 -43 33 53 13 19 32 46 64 5 -24 -27 -2 77 -32 24 -32 11 31 -33 -6 8 37
2569C7n8L9NK6o7k2JJ5L6k6NM8l5j1j9N2M5r0M3l2lnJ4jk0jl3P1Kj7L%J1p7P0
2604FK4k6Qn2N3Ol1Rmj3MK8o2Q3nm4K8j3l2J6J2n2N8K7m3KN6m9M0k3j5J7Pn5L1
2639dL0J9lj08Q3k7Nm2M9k5K9m5L3nj0J3ml3O1rr6R5l8M8m0L5m4OK9n7M2J6j8
2672a5POl5N8l5K9k0m9N2l0J4K0k2QK9r2L8nO0m0k3M5PJ0k5lM1m5k6K9qO7Pm5
2706IjPqJ6Oq5Q1l4K0j3K9jOl1k7L4Nl2Q0l9k9%mjJ1k6l0O0j8k2P3n2LM4m4jK8
2743A4r1P8k9j5L3N1k8K4k7j2N2o3RL5j6j4J9%m5K8oj3lL4j4k5J9J6m6n3P3K9
2775A4j9jJ2m2J4M7l8mK8pl7K5rM4pn0L0J8K6n0L0l3K9N3q0j0k2P0m6M2j4l3m6
2808f6Q9m7rL7mPk2k6P8jq1L9L2m0j4K4N0o6k0jL7K3M9n7k3K6j2k6M9k4KqPk7
$$ plain form
2569 37 -21 18 23 49 -18 -40 -39 -24 12 -14 -9 39 4 -7 -26 26 71 -19 24 -8 -11 -16 -2 -3 -23 -24 -57 14 16 -1 2 2 13 -64 6
2604 6 30 4 12 -40 13 19 -12 -3 -7 -20 -16 12 -50 33 28 -16 12 -1 -33 -17 -5 -57 1 28 -15 -13 43 -6 34 11 -4 13 20 -35 -4
2639 -4 26 45 42 -66 17 -10 -5 -47 2 -23 6 -39 -6 -11 -21 -8 -12 -45 16 7 -89 6 -32 16 -24 11 -33 -27 2 -55 -13 3 -15
2672 -15 -8 -2 -37 21 -14 15 -5 -54 -2 -32 -18 2 -20 -12 17 -75 -37 -42 18 -22 -45 0 7 17 -8 -11 30 -15 -41 -12 -20 47 54 9
2706 9 8 15 7 23 29 -56 25 -9 11 -2 27 26 32 1 -26 8 13 -19 61 22 -7 -7 -11 -12 -1 -27 -57 3 -15 -37 36 -16 -13 31 -13 -14 14
2743 14 -77 1 -28 -43 -10 41 13 37 10 -2 50 -13 -4 31 15 1 20 20 -25 3 -3 -16 -19 15 1 -24 -5 11 -35 -88 -15 14
2775 14 -5 -6 6 -36 -22 25 -13 -17 11 4 -33 -8 -17 27 20 -30 0 18 44 -6 24 -9 20 73 -7 -17 -39 31 -15 27 13 -20 -66
2808 -66 23 -24 -33 4 0 7 -15 -41 37 36 -45 -6 26 -14 -28 -4 46 -20 -40 -41 -4 19 68 11 -12 14 2 -24 25 1 3 -5 2 -25
2842b5L5OK3l5%n5O1o1M8jK4n2P9o1k3K7NK0K5m8Lk4J7jN3l4j6k2N6L1j02P9n
2875B7oo9J4J5K5o3R4n7j3QJ3K0m4J7Mj2J9MP4p3K7o2k6J16n1nj4P8j36J21J4
2906E9r8O0l0K5n3pK4N9k3n2L1L0m0o1L6P0JNrk7%j5O8r0O5j2o1Q2l0j7j6N8n2
2939b0K0j6j7L6lMrLNk0k7J5K0l8O6jn2M4oN6l4m1j8J9j4L5%K3K0m8j8lR3m1n2
2974a9K7mn5O1l2mLK1LJ4p2P3l6pj6K5nm3L7K5%Mj8Mo4P3MJ7j5OJ9n1OM4k0KQ
3011A5qm5P4kn0L2K5j00J6L8M2o0L8J0l6J5K2J2q0N1JL5q9P5Qm8M2l7l0L8qRl5
3044c0J6N1o3L7L7p3JK7L4m1j0N5l9K7n6K7nKL3k3M2l5l2J2qk4L9N3o1M4m6J5
3076FJ4n1NM7J2j0%M1q2k7L6J3M7n9j1K8j3L2p1M9j5Jk9K7Jno2M2L3l7L6mn8p
$$ plain form
2842 -25 10 16 39 4 4 -51 10 -51 -3 -4 20 -32 47 -14 -37 -10 -5 15 40 -8 -5 -29 -12 -13 40 6 -10 -32 24 55 -47 32 27
2875 27 21 -48 -34 -19 6 -57 37 -20 -33 -25 -12 8 -36 -19 -15 -27 -8 -4 70 -3 24 -38 -64 52 1 -4 -18 60 -76 45 59
2906 59 -39 21 -9 16 -37 -44 -20 39 16 -36 -5 25 -15 -76 -40 30 31 36 27 0 0 -15 53 -37 28 16 -45 37 7 -10 -26 32 -20
2939 -20 0 -16 -33 3 0 4 -5 -2 3 -17 -44 -29 -9 -47 19 18 -34 10 4 60 26 -15 -33 -14 -28 7 7 30 50 2 -16 -19 74 33 -19
2974 -19 8 4 -51 10 -22 -26 -23 -2 1 15 -57 16 -20 -27 -43 -18 -23 -66 -29 -4 -4 0 -18 -14 -78 -5 -1 16 1 7 26 -25 -19 25 5 7 15
3011 15 7 -38 36 34 -16 16 41 -59 -43 -5 37 -23 15 25 -11 4 26 38 -42 9 10 45 -44 31 39 -9 33 -4 -34 4 -4 5 -30
3044 -30 -14 37 -26 11 48 -25 -24 3 37 -4 -14 41 2 29 -27 0 -5 -3 30 7 49 14 -18 -6 -14 -38 1 54 -7 37 -9 6
3076 6 20 -31 -26 21 33 23 23 64 -18 -45 -9 4 51 -8 -19 9 -4 28 -43 6 -9 -8 -37 -10 -9 -14 -76 -34 -1 -38 -2 -6 -64 -71
3110g1N8NK0k9M9J3l0qKo1O4nM1l0QJq1N8%O8p3k7J1P4k5K2m4L2L3q9K6j8o0Q3
3144A7K0o8L5jJ0N7j05M2l9KL3J2m0m7R2j0m0k1J8rN5l6k9K9O3%m1J3J6q3P6j8
3176CL0k6Lm4L5K1J2k8k9O3o1K1k3N7p0Qj2O6n1M2K4r8R2l9pK3m7L3%J4r8J05
3208A9M0q4P6r1O0K0nJ2j01J3J5M9m1J8om9M9J5m6M2j9J0ool1O9l0NjJ0l4qQ0
3241D4j6nl7K0J4o1O6l5M6m5kK9L3n5Ml1%J5j1N2l1K4n2N6k9Q6k6p9N8n2O2k6
3273A6m4K3K6m0m6M4qM7k5k2mK0L8m5K1K7m6l%K0L9J3q7P1K8j09P2k8J8rp5J22
3305E4j7o1K8nmmm1j9N6K9l0J9m8K8J4L2n4K6%j5r8J21J8K2p0M3L8o6LN1k9mJ3
3338C0njk6J7K8n2N5m1Lk1QJ9qj7O8o3k8L0P3l4L0p0rL0Lj0K2p5O6n5K1RnQLL
$$ plain form
3110 -71 -13 -8 12 -17 32 45 15 7 9 -52 12 7 48 18 26 27 -54 4 4 72 -1 -28 -17 57 32 54 10 42 75 -14 12 -6 -66 17
3144 17 37 -31 4 3 13 70 -35 7 -32 -30 3 15 -25 -72 20 10 -30 -51 -33 -42 13 -23 -52 -23 40 40 -1 12 28 -55 21 3
3176 3 33 7 10 -34 1 22 34 6 -23 40 -21 0 -23 34 -36 -28 -40 26 -25 17 41 -57 35 -4 -11 12 -35 -2 -2 12 -86 19
3208 19 59 -25 51 -40 20 40 35 47 -54 -41 -26 23 -18 0 -6 -55 -6 9 -37 5 -14 -4 -10 -16 -47 22 -8 -3 -4 6 -28 -36 44
3241 44 28 23 -14 6 20 -41 25 -10 36 -9 -11 18 51 -4 0 -31 -31 -16 -27 25 -6 18 -34 22 -7 79 53 -26 32 -20 42 16
3273 16 -28 -5 21 -19 -65 -21 -29 18 -7 -29 -33 -13 25 -20 1 28 -18 -21 -21 -1 38 51 -36 35 63 -46 26 -2 16 7 -68 54
3305 54 37 -24 4 -1 -5 -9 -50 -69 -13 16 -14 5 -43 -15 -1 31 -23 3 3 -12 -110 11 29 51 -19 24 62 -4 -1 50 21 17 30
3338 30 25 24 -2 15 43 -9 46 5 8 -13 -5 14 6 -11 57 -6 -34 -4 69 35 65 -5 -14 16 19 9 31 -44 22 -33 -12 -3 -8 0 3 6
3374Fj9P7q9K6O2o6K0l9L8n0M5m8j9P1PK3l6j2j0M9%m4K3K0l4M3j00L2jPN1n1
3406a8j4K9ok8M1L6k7J4j0k8N6o4N4k7L1l1o9O8Nj5L0k8M%m6M2L5oJ3p2J5K5l8
3439b9PK0o0J1K4L9k2m1N7KL1p0RM9Mk4oj6N5K4o6J1k3O3p4J3L8j7j4k8L9n5L5
3472a4N9k0n6N3Rk5%j1j5L6lK3m7K6LKo7N7noK2kJ3m0K1J8J0lnn2O8nk2k1lm0
3508d2N5L6Mq5kR7m8K8Mn7J3mJ4o7N1K0ol0j8L8k5K4k4j8NOm6J04j7ok4L9k2J8
3542A5pQj4j7M0m8J9lK4q7R9j9J1oJ1k8K8Kq8O8j3p3R6l4k5Q5o7O8r1N4l9QJ2
3575a1K7rKn8K2QK2l7J6M0Kp3L3NmL6n5O6Kl9K0j2j7J9j2kK1n6P0m2P4o2k6Q0
3609E0n5l1J2K6n0J5M9j0L3k1K0q2O7p7L7Nj2K2%j0O2p1J4KM1o7KM8q0N9k0qj
$$ plain form
3374 6 -13 64 -25 1 63 -3 17 -22 16 -34 11 -37 -56 15 22 45 9 -3 -13 36 36 -8 15 35 1 44 -56 -24 -25 -18 33 -18
3406 -18 -32 -3 -9 -37 4 40 13 27 17 -11 45 -19 35 8 39 8 -61 7 12 -3 27 -1 3 3 -43 -1 34 28 41 -31 -16 9 -29
3439 -29 -22 -2 -62 -51 -27 12 -10 -51 6 8 39 -31 -22 27 31 7 1 -15 40 64 -2 9 -14 49 -25 -12 26 9 -5 -33 6 -49 -14
3472 -14 45 25 -31 22 31 6 6 -5 -20 16 13 36 -11 15 18 20 -47 10 5 -1 21 19 32 -8 13 31 41 38 33 -19 49 44 22 1 -2 -42
3508 -42 13 49 53 -32 -34 63 15 43 47 -10 3 -1 13 -54 -3 17 11 -19 -37 1 -24 0 -24 -42 -37 -31 -77 27 10 4 -20 19 -3 15
3542 15 8 16 2 -15 25 -23 -4 -7 17 -70 29 10 21 15 26 -2 26 28 -60 8 -5 -78 18 -16 -41 44 -23 45 -46 8 -31 -23 -11
3575 -11 16 7 9 -49 -27 -19 3 -34 -18 22 24 -49 -16 -11 -15 21 -34 32 34 -5 15 3 -14 5 -7 -9 12 -44 26 -16 58 -4 -30 50
3609 50 -5 -36 -24 2 -48 -33 16 6 39 18 38 -44 23 -54 -17 -12 -24 -2 -2 -12 50 -21 -7 -5 36 -31 -29 19 -61 -2 -22 -30 -31
3642c1L5L1j8q6L7N3k2J%L1m5J7kJp3R8l1k7L1p0O3k9jO0m5M1Rj6OK2k2j6Pj1
3676bORm0L9JN3j10R2l3Lp8N6K5r2R7qp6M1L5o3P9K4m7Jnl6k%M1L2n4K0qL9J0
3711D9n9j9R2k4m8OL1K3k2j08N1J0J9qj6j0K3K0r2Q2K2n3JJ6J7k3j0K0K7J4j9
3742A2oo3R3o3j8M1P7p6k3L8l5J3J6krp1K7L7l8Q6qm0m3L1P7r1L6J6jRj9M0r2
3775d9J3M8ol8L6k7L1N9m7J8Lm4L8j03M9M6kjj7K7%m9O8l5l3J0mL7j0j0N5m9K7
3808D1r8O4O9p3LkOL8p4M2k5L0m6L1K5n6qrL1k6N1K5m5JN9j16Q0kn7L8QpM5M8
3842I1r2J0j8J5PK4k5k1k6O1k6J6j7Rk7L3m0k8Q2l6M9K3k3m4k7M3L7l2J7l7%L9
3874C7j6p0O4l3M9k8K2j2k7N3pk5j8O0l7K5J6q6L9Kl8K0N5jo9J7RK3p6L3J6L3
$$ plain form
3642 -31 4 35 17 -69 -32 21 -1 0 0 31 -14 3 1 2 -71 27 -4 -31 0 -70 -7 -36 -37 23 -22 19 28 12 18 40 18 2 9 -2
3676 -2 4 13 -27 12 13 66 -44 48 15 18 -60 -4 21 -71 26 18 -58 -17 18 -45 34 58 11 12 7 -29 -31 -31 10 42 -12 8 0 39 49
3711 49 -10 -29 63 39 -9 -3 28 51 29 -79 -28 -18 1 -7 -23 -33 -10 10 -82 0 22 -31 -30 -14 3 -20 -30 -10 17 31 12
3742 12 6 -57 36 -27 -45 -4 73 -3 -26 12 -23 -10 6 4 -5 -76 -49 -12 -50 36 28 -12 -55 -24 53 -38 -2 14 13 22 3 43 -49
3775 -49 -36 12 6 -32 4 -23 8 67 20 38 41 -3 35 -68 -19 27 25 24 7 34 34 -15 53 18 -15 -5 -9 28 18 8 63 14 41
3808 41 -57 7 76 3 6 4 10 48 -26 16 -9 21 -25 6 31 -25 -33 -42 -11 -37 14 39 -6 -5 54 -62 18 16 -41 -3 5 -2 43 91
3842 91 -1 9 -9 6 13 37 12 -9 -35 26 0 16 -1 8 -19 14 -26 -54 28 -8 41 64 41 -3 -30 13 50 18 35 -2 -2 37
3874 37 21 -49 15 -18 31 3 25 13 -14 39 32 7 -11 49 12 37 53 -33 6 8 -30 -10 45 44 -25 -8 1 24 -52 -19 -3 30
3906C0k6k4pl1K7M0l4QM3m9J1MJ4K5j4k4L1n2L5k3L1J1Jj9KK5o0j2M7J2K7o2M1
3939B8k7J9lk5Mm1Q0k6K6k0n7O0j2nL2Nm2j5P4n8j2O2n9KMo1K2ML9J2M3m0J6j2
3973A7l2JQ3n6P1j21P2Jl4M3p0L0L0L4o2K9m0K5k0l1k3J5J9J1k2P3k9j8L5k2j1
4004bmj7j5J05j01L9L0n4J8J0J2p6N8Ll3LO6k8p3K1K3M9j2m8M3N3q5j2M1k7j4
4035b7oO1p0Q1j11O7l7J5L7j9K2j5j6M1k6KKJ5JmL6j8k3m5L8m1K6M1l8M3n9j0
4067c7M0l6K7j8lJ6M9j18N1L4J7m2lPN3l5MkM9m8l1J6J8o7O8n7R2j12O9K6p8M4
4099gJ1k3L2j3rJk2L3q1O9k4j9PoN0j6J00j03L1l2LOJ5mK5Kn4j0PN2l9j9N2J4
4133B9J8n2j0n1K4L7n0P1k1j2N8n3Rk3J0j7L4pOK8j20J19j9Km3L5nj4M4k3k8K0
$$ plain form
3906 30 4 -20 -27 -58 -31 9 -25 -17 26 -23 -12 -8 6 31 17 -7 24 -28 7 -16 15 26 27 8 10 35 -25 -37 10 22 49 -13 28
3939 28 1 20 17 -8 -4 -45 35 9 35 15 -42 18 6 1 33 38 -4 -19 55 -3 -15 47 -12 -10 -6 -67 -45 -41 -2 10 53 13 29 17
3973 17 -15 -14 69 13 84 -37 35 36 2 45 -25 5 35 69 7 36 -4 21 1 -30 -53 -38 -19 -8 -30 43 14 -4 31 9 -2
4004 -2 -6 -23 -38 67 -34 5 35 -19 -1 9 21 -55 3 6 -27 -24 42 14 -59 -38 -15 34 22 -26 17 70 -15 -27 14 -13 -27
4035 -27 -33 28 -42 39 -72 -5 -42 -27 10 -9 13 -2 -18 23 -3 -1 1 16 17 13 49 31 8 -37 1 -40 -14 27 -11 32 -27 -37
4067 -37 3 -33 -6 -24 -27 -11 38 -80 -29 5 22 -20 -23 -16 37 2 6 4 53 5 -26 -10 8 -59 9 -48 44 -68 1 27 -51 -7
4099 -7 4 -19 13 0 -9 -8 -30 3 -78 -9 -33 -52 -45 -51 -1 -17 83 -20 11 -21 -18 -12 3 -1 24 26 -28 -38 -31 21 -18 -37 15 29
4133 29 47 -5 -15 -66 -42 -5 -55 16 -5 -17 41 -12 -3 -26 -16 -33 1 -6 0 28 -92 27 8 10 -33 2 -3 -17 27 4 -24 -4
4165dj0jK9l4K0pl8J0K7kK0J5j6O7j32P0j2LJ3K5p2K7M1Qn4PJ7M7o3J1k3L4J5
4198C8o6L5l5P0l3l1L1Nj9lj8N3k1J0l4K3J4m3K0l1J0J1NL3o8J6K6NPlL7l4k1
4231a1PK5k6K8k6K1kJ6n3pnJ11j10j5N7Pm2P2j0ml6L2k6l0kP9m6l0P9rl5K3k9
4264Cj6M0q9M3MJ6OnK2Ln7RN8k3OO1r0PMPO6n4k6l1M1k4k0M4Pm2J5Jj2k9O5L6
4300D6l9j3Nk9k0O9j7Qj5k0P5q0N1m3M6j9mL0ol7MJ7m4M2p2N6nK5qJK4l7QJl6
4335c6k8Q6jo5K0L0O3j27O9oM6l9L1j7j9jL2Jk1J8n5J4O0j4o8L6n0P7r0P5j0l3
4367b2K7r4R5J3l7M5j2j1J4k1n8O5K0q7P2j9M3n2J8N5p4N2qo3O3L0l8l3J%L6k2
4399bJK3J8j7k0m2P8m7LM1n7PL1K8p4N5n4kJ6K2J0j2j8J6l8P3l5K6n4j5P4p1O0
$$ plain form
4165 -4 -14 -15 14 -20 0 -7 -45 -35 -8 -10 10 25 9 76 -56 14 2 5 18 43 -29 -2 39 47 -7 0 17 64 1 12 -11 23 38
4198 38 -28 7 -28 42 9 -22 9 14 -5 -8 -26 27 6 16 -18 5 19 -24 -4 -35 -25 -14 -9 24 -44 -28 -2 3 10 7 44 10 -11
4231 -11 -4 21 -5 23 -3 18 16 32 -21 -28 -33 78 -32 -47 10 17 -25 47 37 33 -3 29 3 -27 -29 50 4 -26 53 44 9 32 3
4264 3 -13 27 -62 -19 -15 1 7 2 24 27 -30 -21 37 14 20 81 -9 -2 2 9 75 21 -5 -36 5 -19 -39 5 12 -30 -15 -14 -26 -55 10 46
4300 46 7 -6 -1 -30 -50 19 2 10 -5 -25 50 -30 21 -22 24 5 1 31 25 -12 -8 9 -35 7 -65 -9 -14 11 3 4 28 -9 -1 0 -36
4335 -36 -64 22 21 -44 -24 6 69 -58 11 5 51 12 43 26 7 6 38 39 18 36 -19 -5 55 41 -27 9 -41 36 -54 21 11 -22
4367 -22 5 -89 6 19 -18 27 15 4 18 -3 -61 4 24 -63 9 -10 33 -19 -1 54 -20 32 24 -39 24 54 16 -17 -16 -16 20 -2
4399 -2 -1 22 40 23 3 -39 39 -8 -5 36 -21 -14 17 45 -29 26 -28 -30 -14 8 18 6 -12 4 -34 39 4 30 -24 -39 35 -36 24
4432B4k4k6K1N5j0k6m7J5N5kk3n1L4m3O6l1J6Rk0J5l2J6PP8n1l9L1j7lJj8nK7
4465Bm3M7qqMj9J8m2N0K4l1pK6M0o1K4J5n1J7mk0O3o9J3J7nj7PJ5K0rp1J06j3
4499C0k7j0ko9N2ML0k4M5o7J4J08n4l6K1PpM4p9j8O1nJok5K4k2oJ6QL8k1m6LP
4534a1l4J00k4m9Nj0QJ4L5j3n9N2k3qPJ7n6O9j0p3J18m5M5n6K6o1Q8p6J5j3l9
4565f1R4l4Qk6O8j19M0J4J1L6o3mP3J5o3k0J6OJ9K2n9J4J6n6R5l1J4O2m5PKq6
4597c5O0p1P6K2l8j8P9k2o9O1m3j4O3n7K7J2n3N1q0Q5k9Lk0J4O4r5L0l1qO0o0
4628c6M5l9j6KMK2j5O1l5K9k3k7oNL9k9M0l7%k2M7j3j9J1l5K0N3k1o0R7o7kM9
4661B2l7M3m8jk0M7k0K2K0pm9O4l8LL3lK8r1lM3mn0L0J6j1J4nK9k7J4q%L4lj3
$$ plain form
4432 24 0 -26 -5 50 40 14 -33 -18 37 35 12 -39 -5 -48 18 -13 3 12 -8 7 -25 -9 -2 76 25 -14 17 0 -3 -2 -20 -25 2
4465 2 -41 6 -2 -10 -6 -25 -7 -49 1 25 -6 -13 13 53 -8 16 31 -20 -3 -7 -27 36 -33 -20 -3 -8 -25 -18 -3 17 8 -63 43 30
4499 30 3 -7 -9 -78 -26 -22 8 -16 29 -38 -24 84 30 -6 15 22 15 59 -20 -38 23 18 19 13 -12 12 -10 -16 0 8 46 25 -21 -18 -11
4534 -11 -45 55 31 -18 -13 -23 -15 -1 34 21 -38 14 -9 -17 -10 7 -49 20 10 -63 55 10 55 -1 25 -36 52 -24 -9 -22 -61
4565 -61 33 -1 7 -19 49 -70 -30 -16 -5 31 -32 -36 37 52 -11 -31 -15 -9 10 32 -27 -13 3 -53 42 11 25 87 42 49 51 -35
4597 -35 25 -46 30 52 14 -4 75 53 -16 45 2 -12 51 -6 21 33 -20 31 -49 36 7 10 -10 4 68 -27 3 -28 -36 24 -36
4628 -36 9 -30 -46 -44 -40 -18 -33 28 -7 22 -1 -28 -34 -29 10 -19 21 -16 -16 -38 9 -4 -23 -12 -47 -27 26 5 -55 42 -25 -27 22
4661 22 -15 28 -20 -21 -41 6 -14 8 28 21 -28 36 -2 1 34 31 59 -32 -35 8 4 -46 -16 0 -11 3 -2 27 0 14 6 6 40 37 24
4696B4RJ9o2Pj7K2j5K1qj5qJ3o8R3J2n4O6r4L2NoM2N8q0L7j5oo2N7l1L7l0j4L0
4730aPp0Q4k2M4K2r6J4M3n0j4L2l6O5J8l7mP4k2o0Mk9N4nk4k9N0J2l5lj6J03r3
4763b0rO6m0pO0l8nn1N1Ork7j3J0N3n6M9l9K1Jk5M9oJ5J3q3L3P0l6m8kO6r0L8
4797cj7M5jp9M6l1L4j8j4l9L9L3Oj1k9O7m9kK9K6pK9l6Jp0N6Pk3L5k5Mq1J8K3
4831c7M5K1o2Kj9K0K5k9J4l7R1k2m5O5m5k0K5k3O0m4l6oO5K5pl3L0j0%m0M6nj3
4864Al3N5K2jm0k3O1j4k4m6Q4L3q3m9J8O1m8QJO1j2m2oK2PnK1k9j8m8Q5m1O2l9
4898Aj9K8lJ3KJ7mp6P2l2lk2j9M0QP2q3N9o2P9q2L7l7mKPMM8o4K6K3o1kJ12j45
4933f8O5J4J8n2l4Q4n4K3o1Q7qj4L1ll0L2K2n2K7n0J9JrO3l9Qm7O7p2M4L2q3O8
$$ plain form
4696 24 33 52 -10 -3 -20 2 -13 8 0 -15 -23 -10 -78 15 27 -27 39 -55 -23 -18 -24 18 76 -4 33 18 12 -50 7 -24 13 -17 -31 -1
4730 -1 6 -64 20 -2 42 64 -32 -18 25 -25 -39 -7 -43 22 40 3 -1 73 51 -9 -5 -34 20 15 -9 -38 12 24 -11 -14 -30 73 -20
4763 -20 -29 37 -3 -10 50 12 7 -44 7 13 4 -23 -36 -26 27 -29 20 -19 2 3 -22 27 21 36 49 -34 -1 69 33 -15 -17 49 -41 -3
4797 -3 -20 25 24 -55 -9 -40 -6 -24 -38 -77 -38 -5 1 -10 -39 28 -21 -23 6 32 25 54 18 19 -51 5 12 -11 24 -1 3 -78 -60 -37
4831 -37 8 29 -33 -31 -50 -30 -5 -34 -20 -57 34 12 -33 32 -13 -33 -8 -31 29 -15 -51 -57 8 33 26 -7 23 13 13 -27 19 14 1
4864 1 -32 23 45 44 4 -19 42 28 4 -42 42 75 -8 -57 -39 22 -26 -18 -17 44 32 -10 -16 6 13 8 29 0 -18 -66 19 -22 40 1
4898 1 -18 10 7 20 22 39 35 -41 31 -1 -4 -26 -45 -5 3 75 -8 51 -11 68 -14 23 -14 -18 -16 -9 -5 43 -21 5 28 -33 -35 77 -68
4933 -68 -3 11 29 -23 -57 27 -27 -4 -65 22 14 0 31 28 -2 30 52 0 27 -23 -4 -3 -12 51 12 20 -27 40 -32 12 44 -39 29
4966B9m8N1j4Mn1NK2M4Mm9n1O0j05Q6K8RJ7m2L2k9M2k7lK0m5J7J6m6M2K9r5P1
4998B3n0j9N4o0R9n1ol1O1p3O2jl1J1N1j06N4j9K0nm7M1m2P0j2k3K6P0j06Q8j5
5029C3m2j3k6J2M5j3N2m1Rj9J7%n4K4Qo3Q7k8K0l5L2Ll3l4Q1j1l0M3k2pl0mR3
5062E4m1k8L6k1K8l8KL9mk3QMnk1J5J6nJl5k5L2KN8j05K7P8p8QK6jj4K1l2P4r8
5097d5J17m2o2O2j6mj5J1J5l5L0J2n0m0Q3r2M5J0RqK4j4K4L3j33N3l3L1K5K5k0
5128@%mk1M0m5pJ5jJ9J6j0lN7k9k0m2N4p5L9jK6j3j3M5l5L8j9J8L1j14Q8p0M6
5161A0ll9J7K3M1o9KJO9n6J0n7N6l1M9o6N2rJ1K7n2K6n2K0J1L4n1M4l8K8KK9q4
5194d5lK0J4J1M6k7j9L8p9K6k9P7k3J2k9RJJ0j8K8J4j5j9k6Ok9J8N1k3K2n0L5
$$ plain form
4966 29 -19 32 18 22 -29 -24 -2 42 46 -3 -54 6 -99 -13 15 24 41 -1 31 2 44 17 14 34 -11 6 22 -24 18 47 -48 23
4998 23 -27 -46 8 -52 47 -4 -10 -41 20 -53 9 8 -23 -12 39 -67 -13 -32 -12 -17 -64 -23 -65 5 -7 -30 -4 66 -40 48 33
5029 33 -9 -22 -48 -36 9 -4 48 7 16 -3 14 14 -40 -16 -8 -71 16 -12 8 -27 5 8 -25 -59 22 11 -19 24 2 -5 -35 -39 54
5062 54 13 -15 21 0 28 -10 -8 31 27 4 12 16 11 -10 5 21 16 17 -18 -43 -11 -9 49 -56 -29 49 -29 -21 5 4 -10 11 -21 53 -45
5097 -45 72 30 -32 30 14 10 -5 6 21 -14 16 28 -22 -62 21 -71 -26 -16 -7 -15 9 -5 19 52 -81 -28 -61 -30 -5 20 0
5128 0 0 -4 -25 15 -30 -37 -22 -23 -4 12 2 -1 56 27 7 -35 19 -56 -17 -18 8 -5 -18 27 -8 30 11 29 60 -54 34 -36 10
5161 10 7 -32 -15 8 49 -20 -18 -17 52 -4 6 -51 5 -26 23 -43 9 0 11 38 -14 12 -40 -20 -9 25 -26 18 -20 8 10 39 -45
5194 -45 -48 -28 -14 -3 43 16 -3 35 -44 -18 -47 30 7 19 -10 -1 0 10 -8 20 34 19 0 -26 -20 -49 -31 20 -3 19 -31 4
5226Dk7L7k4L6k1K2j1mm1K7%j1qQ0l8k2M3ll3o2Q1ml9K7RPL0pl4k5lJ6l8O2K2
5261D8kq3N0m5K2N5pn8K9L4q0J0K5kj9Jn2N5P5j0m0k3N5l9Qm1M7M0j3qj8lj5%
5295dm8J9L2k6N0Rl5j3j2nL7k8J0L7j0Nk9O0m6m9J02p3K8m3J8NJP2o5J7QJ0j3
5328B1M2j0m1n2P1l5p2qO6j2oP0k4l2M4k4J5KK8m7k4JL2l2M8m2L6l3MK6j1J5L8
5361E4o4k1L4K3j7J6o3NQ0j8p0L6oKP2p4P8m5nr5L1N1Nj3j5l6P5k4n2Q5l4m9P2
5394A8j0j0N1n8mL3l2%M5n2Kj1K6J4lk4J4k1n0R2l1L2J9p8K8J9m2mO1j5k6J9J1
5427A3l4P6r9K9pK1j3KK5rn3N4K2p7P6rroK1k7J7j8PrJ1k3J2K5K0m%q0M2K4n0
5462c0O4J1j4J2p0J5K8J9o2J8K0K5l0K5ol5J9k6jM2Lo0M4Rj4L2n8k8P7j1k2o6
$$ plain form
5226 4 -23 14 -10 26 5 27 16 12 -29 -2 -2 -13 -21 59 21 -1 42 39 6 -56 25 21 -18 9 18 25 55 48 14 -11 -14 2 -36 26 48
5261 48 46 -37 13 -32 -10 45 38 -20 9 43 -37 -27 -2 -4 -23 -22 -74 -19 56 46 6 -17 38 -1 7 -34 13 53 40 32 14 11 -4 -4
5295 -4 -52 -33 -1 -27 23 32 -3 -16 -28 -33 4 -24 -14 23 13 18 -11 49 3 -46 56 -17 11 -32 -14 -9 -8 64 -1 16 24 34 21
5328 21 63 53 12 -40 31 -4 -76 -84 -18 -30 -36 34 10 -22 22 -2 13 15 43 -4 -28 -27 5 -27 21 -21 15 -18 -14 12 1 16 54
5361 54 -10 -31 3 26 9 25 -38 -33 47 29 -41 -5 -11 -9 63 -11 67 22 17 -78 -47 4 9 -4 -19 -55 20 -4 -56 29 -5 -54 18
5394 18 8 -2 49 -9 -13 20 -12 -12 33 -19 -17 -28 -2 12 9 -15 -1 -22 -72 20 -11 21 40 -38 -10 9 -33 -37 24 9 -17 2 13
5427 13 -21 55 -44 -15 -22 -1 -14 -12 13 4 -49 5 27 -50 26 17 8 2 23 -4 13 -5 2 -7 4 -19 -7 18 38 34 34 -46 -4 20 -30
5462 -30 34 45 31 43 -27 -12 16 35 -27 -9 11 36 6 31 25 -10 9 -17 -18 24 27 -33 11 20 6 38 -20 -48 29 18 -4 -70
5494g0K9L4L4n5J6lj4N6m6L3PJ6m2QpJnj1lLL2l3k4J0oj0qP5J6l0J5mm1M4p7K7
5530c3R1k9L7mm8m4Q9n7N9k5k1j0K4k4J2mk0l4K8k5K4KN0n4M9l1n3N6L8q7L6K8
5562B0J6n3N3m4J2qJ9j1J7k9M5j8j8mL4km5Rk9N7j7Nk5M1nk1k3J5k5M1PN4o9O9
5596F8n1JKn7K9mO4n6K8K2j7j4%L9o8K1N0m1l6M5%K7m9J0l1L2O3p0Nk7L5Mrrr
5631cNO7o1l2K8o7O6n5Q7n7k1K4M2j0j7l7M2nl6J00j05K7NL7j6L4kj3Kp9P5n4
5663b9j6K0k2J00l6K9l7n5K7l1PM4qK1n9KL4M4m8k3rP3o1M0nPK6n7NL8Lm8m3J24
5697E7m2j2PK3J1k8M7q7P2n4m6M8K2m7nK6Lj4J3Nj0K3%k1kK9lq1R1J6n1j8M0k1
5731iOJ2rkK4jn5K4pL0M2n1J5K3m3l2Q2l1J0m4K9L9m2j3M2k6m2lP1q2O0jK5Jj7
$$ plain form
5494 -70 -41 -7 27 -28 -12 -15 -29 27 -19 14 21 37 -5 3 -4 -3 -8 -19 -22 -19 13 -20 -44 -34 -40 -50 -58 17 33 3 18 14 -27 17 -60 -33
5530 -33 58 29 66 62 14 -30 59 2 61 36 15 5 29 5 17 13 -7 -41 -13 -38 -14 -12 38 -16 33 2 -51 5 43 -44 -8 20
5562 20 36 -17 36 -8 4 -4 15 4 21 -8 37 19 1 -3 31 29 -16 -7 -36 21 4 9 -16 25 20 -1 -24 -9 -34 7 14 68 -1 68
5596 68 17 18 20 -37 -8 -12 52 -4 24 46 29 15 15 54 -14 7 57 16 -20 25 25 52 3 13 -18 14 77 7 12 -15 20 24 15 6 -3
5631 -3 2 69 8 -24 4 -63 3 -52 35 -22 -43 -19 23 13 -4 -41 1 -4 -40 60 -45 -18 -13 24 8 42 40 27 29 -50 25 -29
5663 -29 -45 -25 -47 53 17 46 9 -46 -19 -50 -43 1 -7 14 -45 -43 -9 35 -13 -36 -45 28 -33 7 2 9 35 -22 -17 21 24 -24 -67 57
5697 57 15 3 10 33 44 16 63 -24 48 -6 -52 -4 18 -29 -34 -8 -5 -19 -6 -1 -11 12 12 -9 -11 18 15 -66 25 41 -10 -28 12 -9
5731 -9 -3 9 0 -2 22 21 -34 -10 -17 13 55 4 19 42 -1 -33 49 18 28 -16 13 52 10 -3 39 13 -29 -32 39 -43 17 16 41 42 25
5766B5k6N2l0Nj1n1J1j4N6k4Pk7L8m1M3o2N5J1m8M1Oj0k1P8l8%l0J9M6j18M9M5
5798C6n2j2N9k0Kl8j0L3J4qp2J9O3k0nN5m3QJ3K4o3L5o6R4m2Mn0R2p5l8P6J2K
5831B7n4L4M9j13O5j0Pj6%M0q7KL1P7k9o1J00k9l9Kq1R6Pqn3J8K1O7j25N4npJ1
5864iOJ6m3O5k9m4J5K1O2n7o0J8M3RpRp4N5K4k3K3J4n7Onk2J6K4Jj8M3j7L4kl0
5899Gn1Q3j9j3Pj0k9J13l8j1q4O1M4n4P7j05O9Kp5M2k1k4O6n7j0QK5N2m6J7j6
5930A0L5q5Q8j03R2k6m0Q9m6K5j4PPn3k1L0K5k3L6m0L0m4pJ8j3jMK7O6r9J1M0
5962B5l8J1k5L9mJ4Kk1K6k6j2O0p1O3k4m4m2P8j4o1J08q3K3M9n2j0M6L8r5N7j8
5993an9L6l4N1j1N8j4m7M4m6N0j9K1k4Nk3o6J03o3J3J1M7mj5k4K3qk9J1JR2k8
$$ plain form
5766 25 -1 51 21 26 15 -36 -25 -39 17 -7 0 -27 11 -30 13 -49 6 17 -31 10 16 6 -15 63 25 25 -5 14 60 -58 -9 36
5798 36 -16 -28 31 11 13 -25 -35 -2 12 4 -68 -49 14 -6 -11 44 1 9 22 46 -17 18 -48 46 4 8 -42 50 -25 -63 13 25 27
5831 27 -27 7 56 -57 8 -2 5 -11 -11 29 -58 -56 -25 52 23 -38 62 33 -6 -4 -85 11 18 10 -43 -25 -4 63 -62 -8 -13 -20 -9
5864 -9 -3 13 -30 35 6 -38 -23 -2 60 3 -57 -39 4 13 6 15 -59 -4 20 -3 20 34 -23 -17 -22 -44 -28 -4 -3 -21 22 5 39 37 7
5899 7 -44 39 20 7 14 4 -25 88 50 39 -45 16 60 6 83 -22 47 49 -26 16 -5 -29 37 -20 -30 -22 3 55 9 26 10
5930 10 45 -40 48 -55 37 11 -29 60 14 39 25 32 39 -14 -35 -5 20 -3 33 -7 23 -21 -28 -10 -23 -24 -20 7 73 -26 -15 25
5962 25 -13 -2 -27 12 8 22 24 3 29 3 -9 51 -20 43 19 -25 -67 11 -3 -64 44 -39 -16 33 -19 -29 17 55 -40 17 -1
5993 -1 -60 -24 -58 -7 -18 40 26 -21 23 -23 27 8 29 5 10 -13 -79 24 -39 -26 -15 32 28 13 -11 12 4 -25 -14 -13 79 51
6025E1p1j0O4m6L3Jj2k4N5k2J1k6lN0n9M7k7JL1o5j4J0PN9n1L3o5L8K4o4L3j%
6058a2P5o6k2J9%QJ7pm0M3l4L0l7oL1L5l2k4O9n2J7k3Lj9ON2m4l9O6k4K6rj0M6
6092D3n4RL1k8kM1j5l5oL9%k9kL2o8L4k7K8nqk8N0j2N8m8L3n8M2j6K5J6o2L1m9
6126d0L5%Kj2k3k3L1N5l1J3k2M9p8J2Q9j1n4lJ0n7M2pP2o7Qlj8J9k4M0k7L5Jq
6160EK7l9L3l0k7O4k1j3j7K9J8m5M1Lm3rJ1MK9o0K3J6k2J3k6j6K0L5jK2o7O2o3
6193d4K0L3k8L9l9k8k1O5J9LRkJ3j5o1J7k2O9j6lk6J5K9j37N9M1jJ0M8l5l1J3
6225gk6O9l0j7L1l0k8l3J15o1L7K1m3qk7J6K9Jk8P3o5K3k7N2r6O5K9k1J0m6K0
6256bk4L9j2m8M4K6k0pK5k9Pk0J6l3K0rO2m0j3J4j0N3n9LN8q2J5J8L3OL2ok3n0
$$ plain form
6025 51 -20 -30 34 -12 21 22 10 -14 41 19 30 4 1 51 -8 39 12 13 44 -21 -35 -25 -18 41 -10 23 -42 -4 20 -44 -11 -12 -12
6058 -12 63 -3 -25 -6 -6 2 19 12 -28 15 -19 11 -26 -32 -1 34 2 -22 47 -5 12 -11 -8 -27 -21 31 -13 -52 14 -10 16 7 -3 43
6092 43 -11 -2 29 1 -1 40 25 -10 -16 23 23 -6 -8 24 -44 -10 -37 -9 -14 -22 -50 0 -12 46 -2 31 -27 15 -1 24 40 -22 9 -40
6126 -40 -5 -5 -3 -15 -38 -61 -30 25 -6 7 -15 34 -44 -32 57 46 -8 -11 -1 -58 -16 -23 49 -18 -10 -13 -31 -12 -36 4 -23 12 13 5
6160 5 32 -7 26 -4 -31 33 12 -1 -18 11 29 -16 25 28 -15 -24 -13 -9 20 -40 -17 -1 -23 -10 -36 -52 -32 3 2 24 -43 19 -44
6193 -44 -24 9 -19 20 -19 -47 -68 -3 16 19 28 26 39 24 -37 -20 -42 27 11 8 -18 -3 26 -111 -52 -11 -12 -2 46 11 -20 -7
6225 -7 -33 36 6 -11 20 -10 -38 -71 44 -17 20 41 -2 -10 -37 -21 8 9 -19 54 -11 12 -15 37 -59 6 35 14 24 -22 -2
6256 -2 -26 13 1 -47 -3 23 3 -4 21 -8 -1 -21 -5 -38 -18 -27 35 -5 -18 -4 -14 39 -20 -17 41 -41 -26 -8 25 31 63 57 34 -16
6290a6L5k0N7o6K2P7j00j8J03o9n0Q4o7l1P3Kl0j6M0l9J5j2jL4q6J4P5k2j5K5
6320bj6J7j6K8n5L9pk8R0o2j7K5J4K9J5n6P3n1r2Q7k6k8NN7rQ4o5k4K6o0L4l5
6352b6L2oO3q1L5p0O8k9O0k0n3K3m3R8o0K2j5q1R8k0j0mO0l6j5jJm2O2l5K4L2
6384C1k7K2m4M4k0rpl7j5P3ol9L7MrJ1j6n2N7M5j5k7k2P3n5Pj0J7k3N9m8k2N0
6417B7j2K8m9J3l9J2M6j4p4J06Jl6j6M6l0nJ6qK7l4k6oP5m3r0P5m5JO6j7rM7J2
6450D5p1oK1k9N6k0j1kN3l4mj4j3M5J6qm3RK1k5k4M3m3O2K2r1M0J3m0P5J6l4J1
6483C6l2MJ3K0m5l5Q0n0l0N6j7j3j4M6L6r1J2O5n6N2L8p8M0k7M7o8K8l9MJ6l5
6514c7O3j4o9Q8m7N2r0Q6QOm9j2qK3N3o9j5K7M0lp4k4O5J6j0p4P6mk8O5l5qnj6
$$ plain form
6290 -16 19 -1 56 -10 12 89 -11 -29 74 5 -45 39 -28 -59 14 16 -14 -30 10 -29 -14 -26 -27 7 -79 -65 10 -12 -27 -2
6320 -2 -18 -1 -17 11 -44 -5 -12 -40 50 -12 -29 -4 10 39 54 -2 71 20 -72 15 -11 -39 -34 23 14 98 33 9 35 -25 9 -26
6352 -26 6 0 63 -18 17 -53 15 -14 46 26 -27 -4 -47 51 -9 13 -2 -83 15 -5 -15 -19 41 5 -10 -11 -10 -52 10 -25 -1 31
6384 31 4 26 -18 26 6 -3 -10 -47 -62 11 5 -34 3 7 -2 9 -7 -59 -2 43 28 1 -21 52 -3 4 -6 11 -12 47 -1 -23 27
6417 27 15 43 -6 7 -32 -20 26 12 -62 44 45 9 -7 39 9 4 20 12 39 5 -21 -27 48 5 -85 -10 -55 -54 12 -5 -14 33 45
6450 45 -26 -32 -11 -40 16 -4 -15 -17 36 2 -2 -16 -29 16 32 24 -19 -10 11 -14 -38 5 -38 24 46 -45 -5 8 -32 43 59 25 36
6483 36 4 8 21 41 -4 -39 41 -9 -39 17 0 -13 -27 19 55 -36 -24 41 -15 37 75 -3 37 10 57 -11 17 -22 -18 -2 -37
6514 -37 26 12 -57 31 -16 36 -54 32 40 46 -3 -15 -23 0 53 -16 -31 -4 36 33 -41 -65 0 16 6 -68 8 4 -24 41 6 -2 -7 -23
6548b3lN9J0o1j3J5%J0Rj6mLN8r4J07p2rQ1k9j5j8K2nrkl5M1K1o1P2n6PK1nk7
6583b1P0l8K5j5j6j0M2ol3lm5R7o2K1l6j3KL9OJ2J1pM1q2K2m7M3O3m0n2nM5M6
6616E4j9l7J4po0J8Q8lj0p6N2J2j1q5O2KJ0k9J5J2n6N0j5M4m7NN4j9Mm7kL3j6
6649a0J8k3kJk8K1jL0j5J9j6knP7j26L9jM3j9k7K0N0n1L1j0J0M0r3K2k4N7J5k0
6682B0N3q5L8n0ML7p1M5M2o4qN7k9LKrL5rL6j5l2l6M3k0%L1k8L0%rk1M7k2M3o7
6717inj4PL2k0K9On1jN1joN0k6p7O0l6OL8k8k4L6jk1J0Mj2N1J7n6l9M1NK6m5l6
6753c9MJ17q4j6N0M9n0k7j6L3j8j8JNK7Km1K2l9J03o8J4k6n3Q4lkM9l2l6jk5M8
6786A4J3m2m2O1j9N1m9J3k6K8pK0l0N3n1kN8l5j6L2m5j8NN4q5M2k4M2K7K0m6L0
$$ plain form
6548 -23 -26 33 43 -18 -31 -16 -16 -6 3 -13 -17 -14 44 -50 57 -15 -24 57 28 13 -5 17 12 3 1 -34 7 28 -33 39 -17 -10 11 6 -21
6583 -21 49 11 36 21 5 -5 37 31 -2 -5 -50 47 -15 6 -30 -43 -41 -2 4 16 27 20 61 -21 1 -46 -3 60 20 -32 -37 8 54
6616 54 35 -2 12 5 -55 -37 51 48 38 -38 14 26 15 -70 -8 -6 4 -25 -10 2 -54 -4 -19 25 -22 -17 37 18 22 -25 -27 6 -10
6649 -10 8 -15 -17 -16 -44 -23 -24 6 -9 10 -6 -8 -13 64 -62 -23 -24 19 0 -27 -7 43 -8 23 13 23 63 -30 -8 -32 25 40 20
6682 20 73 -12 26 -24 -20 17 -54 -9 33 -31 -39 18 -11 -8 -6 -15 20 11 47 32 0 -36 7 -13 -13 18 -10 20 20 11 -10 37 15 58 -9
6717 -9 -14 -28 -21 11 -9 20 26 -25 -26 25 24 18 68 42 -35 25 -11 -5 33 5 -19 17 16 -5 5 9 -3 48 65 9 -30 11 16 42 -3 -39
6753 -39 -35 82 -2 -18 32 81 31 4 -12 21 3 -15 -14 -9 18 20 -21 1 -38 65 -3 11 -15 -68 16 13 11 60 28 -8 -9 -34 14
6786 14 27 -15 -57 4 -15 36 -13 0 -26 2 -5 15 -15 38 -13 -15 43 8 -8 24 -21 -39 -34 20 -65 -23 -47 -5 22 42 -4 26
6818B6p2K8K9%P0j06L1m5R8r5L6K5rk5n6J11l3o2N6%M3K5m2n1j8jJ05n5k3N1m8
6849gJ6k7m2J07J9p1jpK0L9k0k8j9Jj2N7o7Q0m4j0K2Qk2j1Q4m0m8O7q6N9J8n5
6881b0M8M0m8J7k1J6o3O2l9kn3O2j7J7JJ8j1M8r9P5ql0KrM0o4O4m1O0q3N6J2l5
6914ek2j9N0k7L0k7M1J5m6k9O6n4l0M1L2%K0n7j2R4n0Ml4KON9r9L3Rpj3m7J8L8
6948b0j7OL0J9J6o3LM6Jj9l0RL0k5L1n5Q1o8J5j8M9pJ9k7m1M0k2J5J5m5M4j6L0
6981B6ON0j38R7j9o4K7jKpJ0J1J8j4M3m9L6o2mM3kPk8n5N5L5m4Q7q3J4K9m2J7
7014Aj5j2N9m0j7J9K8MLk1l2oM4ljk9M2o0M6K0l8K1qkN9r0N4n4nN6k7j8J0j5N0
7049B3L2k8k6kJ1%k6J6N1o2p2J06n7P6j3q7O5p4J16p4P3p7NN6p8N7n9M9K7n1N7
$$ plain form
6818 26 -46 -18 11 11 81 -25 6 -39 59 -36 0 25 16 -9 -65 46 13 -49 7 7 50 75 33 -18 -36 -37 68 13 -10 41 -7
6849 -7 9 -18 -60 47 66 -5 -6 -13 7 46 26 -2 -21 -20 -32 25 -42 38 -6 -16 6 14 -8 -19 65 25 -23 44 -42 17 35 -20
6881 -20 28 68 20 37 16 32 -31 31 -8 -10 -63 -1 -18 -1 0 18 7 55 -44 31 23 -7 -5 -14 26 -38 26 -15 45 -38 18 30 -5
6914 -5 -27 -46 4 -23 7 -20 21 36 -10 -39 27 -27 -57 -16 16 16 36 -21 -33 61 11 15 -19 -17 -11 48 -51 -18 -9 -16 -29 -76 -58 -20
6948 -20 -37 -31 -1 18 34 -29 -26 20 21 2 -28 -19 11 -14 17 -38 43 -25 -10 -28 21 14 33 6 -35 5 -17 -2 13 -32 12 -4 26
6981 26 32 82 -56 41 22 -42 -15 -16 -14 -21 -11 0 18 4 47 -2 34 -28 -32 11 9 16 -12 -67 -12 23 -21 66 -17 -3 26 -16 1
7014 1 -14 -26 33 -7 -24 -5 23 27 30 9 -23 -29 15 12 11 -18 24 -36 10 30 -8 13 5 3 62 -28 26 -28 -33 23 -4 -22 -12 -27 23
7049 23 55 27 1 -1 10 10 -16 0 51 -11 -83 23 -34 42 29 -58 7 -67 49 -25 48 -29 -24 32 -46 11 -48 1 28 -23 34
7080C4n6K0k8Rj2M7K0o3N8J2k6K9o8Q0r9N2k3P7kn9Kj0QM5n5m8N9n1L9L2j8k2
7112a7m7R5n1m3N6l3P1n3N6l3n7O7%KkOm0k7L1NN2l6oOJ9o6O0Mn0N3nm6mM2n6
7147d7R1l9Qk4l0N6j1K2o6N2mk5j0k4N8m6K8K6l6J9J6l0M1J3j5K7o7L9n2K7L2
7178B9j7M5n9J3jn7j5R2m2J2O5o3Oj9K0k8P8l8j0m9Q5o6L9j9K3j8L4n0l7O5j7
7209AK0J2k1j5j0L3K2l1n0K3L7k7O5p7l3M8l5N5np3L4K1k0K0M3j07J00l0l9M0
7239Ak5J3j4l1L0J3L3m2O0q0Q4m3lJ7K8j25Q9k4M2k9JoL3Orl7k2L3K6l1K1jk6
7272a8N0p4J4M2j0L8k3j1J1j5l3M2k7KL0p6N8j5M4l2LL9q1P1j29O8P5n0K7l9K2
7303CK2k1L4o5j8M7l0L8k0N2j4l1l8M1n5Q9J0o0OK8j3k2M2j6J8%mK4n2K7J1pn3
$$ plain form
7080 34 -22 -2 -30 -21 -33 14 34 -29 29 41 15 44 -24 56 -43 9 -14 63 61 2 4 -6 2 47 -8 -56 3 -48 -9 23 5 -17
7112 -17 -64 31 -20 -63 -7 -40 31 -22 34 1 -56 11 11 13 11 17 -23 -50 -19 -14 38 2 -4 2 21 -45 15 19 -31 22 17 -29 -33 9 -47
7147 -47 44 5 13 -11 -41 15 4 26 -40 12 8 -17 -27 -51 7 -39 -11 15 -21 -2 14 -16 25 38 23 50 -17 22 -30 -3 29
7178 29 12 57 -2 11 10 -47 -62 30 -12 0 65 2 8 -11 9 -19 59 21 11 -38 47 -19 20 1 24 6 40 -10 -47 18 1
7209 1 21 33 12 -3 -13 20 42 11 -39 -16 21 -6 59 -18 -51 -3 -38 17 12 -61 -27 -6 -26 -6 37 -70 30 0 -39 1
7239 1 -24 -11 -25 -56 -26 -13 20 -22 38 -42 42 -1 -4 13 41 -84 5 -19 23 -6 -5 -11 22 28 19 -18 -40 -7 19 -12 9 8 -18
7272 -18 32 -42 -28 14 4 42 19 8 19 4 -29 13 -14 -12 18 -58 0 -15 29 -3 0 39 -42 29 -100 -32 43 -7 20 -19 3
7303 3 25 4 38 -27 -45 2 -28 10 -10 42 28 -3 -41 0 -55 34 44 -16 -10 18 5 -17 25 9 27 27 23 47 -5 22 33 26 -27
7336b7J8k1M6J6n3qN1p7M2P1l3m3pJ23j32L2K6k3Lj9K7J3j9k0L4%m8L4n2N4k7
7367a9K6J4k4pjQl5KJ04q8L7j6j5l0N4mMk9m8L1M5j6j6k4P9l4j5L5k8n7P1l8M0
7400FK5nl0rRK1n2q2J35l3J3l6J6K3j3K3Rp1K4j7RqJ1J3L4n2K4M9p9N3QMl1rj3
7435c1K8KLmkk9J4N8m2k9K3K9k7oj2Ll0ML2l3N4pl3N2k7qK3rrrJ4N7q5P0k3l4
7471b3k5P1M5l9m4QMJPm2K6KL0k6J4j8L5l0l0P2n7pJ6L2J7m7K5J2m4l1K6j3P5
7504D2q3Q0j7l6qk3L8O9p8L9l7J1j5L7K7o9O6jmk2l9K2M7o5kJ1j3L3q1O2K2r8
7536h5J38m0l1M6r9M4n4L0O9l2K0J0l9j9K9K1Mrj6N4K6n9Rl1L4J8Op5M7Ln2NN5
7569B7qM0r7P0p6M4k7J8%n8R7n7J8k1L2O1m0j5Kn3J7L6Rl3l2N5Ol9J7K5l7oM4
$$ plain form
7336 -27 -9 -30 16 32 -21 -29 22 -55 -13 58 25 -18 -25 98 -34 -2 24 1 4 -15 12 25 6 -14 20 20 -28 6 -46 8 -19
7367 -19 7 21 -3 -10 -11 -3 -38 -36 68 -20 17 1 -14 -44 10 6 10 -19 -67 -36 9 -7 -23 -47 32 -2 -17 18 -10 -67 4 -34 6
7400 6 31 26 -4 -13 -4 17 -35 -117 18 -15 -2 -38 -22 1 -12 11 20 -51 -27 -44 -35 -43 -32 -19 15 -37 -13 36 -43 10 18 22 -9 -18 -31
7435 -31 -3 -1 2 -2 -4 -33 -19 39 -3 -32 -9 20 -7 -13 -25 -22 -52 -48 -16 -49 5 -2 -35 17 -10 -18 5 -4 -13 -22 -8 49 -36 34 11 -23
7471 -23 -48 23 68 29 -15 -7 -3 -2 5 -37 -11 -9 21 -5 9 -9 26 -4 -34 38 -19 -26 -10 22 39 -8 17 29 -15 -46 -20 -33 42
7504 42 -41 39 22 -14 -22 -45 -7 62 -16 23 -14 -3 -18 19 46 -23 43 42 38 16 -23 -1 46 -19 -21 -10 -23 10 -71 -9 13 -85
7536 -85 53 13 -18 28 -71 -27 -81 -51 18 -14 6 16 -23 -42 -13 8 12 3 -13 41 67 8 17 -14 20 38 44 -31 16 19 -33 -28 27
7569 27 19 59 -38 32 -44 0 -27 -9 -9 -67 30 -27 -9 -30 2 63 23 8 10 -43 -26 10 19 -14 -46 9 15 -24 -7 18 -19 -25 19
7602A9LL7q3j4NpO6n9qR1p7K3m8M0K9Mn4lL9j1J1K2k0l2J0K2o3N6M3l0KJm9K5
7636a0K6j9Pl5Q1r0O6J0o1M0J8m6J6k8kM6ok0k5K1KJ4J9j3K3j6l7J4m1PP4r7N4
7669hk1N5m3n7J01l1O1n3j3k6N6mpk6RN0k4j0oj3n4N1k4j2P1q9J3R3o1L0j2j8
7701b2L6L0jom9L2l5P0j30O0pK1j0K8J7KJ7j01Q6n6K8n4O2n1%P8l0J0r5O2Rk0
7733a9k6L3nQoJj6J9K8j8nk9L3m9O5qn5N2J8k3K6p1qO8l0Q5r0j1O8kk7J7k9l2
7767c8j3Q3p2O5pL5l8oq3M3O6p3L0N1l7k0J0PJ7j4M8m8o0oN1J0J7l1O9n5j6k6
7799d1L5L0q0O9l8j6PRO5Ol8j6M7n2M7L2j7p7M8J9p0M7oj7j2P6k7J0p9L3M8l2
7831A0m8L3j5Rk3M8k3j8K5M1o4m7J6M8j8P5Qn1J7Lok3J9QJK8m0l0K1k4KL9n3j7
$$ plain form
7602 19 22 59 -24 -38 -33 -40 26 -33 -41 50 -27 -4 -52 -12 17 21 -33 -36 3 -8 3 25 5 -27 -17 5 -58 -2 41 11 13 14 -35 -10
7636 -10 16 -3 4 -31 50 -40 26 36 -25 15 33 -13 3 -25 -27 19 13 -7 -32 -11 -9 5 24 11 34 18 -19 -5 -46 -39 35 -62 -8
7669 -8 -29 26 -17 -74 27 -4 57 4 -9 -35 21 17 10 -16 -7 43 19 9 3 -10 -64 -13 -37 -49 22 -67 -54 39 -22 8 -4 -22
7701 -22 14 44 43 37 -12 20 -15 55 -75 -15 -22 -1 -11 17 34 36 53 -48 38 -18 10 -44 18 -33 -33 45 15 25 -70 -8 1 -19
7733 -19 -45 -12 -17 -9 -15 -14 -30 -11 17 -1 -6 -35 -2 -51 14 6 -49 3 21 -2 24 -47 -55 13 -17 68 -22 -33 35 33 6 23 -6 -38
7767 -38 -51 32 -40 25 18 53 15 9 -74 -31 35 -38 -8 43 6 -14 -4 3 20 6 54 6 -54 -60 -9 1 18 -13 56 1 -15 -41
7799 -41 -6 24 -56 13 -25 -41 -34 -25 40 46 8 -8 39 -13 34 66 49 -28 20 39 -31 16 10 -7 -19 57 30 40 -39 -6 42 10
7831 10 -38 -5 -20 -11 -34 14 -9 -27 -2 39 -25 -72 -56 -8 -26 49 57 6 23 26 20 -3 16 24 25 53 13 -17 4 -20 -18 21 -32 -49
7865d9O3m5M9m0K5K3j7L2l8K2j3m6K5L4o4M2POn5jJ03p2N4j3J9q4P9n2OK2l1P2
7897F3%p6QJ2k1j6MRk4L0m2M4nJ7m2NL6k0N0q1P4J9m5L4L0o4kQRm9j9L8K3qM5
7932D4j1q1RO2J4j3Nl8RPl9R4o0k0j0L7J1m8O7p2J7M3m4m1O1L7n7N6o7L5M2K9
7964G8r7J5J0m5K2P3n0J6m4N7J1p2P0l3J3n8R6l9m4M4j2o9M8l0L3oL1n4K1J1J
7995cP7q0K5m6M7m8M9l1O7o7p9Q5J7K0o8P2k8L1plm7L3j7k3L8n4P2j5K0l3K6m5
8027a5j8O3n8K0K1K8Km2L3qm6LMN3k3Kn7j4M9K9KK0r4%Q7j8ml8M3k9J4J8m3o0
8061g6J09J5M0n0J4k0L4r7N0k6k3K4K2K0Nl9nj1K8J0O1q5j4M8Jp8M2L4o3L1J8
8092A9j6m4l8P6O6p1K9k3J7K1n3J8%L3o3kK1L5l6j0K2J7o1J4O7Jo0J0J8K0l5K0
$$ plain form
7865 -49 14 -31 18 -22 3 26 9 41 3 25 12 -34 -9 25 -39 3 10 16 -39 -40 63 -9 45 32 51 -33 46 -6 0 22 -9 63
7897 63 63 -13 -5 7 -14 -30 -26 -17 -41 -11 -53 -9 -14 3 -39 -34 2 -18 32 -49 25 44 -1 33 63 -1 -3 5 14 -35 -54 -16 7 -1 44
7932 44 33 -48 -39 23 37 24 29 -9 0 7 -32 62 2 -18 -28 9 20 -28 39 -33 -16 27 -17 -58 3 40 -17 39 -28 7 49 78
7964 78 -19 -4 6 -39 -17 56 6 22 -22 35 46 -26 44 11 24 -34 62 23 -21 23 11 -58 -10 -40 -7 -13 18 -36 -15 -4 -3
7995 -3 74 -6 19 -27 20 -28 21 -10 57 -10 -89 -4 13 33 -35 37 9 40 33 30 -17 16 -1 -24 14 -40 32 17 37 4 30 -15
8027 -15 -33 30 -28 -8 13 41 43 1 34 26 -20 -17 -13 40 17 19 -38 -52 -3 26 28 48 -46 -46 41 23 19 -19 24 -5 9 27 -16 -76
8061 -76 33 48 88 38 52 32 66 -31 19 -7 -30 -6 16 36 41 2 -3 -14 14 24 85 0 -14 34 35 -43 -1 33 -30 1 19
8092 19 3 -41 -79 -3 63 -8 21 -2 15 36 -17 1 1 34 -29 -31 -10 25 -11 -21 1 18 -43 -29 38 39 -21 -11 7 27 -8 12
8124A2ll0N4m4k0kN9p7N1j2M0o2L8rOk1L7m1K9K6Qk2m6O9l4j1J2J3m9ML0J9Lm2
8158a5nM2j9J0j9m0M1J2j4l2kO3n3P5p2O3k2k7M7r7L3J5R0o4j9n2M6K4pj5K1J7
8190B5K7
$$ plain form
8124 12 9 -21 33 -11 -31 -33 26 -51 0 -12 28 -34 4 -5 1 -20 17 -24 5 31 39 17 -29 40 6 -5 7 20 -29 -25 5 24 27 -15
8158 -15 -20 22 3 13 -6 -46 -5 7 -7 -39 -41 22 -31 44 -28 35 13 -14 33 -64 -31 -16 74 10 -9 -61 -15 9 2 -13 8 25
8190 25 52
8191E2
##END NTUPLES=NMR FID
##END=
